lucene-dev mailing list archives

Site index · List index
Message view « Date » · « Thread »
Top « Date » · « Thread »
From Robert Muir <rcm...@gmail.com>
Subject Re: [JENKINS] Lucene-trunk-Linux-Java7-64-test-only - Build # 10035 - Failure!
Date Wed, 17 Oct 2012 17:22:10 GMT
I'm not able to reproduce this one at the moment, i only have mac (no
java7). I even tried tacking on -Dtests.jvms=1 -Dtests.dups=20 in case
its a testrunner leak (this one makes lots of threads).

Is anyone else able to reproduce this?

On Tue, Oct 16, 2012 at 5:21 PM,  <builder@flonkings.com> wrote:
> Build: builds.flonkings.com/job/Lucene-trunk-Linux-Java7-64-test-only/10035/
>
> 1 tests failed.
> REGRESSION:  org.apache.lucene.search.TestTimeLimitingCollector.testSearchMultiThreaded
>
> Error Message:
> Captured an uncaught exception in thread: Thread[id=255, name=Thread-198, state=RUNNABLE,
group=TGRP-TestTimeLimitingCollector]
>
> Stack Trace:
> com.carrotsearch.randomizedtesting.UncaughtExceptionError: Captured an uncaught exception
in thread: Thread[id=255, name=Thread-198, state=RUNNABLE, group=TGRP-TestTimeLimitingCollector]
> Caused by: java.lang.OutOfMemoryError: Java heap space
>         at __randomizedtesting.SeedInfo.seed([41D53676D3187506]:0)
>         at org.apache.lucene.codecs.BlockTreeTermsReader$FieldReader$SegmentTermsEnum$Frame.<init>(BlockTreeTermsReader.java:2266)
>         at org.apache.lucene.codecs.BlockTreeTermsReader$FieldReader$SegmentTermsEnum.<init>(BlockTreeTermsReader.java:1275)
>         at org.apache.lucene.codecs.BlockTreeTermsReader$FieldReader.iterator(BlockTreeTermsReader.java:525)
>         at org.apache.lucene.index.FilterAtomicReader$FilterTerms.iterator(FilterAtomicReader.java:86)
>         at org.apache.lucene.index.AssertingAtomicReader$AssertingTerms.iterator(AssertingAtomicReader.java:99)
>         at org.apache.lucene.index.MultiTerms.iterator(MultiTerms.java:103)
>         at org.apache.lucene.index.TermContext.build(TermContext.java:94)
>         at org.apache.lucene.search.TermQuery.createWeight(TermQuery.java:167)
>         at org.apache.lucene.search.BooleanQuery$BooleanWeight.<init>(BooleanQuery.java:186)
>         at org.apache.lucene.search.BooleanQuery.createWeight(BooleanQuery.java:400)
>         at org.apache.lucene.search.IndexSearcher.createNormalizedWeight(IndexSearcher.java:648)
>         at org.apache.lucene.search.AssertingIndexSearcher.createNormalizedWeight(AssertingIndexSearcher.java:60)
>         at org.apache.lucene.search.IndexSearcher.search(IndexSearcher.java:293)
>         at org.apache.lucene.search.TestTimeLimitingCollector.search(TestTimeLimitingCollector.java:124)
>         at org.apache.lucene.search.TestTimeLimitingCollector.doTestSearch(TestTimeLimitingCollector.java:139)
>         at org.apache.lucene.search.TestTimeLimitingCollector.access$200(TestTimeLimitingCollector.java:42)
>         at org.apache.lucene.search.TestTimeLimitingCollector$1.run(TestTimeLimitingCollector.java:292)
>
>
>
>
> Build Log:
> [...truncated 1072 lines...]
> [junit4:junit4] Suite: org.apache.lucene.search.TestTimeLimitingCollector
> [junit4:junit4]   2> oct 16, 2012 5:21:37 P.M. com.carrotsearch.randomizedtesting.RandomizedRunner$QueueUncaughtExceptionsHandler
uncaughtException
> [junit4:junit4]   2> Advertencia: Uncaught exception in thread: Thread[Thread-198,5,TGRP-TestTimeLimitingCollector]
> [junit4:junit4]   2> java.lang.OutOfMemoryError: Java heap space
> [junit4:junit4]   2>    at __randomizedtesting.SeedInfo.seed([41D53676D3187506]:0)
> [junit4:junit4]   2>    at org.apache.lucene.codecs.BlockTreeTermsReader$FieldReader$SegmentTermsEnum$Frame.<init>(BlockTreeTermsReader.java:2266)
> [junit4:junit4]   2>    at org.apache.lucene.codecs.BlockTreeTermsReader$FieldReader$SegmentTermsEnum.<init>(BlockTreeTermsReader.java:1275)
> [junit4:junit4]   2>    at org.apache.lucene.codecs.BlockTreeTermsReader$FieldReader.iterator(BlockTreeTermsReader.java:525)
> [junit4:junit4]   2>    at org.apache.lucene.index.FilterAtomicReader$FilterTerms.iterator(FilterAtomicReader.java:86)
> [junit4:junit4]   2>    at org.apache.lucene.index.AssertingAtomicReader$AssertingTerms.iterator(AssertingAtomicReader.java:99)
> [junit4:junit4]   2>    at org.apache.lucene.index.MultiTerms.iterator(MultiTerms.java:103)
> [junit4:junit4]   2>    at org.apache.lucene.index.TermContext.build(TermContext.java:94)
> [junit4:junit4]   2>    at org.apache.lucene.search.TermQuery.createWeight(TermQuery.java:167)
> [junit4:junit4]   2>    at org.apache.lucene.search.BooleanQuery$BooleanWeight.<init>(BooleanQuery.java:186)
> [junit4:junit4]   2>    at org.apache.lucene.search.BooleanQuery.createWeight(BooleanQuery.java:400)
> [junit4:junit4]   2>    at org.apache.lucene.search.IndexSearcher.createNormalizedWeight(IndexSearcher.java:648)
> [junit4:junit4]   2>    at org.apache.lucene.search.AssertingIndexSearcher.createNormalizedWeight(AssertingIndexSearcher.java:60)
> [junit4:junit4]   2>    at org.apache.lucene.search.IndexSearcher.search(IndexSearcher.java:293)
> [junit4:junit4]   2>    at org.apache.lucene.search.TestTimeLimitingCollector.search(TestTimeLimitingCollector.java:124)
> [junit4:junit4]   2>    at org.apache.lucene.search.TestTimeLimitingCollector.doTestSearch(TestTimeLimitingCollector.java:139)
> [junit4:junit4]   2>    at org.apache.lucene.search.TestTimeLimitingCollector.access$200(TestTimeLimitingCollector.java:42)
> [junit4:junit4]   2>    at org.apache.lucene.search.TestTimeLimitingCollector$1.run(TestTimeLimitingCollector.java:292)
> [junit4:junit4]   2>
> [junit4:junit4]   2> oct 16, 2012 5:21:43 P.M. com.carrotsearch.randomizedtesting.RandomizedRunner$QueueUncaughtExceptionsHandler
uncaughtException
> [junit4:junit4]   2> Advertencia: Uncaught exception in thread: Thread[Thread-175,5,TGRP-TestTimeLimitingCollector]
> [junit4:junit4]   2> java.lang.OutOfMemoryError: Java heap space
> [junit4:junit4]   2>    at __randomizedtesting.SeedInfo.seed([41D53676D3187506]:0)
> [junit4:junit4]   2>    at org.apache.lucene.codecs.BlockTreeTermsReader$FieldReader$SegmentTermsEnum.getFrame(BlockTreeTermsReader.java:1414)
> [junit4:junit4]   2>    at org.apache.lucene.codecs.BlockTreeTermsReader$FieldReader$SegmentTermsEnum.pushFrame(BlockTreeTermsReader.java:1445)
> [junit4:junit4]   2>    at org.apache.lucene.codecs.BlockTreeTermsReader$FieldReader$SegmentTermsEnum.next(BlockTreeTermsReader.java:2079)
> [junit4:junit4]   2>    at org.apache.lucene.index.FilterAtomicReader$FilterTermsEnum.next(FilterAtomicReader.java:163)
> [junit4:junit4]   2>    at org.apache.lucene.index.AssertingAtomicReader$AssertingTermsEnum.next(AssertingAtomicReader.java:144)
> [junit4:junit4]   2>    at org.apache.lucene.index.MultiTermsEnum.reset(MultiTermsEnum.java:128)
> [junit4:junit4]   2>    at org.apache.lucene.index.MultiTerms.iterator(MultiTerms.java:110)
> [junit4:junit4]   2>    at org.apache.lucene.index.TermContext.build(TermContext.java:94)
> [junit4:junit4]   2>    at org.apache.lucene.search.TermQuery.createWeight(TermQuery.java:167)
> [junit4:junit4]   2>    at org.apache.lucene.search.BooleanQuery$BooleanWeight.<init>(BooleanQuery.java:186)
> [junit4:junit4]   2>    at org.apache.lucene.search.BooleanQuery.createWeight(BooleanQuery.java:400)
> [junit4:junit4]   2>    at org.apache.lucene.search.IndexSearcher.createNormalizedWeight(IndexSearcher.java:648)
> [junit4:junit4]   2>    at org.apache.lucene.search.AssertingIndexSearcher.createNormalizedWeight(AssertingIndexSearcher.java:60)
> [junit4:junit4]   2>    at org.apache.lucene.search.IndexSearcher.search(IndexSearcher.java:293)
> [junit4:junit4]   2>    at org.apache.lucene.search.TestTimeLimitingCollector.search(TestTimeLimitingCollector.java:124)
> [junit4:junit4]   2>    at org.apache.lucene.search.TestTimeLimitingCollector.doTestSearch(TestTimeLimitingCollector.java:145)
> [junit4:junit4]   2>    at org.apache.lucene.search.TestTimeLimitingCollector.access$200(TestTimeLimitingCollector.java:42)
> [junit4:junit4]   2>    at org.apache.lucene.search.TestTimeLimitingCollector$1.run(TestTimeLimitingCollector.java:292)
> [junit4:junit4]   2>
> [junit4:junit4]   2> oct 16, 2012 5:21:43 P.M. com.carrotsearch.randomizedtesting.RandomizedRunner$QueueUncaughtExceptionsHandler
uncaughtException
> [junit4:junit4]   2> Advertencia: Uncaught exception in thread: Thread[Thread-166,5,TGRP-TestTimeLimitingCollector]
> [junit4:junit4]   2> java.lang.OutOfMemoryError: Java heap space
> [junit4:junit4]   2>
> [junit4:junit4]   2> oct 16, 2012 5:21:43 P.M. com.carrotsearch.randomizedtesting.RandomizedRunner$QueueUncaughtExceptionsHandler
uncaughtException
> [junit4:junit4]   2> Advertencia: Uncaught exception in thread: Thread[Thread-207,5,TGRP-TestTimeLimitingCollector]
> [junit4:junit4]   2> java.lang.OutOfMemoryError: GC overhead limit exceeded
> [junit4:junit4]   2>    at __randomizedtesting.SeedInfo.seed([41D53676D3187506]:0)
> [junit4:junit4]   2>    at org.apache.lucene.codecs.BlockTreeTermsReader$FieldReader$SegmentTermsEnum.getFrame(BlockTreeTermsReader.java:1414)
> [junit4:junit4]   2>    at org.apache.lucene.codecs.BlockTreeTermsReader$FieldReader$SegmentTermsEnum.pushFrame(BlockTreeTermsReader.java:1445)
> [junit4:junit4]   2>    at org.apache.lucene.codecs.BlockTreeTermsReader$FieldReader$SegmentTermsEnum.next(BlockTreeTermsReader.java:2079)
> [junit4:junit4]   2>    at org.apache.lucene.index.FilterAtomicReader$FilterTermsEnum.next(FilterAtomicReader.java:163)
> [junit4:junit4]   2>    at org.apache.lucene.index.AssertingAtomicReader$AssertingTermsEnum.next(AssertingAtomicReader.java:144)
> [junit4:junit4]   2>    at org.apache.lucene.index.MultiTermsEnum.reset(MultiTermsEnum.java:128)
> [junit4:junit4]   2>    at org.apache.lucene.index.MultiTerms.iterator(MultiTerms.java:110)
> [junit4:junit4]   2>    at org.apache.lucene.index.AtomicReader.docFreq(AtomicReader.java:80)
> [junit4:junit4]   2>    at org.apache.lucene.search.TermQuery$TermWeight.termNotInReader(TermQuery.java:110)
> [junit4:junit4]   2>    at org.apache.lucene.search.TermQuery$TermWeight.getTermsEnum(TermQuery.java:98)
> [junit4:junit4]   2>    at org.apache.lucene.search.TermQuery$TermWeight.scorer(TermQuery.java:82)
> [junit4:junit4]   2>    at org.apache.lucene.search.BooleanQuery$BooleanWeight.scorer(BooleanQuery.java:322)
> [junit4:junit4]   2>    at org.apache.lucene.search.AssertingIndexSearcher$1.scorer(AssertingIndexSearcher.java:80)
> [junit4:junit4]   2>    at org.apache.lucene.search.IndexSearcher.search(IndexSearcher.java:587)
> [junit4:junit4]   2>    at org.apache.lucene.search.IndexSearcher.search(IndexSearcher.java:293)
> [junit4:junit4]   2>    at org.apache.lucene.search.TestTimeLimitingCollector.search(TestTimeLimitingCollector.java:124)
> [junit4:junit4]   2>    at org.apache.lucene.search.TestTimeLimitingCollector.doTestSearch(TestTimeLimitingCollector.java:139)
> [junit4:junit4]   2>    at org.apache.lucene.search.TestTimeLimitingCollector.access$200(TestTimeLimitingCollector.java:42)
> [junit4:junit4]   2>    at org.apache.lucene.search.TestTimeLimitingCollector$1.run(TestTimeLimitingCollector.java:292)
> [junit4:junit4]   2>
> [junit4:junit4]   2> oct 16, 2012 5:21:43 P.M. com.carrotsearch.randomizedtesting.RandomizedRunner$QueueUncaughtExceptionsHandler
uncaughtException
> [junit4:junit4]   2> Advertencia: Uncaught exception in thread: Thread[Thread-194,5,TGRP-TestTimeLimitingCollector]
> [junit4:junit4]   2> java.lang.OutOfMemoryError: Java heap space
> [junit4:junit4]   2>
> [junit4:junit4]   2> oct 16, 2012 5:21:44 P.M. com.carrotsearch.randomizedtesting.RandomizedRunner$QueueUncaughtExceptionsHandler
uncaughtException
> [junit4:junit4]   2> Advertencia: Uncaught exception in thread: Thread[Thread-170,5,TGRP-TestTimeLimitingCollector]
> [junit4:junit4]   2> java.lang.OutOfMemoryError: Java heap space
> [junit4:junit4]   2>    at __randomizedtesting.SeedInfo.seed([41D53676D3187506]:0)
> [junit4:junit4]   2>    at org.apache.lucene.codecs.lucene41.Lucene41PostingsReader.newTermState(Lucene41PostingsReader.java:188)
> [junit4:junit4]   2>    at org.apache.lucene.codecs.lucene41.Lucene41PostingsReader.newTermState(Lucene41PostingsReader.java:55)
> [junit4:junit4]   2>    at org.apache.lucene.codecs.BlockTreeTermsReader$FieldReader$SegmentTermsEnum$Frame.<init>(BlockTreeTermsReader.java:2302)
> [junit4:junit4]   2>    at org.apache.lucene.codecs.BlockTreeTermsReader$FieldReader$SegmentTermsEnum.getFrame(BlockTreeTermsReader.java:1414)
> [junit4:junit4]   2>    at org.apache.lucene.codecs.BlockTreeTermsReader$FieldReader$SegmentTermsEnum.pushFrame(BlockTreeTermsReader.java:1445)
> [junit4:junit4]   2>    at org.apache.lucene.codecs.BlockTreeTermsReader$FieldReader$SegmentTermsEnum.next(BlockTreeTermsReader.java:2079)
> [junit4:junit4]   2>    at org.apache.lucene.index.FilterAtomicReader$FilterTermsEnum.next(FilterAtomicReader.java:163)
> [junit4:junit4]   2>    at org.apache.lucene.index.AssertingAtomicReader$AssertingTermsEnum.next(AssertingAtomicReader.java:144)
> [junit4:junit4]   2>    at org.apache.lucene.index.MultiTermsEnum.reset(MultiTermsEnum.java:128)
> [junit4:junit4]   2>    at org.apache.lucene.index.MultiTerms.iterator(MultiTerms.java:110)
> [junit4:junit4]   2>    at org.apache.lucene.search.TermQuery$TermWeight.getTermsEnum(TermQuery.java:102)
> [junit4:junit4]   2>    at org.apache.lucene.search.TermQuery$TermWeight.scorer(TermQuery.java:82)
> [junit4:junit4]   2>    at org.apache.lucene.search.BooleanQuery$BooleanWeight.scorer(BooleanQuery.java:322)
> [junit4:junit4]   2>    at org.apache.lucene.search.AssertingIndexSearcher$1.scorer(AssertingIndexSearcher.java:80)
> [junit4:junit4]   2>    at org.apache.lucene.search.IndexSearcher.search(IndexSearcher.java:587)
> [junit4:junit4]   2>    at org.apache.lucene.search.IndexSearcher.search(IndexSearcher.java:293)
> [junit4:junit4]   2>    at org.apache.lucene.search.TestTimeLimitingCollector.search(TestTimeLimitingCollector.java:124)
> [junit4:junit4]   2>    at org.apache.lucene.search.TestTimeLimitingCollector.doTestSearch(TestTimeLimitingCollector.java:139)
> [junit4:junit4]   2>    at org.apache.lucene.search.TestTimeLimitingCollector.access$200(TestTimeLimitingCollector.java:42)
> [junit4:junit4]   2>    at org.apache.lucene.search.TestTimeLimitingCollector$1.run(TestTimeLimitingCollector.java:292)
> [junit4:junit4]   2>
> [junit4:junit4]   2> NOTE: reproduce with: ant test  -Dtestcase=TestTimeLimitingCollector
-Dtests.method=testSearchMultiThreaded -Dtests.seed=41D53676D3187506 -Dtests.slow=true -Dtests.locale=es_US
-Dtests.timezone=US/Arizona -Dtests.file.encoding=UTF-8
> [junit4:junit4] ERROR   73.0s J5 | TestTimeLimitingCollector.testSearchMultiThreaded
<<<
> [junit4:junit4]    > Throwable #1: java.lang.AssertionError: some threads failed!
expected:<50> but was:<44>
> [junit4:junit4]    >    at org.junit.Assert.fail(Assert.java:93)
> [junit4:junit4]    >    at org.junit.Assert.failNotEquals(Assert.java:647)
> [junit4:junit4]    >    at org.junit.Assert.assertEquals(Assert.java:128)
> [junit4:junit4]    >    at org.junit.Assert.assertEquals(Assert.java:472)
> [junit4:junit4]    >    at org.apache.lucene.search.TestTimeLimitingCollector.doTestMultiThreads(TestTimeLimitingCollector.java:306)
> [junit4:junit4]    >    at org.apache.lucene.search.TestTimeLimitingCollector.testSearchMultiThreaded(TestTimeLimitingCollector.java:271)
> [junit4:junit4]    >    at sun.reflect.NativeMethodAccessorImpl.invoke0(Native Method)
> [junit4:junit4]    >    at sun.reflect.NativeMethodAccessorImpl.invoke(NativeMethodAccessorImpl.java:57)
> [junit4:junit4]    >    at sun.reflect.DelegatingMethodAccessorImpl.invoke(DelegatingMethodAccessorImpl.java:43)
> [junit4:junit4]    >    at java.lang.reflect.Method.invoke(Method.java:601)
> [junit4:junit4]    >    at com.carrotsearch.randomizedtesting.RandomizedRunner.invoke(RandomizedRunner.java:1559)
> [junit4:junit4]    >    at com.carrotsearch.randomizedtesting.RandomizedRunner.access$600(RandomizedRunner.java:79)
> [junit4:junit4]    >    at com.carrotsearch.randomizedtesting.RandomizedRunner$6.evaluate(RandomizedRunner.java:737)
> [junit4:junit4]    >    at com.carrotsearch.randomizedtesting.RandomizedRunner$7.evaluate(RandomizedRunner.java:773)
> [junit4:junit4]    >    at com.carrotsearch.randomizedtesting.RandomizedRunner$8.evaluate(RandomizedRunner.java:787)
> [junit4:junit4]    >    at org.apache.lucene.util.TestRuleSetupTeardownChained$1.evaluate(TestRuleSetupTeardownChained.java:50)
> [junit4:junit4]    >    at org.apache.lucene.util.TestRuleFieldCacheSanity$1.evaluate(TestRuleFieldCacheSanity.java:51)
> [junit4:junit4]    >    at org.apache.lucene.util.AbstractBeforeAfterRule$1.evaluate(AbstractBeforeAfterRule.java:45)
> [junit4:junit4]    >    at com.carrotsearch.randomizedtesting.rules.SystemPropertiesInvariantRule$1.evaluate(SystemPropertiesInvariantRule.java:55)
> [junit4:junit4]    >    at org.apache.lucene.util.TestRuleThreadAndTestName$1.evaluate(TestRuleThreadAndTestName.java:48)
> [junit4:junit4]    >    at org.apache.lucene.util.TestRuleIgnoreAfterMaxFailures$1.evaluate(TestRuleIgnoreAfterMaxFailures.java:70)
> [junit4:junit4]    >    at org.apache.lucene.util.TestRuleMarkFailure$1.evaluate(TestRuleMarkFailure.java:48)
> [junit4:junit4]    >    at com.carrotsearch.randomizedtesting.rules.StatementAdapter.evaluate(StatementAdapter.java:36)
> [junit4:junit4]    >    at com.carrotsearch.randomizedtesting.ThreadLeakControl$StatementRunner.run(ThreadLeakControl.java:358)
> [junit4:junit4]    >    at com.carrotsearch.randomizedtesting.ThreadLeakControl.forkTimeoutingTask(ThreadLeakControl.java:782)
> [junit4:junit4]    >    at com.carrotsearch.randomizedtesting.ThreadLeakControl$3.evaluate(ThreadLeakControl.java:442)
> [junit4:junit4]    >    at com.carrotsearch.randomizedtesting.RandomizedRunner.runSingleTest(RandomizedRunner.java:746)
> [junit4:junit4]    >    at com.carrotsearch.randomizedtesting.RandomizedRunner$3.evaluate(RandomizedRunner.java:648)
> [junit4:junit4]    >    at com.carrotsearch.randomizedtesting.RandomizedRunner$4.evaluate(RandomizedRunner.java:682)
> [junit4:junit4]    >    at com.carrotsearch.randomizedtesting.RandomizedRunner$5.evaluate(RandomizedRunner.java:693)
> [junit4:junit4]    >    at org.apache.lucene.util.AbstractBeforeAfterRule$1.evaluate(AbstractBeforeAfterRule.java:45)
> [junit4:junit4]    >    at org.apache.lucene.util.TestRuleStoreClassName$1.evaluate(TestRuleStoreClassName.java:42)
> [junit4:junit4]    >    at com.carrotsearch.randomizedtesting.rules.SystemPropertiesInvariantRule$1.evaluate(SystemPropertiesInvariantRule.java:55)
> [junit4:junit4]    >    at com.carrotsearch.randomizedtesting.rules.NoShadowingOrOverridesOnMethodsRule$1.evaluate(NoShadowingOrOverridesOnMethodsRule.java:39)
> [junit4:junit4]    >    at com.carrotsearch.randomizedtesting.rules.NoShadowingOrOverridesOnMethodsRule$1.evaluate(NoShadowingOrOverridesOnMethodsRule.java:39)
> [junit4:junit4]    >    at com.carrotsearch.randomizedtesting.rules.StatementAdapter.evaluate(StatementAdapter.java:36)
> [junit4:junit4]    >    at org.apache.lucene.util.TestRuleAssertionsRequired$1.evaluate(TestRuleAssertionsRequired.java:43)
> [junit4:junit4]    >    at org.apache.lucene.util.TestRuleMarkFailure$1.evaluate(TestRuleMarkFailure.java:48)
> [junit4:junit4]    >    at org.apache.lucene.util.TestRuleIgnoreAfterMaxFailures$1.evaluate(TestRuleIgnoreAfterMaxFailures.java:70)
> [junit4:junit4]    >    at org.apache.lucene.util.TestRuleIgnoreTestSuites$1.evaluate(TestRuleIgnoreTestSuites.java:55)
> [junit4:junit4]    >    at com.carrotsearch.randomizedtesting.rules.StatementAdapter.evaluate(StatementAdapter.java:36)
> [junit4:junit4]    >    at com.carrotsearch.randomizedtesting.ThreadLeakControl$StatementRunner.run(ThreadLeakControl.java:358)
> [junit4:junit4]    >    at java.lang.Thread.run(Thread.java:722)
> [junit4:junit4]    > Throwable #2: com.carrotsearch.randomizedtesting.UncaughtExceptionError:
Captured an uncaught exception in thread: Thread[id=255, name=Thread-198, state=RUNNABLE,
group=TGRP-TestTimeLimitingCollector]
> [junit4:junit4]    > Caused by: java.lang.OutOfMemoryError: Java heap space
> [junit4:junit4]    >    at __randomizedtesting.SeedInfo.seed([41D53676D3187506]:0)
> [junit4:junit4]    >    at org.apache.lucene.codecs.BlockTreeTermsReader$FieldReader$SegmentTermsEnum$Frame.<init>(BlockTreeTermsReader.java:2266)
> [junit4:junit4]    >    at org.apache.lucene.codecs.BlockTreeTermsReader$FieldReader$SegmentTermsEnum.<init>(BlockTreeTermsReader.java:1275)
> [junit4:junit4]    >    at org.apache.lucene.codecs.BlockTreeTermsReader$FieldReader.iterator(BlockTreeTermsReader.java:525)
> [junit4:junit4]    >    at org.apache.lucene.index.FilterAtomicReader$FilterTerms.iterator(FilterAtomicReader.java:86)
> [junit4:junit4]    >    at org.apache.lucene.index.AssertingAtomicReader$AssertingTerms.iterator(AssertingAtomicReader.java:99)
> [junit4:junit4]    >    at org.apache.lucene.index.MultiTerms.iterator(MultiTerms.java:103)
> [junit4:junit4]    >    at org.apache.lucene.index.TermContext.build(TermContext.java:94)
> [junit4:junit4]    >    at org.apache.lucene.search.TermQuery.createWeight(TermQuery.java:167)
> [junit4:junit4]    >    at org.apache.lucene.search.BooleanQuery$BooleanWeight.<init>(BooleanQuery.java:186)
> [junit4:junit4]    >    at org.apache.lucene.search.BooleanQuery.createWeight(BooleanQuery.java:400)
> [junit4:junit4]    >    at org.apache.lucene.search.IndexSearcher.createNormalizedWeight(IndexSearcher.java:648)
> [junit4:junit4]    >    at org.apache.lucene.search.AssertingIndexSearcher.createNormalizedWeight(AssertingIndexSearcher.java:60)
> [junit4:junit4]    >    at org.apache.lucene.search.IndexSearcher.search(IndexSearcher.java:293)
> [junit4:junit4]    >    at org.apache.lucene.search.TestTimeLimitingCollector.search(TestTimeLimitingCollector.java:124)
> [junit4:junit4]    >    at org.apache.lucene.search.TestTimeLimitingCollector.doTestSearch(TestTimeLimitingCollector.java:139)
> [junit4:junit4]    >    at org.apache.lucene.search.TestTimeLimitingCollector.access$200(TestTimeLimitingCollector.java:42)
> [junit4:junit4]    >    at org.apache.lucene.search.TestTimeLimitingCollector$1.run(TestTimeLimitingCollector.java:292)
> [junit4:junit4]    > Throwable #3: com.carrotsearch.randomizedtesting.UncaughtExceptionError:
Captured an uncaught exception in thread: Thread[id=232, name=Thread-175, state=RUNNABLE,
group=TGRP-TestTimeLimitingCollector]
> [junit4:junit4]    > Caused by: java.lang.OutOfMemoryError: Java heap space
> [junit4:junit4]    >    at __randomizedtesting.SeedInfo.seed([41D53676D3187506]:0)
> [junit4:junit4]    >    at org.apache.lucene.codecs.BlockTreeTermsReader$FieldReader$SegmentTermsEnum.getFrame(BlockTreeTermsReader.java:1414)
> [junit4:junit4]    >    at org.apache.lucene.codecs.BlockTreeTermsReader$FieldReader$SegmentTermsEnum.pushFrame(BlockTreeTermsReader.java:1445)
> [junit4:junit4]    >    at org.apache.lucene.codecs.BlockTreeTermsReader$FieldReader$SegmentTermsEnum.next(BlockTreeTermsReader.java:2079)
> [junit4:junit4]    >    at org.apache.lucene.index.FilterAtomicReader$FilterTermsEnum.next(FilterAtomicReader.java:163)
> [junit4:junit4]    >    at org.apache.lucene.index.AssertingAtomicReader$AssertingTermsEnum.next(AssertingAtomicReader.java:144)
> [junit4:junit4]    >    at org.apache.lucene.index.MultiTermsEnum.reset(MultiTermsEnum.java:128)
> [junit4:junit4]    >    at org.apache.lucene.index.MultiTerms.iterator(MultiTerms.java:110)
> [junit4:junit4]    >    at org.apache.lucene.index.TermContext.build(TermContext.java:94)
> [junit4:junit4]    >    at org.apache.lucene.search.TermQuery.createWeight(TermQuery.java:167)
> [junit4:junit4]    >    at org.apache.lucene.search.BooleanQuery$BooleanWeight.<init>(BooleanQuery.java:186)
> [junit4:junit4]    >    at org.apache.lucene.search.BooleanQuery.createWeight(BooleanQuery.java:400)
> [junit4:junit4]    >    at org.apache.lucene.search.IndexSearcher.createNormalizedWeight(IndexSearcher.java:648)
> [junit4:junit4]    >    at org.apache.lucene.search.AssertingIndexSearcher.createNormalizedWeight(AssertingIndexSearcher.java:60)
> [junit4:junit4]    >    at org.apache.lucene.search.IndexSearcher.search(IndexSearcher.java:293)
> [junit4:junit4]    >    at org.apache.lucene.search.TestTimeLimitingCollector.search(TestTimeLimitingCollector.java:124)
> [junit4:junit4]    >    at org.apache.lucene.search.TestTimeLimitingCollector.doTestSearch(TestTimeLimitingCollector.java:145)
> [junit4:junit4]    >    at org.apache.lucene.search.TestTimeLimitingCollector.access$200(TestTimeLimitingCollector.java:42)
> [junit4:junit4]    >    at org.apache.lucene.search.TestTimeLimitingCollector$1.run(TestTimeLimitingCollector.java:292)
> [junit4:junit4]    > Throwable #4: com.carrotsearch.randomizedtesting.UncaughtExceptionError:
Captured an uncaught exception in thread: Thread[id=251, name=Thread-194, state=RUNNABLE,
group=TGRP-TestTimeLimitingCollector]
> [junit4:junit4]    > Caused by: java.lang.OutOfMemoryError: Java heap space
> [junit4:junit4]    > Throwable #5: com.carrotsearch.randomizedtesting.UncaughtExceptionError:
Captured an uncaught exception in thread: Thread[id=264, name=Thread-207, state=RUNNABLE,
group=TGRP-TestTimeLimitingCollector]
> [junit4:junit4]    > Caused by: java.lang.OutOfMemoryError: GC overhead limit exceeded
> [junit4:junit4]    >    at __randomizedtesting.SeedInfo.seed([41D53676D3187506]:0)
> [junit4:junit4]    >    at org.apache.lucene.codecs.BlockTreeTermsReader$FieldReader$SegmentTermsEnum.getFrame(BlockTreeTermsReader.java:1414)
> [junit4:junit4]    >    at org.apache.lucene.codecs.BlockTreeTermsReader$FieldReader$SegmentTermsEnum.pushFrame(BlockTreeTermsReader.java:1445)
> [junit4:junit4]    >    at org.apache.lucene.codecs.BlockTreeTermsReader$FieldReader$SegmentTermsEnum.next(BlockTreeTermsReader.java:2079)
> [junit4:junit4]    >    at org.apache.lucene.index.FilterAtomicReader$FilterTermsEnum.next(FilterAtomicReader.java:163)
> [junit4:junit4]    >    at org.apache.lucene.index.AssertingAtomicReader$AssertingTermsEnum.next(AssertingAtomicReader.java:144)
> [junit4:junit4]    >    at org.apache.lucene.index.MultiTermsEnum.reset(MultiTermsEnum.java:128)
> [junit4:junit4]    >    at org.apache.lucene.index.MultiTerms.iterator(MultiTerms.java:110)
> [junit4:junit4]    >    at org.apache.lucene.index.AtomicReader.docFreq(AtomicReader.java:80)
> [junit4:junit4]    >    at org.apache.lucene.search.TermQuery$TermWeight.termNotInReader(TermQuery.java:110)
> [junit4:junit4]    >    at org.apache.lucene.search.TermQuery$TermWeight.getTermsEnum(TermQuery.java:98)
> [junit4:junit4]    >    at org.apache.lucene.search.TermQuery$TermWeight.scorer(TermQuery.java:82)
> [junit4:junit4]    >    at org.apache.lucene.search.BooleanQuery$BooleanWeight.scorer(BooleanQuery.java:322)
> [junit4:junit4]    >    at org.apache.lucene.search.AssertingIndexSearcher$1.scorer(AssertingIndexSearcher.java:80)
> [junit4:junit4]    >    at org.apache.lucene.search.IndexSearcher.search(IndexSearcher.java:587)
> [junit4:junit4]    >    at org.apache.lucene.search.IndexSearcher.search(IndexSearcher.java:293)
> [junit4:junit4]    >    at org.apache.lucene.search.TestTimeLimitingCollector.search(TestTimeLimitingCollector.java:124)
> [junit4:junit4]    >    at org.apache.lucene.search.TestTimeLimitingCollector.doTestSearch(TestTimeLimitingCollector.java:139)
> [junit4:junit4]    >    at org.apache.lucene.search.TestTimeLimitingCollector.access$200(TestTimeLimitingCollector.java:42)
> [junit4:junit4]    >    at org.apache.lucene.search.TestTimeLimitingCollector$1.run(TestTimeLimitingCollector.java:292)
> [junit4:junit4]    > Throwable #6: com.carrotsearch.randomizedtesting.UncaughtExceptionError:
Captured an uncaught exception in thread: Thread[id=223, name=Thread-166, state=RUNNABLE,
group=TGRP-TestTimeLimitingCollector]
> [junit4:junit4]    > Caused by: java.lang.OutOfMemoryError: Java heap space
> [junit4:junit4]    > Throwable #7: com.carrotsearch.randomizedtesting.UncaughtExceptionError:
Captured an uncaught exception in thread: Thread[id=227, name=Thread-170, state=RUNNABLE,
group=TGRP-TestTimeLimitingCollector]
> [junit4:junit4]    > Caused by: java.lang.OutOfMemoryError: Java heap space
> [junit4:junit4]    >    at __randomizedtesting.SeedInfo.seed([41D53676D3187506]:0)
> [junit4:junit4]    >    at org.apache.lucene.codecs.lucene41.Lucene41PostingsReader.newTermState(Lucene41PostingsReader.java:188)
> [junit4:junit4]    >    at org.apache.lucene.codecs.lucene41.Lucene41PostingsReader.newTermState(Lucene41PostingsReader.java:55)
> [junit4:junit4]    >    at org.apache.lucene.codecs.BlockTreeTermsReader$FieldReader$SegmentTermsEnum$Frame.<init>(BlockTreeTermsReader.java:2302)
> [junit4:junit4]    >    at org.apache.lucene.codecs.BlockTreeTermsReader$FieldReader$SegmentTermsEnum.getFrame(BlockTreeTermsReader.java:1414)
> [junit4:junit4]    >    at org.apache.lucene.codecs.BlockTreeTermsReader$FieldReader$SegmentTermsEnum.pushFrame(BlockTreeTermsReader.java:1445)
> [junit4:junit4]    >    at org.apache.lucene.codecs.BlockTreeTermsReader$FieldReader$SegmentTermsEnum.next(BlockTreeTermsReader.java:2079)
> [junit4:junit4]    >    at org.apache.lucene.index.FilterAtomicReader$FilterTermsEnum.next(FilterAtomicReader.java:163)
> [junit4:junit4]    >    at org.apache.lucene.index.AssertingAtomicReader$AssertingTermsEnum.next(AssertingAtomicReader.java:144)
> [junit4:junit4]    >    at org.apache.lucene.index.MultiTermsEnum.reset(MultiTermsEnum.java:128)
> [junit4:junit4]    >    at org.apache.lucene.index.MultiTerms.iterator(MultiTerms.java:110)
> [junit4:junit4]    >    at org.apache.lucene.search.TermQuery$TermWeight.getTermsEnum(TermQuery.java:102)
> [junit4:junit4]    >    at org.apache.lucene.search.TermQuery$TermWeight.scorer(TermQuery.java:82)
> [junit4:junit4]    >    at org.apache.lucene.search.BooleanQuery$BooleanWeight.scorer(BooleanQuery.java:322)
> [junit4:junit4]    >    at org.apache.lucene.search.AssertingIndexSearcher$1.scorer(AssertingIndexSearcher.java:80)
> [junit4:junit4]    >    at org.apache.lucene.search.IndexSearcher.search(IndexSearcher.java:587)
> [junit4:junit4]    >    at org.apache.lucene.search.IndexSearcher.search(IndexSearcher.java:293)
> [junit4:junit4]    >    at org.apache.lucene.search.TestTimeLimitingCollector.search(TestTimeLimitingCollector.java:124)
> [junit4:junit4]    >    at org.apache.lucene.search.TestTimeLimitingCollector.doTestSearch(TestTimeLimitingCollector.java:139)
> [junit4:junit4]    >    at org.apache.lucene.search.TestTimeLimitingCollector.access$200(TestTimeLimitingCollector.java:42)
> [junit4:junit4]    >    at org.apache.lucene.search.TestTimeLimitingCollector$1.run(TestTimeLimitingCollector.java:292)
> [junit4:junit4]   2> NOTE: test params are: codec=Asserting, sim=DefaultSimilarity,
locale=es_US, timezone=US/Arizona
> [junit4:junit4]   2> NOTE: Linux 3.2.0-26-generic amd64/Oracle Corporation 1.7.0_05
(64-bit)/cpus=8,threads=1,free=289192176,total=477233152
> [junit4:junit4]   2> NOTE: All tests run in this JVM: [TestTermScorer, TestPrefixFilter,
TestSubScorerFreqs, TestPerFieldPostingsFormat2, TestTermsEnum2, TestRegexpRandom2, Nested1,
TestPagedBytes, TestSearch, TestStressIndexing2, TestNumericRangeQuery64, TestForceMergeForever,
TestIndexWriterUnicode, TestTermVectors, TestDeterminism, TestBlockPostingsFormat, TestStressAdvance,
TestElevationComparator, TestWindowsMMap, TestOmitPositions, TestTimeLimitingCollector]
> [junit4:junit4] Completed on J5 in 82.56s, 6 tests, 1 error <<< FAILURES!
>
> [...truncated 16 lines...]
> BUILD FAILED
> /var/lib/jenkins/workspace/Lucene-trunk-Linux-Java7-64-test-only/checkout/lucene/build.xml:50:
The following error occurred while executing this line:
> /var/lib/jenkins/workspace/Lucene-trunk-Linux-Java7-64-test-only/checkout/lucene/common-build.xml:1143:
The following error occurred while executing this line:
> /var/lib/jenkins/workspace/Lucene-trunk-Linux-Java7-64-test-only/checkout/lucene/common-build.xml:816:
There were test failures: 317 suites, 1819 tests, 1 error, 20 ignored (10 assumptions)
>
> Total time: 4 minutes 4 seconds
> Build step 'Invoke Ant' marked build as failure
> Archiving artifacts
> Recording test results
> Email was triggered for: Failure
> Sending email for trigger: Failure
>
>
>
>
>
> ---------------------------------------------------------------------
> To unsubscribe, e-mail: dev-unsubscribe@lucene.apache.org
> For additional commands, e-mail: dev-help@lucene.apache.org

---------------------------------------------------------------------
To unsubscribe, e-mail: dev-unsubscribe@lucene.apache.org
For additional commands, e-mail: dev-help@lucene.apache.org


Mime
View raw message