lucene-dev mailing list archives

Site index · List index
Message view « Date » · « Thread »
Top « Date » · « Thread »
From Michael McCandless <luc...@mikemccandless.com>
Subject Re: [JENKINS] Lucene-Solr-NightlyTests-trunk - Build # 56 - Failure
Date Sun, 07 Oct 2012 15:55:29 GMT
Hmmm OOME w/ Test2BPostings ...

It doesn't reproduce standalone, but does reproduce if I run all tests
w/ 2 JVMs (test leak somewhere?)... I'll get a heap dump and look.

Mike McCandless

http://blog.mikemccandless.com

On Sun, Oct 7, 2012 at 3:36 AM, Apache Jenkins Server
<jenkins@builds.apache.org> wrote:
> Build: https://builds.apache.org/job/Lucene-Solr-NightlyTests-trunk/56/
>
> 2 tests failed.
> REGRESSION:  org.apache.lucene.index.Test2BPostings.test
>
> Error Message:
> background merge hit exception: _0(5.0):C10063430 _1(5.0):C10063430 _2(5.0):C10063430
_3(5.0):C10063430 _4(5.0):C10063430 _5(5.0):C10063430 _6(5.0):C10063430 _7(5.0):C10063430
_8(5.0):C2088085 into _9 [maxNumSegments=1]
>
> Stack Trace:
> java.io.IOException: background merge hit exception: _0(5.0):C10063430 _1(5.0):C10063430
_2(5.0):C10063430 _3(5.0):C10063430 _4(5.0):C10063430 _5(5.0):C10063430 _6(5.0):C10063430
_7(5.0):C10063430 _8(5.0):C2088085 into _9 [maxNumSegments=1]
>         at __randomizedtesting.SeedInfo.seed([7A651D74329400BD:F23122AE9C686D45]:0)
>         at org.apache.lucene.index.IndexWriter.forceMerge(IndexWriter.java:1644)
>         at org.apache.lucene.index.IndexWriter.forceMerge(IndexWriter.java:1580)
>         at org.apache.lucene.index.Test2BPostings.test(Test2BPostings.java:81)
>         at sun.reflect.NativeMethodAccessorImpl.invoke0(Native Method)
>         at sun.reflect.NativeMethodAccessorImpl.invoke(NativeMethodAccessorImpl.java:57)
>         at sun.reflect.DelegatingMethodAccessorImpl.invoke(DelegatingMethodAccessorImpl.java:43)
>         at java.lang.reflect.Method.invoke(Method.java:616)
>         at com.carrotsearch.randomizedtesting.RandomizedRunner.invoke(RandomizedRunner.java:1559)
>         at com.carrotsearch.randomizedtesting.RandomizedRunner.access$600(RandomizedRunner.java:79)
>         at com.carrotsearch.randomizedtesting.RandomizedRunner$6.evaluate(RandomizedRunner.java:737)
>         at com.carrotsearch.randomizedtesting.RandomizedRunner$7.evaluate(RandomizedRunner.java:773)
>         at com.carrotsearch.randomizedtesting.RandomizedRunner$8.evaluate(RandomizedRunner.java:787)
>         at org.apache.lucene.util.TestRuleSetupTeardownChained$1.evaluate(TestRuleSetupTeardownChained.java:50)
>         at org.apache.lucene.util.TestRuleFieldCacheSanity$1.evaluate(TestRuleFieldCacheSanity.java:51)
>         at org.apache.lucene.util.AbstractBeforeAfterRule$1.evaluate(AbstractBeforeAfterRule.java:45)
>         at com.carrotsearch.randomizedtesting.rules.SystemPropertiesInvariantRule$1.evaluate(SystemPropertiesInvariantRule.java:55)
>         at org.apache.lucene.util.TestRuleThreadAndTestName$1.evaluate(TestRuleThreadAndTestName.java:48)
>         at org.apache.lucene.util.TestRuleIgnoreAfterMaxFailures$1.evaluate(TestRuleIgnoreAfterMaxFailures.java:70)
>         at org.apache.lucene.util.TestRuleMarkFailure$1.evaluate(TestRuleMarkFailure.java:48)
>         at com.carrotsearch.randomizedtesting.rules.StatementAdapter.evaluate(StatementAdapter.java:36)
>         at com.carrotsearch.randomizedtesting.ThreadLeakControl$StatementRunner.run(ThreadLeakControl.java:358)
>         at com.carrotsearch.randomizedtesting.ThreadLeakControl.forkTimeoutingTask(ThreadLeakControl.java:782)
>         at com.carrotsearch.randomizedtesting.ThreadLeakControl$3.evaluate(ThreadLeakControl.java:442)
>         at com.carrotsearch.randomizedtesting.RandomizedRunner.runSingleTest(RandomizedRunner.java:746)
>         at com.carrotsearch.randomizedtesting.RandomizedRunner$3.evaluate(RandomizedRunner.java:648)
>         at com.carrotsearch.randomizedtesting.RandomizedRunner$4.evaluate(RandomizedRunner.java:682)
>         at com.carrotsearch.randomizedtesting.RandomizedRunner$5.evaluate(RandomizedRunner.java:693)
>         at org.apache.lucene.util.AbstractBeforeAfterRule$1.evaluate(AbstractBeforeAfterRule.java:45)
>         at org.apache.lucene.util.TestRuleStoreClassName$1.evaluate(TestRuleStoreClassName.java:42)
>         at com.carrotsearch.randomizedtesting.rules.SystemPropertiesInvariantRule$1.evaluate(SystemPropertiesInvariantRule.java:55)
>         at com.carrotsearch.randomizedtesting.rules.NoShadowingOrOverridesOnMethodsRule$1.evaluate(NoShadowingOrOverridesOnMethodsRule.java:39)
>         at com.carrotsearch.randomizedtesting.rules.NoShadowingOrOverridesOnMethodsRule$1.evaluate(NoShadowingOrOverridesOnMethodsRule.java:39)
>         at com.carrotsearch.randomizedtesting.rules.StatementAdapter.evaluate(StatementAdapter.java:36)
>         at org.apache.lucene.util.TestRuleAssertionsRequired$1.evaluate(TestRuleAssertionsRequired.java:43)
>         at org.apache.lucene.util.TestRuleMarkFailure$1.evaluate(TestRuleMarkFailure.java:48)
>         at org.apache.lucene.util.TestRuleIgnoreAfterMaxFailures$1.evaluate(TestRuleIgnoreAfterMaxFailures.java:70)
>         at org.apache.lucene.util.TestRuleIgnoreTestSuites$1.evaluate(TestRuleIgnoreTestSuites.java:55)
>         at com.carrotsearch.randomizedtesting.rules.StatementAdapter.evaluate(StatementAdapter.java:36)
>         at com.carrotsearch.randomizedtesting.ThreadLeakControl$StatementRunner.run(ThreadLeakControl.java:358)
>         at java.lang.Thread.run(Thread.java:679)
> Caused by: java.lang.OutOfMemoryError: Java heap space
>         at org.apache.lucene.store.RAMFile.newBuffer(RAMFile.java:75)
>         at org.apache.lucene.store.RAMFile.addBuffer(RAMFile.java:48)
>         at org.apache.lucene.store.RAMOutputStream.switchCurrentBuffer(RAMOutputStream.java:152)
>         at org.apache.lucene.store.RAMOutputStream.writeByte(RAMOutputStream.java:127)
>         at org.apache.lucene.store.DataOutput.writeVLong(DataOutput.java:219)
>         at org.apache.lucene.codecs.MultiLevelSkipListWriter.bufferSkip(MultiLevelSkipListWriter.java:147)
>         at org.apache.lucene.codecs.lucene40.Lucene40PostingsWriter.startDoc(Lucene40PostingsWriter.java:204)
>         at org.apache.lucene.codecs.pulsing.PulsingPostingsWriter.startDoc(PulsingPostingsWriter.java:173)
>         at org.apache.lucene.codecs.PostingsConsumer.merge(PostingsConsumer.java:89)
>         at org.apache.lucene.codecs.TermsConsumer.merge(TermsConsumer.java:110)
>         at org.apache.lucene.codecs.FieldsConsumer.merge(FieldsConsumer.java:71)
>         at org.apache.lucene.index.SegmentMerger.mergeTerms(SegmentMerger.java:314)
>         at org.apache.lucene.index.SegmentMerger.merge(SegmentMerger.java:107)
>         at org.apache.lucene.index.IndexWriter.mergeMiddle(IndexWriter.java:3696)
>         at org.apache.lucene.index.IndexWriter.merge(IndexWriter.java:3308)
>         at org.apache.lucene.index.ConcurrentMergeScheduler.doMerge(ConcurrentMergeScheduler.java:402)
>         at org.apache.lucene.index.ConcurrentMergeScheduler$MergeThread.run(ConcurrentMergeScheduler.java:479)
>
>
> FAILED:  junit.framework.TestSuite.org.apache.lucene.index.Test2BPostings
>
> Error Message:
> Captured an uncaught exception in thread: Thread[id=4435, name=Lucene Merge Thread #0,
state=RUNNABLE, group=TGRP-Test2BPostings]
>
> Stack Trace:
> com.carrotsearch.randomizedtesting.UncaughtExceptionError: Captured an uncaught exception
in thread: Thread[id=4435, name=Lucene Merge Thread #0, state=RUNNABLE, group=TGRP-Test2BPostings]
> Caused by: org.apache.lucene.index.MergePolicy$MergeException: java.lang.OutOfMemoryError:
Java heap space
>         at __randomizedtesting.SeedInfo.seed([7A651D74329400BD]:0)
>         at org.apache.lucene.index.ConcurrentMergeScheduler.handleMergeException(ConcurrentMergeScheduler.java:535)
>         at org.apache.lucene.index.ConcurrentMergeScheduler$MergeThread.run(ConcurrentMergeScheduler.java:508)
> Caused by: java.lang.OutOfMemoryError: Java heap space
>         at org.apache.lucene.store.RAMFile.newBuffer(RAMFile.java:75)
>         at org.apache.lucene.store.RAMFile.addBuffer(RAMFile.java:48)
>         at org.apache.lucene.store.RAMOutputStream.switchCurrentBuffer(RAMOutputStream.java:152)
>         at org.apache.lucene.store.RAMOutputStream.writeByte(RAMOutputStream.java:127)
>         at org.apache.lucene.store.DataOutput.writeVLong(DataOutput.java:219)
>         at org.apache.lucene.codecs.MultiLevelSkipListWriter.bufferSkip(MultiLevelSkipListWriter.java:147)
>         at org.apache.lucene.codecs.lucene40.Lucene40PostingsWriter.startDoc(Lucene40PostingsWriter.java:204)
>         at org.apache.lucene.codecs.pulsing.PulsingPostingsWriter.startDoc(PulsingPostingsWriter.java:173)
>         at org.apache.lucene.codecs.PostingsConsumer.merge(PostingsConsumer.java:89)
>         at org.apache.lucene.codecs.TermsConsumer.merge(TermsConsumer.java:110)
>         at org.apache.lucene.codecs.FieldsConsumer.merge(FieldsConsumer.java:71)
>         at org.apache.lucene.index.SegmentMerger.mergeTerms(SegmentMerger.java:314)
>         at org.apache.lucene.index.SegmentMerger.merge(SegmentMerger.java:107)
>         at org.apache.lucene.index.IndexWriter.mergeMiddle(IndexWriter.java:3696)
>         at org.apache.lucene.index.IndexWriter.merge(IndexWriter.java:3308)
>         at org.apache.lucene.index.ConcurrentMergeScheduler.doMerge(ConcurrentMergeScheduler.java:402)
>         at org.apache.lucene.index.ConcurrentMergeScheduler$MergeThread.run(ConcurrentMergeScheduler.java:479)
>
>
>
>
> Build Log:
> [...truncated 1185 lines...]
> [junit4:junit4] Suite: org.apache.lucene.index.Test2BPostings
> [junit4:junit4]   2> NOTE: download the large Jenkins line-docs file by running 'ant
get-jenkins-line-docs' in the lucene directory.
> [junit4:junit4]   2> NOTE: reproduce with: ant test  -Dtestcase=Test2BPostings -Dtests.method=test
-Dtests.seed=7A651D74329400BD -Dtests.multiplier=3 -Dtests.nightly=true -Dtests.slow=true
-Dtests.linedocsfile=/home/hudson/lucene-data/enwiki.random.lines.txt -Dtests.locale=zh_SG
-Dtests.timezone=Asia/Tbilisi -Dtests.file.encoding=UTF-8
> [junit4:junit4] ERROR    672s J0 | Test2BPostings.test <<<
> [junit4:junit4]    > Throwable #1: java.io.IOException: background merge hit exception:
_0(5.0):C10063430 _1(5.0):C10063430 _2(5.0):C10063430 _3(5.0):C10063430 _4(5.0):C10063430
_5(5.0):C10063430 _6(5.0):C10063430 _7(5.0):C10063430 _8(5.0):C2088085 into _9 [maxNumSegments=1]
> [junit4:junit4]    >    at __randomizedtesting.SeedInfo.seed([7A651D74329400BD:F23122AE9C686D45]:0)
> [junit4:junit4]    >    at org.apache.lucene.index.IndexWriter.forceMerge(IndexWriter.java:1644)
> [junit4:junit4]    >    at org.apache.lucene.index.IndexWriter.forceMerge(IndexWriter.java:1580)
> [junit4:junit4]    >    at org.apache.lucene.index.Test2BPostings.test(Test2BPostings.java:81)
> [junit4:junit4]    >    at sun.reflect.NativeMethodAccessorImpl.invoke0(Native Method)
> [junit4:junit4]    >    at sun.reflect.NativeMethodAccessorImpl.invoke(NativeMethodAccessorImpl.java:57)
> [junit4:junit4]    >    at sun.reflect.DelegatingMethodAccessorImpl.invoke(DelegatingMethodAccessorImpl.java:43)
> [junit4:junit4]    >    at java.lang.reflect.Method.invoke(Method.java:616)
> [junit4:junit4]    >    at com.carrotsearch.randomizedtesting.RandomizedRunner.invoke(RandomizedRunner.java:1559)
> [junit4:junit4]    >    at com.carrotsearch.randomizedtesting.RandomizedRunner.access$600(RandomizedRunner.java:79)
> [junit4:junit4]    >    at com.carrotsearch.randomizedtesting.RandomizedRunner$6.evaluate(RandomizedRunner.java:737)
> [junit4:junit4]    >    at com.carrotsearch.randomizedtesting.RandomizedRunner$7.evaluate(RandomizedRunner.java:773)
> [junit4:junit4]    >    at com.carrotsearch.randomizedtesting.RandomizedRunner$8.evaluate(RandomizedRunner.java:787)
> [junit4:junit4]    >    at org.apache.lucene.util.TestRuleSetupTeardownChained$1.evaluate(TestRuleSetupTeardownChained.java:50)
> [junit4:junit4]    >    at org.apache.lucene.util.TestRuleFieldCacheSanity$1.evaluate(TestRuleFieldCacheSanity.java:51)
> [junit4:junit4]    >    at org.apache.lucene.util.AbstractBeforeAfterRule$1.evaluate(AbstractBeforeAfterRule.java:45)
> [junit4:junit4]    >    at com.carrotsearch.randomizedtesting.rules.SystemPropertiesInvariantRule$1.evaluate(SystemPropertiesInvariantRule.java:55)
> [junit4:junit4]    >    at org.apache.lucene.util.TestRuleThreadAndTestName$1.evaluate(TestRuleThreadAndTestName.java:48)
> [junit4:junit4]    >    at org.apache.lucene.util.TestRuleIgnoreAfterMaxFailures$1.evaluate(TestRuleIgnoreAfterMaxFailures.java:70)
> [junit4:junit4]    >    at org.apache.lucene.util.TestRuleMarkFailure$1.evaluate(TestRuleMarkFailure.java:48)
> [junit4:junit4]    >    at com.carrotsearch.randomizedtesting.rules.StatementAdapter.evaluate(StatementAdapter.java:36)
> [junit4:junit4]    >    at com.carrotsearch.randomizedtesting.ThreadLeakControl$StatementRunner.run(ThreadLeakControl.java:358)
> [junit4:junit4]    >    at com.carrotsearch.randomizedtesting.ThreadLeakControl.forkTimeoutingTask(ThreadLeakControl.java:782)
> [junit4:junit4]    >    at com.carrotsearch.randomizedtesting.ThreadLeakControl$3.evaluate(ThreadLeakControl.java:442)
> [junit4:junit4]    >    at com.carrotsearch.randomizedtesting.RandomizedRunner.runSingleTest(RandomizedRunner.java:746)
> [junit4:junit4]    >    at com.carrotsearch.randomizedtesting.RandomizedRunner$3.evaluate(RandomizedRunner.java:648)
> [junit4:junit4]    >    at com.carrotsearch.randomizedtesting.RandomizedRunner$4.evaluate(RandomizedRunner.java:682)
> [junit4:junit4]    >    at com.carrotsearch.randomizedtesting.RandomizedRunner$5.evaluate(RandomizedRunner.java:693)
> [junit4:junit4]    >    at org.apache.lucene.util.AbstractBeforeAfterRule$1.evaluate(AbstractBeforeAfterRule.java:45)
> [junit4:junit4]    >    at org.apache.lucene.util.TestRuleStoreClassName$1.evaluate(TestRuleStoreClassName.java:42)
> [junit4:junit4]    >    at com.carrotsearch.randomizedtesting.rules.SystemPropertiesInvariantRule$1.evaluate(SystemPropertiesInvariantRule.java:55)
> [junit4:junit4]    >    at com.carrotsearch.randomizedtesting.rules.NoShadowingOrOverridesOnMethodsRule$1.evaluate(NoShadowingOrOverridesOnMethodsRule.java:39)
> [junit4:junit4]    >    at com.carrotsearch.randomizedtesting.rules.NoShadowingOrOverridesOnMethodsRule$1.evaluate(NoShadowingOrOverridesOnMethodsRule.java:39)
> [junit4:junit4]    >    at com.carrotsearch.randomizedtesting.rules.StatementAdapter.evaluate(StatementAdapter.java:36)
> [junit4:junit4]    >    at org.apache.lucene.util.TestRuleAssertionsRequired$1.evaluate(TestRuleAssertionsRequired.java:43)
> [junit4:junit4]    >    at org.apache.lucene.util.TestRuleMarkFailure$1.evaluate(TestRuleMarkFailure.java:48)
> [junit4:junit4]    >    at org.apache.lucene.util.TestRuleIgnoreAfterMaxFailures$1.evaluate(TestRuleIgnoreAfterMaxFailures.java:70)
> [junit4:junit4]    >    at org.apache.lucene.util.TestRuleIgnoreTestSuites$1.evaluate(TestRuleIgnoreTestSuites.java:55)
> [junit4:junit4]    >    at com.carrotsearch.randomizedtesting.rules.StatementAdapter.evaluate(StatementAdapter.java:36)
> [junit4:junit4]    >    at com.carrotsearch.randomizedtesting.ThreadLeakControl$StatementRunner.run(ThreadLeakControl.java:358)
> [junit4:junit4]    >    at java.lang.Thread.run(Thread.java:679)
> [junit4:junit4]    > Caused by: java.lang.OutOfMemoryError: Java heap space
> [junit4:junit4]    >    at org.apache.lucene.store.RAMFile.newBuffer(RAMFile.java:75)
> [junit4:junit4]    >    at org.apache.lucene.store.RAMFile.addBuffer(RAMFile.java:48)
> [junit4:junit4]    >    at org.apache.lucene.store.RAMOutputStream.switchCurrentBuffer(RAMOutputStream.java:152)
> [junit4:junit4]    >    at org.apache.lucene.store.RAMOutputStream.writeByte(RAMOutputStream.java:127)
> [junit4:junit4]    >    at org.apache.lucene.store.DataOutput.writeVLong(DataOutput.java:219)
> [junit4:junit4]    >    at org.apache.lucene.codecs.MultiLevelSkipListWriter.bufferSkip(MultiLevelSkipListWriter.java:147)
> [junit4:junit4]    >    at org.apache.lucene.codecs.lucene40.Lucene40PostingsWriter.startDoc(Lucene40PostingsWriter.java:204)
> [junit4:junit4]    >    at org.apache.lucene.codecs.pulsing.PulsingPostingsWriter.startDoc(PulsingPostingsWriter.java:173)
> [junit4:junit4]    >    at org.apache.lucene.codecs.PostingsConsumer.merge(PostingsConsumer.java:89)
> [junit4:junit4]    >    at org.apache.lucene.codecs.TermsConsumer.merge(TermsConsumer.java:110)
> [junit4:junit4]    >    at org.apache.lucene.codecs.FieldsConsumer.merge(FieldsConsumer.java:71)
> [junit4:junit4]    >    at org.apache.lucene.index.SegmentMerger.mergeTerms(SegmentMerger.java:314)
> [junit4:junit4]    >    at org.apache.lucene.index.SegmentMerger.merge(SegmentMerger.java:107)
> [junit4:junit4]    >    at org.apache.lucene.index.IndexWriter.mergeMiddle(IndexWriter.java:3696)
> [junit4:junit4]    >    at org.apache.lucene.index.IndexWriter.merge(IndexWriter.java:3308)
> [junit4:junit4]    >    at org.apache.lucene.index.ConcurrentMergeScheduler.doMerge(ConcurrentMergeScheduler.java:402)
> [junit4:junit4]    >    at org.apache.lucene.index.ConcurrentMergeScheduler$MergeThread.run(ConcurrentMergeScheduler.java:479)
> [junit4:junit4]   2> NOTE: test params are: codec=Lucene40: {field=PostingsFormat(name=MockRandom)},
sim=RandomSimilarityProvider(queryNorm=true,coord=yes): {}, locale=zh_SG, timezone=Asia/Tbilisi
> [junit4:junit4]   2> NOTE: FreeBSD 9.0-RELEASE amd64/Sun Microsystems Inc. 1.6.0_32
(64-bit)/cpus=16,threads=1,free=66536080,total=477233152
> [junit4:junit4]   2> NOTE: All tests run in this JVM: [TestTopDocsCollector, TestTransactionRollback,
TestAttributeSource, TestDirectoryReaderReopen, TestDeterminism, TestNRTThreads, TestNamedSPILoader,
TestBackwardsCompatibility, TestGraphTokenizers, TestWindowsMMap, TestRegexpQuery, TestIndexableField,
TestSimilarityBase, TestNewestSegment, TestIndexWriter, TestWildcardRandom, TestDeterminizeLexicon,
Nested, Nested, TestScorerPerf, TestPostingsFormat, TestNumericUtils, TestSimilarityProvider,
TestArrayUtil, TestDoubleBarrelLRUCache, TestIndexCommit, TestTransactions, TestPayloadExplanations,
TestNGramPhraseQuery, TestLucene40PostingsFormat, TestCharFilter, TestPayloadsOnVectors, TestSizeBoundedForceMerge,
TestDocValuesTypeCompatibility, TestPayloadNearQuery, TestTimeLimitingCollector, TestPositiveScoresOnlyCollector,
TestFlushByRamOrCountsPolicy, TestDateFilter, TestFieldCacheRangeFilter, TestSumDocFreq, TestByteBlockPool,
TestStressNRT, Nested, Nested, Nested, Nested, Nested, Nested, Nested, Nested, Nested, Nested,
Nested, Nested, Nested, Nested, Nested, Nested, Nested, Nested, Nested, Nested, Nested, TestCachingCollector,
TestFixedBitSet, TestByteSlices, TestTermVectors, TestWeakIdentityMap, TestPhrasePrefixQuery,
TestBytesRefHash, TestDisjunctionMaxQuery, TestRegexpRandom2, TestSetOnce, TestRollingBuffer,
TestCustomSearcherSort, TestConcurrentMergeScheduler, TestPagedBytes, TestMultiMMap, ThrowInUncaught,
TestStressAdvance, TestMergeSchedulerExternal, TestMultiTermConstantScore, NestedSetupChain,
NestedTeardownChain, TestSimilarity2, TestCloseableThreadLocal, TestSpanExplanationsOfNonMatches,
TestPrefixCodedTerms, TestThreadedForceMerge, TestTieredMergePolicy, TestPayloadSpans, TestNoDeletionPolicy,
TestSegmentReader, Nested1, TestStressIndexing2, TestTermScorer, TestSpecialOperations, TestIndexWriterOnJRECrash,
TestSnapshotDeletionPolicy, TestIndexWriterReader, TestLookaheadTokenFilter, TestShardSearching,
TestNumericRangeQuery64, TestDeletionPolicy, TestAtomicUpdate, TestIndexWriterMerging, TestLucene40PostingsReader,
TestOpenBitSet, TestIndexWriterMergePolicy, TestNeverDelete, TestTopDocsMerge, TestSearchAfter,
TestMinimize, TestSloppyPhraseQuery, TestNRTManager, TestSegmentMerger, TestBitVector, TestPostingsOffsets,
TestRandomStoredFields, TestFieldCache, TestRamUsageEstimatorOnWildAnimals, TestMixedCodecs,
TestIndexWriterOnDiskFull, TestWildcard, TestIdentityHashSet, TestCheckIndex, TestDocCount,
TestSearchForDuplicates, TestSmallFloat, TestBinaryTerms, TestParallelReaderEmptyIndex, TestDocument,
TestIndexFileDeleter, TestIndexWriterConfig, TestFilteredSearch, TestCachingWrapperFilter,
Test2BPostings]
> [junit4:junit4]   2> NOTE: download the large Jenkins line-docs file by running 'ant
get-jenkins-line-docs' in the lucene directory.
> [junit4:junit4]   2> NOTE: reproduce with: ant test  -Dtestcase=Test2BPostings -Dtests.seed=7A651D74329400BD
-Dtests.multiplier=3 -Dtests.nightly=true -Dtests.slow=true -Dtests.linedocsfile=/home/hudson/lucene-data/enwiki.random.lines.txt
-Dtests.locale=zh_SG -Dtests.timezone=Asia/Tbilisi -Dtests.file.encoding=UTF-8
> [junit4:junit4] ERROR   0.00s J0 | Test2BPostings (suite) <<<
> [junit4:junit4]    > Throwable #1: com.carrotsearch.randomizedtesting.UncaughtExceptionError:
Captured an uncaught exception in thread: Thread[id=4435, name=Lucene Merge Thread #0, state=RUNNABLE,
group=TGRP-Test2BPostings]
> [junit4:junit4]    > Caused by: org.apache.lucene.index.MergePolicy$MergeException:
java.lang.OutOfMemoryError: Java heap space
> [junit4:junit4]    >    at __randomizedtesting.SeedInfo.seed([7A651D74329400BD]:0)
> [junit4:junit4]    >    at org.apache.lucene.index.ConcurrentMergeScheduler.handleMergeException(ConcurrentMergeScheduler.java:535)
> [junit4:junit4]    >    at org.apache.lucene.index.ConcurrentMergeScheduler$MergeThread.run(ConcurrentMergeScheduler.java:508)
> [junit4:junit4]    > Caused by: java.lang.OutOfMemoryError: Java heap space
> [junit4:junit4]    >    at org.apache.lucene.store.RAMFile.newBuffer(RAMFile.java:75)
> [junit4:junit4]    >    at org.apache.lucene.store.RAMFile.addBuffer(RAMFile.java:48)
> [junit4:junit4]    >    at org.apache.lucene.store.RAMOutputStream.switchCurrentBuffer(RAMOutputStream.java:152)
> [junit4:junit4]    >    at org.apache.lucene.store.RAMOutputStream.writeByte(RAMOutputStream.java:127)
> [junit4:junit4]    >    at org.apache.lucene.store.DataOutput.writeVLong(DataOutput.java:219)
> [junit4:junit4]    >    at org.apache.lucene.codecs.MultiLevelSkipListWriter.bufferSkip(MultiLevelSkipListWriter.java:147)
> [junit4:junit4]    >    at org.apache.lucene.codecs.lucene40.Lucene40PostingsWriter.startDoc(Lucene40PostingsWriter.java:204)
> [junit4:junit4]    >    at org.apache.lucene.codecs.pulsing.PulsingPostingsWriter.startDoc(PulsingPostingsWriter.java:173)
> [junit4:junit4]    >    at org.apache.lucene.codecs.PostingsConsumer.merge(PostingsConsumer.java:89)
> [junit4:junit4]    >    at org.apache.lucene.codecs.TermsConsumer.merge(TermsConsumer.java:110)
> [junit4:junit4]    >    at org.apache.lucene.codecs.FieldsConsumer.merge(FieldsConsumer.java:71)
> [junit4:junit4]    >    at org.apache.lucene.index.SegmentMerger.mergeTerms(SegmentMerger.java:314)
> [junit4:junit4]    >    at org.apache.lucene.index.SegmentMerger.merge(SegmentMerger.java:107)
> [junit4:junit4]    >    at org.apache.lucene.index.IndexWriter.mergeMiddle(IndexWriter.java:3696)
> [junit4:junit4]    >    at org.apache.lucene.index.IndexWriter.merge(IndexWriter.java:3308)
> [junit4:junit4]    >    at org.apache.lucene.index.ConcurrentMergeScheduler.doMerge(ConcurrentMergeScheduler.java:402)
> [junit4:junit4]    >    at org.apache.lucene.index.ConcurrentMergeScheduler$MergeThread.run(ConcurrentMergeScheduler.java:479)
> [junit4:junit4] Completed on J0 in 672.31s, 1 test, 2 errors <<< FAILURES!
>
> [...truncated 11 lines...]
> BUILD FAILED
> /usr/home/hudson/hudson-slave/workspace/Lucene-Solr-NightlyTests-trunk/build.xml:38:
The following error occurred while executing this line:
> /usr/home/hudson/hudson-slave/workspace/Lucene-Solr-NightlyTests-trunk/lucene/build.xml:49:
The following error occurred while executing this line:
> /usr/home/hudson/hudson-slave/workspace/Lucene-Solr-NightlyTests-trunk/lucene/common-build.xml:1143:
The following error occurred while executing this line:
> /usr/home/hudson/hudson-slave/workspace/Lucene-Solr-NightlyTests-trunk/lucene/common-build.xml:816:
There were test failures: 309 suites, 1801 tests, 1 suite-level error, 1 error, 12 ignored
(4 assumptions)
>
> Total time: 38 minutes 15 seconds
> Build step 'Invoke Ant' marked build as failure
> Recording test results
> Email was triggered for: Failure
> Sending email for trigger: Failure
>
>
>
>
> ---------------------------------------------------------------------
> To unsubscribe, e-mail: dev-unsubscribe@lucene.apache.org
> For additional commands, e-mail: dev-help@lucene.apache.org

---------------------------------------------------------------------
To unsubscribe, e-mail: dev-unsubscribe@lucene.apache.org
For additional commands, e-mail: dev-help@lucene.apache.org


Mime
View raw message