lucene-dev mailing list archives

Site index · List index
Message view « Date » · « Thread »
Top « Date » · « Thread »
From Michael McCandless <luc...@mikemccandless.com>
Subject Re: [JENKINS] Lucene-Solr-4.x-Linux (32bit/jdk1.8.0-ea-b58) - Build # 1489 - Failure!
Date Tue, 02 Oct 2012 22:30:20 GMT
Working on this failure (LUCENE-4456) ... but the fix has uncovered
all sorts of other issues ... so we have a branch & jenkins job
running on it ...

Mike McCandless

http://blog.mikemccandless.com

On Tue, Oct 2, 2012 at 7:41 AM, Policeman Jenkins Server
<jenkins@sd-datasolutions.de> wrote:
> Build: http://jenkins.sd-datasolutions.de/job/Lucene-Solr-4.x-Linux/1489/
> Java: 32bit/jdk1.8.0-ea-b58 -client -XX:+UseG1GC
>
> 1 tests failed.
> REGRESSION:  org.apache.lucene.index.TestRollingUpdates.testRollingUpdates
>
> Error Message:
> expected:<5628969> but was:<1023022>
>
> Stack Trace:
> java.lang.AssertionError: expected:<5628969> but was:<1023022>
>         at __randomizedtesting.SeedInfo.seed([85BF90283BFC2E2A:B44915188628BE1]:0)
>         at org.junit.Assert.fail(Assert.java:93)
>         at org.junit.Assert.failNotEquals(Assert.java:647)
>         at org.junit.Assert.assertEquals(Assert.java:128)
>         at org.junit.Assert.assertEquals(Assert.java:472)
>         at org.junit.Assert.assertEquals(Assert.java:456)
>         at org.apache.lucene.index.TestRollingUpdates.testRollingUpdates(TestRollingUpdates.java:150)
>         at sun.reflect.NativeMethodAccessorImpl.invoke0(Native Method)
>         at sun.reflect.NativeMethodAccessorImpl.invoke(NativeMethodAccessorImpl.java:57)
>         at sun.reflect.DelegatingMethodAccessorImpl.invoke(DelegatingMethodAccessorImpl.java:43)
>         at java.lang.reflect.Method.invoke(Method.java:474)
>         at com.carrotsearch.randomizedtesting.RandomizedRunner.invoke(RandomizedRunner.java:1559)
>         at com.carrotsearch.randomizedtesting.RandomizedRunner.access$600(RandomizedRunner.java:79)
>         at com.carrotsearch.randomizedtesting.RandomizedRunner$6.evaluate(RandomizedRunner.java:737)
>         at com.carrotsearch.randomizedtesting.RandomizedRunner$7.evaluate(RandomizedRunner.java:773)
>         at com.carrotsearch.randomizedtesting.RandomizedRunner$8.evaluate(RandomizedRunner.java:787)
>         at org.apache.lucene.util.TestRuleSetupTeardownChained$1.evaluate(TestRuleSetupTeardownChained.java:50)
>         at org.apache.lucene.util.TestRuleFieldCacheSanity$1.evaluate(TestRuleFieldCacheSanity.java:51)
>         at org.apache.lucene.util.AbstractBeforeAfterRule$1.evaluate(AbstractBeforeAfterRule.java:45)
>         at com.carrotsearch.randomizedtesting.rules.SystemPropertiesInvariantRule$1.evaluate(SystemPropertiesInvariantRule.java:55)
>         at org.apache.lucene.util.TestRuleThreadAndTestName$1.evaluate(TestRuleThreadAndTestName.java:48)
>         at org.apache.lucene.util.TestRuleIgnoreAfterMaxFailures$1.evaluate(TestRuleIgnoreAfterMaxFailures.java:70)
>         at org.apache.lucene.util.TestRuleMarkFailure$1.evaluate(TestRuleMarkFailure.java:48)
>         at com.carrotsearch.randomizedtesting.rules.StatementAdapter.evaluate(StatementAdapter.java:36)
>         at com.carrotsearch.randomizedtesting.ThreadLeakControl$StatementRunner.run(ThreadLeakControl.java:358)
>         at com.carrotsearch.randomizedtesting.ThreadLeakControl.forkTimeoutingTask(ThreadLeakControl.java:782)
>         at com.carrotsearch.randomizedtesting.ThreadLeakControl$3.evaluate(ThreadLeakControl.java:442)
>         at com.carrotsearch.randomizedtesting.RandomizedRunner.runSingleTest(RandomizedRunner.java:746)
>         at com.carrotsearch.randomizedtesting.RandomizedRunner$3.evaluate(RandomizedRunner.java:648)
>         at com.carrotsearch.randomizedtesting.RandomizedRunner$4.evaluate(RandomizedRunner.java:682)
>         at com.carrotsearch.randomizedtesting.RandomizedRunner$5.evaluate(RandomizedRunner.java:693)
>         at org.apache.lucene.util.AbstractBeforeAfterRule$1.evaluate(AbstractBeforeAfterRule.java:45)
>         at org.apache.lucene.util.TestRuleStoreClassName$1.evaluate(TestRuleStoreClassName.java:42)
>         at com.carrotsearch.randomizedtesting.rules.SystemPropertiesInvariantRule$1.evaluate(SystemPropertiesInvariantRule.java:55)
>         at com.carrotsearch.randomizedtesting.rules.NoShadowingOrOverridesOnMethodsRule$1.evaluate(NoShadowingOrOverridesOnMethodsRule.java:39)
>         at com.carrotsearch.randomizedtesting.rules.NoShadowingOrOverridesOnMethodsRule$1.evaluate(NoShadowingOrOverridesOnMethodsRule.java:39)
>         at com.carrotsearch.randomizedtesting.rules.StatementAdapter.evaluate(StatementAdapter.java:36)
>         at org.apache.lucene.util.TestRuleAssertionsRequired$1.evaluate(TestRuleAssertionsRequired.java:43)
>         at org.apache.lucene.util.TestRuleMarkFailure$1.evaluate(TestRuleMarkFailure.java:48)
>         at org.apache.lucene.util.TestRuleIgnoreAfterMaxFailures$1.evaluate(TestRuleIgnoreAfterMaxFailures.java:70)
>         at org.apache.lucene.util.TestRuleIgnoreTestSuites$1.evaluate(TestRuleIgnoreTestSuites.java:55)
>         at com.carrotsearch.randomizedtesting.rules.StatementAdapter.evaluate(StatementAdapter.java:36)
>         at com.carrotsearch.randomizedtesting.ThreadLeakControl$StatementRunner.run(ThreadLeakControl.java:358)
>         at java.lang.Thread.run(Thread.java:722)
>
>
>
>
> Build Log:
> [...truncated 444 lines...]
> [junit4:junit4] Suite: org.apache.lucene.index.TestRollingUpdates
> [junit4:junit4]   2> NOTE: reproduce with: ant test  -Dtestcase=TestRollingUpdates
-Dtests.method=testRollingUpdates -Dtests.seed=85BF90283BFC2E2A -Dtests.multiplier=3 -Dtests.slow=true
-Dtests.locale=tr -Dtests.timezone=Indian/Mauritius -Dtests.file.encoding=ISO-8859-1
> [junit4:junit4] FAILURE 1.29s J0 | TestRollingUpdates.testRollingUpdates <<<
> [junit4:junit4]    > Throwable #1: java.lang.AssertionError: expected:<5628969>
but was:<1023022>
> [junit4:junit4]    >    at __randomizedtesting.SeedInfo.seed([85BF90283BFC2E2A:B44915188628BE1]:0)
> [junit4:junit4]    >    at org.junit.Assert.fail(Assert.java:93)
> [junit4:junit4]    >    at org.junit.Assert.failNotEquals(Assert.java:647)
> [junit4:junit4]    >    at org.junit.Assert.assertEquals(Assert.java:128)
> [junit4:junit4]    >    at org.junit.Assert.assertEquals(Assert.java:472)
> [junit4:junit4]    >    at org.junit.Assert.assertEquals(Assert.java:456)
> [junit4:junit4]    >    at org.apache.lucene.index.TestRollingUpdates.testRollingUpdates(TestRollingUpdates.java:150)
> [junit4:junit4]    >    at sun.reflect.NativeMethodAccessorImpl.invoke0(Native Method)
> [junit4:junit4]    >    at sun.reflect.NativeMethodAccessorImpl.invoke(NativeMethodAccessorImpl.java:57)
> [junit4:junit4]    >    at sun.reflect.DelegatingMethodAccessorImpl.invoke(DelegatingMethodAccessorImpl.java:43)
> [junit4:junit4]    >    at java.lang.reflect.Method.invoke(Method.java:474)
> [junit4:junit4]    >    at com.carrotsearch.randomizedtesting.RandomizedRunner.invoke(RandomizedRunner.java:1559)
> [junit4:junit4]    >    at com.carrotsearch.randomizedtesting.RandomizedRunner.access$600(RandomizedRunner.java:79)
> [junit4:junit4]    >    at com.carrotsearch.randomizedtesting.RandomizedRunner$6.evaluate(RandomizedRunner.java:737)
> [junit4:junit4]    >    at com.carrotsearch.randomizedtesting.RandomizedRunner$7.evaluate(RandomizedRunner.java:773)
> [junit4:junit4]    >    at com.carrotsearch.randomizedtesting.RandomizedRunner$8.evaluate(RandomizedRunner.java:787)
> [junit4:junit4]    >    at org.apache.lucene.util.TestRuleSetupTeardownChained$1.evaluate(TestRuleSetupTeardownChained.java:50)
> [junit4:junit4]    >    at org.apache.lucene.util.TestRuleFieldCacheSanity$1.evaluate(TestRuleFieldCacheSanity.java:51)
> [junit4:junit4]    >    at org.apache.lucene.util.AbstractBeforeAfterRule$1.evaluate(AbstractBeforeAfterRule.java:45)
> [junit4:junit4]    >    at com.carrotsearch.randomizedtesting.rules.SystemPropertiesInvariantRule$1.evaluate(SystemPropertiesInvariantRule.java:55)
> [junit4:junit4]    >    at org.apache.lucene.util.TestRuleThreadAndTestName$1.evaluate(TestRuleThreadAndTestName.java:48)
> [junit4:junit4]    >    at org.apache.lucene.util.TestRuleIgnoreAfterMaxFailures$1.evaluate(TestRuleIgnoreAfterMaxFailures.java:70)
> [junit4:junit4]    >    at org.apache.lucene.util.TestRuleMarkFailure$1.evaluate(TestRuleMarkFailure.java:48)
> [junit4:junit4]    >    at com.carrotsearch.randomizedtesting.rules.StatementAdapter.evaluate(StatementAdapter.java:36)
> [junit4:junit4]    >    at com.carrotsearch.randomizedtesting.ThreadLeakControl$StatementRunner.run(ThreadLeakControl.java:358)
> [junit4:junit4]    >    at com.carrotsearch.randomizedtesting.ThreadLeakControl.forkTimeoutingTask(ThreadLeakControl.java:782)
> [junit4:junit4]    >    at com.carrotsearch.randomizedtesting.ThreadLeakControl$3.evaluate(ThreadLeakControl.java:442)
> [junit4:junit4]    >    at com.carrotsearch.randomizedtesting.RandomizedRunner.runSingleTest(RandomizedRunner.java:746)
> [junit4:junit4]    >    at com.carrotsearch.randomizedtesting.RandomizedRunner$3.evaluate(RandomizedRunner.java:648)
> [junit4:junit4]    >    at com.carrotsearch.randomizedtesting.RandomizedRunner$4.evaluate(RandomizedRunner.java:682)
> [junit4:junit4]    >    at com.carrotsearch.randomizedtesting.RandomizedRunner$5.evaluate(RandomizedRunner.java:693)
> [junit4:junit4]    >    at org.apache.lucene.util.AbstractBeforeAfterRule$1.evaluate(AbstractBeforeAfterRule.java:45)
> [junit4:junit4]    >    at org.apache.lucene.util.TestRuleStoreClassName$1.evaluate(TestRuleStoreClassName.java:42)
> [junit4:junit4]    >    at com.carrotsearch.randomizedtesting.rules.SystemPropertiesInvariantRule$1.evaluate(SystemPropertiesInvariantRule.java:55)
> [junit4:junit4]    >    at com.carrotsearch.randomizedtesting.rules.NoShadowingOrOverridesOnMethodsRule$1.evaluate(NoShadowingOrOverridesOnMethodsRule.java:39)
> [junit4:junit4]    >    at com.carrotsearch.randomizedtesting.rules.NoShadowingOrOverridesOnMethodsRule$1.evaluate(NoShadowingOrOverridesOnMethodsRule.java:39)
> [junit4:junit4]    >    at com.carrotsearch.randomizedtesting.rules.StatementAdapter.evaluate(StatementAdapter.java:36)
> [junit4:junit4]    >    at org.apache.lucene.util.TestRuleAssertionsRequired$1.evaluate(TestRuleAssertionsRequired.java:43)
> [junit4:junit4]    >    at org.apache.lucene.util.TestRuleMarkFailure$1.evaluate(TestRuleMarkFailure.java:48)
> [junit4:junit4]    >    at org.apache.lucene.util.TestRuleIgnoreAfterMaxFailures$1.evaluate(TestRuleIgnoreAfterMaxFailures.java:70)
> [junit4:junit4]    >    at org.apache.lucene.util.TestRuleIgnoreTestSuites$1.evaluate(TestRuleIgnoreTestSuites.java:55)
> [junit4:junit4]    >    at com.carrotsearch.randomizedtesting.rules.StatementAdapter.evaluate(StatementAdapter.java:36)
> [junit4:junit4]    >    at com.carrotsearch.randomizedtesting.ThreadLeakControl$StatementRunner.run(ThreadLeakControl.java:358)
> [junit4:junit4]    >    at java.lang.Thread.run(Thread.java:722)
> [junit4:junit4]   2> NOTE: test params are: codec=SimpleText, sim=DefaultSimilarity,
locale=tr, timezone=Indian/Mauritius
> [junit4:junit4]   2> NOTE: Linux 3.2.0-31-generic i386/Oracle Corporation 1.8.0-ea
(32-bit)/cpus=8,threads=1,free=45636776,total=102760448
> [junit4:junit4]   2> NOTE: All tests run in this JVM: [TestPagedBytes, TestByteArrayDataInput,
TestWeakIdentityMap, TestSizeBoundedForceMerge, TestPrefixCodedTerms, TestTieredMergePolicy,
TestThreadedForceMerge, TestFixedBitSet, TestMultiLevelSkipList, TestAttributeSource, NestedSetupChain,
NestedTeardownChain, TestCachingCollector, TestTransactions, TestBufferedIndexInput, Nested,
TestIndexWriterExceptions, TestIndexWriterOnJRECrash, TestDeletionPolicy, TestBooleanQuery,
TestSpecialOperations, TestMultiMMap, TestPayloads, TestStressIndexing2, TestBinaryDocument,
TestPostingsFormat, TestMergeSchedulerExternal, TestIndexCommit, TestSnapshotDeletionPolicy,
TestMultiThreadTermVectors, TestLevenshteinAutomata, TestWindowsMMap, TestPayloadsOnVectors,
TestTermdocPerf, TestNoDeletionPolicy, TestIndexWriterCommit, TestTopScoreDocCollector, TestConsistentFieldNumbers,
TestReaderClosed, TestSetOnce, TestFieldCacheTermsFilter, TestBitUtil, TestWildcard, TestRollingUpdates]
> [junit4:junit4] Completed on J0 in 1.60s, 2 tests, 1 failure <<< FAILURES!
>
> [...truncated 770 lines...]
> BUILD FAILED
> /mnt/ssd/jenkins/workspace/Lucene-Solr-4.x-Linux/build.xml:38: The following error occurred
while executing this line:
> /mnt/ssd/jenkins/workspace/Lucene-Solr-4.x-Linux/lucene/build.xml:49: The following error
occurred while executing this line:
> /mnt/ssd/jenkins/workspace/Lucene-Solr-4.x-Linux/lucene/common-build.xml:1143: The following
error occurred while executing this line:
> /mnt/ssd/jenkins/workspace/Lucene-Solr-4.x-Linux/lucene/common-build.xml:816: There were
test failures: 314 suites, 1833 tests, 1 failure, 16 ignored (8 assumptions)
>
> Total time: 6 minutes 25 seconds
> Build step 'Invoke Ant' marked build as failure
> Recording test results
> Description set: Java: 32bit/jdk1.8.0-ea-b58 -client -XX:+UseG1GC
> Email was triggered for: Failure
> Sending email for trigger: Failure
>
>
>
>
> ---------------------------------------------------------------------
> To unsubscribe, e-mail: dev-unsubscribe@lucene.apache.org
> For additional commands, e-mail: dev-help@lucene.apache.org

---------------------------------------------------------------------
To unsubscribe, e-mail: dev-unsubscribe@lucene.apache.org
For additional commands, e-mail: dev-help@lucene.apache.org


Mime
View raw message