lucene-dev mailing list archives

Site index · List index
Message view « Date » · « Thread »
Top « Date » · « Thread »
From Mark Miller <markrmil...@gmail.com>
Subject Re: Build failed in Jenkins: fast-io-beasting #6138
Date Sun, 28 Oct 2012 16:17:59 GMT
I tried raising the timeout a bit here since this seems to be intermittent.

On Oct 28, 2012, at 12:08 PM, Charlie Cron <hudsonseviltwin@gmail.com> wrote:

> See <http://sierranevada.servebeer.com/job/fast-io-beasting/6138/>
> 
> ------------------------------------------
> [...truncated 13310 lines...]
> [junit4:junit4]   2> 87794 T10 oazs.FinalRequestProcessor.shutdown shutdown of request
processor complete
> [junit4:junit4]   2> 87794 T10 oasc.ChaosMonkey.monkeyLog monkey: stop shard! 46093
> [junit4:junit4]   2> 87795 T10 oasc.CoreContainer.shutdown Shutting down CoreContainer
instance=1371706360
> [junit4:junit4]   2> 87796 T10 oasc.SolrCore.close [collection1]  CLOSING SolrCore
org.apache.solr.core.SolrCore@1f635484
> [junit4:junit4]   2> 87796 T10 oasu.DirectUpdateHandler2.close closing DirectUpdateHandler2{commits=0,autocommits=0,soft
autocommits=0,optimizes=0,rollbacks=0,expungeDeletes=0,docsPending=0,adds=0,deletesById=0,deletesByQuery=0,errors=0,cumulative_adds=0,cumulative_deletesById=0,cumulative_deletesByQuery=0,cumulative_errors=0}
> [junit4:junit4]   2> 87797 T10 oasc.SolrCore.decrefSolrCoreState Closing SolrCoreState
> [junit4:junit4]   2> 87797 T10 oasu.DefaultSolrCoreState.closeIndexWriter SolrCoreState
ref count has reached 0 - closing IndexWriter
> [junit4:junit4]   2> 87798 T10 oasu.DefaultSolrCoreState.closeIndexWriter closing
IndexWriter with IndexWriterCloser
> [junit4:junit4]   2> 87799 T10 oasc.SolrCore.closeSearcher [collection1] Closing main
searcher on request.
> [junit4:junit4]   2> 87801 T32 oasc.Overseer$ClusterStateUpdater.amILeader According
to ZK I (id=88567990930702338-127.0.0.1:46093_solr-n_0000000000) am no longer a leader.
> [junit4:junit4]   2> 87889 T83 oascc.ConnectionManager.process Watcher org.apache.solr.common.cloud.ConnectionManager@7b8353cf
name:ZooKeeperConnection Watcher:127.0.0.1:54501/solr got event WatchedEvent state:Disconnected
type:None path:null path:null type:None
> [junit4:junit4]   2> 87890 T83 oascc.ConnectionManager.process zkClient has disconnected
> [junit4:junit4]   2> 87890 T109 oascc.ConnectionManager.process Watcher org.apache.solr.common.cloud.ConnectionManager@758c3b7
name:ZooKeeperConnection Watcher:127.0.0.1:54501/solr got event WatchedEvent state:Disconnected
type:None path:null path:null type:None
> [junit4:junit4]   2> 87890 T109 oascc.ConnectionManager.process zkClient has disconnected
> [junit4:junit4]   2> 87892 T69 oascc.ConnectionManager.process Watcher org.apache.solr.common.cloud.ConnectionManager@62a34b91
name:ZooKeeperConnection Watcher:127.0.0.1:54501/solr got event WatchedEvent state:Disconnected
type:None path:null path:null type:None
> [junit4:junit4]   2> 87892 T10 oaz.ZooKeeper.close Session: 0x13aa81e55e50002 closed
> [junit4:junit4]   2> 87892 T31 oascc.ConnectionManager.process Watcher org.apache.solr.common.cloud.ConnectionManager@1edfbb43
name:ZooKeeperConnection Watcher:127.0.0.1:54501/solr got event WatchedEvent state:Disconnected
type:None path:null path:null type:None
> [junit4:junit4]   2> 87892 T69 oascc.ConnectionManager.process zkClient has disconnected
> [junit4:junit4]   2> 87893 T45 oascc.ConnectionManager.process Watcher org.apache.solr.common.cloud.ConnectionManager@58dcdffc
name:ZooKeeperConnection Watcher:127.0.0.1:54501/solr got event WatchedEvent state:Disconnected
type:None path:null path:null type:None
> [junit4:junit4]   2> 87893 T57 oascc.ConnectionManager.process Watcher org.apache.solr.common.cloud.ConnectionManager@7331f919
name:ZooKeeperConnection Watcher:127.0.0.1:54501/solr got event WatchedEvent state:Disconnected
type:None path:null path:null type:None
> [junit4:junit4]   2> 87894 T45 oascc.ConnectionManager.process zkClient has disconnected
> [junit4:junit4]   2> 87893 T31 oascc.ConnectionManager.process Client->ZooKeeper
status change trigger but we are already closed
> [junit4:junit4]   2> 87894 T97 oascc.ConnectionManager.process Watcher org.apache.solr.common.cloud.ConnectionManager@fe14de0
name:ZooKeeperConnection Watcher:127.0.0.1:54501/solr got event WatchedEvent state:Disconnected
type:None path:null path:null type:None
> [junit4:junit4]   2> 87894 T31 oaz.ClientCnxn$EventThread.run EventThread shut down
> [junit4:junit4]   2> 87895 T97 oascc.ConnectionManager.process zkClient has disconnected
> [junit4:junit4]   2> 87895 T57 oascc.ConnectionManager.process zkClient has disconnected
> [junit4:junit4]   2> 87914 T10 oejsh.ContextHandler.doStop stopped o.e.j.s.ServletContextHandler{/solr,null}
> [junit4:junit4]   2> 87967 T10 oasc.ChaosMonkey.monkeyLog monkey: stop shard! 48747
> [junit4:junit4]   2> 87968 T10 oasc.CoreContainer.shutdown Shutting down CoreContainer
instance=336575420
> [junit4:junit4]   2> 87968 T10 oasc.SolrCore.close [collection1]  CLOSING SolrCore
org.apache.solr.core.SolrCore@134683c0
> [junit4:junit4]   2> 87969 T10 oasu.DirectUpdateHandler2.close closing DirectUpdateHandler2{commits=1,autocommits=0,soft
autocommits=0,optimizes=0,rollbacks=0,expungeDeletes=0,docsPending=0,adds=0,deletesById=0,deletesByQuery=0,errors=0,cumulative_adds=0,cumulative_deletesById=0,cumulative_deletesByQuery=0,cumulative_errors=0}
> [junit4:junit4]   2> 87970 T10 oasc.SolrCore.decrefSolrCoreState Closing SolrCoreState
> [junit4:junit4]   2> 87970 T10 oasu.DefaultSolrCoreState.closeIndexWriter SolrCoreState
ref count has reached 0 - closing IndexWriter
> [junit4:junit4]   2> 87971 T10 oasu.DefaultSolrCoreState.closeIndexWriter closing
IndexWriter with IndexWriterCloser
> [junit4:junit4]   2> 87973 T10 oasc.SolrCore.closeSearcher [collection1] Closing main
searcher on request.
> [junit4:junit4]   2> 88060 T13 oazs.SessionTrackerImpl.run SessionTrackerImpl exited
loop!
> [junit4:junit4]   2> 89130 T56 oaz.ClientCnxn$SendThread.startConnect Opening socket
connection to server localhost.localdomain/127.0.0.1:54501
> [junit4:junit4]   2> 89131 T56 oaz.ClientCnxn$SendThread.run WARNING Session 0x13aa81e55e50004
for server null, unexpected error, closing socket connection and attempting reconnect java.net.ConnectException:
Connection refused
> [junit4:junit4]   2> 	at sun.nio.ch.SocketChannelImpl.checkConnect(Native Method)
> [junit4:junit4]   2> 	at sun.nio.ch.SocketChannelImpl.finishConnect(SocketChannelImpl.java:567)
> [junit4:junit4]   2> 	at org.apache.zookeeper.ClientCnxn$SendThread.run(ClientCnxn.java:1143)
> [junit4:junit4]   2> 
> [junit4:junit4]   2> 89300 T96 oaz.ClientCnxn$SendThread.startConnect Opening socket
connection to server localhost.localdomain/127.0.0.1:54501
> [junit4:junit4]   2> 89301 T96 oaz.ClientCnxn$SendThread.run WARNING Session 0x13aa81e55e50007
for server null, unexpected error, closing socket connection and attempting reconnect java.net.ConnectException:
Connection refused
> [junit4:junit4]   2> 	at sun.nio.ch.SocketChannelImpl.checkConnect(Native Method)
> [junit4:junit4]   2> 	at sun.nio.ch.SocketChannelImpl.finishConnect(SocketChannelImpl.java:567)
> [junit4:junit4]   2> 	at org.apache.zookeeper.ClientCnxn$SendThread.run(ClientCnxn.java:1143)
> [junit4:junit4]   2> 
> [junit4:junit4]   2> 89371 T68 oaz.ClientCnxn$SendThread.startConnect Opening socket
connection to server localhost.localdomain/127.0.0.1:54501
> [junit4:junit4]   2> 89372 T68 oaz.ClientCnxn$SendThread.run WARNING Session 0x13aa81e55e50005
for server null, unexpected error, closing socket connection and attempting reconnect java.net.ConnectException:
Connection refused
> [junit4:junit4]   2> 	at sun.nio.ch.SocketChannelImpl.checkConnect(Native Method)
> [junit4:junit4]   2> 	at sun.nio.ch.SocketChannelImpl.finishConnect(SocketChannelImpl.java:567)
> [junit4:junit4]   2> 	at org.apache.zookeeper.ClientCnxn$SendThread.run(ClientCnxn.java:1143)
> [junit4:junit4]   2> 
> [junit4:junit4]   2> 89453 T108 oaz.ClientCnxn$SendThread.startConnect Opening socket
connection to server localhost.localdomain/127.0.0.1:54501
> [junit4:junit4]   2> 89454 T108 oaz.ClientCnxn$SendThread.run WARNING Session 0x13aa81e55e50008
for server null, unexpected error, closing socket connection and attempting reconnect java.net.ConnectException:
Connection refused
> [junit4:junit4]   2> 	at sun.nio.ch.SocketChannelImpl.checkConnect(Native Method)
> [junit4:junit4]   2> 	at sun.nio.ch.SocketChannelImpl.finishConnect(SocketChannelImpl.java:567)
> [junit4:junit4]   2> 	at org.apache.zookeeper.ClientCnxn$SendThread.run(ClientCnxn.java:1143)
> [junit4:junit4]   2> 
> [junit4:junit4]   2> 89562 T44 oaz.ClientCnxn$SendThread.startConnect Opening socket
connection to server localhost.localdomain/127.0.0.1:54501
> [junit4:junit4]   2> 89663 T45 oaz.ClientCnxn$EventThread.run EventThread shut down
> [junit4:junit4]   2> 89663 T10 oaz.ZooKeeper.close Session: 0x13aa81e55e50003 closed
> [junit4:junit4]   2> 89686 T10 oejsh.ContextHandler.doStop stopped o.e.j.s.ServletContextHandler{/solr,null}
> [junit4:junit4]   2> 89739 T10 oasc.ChaosMonkey.monkeyLog monkey: stop shard! 51445
> [junit4:junit4]   2> 89740 T10 oasc.CoreContainer.shutdown Shutting down CoreContainer
instance=1615363167
> [junit4:junit4]   2> 89740 T10 oasc.SolrCore.close [collection1]  CLOSING SolrCore
org.apache.solr.core.SolrCore@7102be12
> [junit4:junit4]   2> 89741 T10 oasu.DirectUpdateHandler2.close closing DirectUpdateHandler2{commits=2,autocommits=0,soft
autocommits=0,optimizes=0,rollbacks=0,expungeDeletes=0,docsPending=0,adds=0,deletesById=0,deletesByQuery=0,errors=0,cumulative_adds=0,cumulative_deletesById=0,cumulative_deletesByQuery=0,cumulative_errors=0}
> [junit4:junit4]   2> 89741 T10 oasc.SolrCore.decrefSolrCoreState Closing SolrCoreState
> [junit4:junit4]   2> 89742 T10 oasu.DefaultSolrCoreState.closeIndexWriter SolrCoreState
ref count has reached 0 - closing IndexWriter
> [junit4:junit4]   2> 89742 T10 oasu.DefaultSolrCoreState.closeIndexWriter closing
IndexWriter with IndexWriterCloser
> [junit4:junit4]   2> 89744 T10 oasc.SolrCore.closeSearcher [collection1] Closing main
searcher on request.
> [junit4:junit4]   2> 89745 T82 oaz.ClientCnxn$SendThread.startConnect Opening socket
connection to server localhost.localdomain/127.0.0.1:54501
> [junit4:junit4]   2> 89746 T82 oaz.ClientCnxn$SendThread.run WARNING Session 0x13aa81e55e50006
for server null, unexpected error, closing socket connection and attempting reconnect java.net.ConnectException:
Connection refused
> [junit4:junit4]   2> 	at sun.nio.ch.SocketChannelImpl.checkConnect(Native Method)
> [junit4:junit4]   2> 	at sun.nio.ch.SocketChannelImpl.finishConnect(SocketChannelImpl.java:567)
> [junit4:junit4]   2> 	at org.apache.zookeeper.ClientCnxn$SendThread.run(ClientCnxn.java:1143)
> [junit4:junit4]   2> 
> [junit4:junit4]   2> 90439 T56 oaz.ClientCnxn$SendThread.startConnect Opening socket
connection to server localhost.localdomain/127.0.0.1:54501
> [junit4:junit4]   2> 90540 T57 oaz.ClientCnxn$EventThread.run EventThread shut down
> [junit4:junit4]   2> 90540 T10 oaz.ZooKeeper.close Session: 0x13aa81e55e50004 closed
> [junit4:junit4]   2> 90563 T10 oejsh.ContextHandler.doStop stopped o.e.j.s.ServletContextHandler{/solr,null}
> [junit4:junit4]   2> 90617 T10 oasc.ChaosMonkey.monkeyLog monkey: stop shard! 47675
> [junit4:junit4]   2> 90617 T10 oasc.CoreContainer.shutdown Shutting down CoreContainer
instance=1309141002
> [junit4:junit4]   2> 90618 T10 oasc.SolrCore.close [collection1]  CLOSING SolrCore
org.apache.solr.core.SolrCore@4927d15e
> [junit4:junit4]   2> 90618 T10 oasu.DirectUpdateHandler2.close closing DirectUpdateHandler2{commits=1,autocommits=0,soft
autocommits=0,optimizes=0,rollbacks=0,expungeDeletes=0,docsPending=0,adds=0,deletesById=0,deletesByQuery=0,errors=0,cumulative_adds=0,cumulative_deletesById=0,cumulative_deletesByQuery=0,cumulative_errors=0}
> [junit4:junit4]   2> 90619 T10 oasc.SolrCore.decrefSolrCoreState Closing SolrCoreState
> [junit4:junit4]   2> 90620 T10 oasu.DefaultSolrCoreState.closeIndexWriter SolrCoreState
ref count has reached 0 - closing IndexWriter
> [junit4:junit4]   2> 90620 T10 oasu.DefaultSolrCoreState.closeIndexWriter closing
IndexWriter with IndexWriterCloser
> [junit4:junit4]   2> 90622 T10 oasc.SolrCore.closeSearcher [collection1] Closing main
searcher on request.
> [junit4:junit4]   2> 90783 T68 oaz.ClientCnxn$SendThread.startConnect Opening socket
connection to server localhost.localdomain/127.0.0.1:54501
> [junit4:junit4]   2> 90814 T96 oaz.ClientCnxn$SendThread.startConnect Opening socket
connection to server localhost.localdomain/127.0.0.1:54501
> [junit4:junit4]   2> 90815 T96 oaz.ClientCnxn$SendThread.run WARNING Session 0x13aa81e55e50007
for server null, unexpected error, closing socket connection and attempting reconnect java.net.ConnectException:
Connection refused
> [junit4:junit4]   2> 	at sun.nio.ch.SocketChannelImpl.checkConnect(Native Method)
> [junit4:junit4]   2> 	at sun.nio.ch.SocketChannelImpl.finishConnect(SocketChannelImpl.java:567)
> [junit4:junit4]   2> 	at org.apache.zookeeper.ClientCnxn$SendThread.run(ClientCnxn.java:1143)
> [junit4:junit4]   2> 
> [junit4:junit4]   2> 90884 T69 oaz.ClientCnxn$EventThread.run EventThread shut down
> [junit4:junit4]   2> 90884 T10 oaz.ZooKeeper.close Session: 0x13aa81e55e50005 closed
> [junit4:junit4]   2> 90907 T10 oejsh.ContextHandler.doStop stopped o.e.j.s.ServletContextHandler{/solr,null}
> [junit4:junit4]   2> 90959 T10 oasc.ChaosMonkey.monkeyLog monkey: stop shard! 40265
> [junit4:junit4]   2> 90960 T10 oasc.CoreContainer.shutdown Shutting down CoreContainer
instance=1176318351
> [junit4:junit4]   2> 90960 T10 oasc.SolrCore.close [collection1]  CLOSING SolrCore
org.apache.solr.core.SolrCore@61697d14
> [junit4:junit4]   2> 90961 T10 oasu.DirectUpdateHandler2.close closing DirectUpdateHandler2{commits=1,autocommits=0,soft
autocommits=0,optimizes=0,rollbacks=0,expungeDeletes=0,docsPending=0,adds=0,deletesById=0,deletesByQuery=0,errors=0,cumulative_adds=0,cumulative_deletesById=0,cumulative_deletesByQuery=0,cumulative_errors=0}
> [junit4:junit4]   2> 90962 T10 oasc.SolrCore.decrefSolrCoreState Closing SolrCoreState
> [junit4:junit4]   2> 90962 T10 oasu.DefaultSolrCoreState.closeIndexWriter SolrCoreState
ref count has reached 0 - closing IndexWriter
> [junit4:junit4]   2> 90963 T10 oasu.DefaultSolrCoreState.closeIndexWriter closing
IndexWriter with IndexWriterCloser
> [junit4:junit4]   2> 90965 T10 oasc.SolrCore.closeSearcher [collection1] Closing main
searcher on request.
> [junit4:junit4]   2> 91142 T82 oaz.ClientCnxn$SendThread.startConnect Opening socket
connection to server localhost.localdomain/127.0.0.1:54501
> [junit4:junit4]   2> 91212 T108 oaz.ClientCnxn$SendThread.startConnect Opening socket
connection to server localhost.localdomain/127.0.0.1:54501
> [junit4:junit4]   2> 91212 T108 oaz.ClientCnxn$SendThread.run WARNING Session 0x13aa81e55e50008
for server null, unexpected error, closing socket connection and attempting reconnect java.net.ConnectException:
Connection refused
> [junit4:junit4]   2> 	at sun.nio.ch.SocketChannelImpl.checkConnect(Native Method)
> [junit4:junit4]   2> 	at sun.nio.ch.SocketChannelImpl.finishConnect(SocketChannelImpl.java:567)
> [junit4:junit4]   2> 	at org.apache.zookeeper.ClientCnxn$SendThread.run(ClientCnxn.java:1143)
> [junit4:junit4]   2> 
> [junit4:junit4]   2> 91243 T83 oaz.ClientCnxn$EventThread.run EventThread shut down
> [junit4:junit4]   2> 91243 T10 oaz.ZooKeeper.close Session: 0x13aa81e55e50006 closed
> [junit4:junit4]   2> 91266 T10 oejsh.ContextHandler.doStop stopped o.e.j.s.ServletContextHandler{/solr,null}
> [junit4:junit4]   2> 91318 T10 oasc.ChaosMonkey.monkeyLog monkey: stop shard! 36645
> [junit4:junit4]   2> 91318 T10 oasc.CoreContainer.shutdown Shutting down CoreContainer
instance=983837745
> [junit4:junit4]   2> 92071 T96 oaz.ClientCnxn$SendThread.startConnect Opening socket
connection to server localhost.localdomain/127.0.0.1:54501
> [junit4:junit4]   2> 92172 T97 oaz.ClientCnxn$EventThread.run EventThread shut down
> [junit4:junit4]   2> 92172 T10 oaz.ZooKeeper.close Session: 0x13aa81e55e50007 closed
> [junit4:junit4]   2> 92195 T10 oejsh.ContextHandler.doStop stopped o.e.j.s.ServletContextHandler{/solr,null}
> [junit4:junit4]   2> 92246 T10 oasc.ChaosMonkey.monkeyLog monkey: stop shard! 47426
> [junit4:junit4]   2> 92246 T10 oasc.CoreContainer.shutdown Shutting down CoreContainer
instance=1644466253
> [junit4:junit4]   2> 92247 T10 oasc.SolrCore.close [collection1]  CLOSING SolrCore
org.apache.solr.core.SolrCore@37d7f3f4
> [junit4:junit4]   2> 92247 T10 oasu.DirectUpdateHandler2.close closing DirectUpdateHandler2{commits=1,autocommits=0,soft
autocommits=0,optimizes=0,rollbacks=0,expungeDeletes=0,docsPending=0,adds=0,deletesById=0,deletesByQuery=0,errors=0,cumulative_adds=0,cumulative_deletesById=0,cumulative_deletesByQuery=0,cumulative_errors=0}
> [junit4:junit4]   2> 92248 T10 oasc.SolrCore.decrefSolrCoreState Closing SolrCoreState
> [junit4:junit4]   2> 92249 T10 oasu.DefaultSolrCoreState.closeIndexWriter SolrCoreState
ref count has reached 0 - closing IndexWriter
> [junit4:junit4]   2> 92249 T10 oasu.DefaultSolrCoreState.closeIndexWriter closing
IndexWriter with IndexWriterCloser
> [junit4:junit4]   2> 92251 T10 oasc.SolrCore.closeSearcher [collection1] Closing main
searcher on request.
> [junit4:junit4]   2> 93097 T108 oaz.ClientCnxn$SendThread.startConnect Opening socket
connection to server localhost.localdomain/127.0.0.1:54501
> [junit4:junit4]   2> 93198 T109 oaz.ClientCnxn$EventThread.run EventThread shut down
> [junit4:junit4]   2> 93198 T10 oaz.ZooKeeper.close Session: 0x13aa81e55e50008 closed
> [junit4:junit4]   2> 93221 T10 oejsh.ContextHandler.doStop stopped o.e.j.s.ServletContextHandler{/solr,null}
> [junit4:junit4]   2> 93311 T10 oas.SolrTestCaseJ4.tearDown ###Ending testDistribSearch
> [junit4:junit4]   2> NOTE: reproduce with: ant test  -Dtestcase=CloudSolrServerTest
-Dtests.method=testDistribSearch -Dtests.seed=FE8F25ED949C08C0 -Dtests.slow=true -Dtests.locale=sv
-Dtests.timezone=Portugal -Dtests.file.encoding=ISO-8859-1
> [junit4:junit4] FAILURE 93.2s J0 | CloudSolrServerTest.testDistribSearch <<<
> [junit4:junit4]    > Throwable #1: java.lang.AssertionError: There are still nodes
recoverying
> [junit4:junit4]    > 	at __randomizedtesting.SeedInfo.seed([FE8F25ED949C08C0:7F69ABF5E3C368FC]:0)
> [junit4:junit4]    > 	at org.junit.Assert.fail(Assert.java:93)
> [junit4:junit4]    > 	at org.apache.solr.cloud.AbstractDistribZkTestBase.waitForRecoveriesToFinish(AbstractDistribZkTestBase.java:154)
> [junit4:junit4]    > 	at org.apache.solr.cloud.AbstractFullDistribZkTestBase.waitForRecoveriesToFinish(AbstractFullDistribZkTestBase.java:558)
> [junit4:junit4]    > 	at org.apache.solr.cloud.AbstractFullDistribZkTestBase.waitForThingsToLevelOut(AbstractFullDistribZkTestBase.java:1133)
> [junit4:junit4]    > 	at org.apache.solr.client.solrj.impl.CloudSolrServerTest.doTest(CloudSolrServerTest.java:95)
> [junit4:junit4]    > 	at org.apache.solr.BaseDistributedSearchTestCase.testDistribSearch(BaseDistributedSearchTestCase.java:695)
> [junit4:junit4]    > 	at sun.reflect.NativeMethodAccessorImpl.invoke0(Native Method)
> [junit4:junit4]    > 	at sun.reflect.NativeMethodAccessorImpl.invoke(NativeMethodAccessorImpl.java:39)
> [junit4:junit4]    > 	at sun.reflect.DelegatingMethodAccessorImpl.invoke(DelegatingMethodAccessorImpl.java:25)
> [junit4:junit4]    > 	at java.lang.reflect.Method.invoke(Method.java:597)
> [junit4:junit4]    > 	at com.carrotsearch.randomizedtesting.RandomizedRunner.invoke(RandomizedRunner.java:1559)
> [junit4:junit4]    > 	at com.carrotsearch.randomizedtesting.RandomizedRunner.access$600(RandomizedRunner.java:79)
> [junit4:junit4]    > 	at com.carrotsearch.randomizedtesting.RandomizedRunner$6.evaluate(RandomizedRunner.java:737)
> [junit4:junit4]    > 	at com.carrotsearch.randomizedtesting.RandomizedRunner$7.evaluate(RandomizedRunner.java:773)
> [junit4:junit4]    > 	at com.carrotsearch.randomizedtesting.RandomizedRunner$8.evaluate(RandomizedRunner.java:787)
> [junit4:junit4]    > 	at com.carrotsearch.randomizedtesting.rules.SystemPropertiesRestoreRule$1.evaluate(SystemPropertiesRestoreRule.java:53)
> [junit4:junit4]    > 	at org.apache.lucene.util.TestRuleSetupTeardownChained$1.evaluate(TestRuleSetupTeardownChained.java:50)
> [junit4:junit4]    > 	at org.apache.lucene.util.TestRuleFieldCacheSanity$1.evaluate(TestRuleFieldCacheSanity.java:51)
> [junit4:junit4]    > 	at org.apache.lucene.util.AbstractBeforeAfterRule$1.evaluate(AbstractBeforeAfterRule.java:45)
> [junit4:junit4]    > 	at com.carrotsearch.randomizedtesting.rules.SystemPropertiesInvariantRule$1.evaluate(SystemPropertiesInvariantRule.java:55)
> [junit4:junit4]    > 	at org.apache.lucene.util.TestRuleThreadAndTestName$1.evaluate(TestRuleThreadAndTestName.java:48)
> [junit4:junit4]    > 	at org.apache.lucene.util.TestRuleIgnoreAfterMaxFailures$1.evaluate(TestRuleIgnoreAfterMaxFailures.java:70)
> [junit4:junit4]    > 	at org.apache.lucene.util.TestRuleMarkFailure$1.evaluate(TestRuleMarkFailure.java:48)
> [junit4:junit4]    > 	at com.carrotsearch.randomizedtesting.rules.StatementAdapter.evaluate(StatementAdapter.java:36)
> [junit4:junit4]    > 	at com.carrotsearch.randomizedtesting.ThreadLeakControl$StatementRunner.run(ThreadLeakControl.java:358)
> [junit4:junit4]    > 	at com.carrotsearch.randomizedtesting.ThreadLeakControl.forkTimeoutingTask(ThreadLeakControl.java:782)
> [junit4:junit4]    > 	at com.carrotsearch.randomizedtesting.ThreadLeakControl$3.evaluate(ThreadLeakControl.java:442)
> [junit4:junit4]    > 	at com.carrotsearch.randomizedtesting.RandomizedRunner.runSingleTest(RandomizedRunner.java:746)
> [junit4:junit4]    > 	at com.carrotsearch.randomizedtesting.RandomizedRunner$3.evaluate(RandomizedRunner.java:648)
> [junit4:junit4]    > 	at com.carrotsearch.randomizedtesting.RandomizedRunner$4.evaluate(RandomizedRunner.java:682)
> [junit4:junit4]    > 	at com.carrotsearch.randomizedtesting.RandomizedRunner$5.evaluate(RandomizedRunner.java:693)
> [junit4:junit4]    > 	at com.carrotsearch.randomizedtesting.rules.StatementAdapter.evaluate(StatementAdapter.java:36)
> [junit4:junit4]    > 	at com.carrotsearch.randomizedtesting.rules.SystemPropertiesRestoreRule$1.evaluate(SystemPropertiesRestoreRule.java:53)
> [junit4:junit4]    > 	at org.apache.lucene.util.AbstractBeforeAfterRule$1.evaluate(AbstractBeforeAfterRule.java:45)
> [junit4:junit4]    > 	at org.apache.lucene.util.TestRuleStoreClassName$1.evaluate(TestRuleStoreClassName.java:42)
> [junit4:junit4]    > 	at com.carrotsearch.randomizedtesting.rules.SystemPropertiesInvariantRule$1.evaluate(SystemPropertiesInvariantRule.java:55)
> [junit4:junit4]    > 	at com.carrotsearch.randomizedtesting.rules.NoShadowingOrOverridesOnMethodsRule$1.evaluate(NoShadowingOrOverridesOnMethodsRule.java:39)
> [junit4:junit4]    > 	at com.carrotsearch.randomizedtesting.rules.NoShadowingOrOverridesOnMethodsRule$1.evaluate(NoShadowingOrOverridesOnMethodsRule.java:39)
> [junit4:junit4]    > 	at com.carrotsearch.randomizedtesting.rules.StatementAdapter.evaluate(StatementAdapter.java:36)
> [junit4:junit4]    > 	at org.apache.lucene.util.TestRuleAssertionsRequired$1.evaluate(TestRuleAssertionsRequired.java:43)
> [junit4:junit4]    > 	at org.apache.lucene.util.TestRuleMarkFailure$1.evaluate(TestRuleMarkFailure.java:48)
> [junit4:junit4]    > 	at org.apache.lucene.util.TestRuleIgnoreAfterMaxFailures$1.evaluate(TestRuleIgnoreAfterMaxFailures.java:70)
> [junit4:junit4]    > 	at org.apache.lucene.util.TestRuleIgnoreTestSuites$1.evaluate(TestRuleIgnoreTestSuites.java:55)
> [junit4:junit4]    > 	at com.carrotsearch.randomizedtesting.rules.StatementAdapter.evaluate(StatementAdapter.java:36)
> [junit4:junit4]    > 	at com.carrotsearch.randomizedtesting.ThreadLeakControl$StatementRunner.run(ThreadLeakControl.java:358)
> [junit4:junit4]    > 	at java.lang.Thread.run(Thread.java:662)
> [junit4:junit4]   2> 93336 T10 oas.SolrTestCaseJ4.deleteCore ###deleteCore
> [junit4:junit4]   2> 214348 T10 oas.SolrTestCaseJ4.endTrackingSearchers SEVERE ERROR:
SolrIndexSearcher opens=12 closes=11
> [junit4:junit4]   2> NOTE: test params are: codec=Compressing(storedFieldsFormat=CompressingStoredFieldsFormat(compressionMode=HIGH_COMPRESSION,
chunkSize=36, storedFieldsIndex=DISK_DOC)), sim=DefaultSimilarity, locale=sv, timezone=Portugal
> [junit4:junit4]   2> NOTE: Linux 3.2.0-24-generic amd64/Sun Microsystems Inc. 1.6.0_27
(64-bit)/cpus=8,threads=1,free=190132040,total=304742400
> [junit4:junit4]   2> NOTE: All tests run in this JVM: [CloudSolrServerTest]
> [junit4:junit4]   2> NOTE: reproduce with: ant test  -Dtestcase=CloudSolrServerTest
-Dtests.seed=FE8F25ED949C08C0 -Dtests.slow=true -Dtests.locale=sv -Dtests.timezone=Portugal
-Dtests.file.encoding=ISO-8859-1
> [junit4:junit4] ERROR   0.00s J0 | CloudSolrServerTest (suite) <<<
> [junit4:junit4]    > Throwable #1: java.lang.AssertionError: ERROR: SolrIndexSearcher
opens=12 closes=11
> [junit4:junit4]    > 	at __randomizedtesting.SeedInfo.seed([FE8F25ED949C08C0]:0)
> [junit4:junit4]    > 	at org.junit.Assert.fail(Assert.java:93)
> [junit4:junit4]    > 	at org.apache.solr.SolrTestCaseJ4.endTrackingSearchers(SolrTestCaseJ4.java:242)
> [junit4:junit4]    > 	at org.apache.solr.SolrTestCaseJ4.afterClass(SolrTestCaseJ4.java:97)
> [junit4:junit4]    > 	at sun.reflect.NativeMethodAccessorImpl.invoke0(Native Method)
> [junit4:junit4]    > 	at sun.reflect.NativeMethodAccessorImpl.invoke(NativeMethodAccessorImpl.java:39)
> [junit4:junit4]    > 	at sun.reflect.DelegatingMethodAccessorImpl.invoke(DelegatingMethodAccessorImpl.java:25)
> [junit4:junit4]    > 	at java.lang.reflect.Method.invoke(Method.java:597)
> [junit4:junit4]    > 	at com.carrotsearch.randomizedtesting.RandomizedRunner.invoke(RandomizedRunner.java:1559)
> [junit4:junit4]    > 	at com.carrotsearch.randomizedtesting.RandomizedRunner.access$600(RandomizedRunner.java:79)
> [junit4:junit4]    > 	at com.carrotsearch.randomizedtesting.RandomizedRunner$5.evaluate(RandomizedRunner.java:700)
> [junit4:junit4]    > 	at com.carrotsearch.randomizedtesting.rules.StatementAdapter.evaluate(StatementAdapter.java:36)
> [junit4:junit4]    > 	at com.carrotsearch.randomizedtesting.rules.SystemPropertiesRestoreRule$1.evaluate(SystemPropertiesRestoreRule.java:53)
> [junit4:junit4]    > 	at org.apache.lucene.util.AbstractBeforeAfterRule$1.evaluate(AbstractBeforeAfterRule.java:45)
> [junit4:junit4]    > 	at org.apache.lucene.util.TestRuleStoreClassName$1.evaluate(TestRuleStoreClassName.java:42)
> [junit4:junit4]    > 	at com.carrotsearch.randomizedtesting.rules.SystemPropertiesInvariantRule$1.evaluate(SystemPropertiesInvariantRule.java:55)
> [junit4:junit4]    > 	at com.carrotsearch.randomizedtesting.rules.NoShadowingOrOverridesOnMethodsRule$1.evaluate(NoShadowingOrOverridesOnMethodsRule.java:39)
> [junit4:junit4]    > 	at com.carrotsearch.randomizedtesting.rules.NoShadowingOrOverridesOnMethodsRule$1.evaluate(NoShadowingOrOverridesOnMethodsRule.java:39)
> [junit4:junit4]    > 	at com.carrotsearch.randomizedtesting.rules.StatementAdapter.evaluate(StatementAdapter.java:36)
> [junit4:junit4]    > 	at org.apache.lucene.util.TestRuleAssertionsRequired$1.evaluate(TestRuleAssertionsRequired.java:43)
> [junit4:junit4]    > 	at org.apache.lucene.util.TestRuleMarkFailure$1.evaluate(TestRuleMarkFailure.java:48)
> [junit4:junit4]    > 	at org.apache.lucene.util.TestRuleIgnoreAfterMaxFailures$1.evaluate(TestRuleIgnoreAfterMaxFailures.java:70)
> [junit4:junit4]    > 	at org.apache.lucene.util.TestRuleIgnoreTestSuites$1.evaluate(TestRuleIgnoreTestSuites.java:55)
> [junit4:junit4]    > 	at com.carrotsearch.randomizedtesting.rules.StatementAdapter.evaluate(StatementAdapter.java:36)
> [junit4:junit4]    > 	at com.carrotsearch.randomizedtesting.ThreadLeakControl$StatementRunner.run(ThreadLeakControl.java:358)
> [junit4:junit4]    > 	at java.lang.Thread.run(Thread.java:662)
> [junit4:junit4] Completed on J0 in 215.52s, 1 test, 2 failures <<< FAILURES!
> [junit4:junit4] 
> [junit4:junit4] 
> [junit4:junit4] Tests with failures:
> [junit4:junit4]   - org.apache.solr.client.solrj.impl.CloudSolrServerTest.testDistribSearch
> [junit4:junit4]   - org.apache.solr.client.solrj.impl.CloudSolrServerTest (suite)
> [junit4:junit4] 
> [junit4:junit4] 
> [junit4:junit4] JVM J0:     1.13 ..   217.38 =   216.26s
> [junit4:junit4] JVM J1:     0.89 ..    22.80 =    21.91s
> [junit4:junit4] JVM J2:     0.91 ..    22.79 =    21.88s
> [junit4:junit4] JVM J3:     1.13 ..    20.64 =    19.51s
> [junit4:junit4] JVM J4:     0.89 ..    20.41 =    19.52s
> [junit4:junit4] JVM J5:     0.89 ..    20.47 =    19.58s
> [junit4:junit4] JVM J6:     0.89 ..    45.09 =    44.20s
> [junit4:junit4] JVM J7:     0.90 ..    20.15 =    19.24s
> [junit4:junit4] Execution time total: 3 minutes 37 seconds
> [junit4:junit4] Tests summary: 43 suites, 239 tests, 1 suite-level error, 1 failure
> 
> BUILD FAILED
> <http://sierranevada.servebeer.com/job/fast-io-beasting/ws/build.xml>:39: The following
error occurred while executing this line:
> <http://sierranevada.servebeer.com/job/fast-io-beasting/ws/solr/build.xml>:185:
The following error occurred while executing this line:
> <http://sierranevada.servebeer.com/job/fast-io-beasting/ws/lucene/module-build.xml>:61:
The following error occurred while executing this line:
> <http://sierranevada.servebeer.com/job/fast-io-beasting/ws/lucene/common-build.xml>:1159:
The following error occurred while executing this line:
> <http://sierranevada.servebeer.com/job/fast-io-beasting/ws/lucene/common-build.xml>:827:
There were test failures: 43 suites, 239 tests, 1 suite-level error, 1 failure
> 
> Total time: 11 minutes 7 seconds
> Build step 'Invoke Ant' marked build as failure
> 
> ---------------------------------------------------------------------
> To unsubscribe, e-mail: dev-unsubscribe@lucene.apache.org
> For additional commands, e-mail: dev-help@lucene.apache.org
> 


---------------------------------------------------------------------
To unsubscribe, e-mail: dev-unsubscribe@lucene.apache.org
For additional commands, e-mail: dev-help@lucene.apache.org


Mime
View raw message