lucene-dev mailing list archives

Site index · List index
Message view « Date » · « Thread »
Top « Date » · « Thread »
From Policeman Jenkins Server <jenk...@sd-datasolutions.de>
Subject [JENKINS] Lucene-Solr-4.x-Windows (32bit/jdk1.6.0_35) - Build # 1359 - Failure!
Date Tue, 30 Oct 2012 03:53:57 GMT
Build: http://jenkins.sd-datasolutions.de/job/Lucene-Solr-4.x-Windows/1359/
Java: 32bit/jdk1.6.0_35 -server -XX:+UseParallelGC

1 tests failed.
REGRESSION:  org.apache.solr.cloud.SyncSliceTest.testDistribSearch

Error Message:
There are still nodes recoverying - waited for 15 seconds

Stack Trace:
java.lang.AssertionError: There are still nodes recoverying - waited for 15 seconds
	at __randomizedtesting.SeedInfo.seed([654008ECAB1AD0A:87B28E96BDEECD36]:0)
	at org.junit.Assert.fail(Assert.java:93)
	at org.apache.solr.cloud.AbstractDistribZkTestBase.waitForRecoveriesToFinish(AbstractDistribZkTestBase.java:165)
	at org.apache.solr.cloud.AbstractFullDistribZkTestBase.waitForRecoveriesToFinish(AbstractFullDistribZkTestBase.java:558)
	at org.apache.solr.cloud.AbstractFullDistribZkTestBase.waitForThingsToLevelOut(AbstractFullDistribZkTestBase.java:1133)
	at org.apache.solr.cloud.SyncSliceTest.doTest(SyncSliceTest.java:89)
	at org.apache.solr.BaseDistributedSearchTestCase.testDistribSearch(BaseDistributedSearchTestCase.java:695)
	at sun.reflect.NativeMethodAccessorImpl.invoke0(Native Method)
	at sun.reflect.NativeMethodAccessorImpl.invoke(NativeMethodAccessorImpl.java:39)
	at sun.reflect.DelegatingMethodAccessorImpl.invoke(DelegatingMethodAccessorImpl.java:25)
	at java.lang.reflect.Method.invoke(Method.java:597)
	at com.carrotsearch.randomizedtesting.RandomizedRunner.invoke(RandomizedRunner.java:1559)
	at com.carrotsearch.randomizedtesting.RandomizedRunner.access$600(RandomizedRunner.java:79)
	at com.carrotsearch.randomizedtesting.RandomizedRunner$6.evaluate(RandomizedRunner.java:737)
	at com.carrotsearch.randomizedtesting.RandomizedRunner$7.evaluate(RandomizedRunner.java:773)
	at com.carrotsearch.randomizedtesting.RandomizedRunner$8.evaluate(RandomizedRunner.java:787)
	at com.carrotsearch.randomizedtesting.rules.SystemPropertiesRestoreRule$1.evaluate(SystemPropertiesRestoreRule.java:53)
	at org.apache.lucene.util.TestRuleSetupTeardownChained$1.evaluate(TestRuleSetupTeardownChained.java:50)
	at org.apache.lucene.util.TestRuleFieldCacheSanity$1.evaluate(TestRuleFieldCacheSanity.java:51)
	at org.apache.lucene.util.AbstractBeforeAfterRule$1.evaluate(AbstractBeforeAfterRule.java:45)
	at com.carrotsearch.randomizedtesting.rules.SystemPropertiesInvariantRule$1.evaluate(SystemPropertiesInvariantRule.java:55)
	at org.apache.lucene.util.TestRuleThreadAndTestName$1.evaluate(TestRuleThreadAndTestName.java:48)
	at org.apache.lucene.util.TestRuleIgnoreAfterMaxFailures$1.evaluate(TestRuleIgnoreAfterMaxFailures.java:70)
	at org.apache.lucene.util.TestRuleMarkFailure$1.evaluate(TestRuleMarkFailure.java:48)
	at com.carrotsearch.randomizedtesting.rules.StatementAdapter.evaluate(StatementAdapter.java:36)
	at com.carrotsearch.randomizedtesting.ThreadLeakControl$StatementRunner.run(ThreadLeakControl.java:358)
	at com.carrotsearch.randomizedtesting.ThreadLeakControl.forkTimeoutingTask(ThreadLeakControl.java:782)
	at com.carrotsearch.randomizedtesting.ThreadLeakControl$3.evaluate(ThreadLeakControl.java:442)
	at com.carrotsearch.randomizedtesting.RandomizedRunner.runSingleTest(RandomizedRunner.java:746)
	at com.carrotsearch.randomizedtesting.RandomizedRunner$3.evaluate(RandomizedRunner.java:648)
	at com.carrotsearch.randomizedtesting.RandomizedRunner$4.evaluate(RandomizedRunner.java:682)
	at com.carrotsearch.randomizedtesting.RandomizedRunner$5.evaluate(RandomizedRunner.java:693)
	at com.carrotsearch.randomizedtesting.rules.StatementAdapter.evaluate(StatementAdapter.java:36)
	at com.carrotsearch.randomizedtesting.rules.SystemPropertiesRestoreRule$1.evaluate(SystemPropertiesRestoreRule.java:53)
	at org.apache.lucene.util.AbstractBeforeAfterRule$1.evaluate(AbstractBeforeAfterRule.java:45)
	at org.apache.lucene.util.TestRuleStoreClassName$1.evaluate(TestRuleStoreClassName.java:42)
	at com.carrotsearch.randomizedtesting.rules.SystemPropertiesInvariantRule$1.evaluate(SystemPropertiesInvariantRule.java:55)
	at com.carrotsearch.randomizedtesting.rules.NoShadowingOrOverridesOnMethodsRule$1.evaluate(NoShadowingOrOverridesOnMethodsRule.java:39)
	at com.carrotsearch.randomizedtesting.rules.NoShadowingOrOverridesOnMethodsRule$1.evaluate(NoShadowingOrOverridesOnMethodsRule.java:39)
	at com.carrotsearch.randomizedtesting.rules.StatementAdapter.evaluate(StatementAdapter.java:36)
	at org.apache.lucene.util.TestRuleAssertionsRequired$1.evaluate(TestRuleAssertionsRequired.java:43)
	at org.apache.lucene.util.TestRuleMarkFailure$1.evaluate(TestRuleMarkFailure.java:48)
	at org.apache.lucene.util.TestRuleIgnoreAfterMaxFailures$1.evaluate(TestRuleIgnoreAfterMaxFailures.java:70)
	at org.apache.lucene.util.TestRuleIgnoreTestSuites$1.evaluate(TestRuleIgnoreTestSuites.java:55)
	at com.carrotsearch.randomizedtesting.rules.StatementAdapter.evaluate(StatementAdapter.java:36)
	at com.carrotsearch.randomizedtesting.ThreadLeakControl$StatementRunner.run(ThreadLeakControl.java:358)
	at java.lang.Thread.run(Thread.java:662)




Build Log:
[...truncated 7774 lines...]
[junit4:junit4] Suite: org.apache.solr.cloud.SyncSliceTest
[junit4:junit4]   2> 3 T788 oas.SolrTestCaseJ4.setUp ###Starting testDistribSearch
[junit4:junit4]   2> Creating dataDir: C:\Users\JenkinsSlave\workspace\Lucene-Solr-4.x-Windows\solr\build\solr-core\test\J0\.\solrtest-SyncSliceTest-1351568219942
[junit4:junit4]   2> 6 T788 oasc.ZkTestServer.run STARTING ZK TEST SERVER
[junit4:junit4]   2> 10 T789 oazs.ZooKeeperServer.setTickTime tickTime set to 1000
[junit4:junit4]   2> 11 T789 oazs.NIOServerCnxn$Factory.<init> binding to port 0.0.0.0/0.0.0.0:0
[junit4:junit4]   2> 12 T789 oazsp.FileTxnSnapLog.save Snapshotting: 0
[junit4:junit4]   2> 128 T788 oasc.ZkTestServer.run start zk server on port:52019
[junit4:junit4]   2> 128 T788 oaz.ZooKeeper.<init> Initiating client connection, connectString=127.0.0.1:52019 sessionTimeout=10000 watcher=org.apache.solr.common.cloud.ConnectionManager@3f31f2
[junit4:junit4]   2> 129 T794 oaz.ClientCnxn$SendThread.startConnect Opening socket connection to server /127.0.0.1:52019
[junit4:junit4]   2> 129 T788 oascc.ConnectionManager.waitForConnected Waiting for client to connect to ZooKeeper
[junit4:junit4]   2> 132 T794 oaz.ClientCnxn$SendThread.primeConnection Socket connection established to 127.0.0.1/127.0.0.1:52019, initiating session
[junit4:junit4]   2> 133 T790 oazs.NIOServerCnxn$Factory.run Accepted socket connection from /127.0.0.1:52022
[junit4:junit4]   2> 134 T790 oazs.NIOServerCnxn.readConnectRequest Client attempting to establish new session at /127.0.0.1:52022
[junit4:junit4]   2> 135 T792 oazsp.FileTxnLog.append Creating new log file: log.1
[junit4:junit4]   2> 147 T792 oazs.NIOServerCnxn.finishSessionInit Established session 0x13aafbe5f2e0000 with negotiated timeout 10000 for client /127.0.0.1:52022
[junit4:junit4]   2> 147 T794 oaz.ClientCnxn$SendThread.readConnectResult Session establishment complete on server 127.0.0.1/127.0.0.1:52019, sessionid = 0x13aafbe5f2e0000, negotiated timeout = 10000
[junit4:junit4]   2> 148 T795 oascc.ConnectionManager.process Watcher org.apache.solr.common.cloud.ConnectionManager@3f31f2 name:ZooKeeperConnection Watcher:127.0.0.1:52019 got event WatchedEvent state:SyncConnected type:None path:null path:null type:None
[junit4:junit4]   2> 148 T788 oascc.ConnectionManager.waitForConnected Client is connected to ZooKeeper
[junit4:junit4]   2> 155 T788 oascc.SolrZkClient.makePath makePath: /solr
[junit4:junit4]   2> 175 T793 oazs.PrepRequestProcessor.pRequest Processed session termination for sessionid: 0x13aafbe5f2e0000
[junit4:junit4]   2> 180 T795 oaz.ClientCnxn$EventThread.run EventThread shut down
[junit4:junit4]   2> 180 T788 oaz.ZooKeeper.close Session: 0x13aafbe5f2e0000 closed
[junit4:junit4]   2> 180 T790 oazs.NIOServerCnxn.doIO WARNING EndOfStreamException: Unable to read additional data from client sessionid 0x13aafbe5f2e0000, likely client has closed socket
[junit4:junit4]   2> 180 T788 oaz.ZooKeeper.<init> Initiating client connection, connectString=127.0.0.1:52019/solr sessionTimeout=10000 watcher=org.apache.solr.common.cloud.ConnectionManager@7409cf
[junit4:junit4]   2> 182 T790 oazs.NIOServerCnxn.closeSock Closed socket connection for client /127.0.0.1:52022 which had sessionid 0x13aafbe5f2e0000
[junit4:junit4]   2> 182 T796 oaz.ClientCnxn$SendThread.startConnect Opening socket connection to server /127.0.0.1:52019
[junit4:junit4]   2> 182 T788 oascc.ConnectionManager.waitForConnected Waiting for client to connect to ZooKeeper
[junit4:junit4]   2> 184 T796 oaz.ClientCnxn$SendThread.primeConnection Socket connection established to 127.0.0.1/127.0.0.1:52019, initiating session
[junit4:junit4]   2> 184 T790 oazs.NIOServerCnxn$Factory.run Accepted socket connection from /127.0.0.1:52025
[junit4:junit4]   2> 185 T790 oazs.NIOServerCnxn.readConnectRequest Client attempting to establish new session at /127.0.0.1:52025
[junit4:junit4]   2> 187 T792 oazs.NIOServerCnxn.finishSessionInit Established session 0x13aafbe5f2e0001 with negotiated timeout 10000 for client /127.0.0.1:52025
[junit4:junit4]   2> 187 T796 oaz.ClientCnxn$SendThread.readConnectResult Session establishment complete on server 127.0.0.1/127.0.0.1:52019, sessionid = 0x13aafbe5f2e0001, negotiated timeout = 10000
[junit4:junit4]   2> 187 T797 oascc.ConnectionManager.process Watcher org.apache.solr.common.cloud.ConnectionManager@7409cf name:ZooKeeperConnection Watcher:127.0.0.1:52019/solr got event WatchedEvent state:SyncConnected type:None path:null path:null type:None
[junit4:junit4]   2> 188 T788 oascc.ConnectionManager.waitForConnected Client is connected to ZooKeeper
[junit4:junit4]   2> 188 T788 oascc.SolrZkClient.makePath makePath: /collections/collection1
[junit4:junit4]   2> 194 T788 oascc.SolrZkClient.makePath makePath: /collections/collection1/shards
[junit4:junit4]   2> 198 T788 oascc.SolrZkClient.makePath makePath: /collections/control_collection
[junit4:junit4]   2> 201 T788 oascc.SolrZkClient.makePath makePath: /collections/control_collection/shards
[junit4:junit4]   2> 207 T788 oasc.AbstractZkTestCase.putConfig put C:\Users\JenkinsSlave\workspace\Lucene-Solr-4.x-Windows\solr\build\solr-core\test-files\solr\collection1\conf\solrconfig.xml to /configs/conf1/solrconfig.xml
[junit4:junit4]   2> 208 T788 oascc.SolrZkClient.makePath makePath: /configs/conf1/solrconfig.xml
[junit4:junit4]   2> 217 T788 oasc.AbstractZkTestCase.putConfig put C:\Users\JenkinsSlave\workspace\Lucene-Solr-4.x-Windows\solr\build\solr-core\test-files\solr\collection1\conf\schema.xml to /configs/conf1/schema.xml
[junit4:junit4]   2> 218 T788 oascc.SolrZkClient.makePath makePath: /configs/conf1/schema.xml
[junit4:junit4]   2> 223 T788 oasc.AbstractZkTestCase.putConfig put C:\Users\JenkinsSlave\workspace\Lucene-Solr-4.x-Windows\solr\build\solr-core\test-files\solr\collection1\conf\solrconfig.xml to /configs/conf1/solrconfig.xml
[junit4:junit4]   2> 224 T788 oascc.SolrZkClient.makePath makePath: /configs/conf1/solrconfig.xml
[junit4:junit4]   2> 234 T788 oasc.AbstractZkTestCase.putConfig put C:\Users\JenkinsSlave\workspace\Lucene-Solr-4.x-Windows\solr\build\solr-core\test-files\solr\collection1\conf\stopwords.txt to /configs/conf1/stopwords.txt
[junit4:junit4]   2> 234 T788 oascc.SolrZkClient.makePath makePath: /configs/conf1/stopwords.txt
[junit4:junit4]   2> 241 T788 oasc.AbstractZkTestCase.putConfig put C:\Users\JenkinsSlave\workspace\Lucene-Solr-4.x-Windows\solr\build\solr-core\test-files\solr\collection1\conf\protwords.txt to /configs/conf1/protwords.txt
[junit4:junit4]   2> 243 T788 oascc.SolrZkClient.makePath makePath: /configs/conf1/protwords.txt
[junit4:junit4]   2> 247 T788 oasc.AbstractZkTestCase.putConfig put C:\Users\JenkinsSlave\workspace\Lucene-Solr-4.x-Windows\solr\build\solr-core\test-files\solr\collection1\conf\currency.xml to /configs/conf1/currency.xml
[junit4:junit4]   2> 249 T788 oascc.SolrZkClient.makePath makePath: /configs/conf1/currency.xml
[junit4:junit4]   2> 253 T788 oasc.AbstractZkTestCase.putConfig put C:\Users\JenkinsSlave\workspace\Lucene-Solr-4.x-Windows\solr\build\solr-core\test-files\solr\collection1\conf\open-exchange-rates.json to /configs/conf1/open-exchange-rates.json
[junit4:junit4]   2> 253 T788 oascc.SolrZkClient.makePath makePath: /configs/conf1/open-exchange-rates.json
[junit4:junit4]   2> 258 T788 oasc.AbstractZkTestCase.putConfig put C:\Users\JenkinsSlave\workspace\Lucene-Solr-4.x-Windows\solr\build\solr-core\test-files\solr\collection1\conf\mapping-ISOLatin1Accent.txt to /configs/conf1/mapping-ISOLatin1Accent.txt
[junit4:junit4]   2> 259 T788 oascc.SolrZkClient.makePath makePath: /configs/conf1/mapping-ISOLatin1Accent.txt
[junit4:junit4]   2> 266 T788 oasc.AbstractZkTestCase.putConfig put C:\Users\JenkinsSlave\workspace\Lucene-Solr-4.x-Windows\solr\build\solr-core\test-files\solr\collection1\conf\old_synonyms.txt to /configs/conf1/old_synonyms.txt
[junit4:junit4]   2> 266 T788 oascc.SolrZkClient.makePath makePath: /configs/conf1/old_synonyms.txt
[junit4:junit4]   2> 271 T788 oasc.AbstractZkTestCase.putConfig put C:\Users\JenkinsSlave\workspace\Lucene-Solr-4.x-Windows\solr\build\solr-core\test-files\solr\collection1\conf\synonyms.txt to /configs/conf1/synonyms.txt
[junit4:junit4]   2> 272 T788 oascc.SolrZkClient.makePath makePath: /configs/conf1/synonyms.txt
[junit4:junit4]   2> 277 T793 oazs.PrepRequestProcessor.pRequest Processed session termination for sessionid: 0x13aafbe5f2e0001
[junit4:junit4]   2> 278 T797 oaz.ClientCnxn$EventThread.run EventThread shut down
[junit4:junit4]   2> 278 T788 oaz.ZooKeeper.close Session: 0x13aafbe5f2e0001 closed
[junit4:junit4]   2> 278 T790 oazs.NIOServerCnxn.doIO WARNING EndOfStreamException: Unable to read additional data from client sessionid 0x13aafbe5f2e0001, likely client has closed socket
[junit4:junit4]   2> 279 T790 oazs.NIOServerCnxn.closeSock Closed socket connection for client /127.0.0.1:52025 which had sessionid 0x13aafbe5f2e0001
[junit4:junit4]   2> 283 T788 oejs.Server.doStart jetty-8.1.2.v20120308
[junit4:junit4]   2> 286 T788 oejs.AbstractConnector.doStart Started SelectChannelConnector@0.0.0.0:52026
[junit4:junit4]   2> 286 T788 oasc.SolrResourceLoader.locateSolrHome JNDI not configured for solr (NoInitialContextEx)
[junit4:junit4]   2> 286 T788 oasc.SolrResourceLoader.locateSolrHome using system property solr.solr.home: C:\Users\JenkinsSlave\workspace\Lucene-Solr-4.x-Windows\solr\build\solr-core\test-files\solr
[junit4:junit4]   2> 288 T788 oasc.SolrResourceLoader.<init> new SolrResourceLoader for deduced Solr Home: 'C:\Users\JenkinsSlave\workspace\Lucene-Solr-4.x-Windows\solr\build\solr-core\test-files\solr\'
[junit4:junit4]   2> 317 T788 oass.SolrDispatchFilter.init SolrDispatchFilter.init()
[junit4:junit4]   2> 317 T788 oasc.SolrResourceLoader.locateSolrHome JNDI not configured for solr (NoInitialContextEx)
[junit4:junit4]   2> 323 T788 oasc.SolrResourceLoader.locateSolrHome using system property solr.solr.home: C:\Users\JenkinsSlave\workspace\Lucene-Solr-4.x-Windows\solr\build\solr-core\test-files\solr
[junit4:junit4]   2> 323 T788 oasc.CoreContainer$Initializer.initialize looking for solr.xml: C:\Users\JenkinsSlave\workspace\Lucene-Solr-4.x-Windows\solr\build\solr-core\test-files\solr\solr.xml
[junit4:junit4]   2> 323 T788 oasc.CoreContainer.<init> New CoreContainer 23834833
[junit4:junit4]   2> 324 T788 oasc.CoreContainer.load Loading CoreContainer using Solr Home: 'C:\Users\JenkinsSlave\workspace\Lucene-Solr-4.x-Windows\solr\build\solr-core\test-files\solr\'
[junit4:junit4]   2> 324 T788 oasc.SolrResourceLoader.<init> new SolrResourceLoader for directory: 'C:\Users\JenkinsSlave\workspace\Lucene-Solr-4.x-Windows\solr\build\solr-core\test-files\solr\'
[junit4:junit4]   2> 345 T788 oasc.CoreContainer.load Registering Log Listener
[junit4:junit4]   2> 362 T788 oasc.CoreContainer.initZooKeeper Zookeeper client=127.0.0.1:52019/solr
[junit4:junit4]   2> 362 T788 oaz.ZooKeeper.<init> Initiating client connection, connectString=127.0.0.1:52019/solr sessionTimeout=5000 watcher=org.apache.solr.common.cloud.ConnectionManager@155d88d
[junit4:junit4]   2> 364 T807 oaz.ClientCnxn$SendThread.startConnect Opening socket connection to server /127.0.0.1:52019
[junit4:junit4]   2> 364 T788 oascc.ConnectionManager.waitForConnected Waiting for client to connect to ZooKeeper
[junit4:junit4]   2> 367 T807 oaz.ClientCnxn$SendThread.primeConnection Socket connection established to 127.0.0.1/127.0.0.1:52019, initiating session
[junit4:junit4]   2> 367 T790 oazs.NIOServerCnxn$Factory.run Accepted socket connection from /127.0.0.1:52031
[junit4:junit4]   2> 367 T790 oazs.NIOServerCnxn.readConnectRequest Client attempting to establish new session at /127.0.0.1:52031
[junit4:junit4]   2> 383 T792 oazs.NIOServerCnxn.finishSessionInit Established session 0x13aafbe5f2e0002 with negotiated timeout 5000 for client /127.0.0.1:52031
[junit4:junit4]   2> 383 T807 oaz.ClientCnxn$SendThread.readConnectResult Session establishment complete on server 127.0.0.1/127.0.0.1:52019, sessionid = 0x13aafbe5f2e0002, negotiated timeout = 5000
[junit4:junit4]   2> 383 T808 oascc.ConnectionManager.process Watcher org.apache.solr.common.cloud.ConnectionManager@155d88d name:ZooKeeperConnection Watcher:127.0.0.1:52019/solr got event WatchedEvent state:SyncConnected type:None path:null path:null type:None
[junit4:junit4]   2> 383 T788 oascc.ConnectionManager.waitForConnected Client is connected to ZooKeeper
[junit4:junit4]   2> 432 T793 oazs.PrepRequestProcessor.pRequest Got user-level KeeperException when processing sessionid:0x13aafbe5f2e0002 type:create cxid:0x2 zxid:0xfffffffffffffffe txntype:unknown reqpath:n/a Error Path:/solr/overseer Error:KeeperErrorCode = NodeExists for /solr/overseer
[junit4:junit4]   2> 467 T788 oascc.SolrZkClient.makePath makePath: /live_nodes
[junit4:junit4]   2> 504 T788 oasc.ZkController.createEphemeralLiveNode Register node as live in ZooKeeper:/live_nodes/127.0.0.1:52026_solr
[junit4:junit4]   2> 505 T793 oazs.PrepRequestProcessor.pRequest Got user-level KeeperException when processing sessionid:0x13aafbe5f2e0002 type:delete cxid:0x7 zxid:0xfffffffffffffffe txntype:unknown reqpath:n/a Error Path:/solr/live_nodes/127.0.0.1:52026_solr Error:KeeperErrorCode = NoNode for /solr/live_nodes/127.0.0.1:52026_solr
[junit4:junit4]   2> 539 T788 oascc.SolrZkClient.makePath makePath: /live_nodes/127.0.0.1:52026_solr
[junit4:junit4]   2> 559 T788 oashc.HttpShardHandlerFactory.getParameter Setting socketTimeout to: 0
[junit4:junit4]   2> 559 T788 oashc.HttpShardHandlerFactory.getParameter Setting urlScheme to: http://
[junit4:junit4]   2> 561 T788 oashc.HttpShardHandlerFactory.getParameter Setting connTimeout to: 0
[junit4:junit4]   2> 561 T788 oashc.HttpShardHandlerFactory.getParameter Setting maxConnectionsPerHost to: 20
[junit4:junit4]   2> 561 T788 oashc.HttpShardHandlerFactory.getParameter Setting corePoolSize to: 0
[junit4:junit4]   2> 562 T788 oashc.HttpShardHandlerFactory.getParameter Setting maximumPoolSize to: 2147483647
[junit4:junit4]   2> 562 T788 oashc.HttpShardHandlerFactory.getParameter Setting maxThreadIdleTime to: 5
[junit4:junit4]   2> 562 T788 oashc.HttpShardHandlerFactory.getParameter Setting sizeOfQueue to: -1
[junit4:junit4]   2> 563 T788 oashc.HttpShardHandlerFactory.getParameter Setting fairnessPolicy to: false
[junit4:junit4]   2> 563 T788 oascsi.HttpClientUtil.createClient Creating new http client, config:maxConnectionsPerHost=20&maxConnections=10000&socketTimeout=0&connTimeout=0&retry=false
[junit4:junit4]   2> 575 T788 oascc.SolrZkClient.makePath makePath: /overseer_elect/election
[junit4:junit4]   2> 662 T793 oazs.PrepRequestProcessor.pRequest Got user-level KeeperException when processing sessionid:0x13aafbe5f2e0002 type:delete cxid:0x15 zxid:0xfffffffffffffffe txntype:unknown reqpath:n/a Error Path:/solr/overseer_elect/leader Error:KeeperErrorCode = NoNode for /solr/overseer_elect/leader
[junit4:junit4]   2> 685 T788 oascc.SolrZkClient.makePath makePath: /overseer_elect/leader
[junit4:junit4]   2> 721 T788 oasc.Overseer.start Overseer (id=88576374862643202-127.0.0.1:52026_solr-n_0000000000) starting
[junit4:junit4]   2> 722 T793 oazs.PrepRequestProcessor.pRequest Got user-level KeeperException when processing sessionid:0x13aafbe5f2e0002 type:create cxid:0x1a zxid:0xfffffffffffffffe txntype:unknown reqpath:n/a Error Path:/solr/overseer Error:KeeperErrorCode = NodeExists for /solr/overseer
[junit4:junit4]   2> 745 T793 oazs.PrepRequestProcessor.pRequest Got user-level KeeperException when processing sessionid:0x13aafbe5f2e0002 type:create cxid:0x1b zxid:0xfffffffffffffffe txntype:unknown reqpath:n/a Error Path:/solr/overseer Error:KeeperErrorCode = NodeExists for /solr/overseer
[junit4:junit4]   2> 770 T793 oazs.PrepRequestProcessor.pRequest Got user-level KeeperException when processing sessionid:0x13aafbe5f2e0002 type:create cxid:0x1c zxid:0xfffffffffffffffe txntype:unknown reqpath:n/a Error Path:/solr/overseer Error:KeeperErrorCode = NodeExists for /solr/overseer
[junit4:junit4]   2> 793 T793 oazs.PrepRequestProcessor.pRequest Got user-level KeeperException when processing sessionid:0x13aafbe5f2e0002 type:create cxid:0x1d zxid:0xfffffffffffffffe txntype:unknown reqpath:n/a Error Path:/solr/overseer Error:KeeperErrorCode = NodeExists for /solr/overseer
[junit4:junit4]   2> 818 T810 oasc.OverseerCollectionProcessor.run Process current queue of collection messages
[junit4:junit4]   2> 820 T788 oascc.SolrZkClient.makePath makePath: /clusterstate.json
[junit4:junit4]   2> 826 T788 oascc.ZkStateReader.createClusterStateWatchersAndUpdate Updating cluster state from ZooKeeper... 
[junit4:junit4]   2> 830 T809 oasc.Overseer$ClusterStateUpdater.run Starting to work on the main queue
[junit4:junit4]   2> 836 T788 oasc.CoreContainer.create Creating SolrCore 'collection1' using instanceDir: C:\Users\JenkinsSlave\workspace\Lucene-Solr-4.x-Windows\solr\build\solr-core\test-files\solr\collection1
[junit4:junit4]   2> 836 T788 oasc.ZkController.createCollectionZkNode Check for collection zkNode:control_collection
[junit4:junit4]   2> 837 T788 oasc.ZkController.createCollectionZkNode Collection zkNode exists
[junit4:junit4]   2> 837 T788 oasc.ZkController.readConfigName Load collection config from:/collections/control_collection
[junit4:junit4]   2> 839 T788 oasc.SolrResourceLoader.<init> new SolrResourceLoader for directory: 'C:\Users\JenkinsSlave\workspace\Lucene-Solr-4.x-Windows\solr\build\solr-core\test-files\solr\collection1\'
[junit4:junit4]   2> 843 T788 oasc.SolrResourceLoader.replaceClassLoader Adding 'file:/C:/Users/JenkinsSlave/workspace/Lucene-Solr-4.x-Windows/solr/build/solr-core/test-files/solr/collection1/lib/classes/' to classloader
[junit4:junit4]   2> 844 T788 oasc.SolrResourceLoader.replaceClassLoader Adding 'file:/C:/Users/JenkinsSlave/workspace/Lucene-Solr-4.x-Windows/solr/build/solr-core/test-files/solr/collection1/lib/README' to classloader
[junit4:junit4]   2> 907 T788 oasc.SolrConfig.<init> Using Lucene MatchVersion: LUCENE_41
[junit4:junit4]   2> 995 T788 oasc.SolrConfig.<init> Loaded SolrConfig: solrconfig.xml
[junit4:junit4]   2> 997 T788 oass.IndexSchema.readSchema Reading Solr Schema
[junit4:junit4]   2> 1004 T788 oass.IndexSchema.readSchema Schema name=test
[junit4:junit4]   2> 1776 T788 oass.OpenExchangeRatesOrgProvider.init Initialized with rates=open-exchange-rates.json, refreshInterval=1440.
[junit4:junit4]   2> 1786 T788 oass.IndexSchema.readSchema default search field in schema is text
[junit4:junit4]   2> 1788 T788 oass.IndexSchema.readSchema unique key field: id
[junit4:junit4]   2> 1807 T788 oass.FileExchangeRateProvider.reload Reloading exchange rates from file currency.xml
[junit4:junit4]   2> 1870 T788 oass.FileExchangeRateProvider.reload Reloading exchange rates from file currency.xml
[junit4:junit4]   2> 1874 T788 oass.OpenExchangeRatesOrgProvider.reload Reloading exchange rates from open-exchange-rates.json
[junit4:junit4]   2> 1878 T788 oass.OpenExchangeRatesOrgProvider.reload Reloading exchange rates from open-exchange-rates.json
[junit4:junit4]   2> 1880 T788 oasc.SolrCore.<init> [collection1] Opening new SolrCore at C:\Users\JenkinsSlave\workspace\Lucene-Solr-4.x-Windows\solr\build\solr-core\test-files\solr\collection1\, dataDir=.\org.apache.solr.cloud.SyncSliceTest-1351568219940/control/data\
[junit4:junit4]   2> 1880 T788 oasc.JmxMonitoredMap.<init> JMX monitoring is enabled. Adding Solr mbeans to JMX Server: com.sun.jmx.mbeanserver.JmxMBeanServer@180cf2a
[junit4:junit4]   2> 1882 T788 oasc.SolrCore.getNewIndexDir New index directory detected: old=null new=.\org.apache.solr.cloud.SyncSliceTest-1351568219940/control/data\index/
[junit4:junit4]   2> 1883 T788 oasc.SolrCore.initIndex WARNING [collection1] Solr index directory '.\org.apache.solr.cloud.SyncSliceTest-1351568219940\control\data\index' doesn't exist. Creating new index...
[junit4:junit4]   2> 1884 T788 oasc.CachingDirectoryFactory.get return new directory for C:\Users\JenkinsSlave\workspace\Lucene-Solr-4.x-Windows\solr\build\solr-core\test\J0\.\org.apache.solr.cloud.SyncSliceTest-1351568219940\control\data\index forceNew:false
[junit4:junit4]   2> 1896 T788 oasc.SolrDeletionPolicy.onCommit SolrDeletionPolicy.onCommit: commits:num=1
[junit4:junit4]   2> 		commit{dir=NRTCachingDirectory(org.apache.lucene.store.SimpleFSDirectory@C:\Users\JenkinsSlave\workspace\Lucene-Solr-4.x-Windows\solr\build\solr-core\test\J0\org.apache.solr.cloud.SyncSliceTest-1351568219940\control\data\index lockFactory=org.apache.lucene.store.NativeFSLockFactory@7f52b8; maxCacheMB=48.0 maxMergeSizeMB=4.0),segFN=segments_1,generation=1,filenames=[segments_1]
[junit4:junit4]   2> 1897 T788 oasc.SolrDeletionPolicy.updateCommits newest commit = 1
[junit4:junit4]   2> 1898 T788 oasc.SolrCore.initWriters created xml: solr.XMLResponseWriter
[junit4:junit4]   2> 1899 T788 oasup.UpdateRequestProcessorChain.init inserting DistributedUpdateProcessorFactory into updateRequestProcessorChain "dedupe"
[junit4:junit4]   2> 1900 T788 oasup.UpdateRequestProcessorChain.init inserting DistributedUpdateProcessorFactory into updateRequestProcessorChain "dedupe-allfields"
[junit4:junit4]   2> 1902 T788 oasup.UpdateRequestProcessorChain.init inserting DistributedUpdateProcessorFactory into updateRequestProcessorChain "stored_sig"
[junit4:junit4]   2> 1902 T788 oasup.UpdateRequestProcessorChain.init inserting DistributedUpdateProcessorFactory into updateRequestProcessorChain "uniq-fields"
[junit4:junit4]   2> 1903 T788 oasup.UpdateRequestProcessorChain.init inserting DistributedUpdateProcessorFactory into updateRequestProcessorChain "distrib-dup-test-chain-implicit"
[junit4:junit4]   2> 1903 T788 oasc.RequestHandlers.initHandlersFromConfig adding lazy requestHandler: solr.ReplicationHandler
[junit4:junit4]   2> 1904 T788 oasc.RequestHandlers.initHandlersFromConfig created /replication: solr.ReplicationHandler
[junit4:junit4]   2> 1904 T788 oasc.RequestHandlers.initHandlersFromConfig created standard: solr.StandardRequestHandler
[junit4:junit4]   2> 1905 T788 oasc.RequestHandlers.initHandlersFromConfig created /get: solr.RealTimeGetHandler
[junit4:junit4]   2> 1906 T788 oasc.RequestHandlers.initHandlersFromConfig created dismax: solr.SearchHandler
[junit4:junit4]   2> 1908 T788 oasc.RequestHandlers.initHandlersFromConfig created mock: org.apache.solr.core.MockQuerySenderListenerReqHandler
[junit4:junit4]   2> 1909 T788 oasc.RequestHandlers.initHandlersFromConfig created /admin/: org.apache.solr.handler.admin.AdminHandlers
[junit4:junit4]   2> 1909 T788 oasc.RequestHandlers.initHandlersFromConfig created defaults: solr.StandardRequestHandler
[junit4:junit4]   2> 1909 T788 oasc.RequestHandlers.initHandlersFromConfig adding lazy requestHandler: solr.StandardRequestHandler
[junit4:junit4]   2> 1909 T788 oasc.RequestHandlers.initHandlersFromConfig created lazy: solr.StandardRequestHandler
[junit4:junit4]   2> 1910 T788 oasc.RequestHandlers.initHandlersFromConfig created /update: solr.UpdateRequestHandler
[junit4:junit4]   2> 1910 T788 oasc.RequestHandlers.initHandlersFromConfig created /terms: org.apache.solr.handler.component.SearchHandler
[junit4:junit4]   2> 1911 T788 oasc.RequestHandlers.initHandlersFromConfig created spellCheckCompRH: org.apache.solr.handler.component.SearchHandler
[junit4:junit4]   2> 1911 T788 oasc.RequestHandlers.initHandlersFromConfig created spellCheckCompRH_Direct: org.apache.solr.handler.component.SearchHandler
[junit4:junit4]   2> 1912 T788 oasc.RequestHandlers.initHandlersFromConfig created spellCheckWithWordbreak: org.apache.solr.handler.component.SearchHandler
[junit4:junit4]   2> 1913 T788 oasc.RequestHandlers.initHandlersFromConfig created spellCheckWithWordbreak_Direct: org.apache.solr.handler.component.SearchHandler
[junit4:junit4]   2> 1913 T788 oasc.RequestHandlers.initHandlersFromConfig created spellCheckCompRH1: org.apache.solr.handler.component.SearchHandler
[junit4:junit4]   2> 1913 T788 oasc.RequestHandlers.initHandlersFromConfig created tvrh: org.apache.solr.handler.component.SearchHandler
[junit4:junit4]   2> 1915 T788 oasc.RequestHandlers.initHandlersFromConfig created /mlt: solr.MoreLikeThisHandler
[junit4:junit4]   2> 1915 T788 oasc.RequestHandlers.initHandlersFromConfig created /debug/dump: solr.DumpRequestHandler
[junit4:junit4]   2> 1923 T788 oashl.XMLLoader.init xsltCacheLifetimeSeconds=60
[junit4:junit4]   2> 1932 T788 oasc.SolrCore.initDeprecatedSupport WARNING solrconfig.xml uses deprecated <admin/gettableFiles>, Please update your config to use the ShowFileRequestHandler.
[junit4:junit4]   2> 1935 T788 oasc.SolrCore.initDeprecatedSupport WARNING adding ShowFileRequestHandler with hidden files: [SCHEMA.XML, OLD_SYNONYMS.TXT, STOPWORDS.TXT, PROTWORDS.TXT, OPEN-EXCHANGE-RATES.JSON, SYNONYMS.TXT, CURRENCY.XML, MAPPING-ISOLATIN1ACCENT.TXT]
[junit4:junit4]   2> 1941 T788 oass.SolrIndexSearcher.<init> Opening Searcher@1000e49 main
[junit4:junit4]   2> 1943 T788 oasu.CommitTracker.<init> Hard AutoCommit: disabled
[junit4:junit4]   2> 1944 T788 oasu.CommitTracker.<init> Soft AutoCommit: disabled
[junit4:junit4]   2> 1944 T788 oashc.SpellCheckComponent.inform Initializing spell checkers
[junit4:junit4]   2> 1957 T788 oass.DirectSolrSpellChecker.init init: {name=direct,classname=DirectSolrSpellChecker,field=lowerfilt,minQueryLength=3}
[junit4:junit4]   2> 2021 T811 oasc.SolrCore.registerSearcher [collection1] Registered new searcher Searcher@1000e49 main{StandardDirectoryReader(segments_1:1)}
[junit4:junit4]   2> 2023 T788 oasc.ZkController.publish numShards not found on descriptor - reading it from system property
[junit4:junit4]   2> 2026 T793 oazs.PrepRequestProcessor.pRequest Got user-level KeeperException when processing sessionid:0x13aafbe5f2e0002 type:create cxid:0x53 zxid:0xfffffffffffffffe txntype:unknown reqpath:n/a Error Path:/solr/overseer/queue Error:KeeperErrorCode = NoNode for /solr/overseer/queue
[junit4:junit4]   2> 2032 T788 oasc.CoreContainer.register registering core: collection1
[junit4:junit4]   2> 2032 T788 oasc.ZkController.register Register shard - core:collection1 address:http://127.0.0.1:52026/solr shardId:control_shard
[junit4:junit4]   2> 2033 T788 oascc.SolrZkClient.makePath makePath: /collections/control_collection/leader_elect/control_shard/election
[junit4:junit4]   2> 2048 T793 oazs.PrepRequestProcessor.pRequest Got user-level KeeperException when processing sessionid:0x13aafbe5f2e0002 type:delete cxid:0x64 zxid:0xfffffffffffffffe txntype:unknown reqpath:n/a Error Path:/solr/collections/control_collection/leaders Error:KeeperErrorCode = NoNode for /solr/collections/control_collection/leaders
[junit4:junit4]   2> 2051 T788 oasc.ShardLeaderElectionContext.runLeaderProcess Running the leader process.
[junit4:junit4]   2> 2051 T793 oazs.PrepRequestProcessor.pRequest Got user-level KeeperException when processing sessionid:0x13aafbe5f2e0002 type:create cxid:0x67 zxid:0xfffffffffffffffe txntype:unknown reqpath:n/a Error Path:/solr/overseer Error:KeeperErrorCode = NodeExists for /solr/overseer
[junit4:junit4]   2> 2052 T809 oascc.ZkStateReader.updateClusterState Updating cloud state from ZooKeeper... 
[junit4:junit4]   2> 2054 T809 oasc.Overseer$ClusterStateUpdater.updateState Update state numShards=null message={
[junit4:junit4]   2> 	  "operation":"state",
[junit4:junit4]   2> 	  "numShards":null,
[junit4:junit4]   2> 	  "shard":"control_shard",
[junit4:junit4]   2> 	  "roles":null,
[junit4:junit4]   2> 	  "state":"down",
[junit4:junit4]   2> 	  "core":"collection1",
[junit4:junit4]   2> 	  "collection":"control_collection",
[junit4:junit4]   2> 	  "node_name":"127.0.0.1:52026_solr",
[junit4:junit4]   2> 	  "base_url":"http://127.0.0.1:52026/solr"}
[junit4:junit4]   2> 2054 T793 oazs.PrepRequestProcessor.pRequest Got user-level KeeperException when processing sessionid:0x13aafbe5f2e0002 type:create cxid:0x6a zxid:0xfffffffffffffffe txntype:unknown reqpath:n/a Error Path:/solr/overseer/queue-work Error:KeeperErrorCode = NoNode for /solr/overseer/queue-work
[junit4:junit4]   2> 2075 T808 oascc.ZkStateReader$2.process A cluster state change has occurred - updating... (1)
[junit4:junit4]   2> 2661 T788 oasc.ShardLeaderElectionContext.waitForReplicasToComeUp Enough replicas found to continue.
[junit4:junit4]   2> 2664 T788 oasc.ShardLeaderElectionContext.runLeaderProcess I may be the new leader - try and sync
[junit4:junit4]   2> 2664 T788 oasc.SyncStrategy.sync Sync replicas to http://127.0.0.1:52026/solr/collection1/
[junit4:junit4]   2> 2665 T788 oasc.SyncStrategy.syncReplicas Sync Success - now sync replicas to me
[junit4:junit4]   2> 2665 T788 oasc.SyncStrategy.syncToMe http://127.0.0.1:52026/solr/collection1/ has no replicas
[junit4:junit4]   2> 2667 T788 oasc.ShardLeaderElectionContext.runLeaderProcess I am the new leader: http://127.0.0.1:52026/solr/collection1/
[junit4:junit4]   2> 2669 T788 oascc.SolrZkClient.makePath makePath: /collections/control_collection/leaders/control_shard
[junit4:junit4]   2> 2690 T793 oazs.PrepRequestProcessor.pRequest Got user-level KeeperException when processing sessionid:0x13aafbe5f2e0002 type:create cxid:0x89 zxid:0xfffffffffffffffe txntype:unknown reqpath:n/a Error Path:/solr/overseer Error:KeeperErrorCode = NodeExists for /solr/overseer
[junit4:junit4]   2> 3308 T809 oascc.ZkStateReader.updateClusterState Updating cloud state from ZooKeeper... 
[junit4:junit4]   2> 3317 T808 oascc.ZkStateReader$2.process A cluster state change has occurred - updating... (1)
[junit4:junit4]   2> 3376 T788 oasc.ZkController.register We are http://127.0.0.1:52026/solr/collection1/ and leader is http://127.0.0.1:52026/solr/collection1/
[junit4:junit4]   2> 3376 T788 oasc.ZkController.register No LogReplay needed for core=collection1 baseURL=http://127.0.0.1:52026/solr
[junit4:junit4]   2> 3376 T788 oasc.ZkController.checkRecovery I am the leader, no recovery necessary
[junit4:junit4]   2> 3377 T788 oasc.ZkController.publish numShards not found on descriptor - reading it from system property
[junit4:junit4]   2> 3381 T788 oascc.ZkStateReader.updateClusterState Updating cloud state from ZooKeeper... 
[junit4:junit4]   2> 3382 T788 oass.SolrDispatchFilter.init user.dir=C:\Users\JenkinsSlave\workspace\Lucene-Solr-4.x-Windows\solr\build\solr-core\test\J0
[junit4:junit4]   2> 3383 T788 oass.SolrDispatchFilter.init SolrDispatchFilter.init() done
[junit4:junit4]   2> 3383 T788 oascsi.HttpClientUtil.createClient Creating new http client, config:maxConnections=128&maxConnectionsPerHost=32&followRedirects=false
[junit4:junit4]   2> 3738 T788 oejs.Server.doStart jetty-8.1.2.v20120308
[junit4:junit4]   2> 3741 T788 oejs.AbstractConnector.doStart Started SelectChannelConnector@0.0.0.0:52032
[junit4:junit4]   2> 3743 T788 oasc.SolrResourceLoader.locateSolrHome JNDI not configured for solr (NoInitialContextEx)
[junit4:junit4]   2> 3743 T788 oasc.SolrResourceLoader.locateSolrHome using system property solr.solr.home: C:\Users\JenkinsSlave\workspace\Lucene-Solr-4.x-Windows\solr\build\solr-core\test\J0\.\solrtest-jetty1-1351568223331
[junit4:junit4]   2> 3744 T788 oasc.SolrResourceLoader.<init> new SolrResourceLoader for deduced Solr Home: 'C:\Users\JenkinsSlave\workspace\Lucene-Solr-4.x-Windows\solr\build\solr-core\test\J0\.\solrtest-jetty1-1351568223331\'
[junit4:junit4]   2> 3784 T788 oass.SolrDispatchFilter.init SolrDispatchFilter.init()
[junit4:junit4]   2> 3785 T788 oasc.SolrResourceLoader.locateSolrHome JNDI not configured for solr (NoInitialContextEx)
[junit4:junit4]   2> 3785 T788 oasc.SolrResourceLoader.locateSolrHome using system property solr.solr.home: C:\Users\JenkinsSlave\workspace\Lucene-Solr-4.x-Windows\solr\build\solr-core\test\J0\.\solrtest-jetty1-1351568223331
[junit4:junit4]   2> 3786 T788 oasc.CoreContainer$Initializer.initialize looking for solr.xml: C:\Users\JenkinsSlave\workspace\Lucene-Solr-4.x-Windows\solr\build\solr-core\test\J0\.\solrtest-jetty1-1351568223331\solr.xml
[junit4:junit4]   2> 3786 T788 oasc.CoreContainer.<init> New CoreContainer 26339201
[junit4:junit4]   2> 3786 T788 oasc.CoreContainer.load Loading CoreContainer using Solr Home: 'C:\Users\JenkinsSlave\workspace\Lucene-Solr-4.x-Windows\solr\build\solr-core\test\J0\.\solrtest-jetty1-1351568223331\'
[junit4:junit4]   2> 3787 T788 oasc.SolrResourceLoader.<init> new SolrResourceLoader for directory: 'C:\Users\JenkinsSlave\workspace\Lucene-Solr-4.x-Windows\solr\build\solr-core\test\J0\.\solrtest-jetty1-1351568223331\'
[junit4:junit4]   2> 3812 T788 oasc.CoreContainer.load Registering Log Listener
[junit4:junit4]   2> 3834 T788 oasc.CoreContainer.initZooKeeper Zookeeper client=127.0.0.1:52019/solr
[junit4:junit4]   2> 3835 T788 oaz.ZooKeeper.<init> Initiating client connection, connectString=127.0.0.1:52019/solr sessionTimeout=5000 watcher=org.apache.solr.common.cloud.ConnectionManager@29c4a4
[junit4:junit4]   2> 3836 T821 oaz.ClientCnxn$SendThread.startConnect Opening socket connection to server /127.0.0.1:52019
[junit4:junit4]   2> 3836 T788 oascc.ConnectionManager.waitForConnected Waiting for client to connect to ZooKeeper
[junit4:junit4]   2> 3838 T821 oaz.ClientCnxn$SendThread.primeConnection Socket connection established to 127.0.0.1/127.0.0.1:52019, initiating session
[junit4:junit4]   2> 3839 T790 oazs.NIOServerCnxn$Factory.run Accepted socket connection from /127.0.0.1:52037
[junit4:junit4]   2> 3839 T790 oazs.NIOServerCnxn.readConnectRequest Client attempting to establish new session at /127.0.0.1:52037
[junit4:junit4]   2> 3852 T792 oazs.NIOServerCnxn.finishSessionInit Established session 0x13aafbe5f2e0003 with negotiated timeout 5000 for client /127.0.0.1:52037
[junit4:junit4]   2> 3852 T821 oaz.ClientCnxn$SendThread.readConnectResult Session establishment complete on server 127.0.0.1/127.0.0.1:52019, sessionid = 0x13aafbe5f2e0003, negotiated timeout = 5000
[junit4:junit4]   2> 3855 T822 oascc.ConnectionManager.process Watcher org.apache.solr.common.cloud.ConnectionManager@29c4a4 name:ZooKeeperConnection Watcher:127.0.0.1:52019/solr got event WatchedEvent state:SyncConnected type:None path:null path:null type:None
[junit4:junit4]   2> 3855 T788 oascc.ConnectionManager.waitForConnected Client is connected to ZooKeeper
[junit4:junit4]   2> 3856 T793 oazs.PrepRequestProcessor.pRequest Got user-level KeeperException when processing sessionid:0x13aafbe5f2e0003 type:create cxid:0x1 zxid:0xfffffffffffffffe txntype:unknown reqpath:n/a Error Path:/solr/overseer Error:KeeperErrorCode = NodeExists for /solr/overseer
[junit4:junit4]   2> 3858 T793 oazs.PrepRequestProcessor.pRequest Got user-level KeeperException when processing sessionid:0x13aafbe5f2e0003 type:create cxid:0x2 zxid:0xfffffffffffffffe txntype:unknown reqpath:n/a Error Path:/solr/overseer Error:KeeperErrorCode = NodeExists for /solr/overseer
[junit4:junit4]   2> 3861 T788 oasc.ZkController.createEphemeralLiveNode Register node as live in ZooKeeper:/live_nodes/127.0.0.1:52032_solr
[junit4:junit4]   2> 3862 T793 oazs.PrepRequestProcessor.pRequest Got user-level KeeperException when processing sessionid:0x13aafbe5f2e0003 type:delete cxid:0x4 zxid:0xfffffffffffffffe txntype:unknown reqpath:n/a Error Path:/solr/live_nodes/127.0.0.1:52032_solr Error:KeeperErrorCode = NoNode for /solr/live_nodes/127.0.0.1:52032_solr
[junit4:junit4]   2> 3863 T788 oascc.SolrZkClient.makePath makePath: /live_nodes/127.0.0.1:52032_solr
[junit4:junit4]   2> 3868 T808 oascc.ZkStateReader$3.process Updating live nodes... (2)
[junit4:junit4]   2> 3869 T788 oashc.HttpShardHandlerFactory.getParameter Setting socketTimeout to: 0
[junit4:junit4]   2> 3869 T788 oashc.HttpShardHandlerFactory.getParameter Setting urlScheme to: http://
[junit4:junit4]   2> 3869 T788 oashc.HttpShardHandlerFactory.getParameter Setting connTimeout to: 0
[junit4:junit4]   2> 3869 T788 oashc.HttpShardHandlerFactory.getParameter Setting maxConnectionsPerHost to: 20
[junit4:junit4]   2> 3873 T788 oashc.HttpShardHandlerFactory.getParameter Setting corePoolSize to: 0
[junit4:junit4]   2> 3873 T788 oashc.HttpShardHandlerFactory.getParameter Setting maximumPoolSize to: 2147483647
[junit4:junit4]   2> 3873 T788 oashc.HttpShardHandlerFactory.getParameter Setting maxThreadIdleTime to: 5
[junit4:junit4]   2> 3874 T788 oashc.HttpShardHandlerFactory.getParameter Setting sizeOfQueue to: -1
[junit4:junit4]   2> 3874 T788 oashc.HttpShardHandlerFactory.getParameter Setting fairnessPolicy to: false
[junit4:junit4]   2> 3874 T788 oascsi.HttpClientUtil.createClient Creating new http client, config:maxConnectionsPerHost=20&maxConnections=10000&socketTimeout=0&connTimeout=0&retry=false
[junit4:junit4]   2> 3896 T788 oascc.ZkStateReader.createClusterStateWatchersAndUpdate Updating cluster state from ZooKeeper... 
[junit4:junit4]   2> 3908 T788 oasc.CoreContainer.create Creating SolrCore 'collection1' using instanceDir: C:\Users\JenkinsSlave\workspace\Lucene-Solr-4.x-Windows\solr\build\solr-core\test\J0\.\solrtest-jetty1-1351568223331\collection1
[junit4:junit4]   2> 3909 T788 oasc.ZkController.createCollectionZkNode Check for collection zkNode:collection1
[junit4:junit4]   2> 3910 T788 oasc.ZkController.createCollectionZkNode Collection zkNode exists
[junit4:junit4]   2> 3910 T788 oasc.ZkController.readConfigName Load collection config from:/collections/collection1
[junit4:junit4]   2> 3914 T788 oasc.SolrResourceLoader.<init> new SolrResourceLoader for directory: 'C:\Users\JenkinsSlave\workspace\Lucene-Solr-4.x-Windows\solr\build\solr-core\test\J0\.\solrtest-jetty1-1351568223331\collection1\'
[junit4:junit4]   2> 3915 T788 oasc.SolrResourceLoader.replaceClassLoader Adding 'file:/C:/Users/JenkinsSlave/workspace/Lucene-Solr-4.x-Windows/solr/build/solr-core/test/J0/solrtest-jetty1-1351568223331/collection1/lib/classes/' to classloader
[junit4:junit4]   2> 3916 T788 oasc.SolrResourceLoader.replaceClassLoader Adding 'file:/C:/Users/JenkinsSlave/workspace/Lucene-Solr-4.x-Windows/solr/build/solr-core/test/J0/solrtest-jetty1-1351568223331/collection1/lib/README' to classloader
[junit4:junit4]   2> 3928 T809 oascc.ZkStateReader.updateClusterState Updating cloud state from ZooKeeper... 
[junit4:junit4]   2> 3930 T809 oasc.Overseer$ClusterStateUpdater.updateState Update state numShards=null message={
[junit4:junit4]   2> 	  "operation":"state",
[junit4:junit4]   2> 	  "numShards":null,
[junit4:junit4]   2> 	  "shard":"control_shard",
[junit4:junit4]   2> 	  "roles":null,
[junit4:junit4]   2> 	  "state":"active",
[junit4:junit4]   2> 	  "core":"collection1",
[junit4:junit4]   2> 	  "collection":"control_collection",
[junit4:junit4]   2> 	  "node_name":"127.0.0.1:52026_solr",
[junit4:junit4]   2> 	  "base_url":"http://127.0.0.1:52026/solr"}
[junit4:junit4]   2> 3942 T822 oascc.ZkStateReader$2.process A cluster state change has occurred - updating... (2)
[junit4:junit4]   2> 3942 T808 oascc.ZkStateReader$2.process A cluster state change has occurred - updating... (2)
[junit4:junit4]   2> 3990 T788 oasc.SolrConfig.<init> Using Lucene MatchVersion: LUCENE_41
[junit4:junit4]   2> 4073 T788 oasc.SolrConfig.<init> Loaded SolrConfig: solrconfig.xml
[junit4:junit4]   2> 4076 T788 oass.IndexSchema.readSchema Reading Solr Schema
[junit4:junit4]   2> 4082 T788 oass.IndexSchema.readSchema Schema name=test
[junit4:junit4]   2> 4897 T788 oass.OpenExchangeRatesOrgProvider.init Initialized with rates=open-exchange-rates.json, refreshInterval=1440.
[junit4:junit4]   2> 4910 T788 oass.IndexSchema.readSchema default search field in schema is text
[junit4:junit4]   2> 4916 T788 oass.IndexSchema.readSchema unique key field: id
[junit4:junit4]   2> 4941 T788 oass.FileExchangeRateProvider.reload Reloading exchange rates from file currency.xml
[junit4:junit4]   2> 4948 T788 oass.FileExchangeRateProvider.reload Reloading exchange rates from file currency.xml
[junit4:junit4]   2> 4956 T788 oass.OpenExchangeRatesOrgProvider.reload Reloading exchange rates from open-exchange-rates.json
[junit4:junit4]   2> 4958 T788 oass.OpenExchangeRatesOrgProvider.reload Reloading exchange rates from open-exchange-rates.json
[junit4:junit4]   2> 4960 T788 oasc.SolrCore.<init> [collection1] Opening new SolrCore at C:\Users\JenkinsSlave\workspace\Lucene-Solr-4.x-Windows\solr\build\solr-core\test\J0\.\solrtest-jetty1-1351568223331\collection1\, dataDir=.\org.apache.solr.cloud.SyncSliceTest-1351568219940/jetty1\
[junit4:junit4]   2> 4961 T788 oasc.JmxMonitoredMap.<init> JMX monitoring is enabled. Adding Solr mbeans to JMX Server: com.sun.jmx.mbeanserver.JmxMBeanServer@180cf2a
[junit4:junit4]   2> 4962 T788 oasc.SolrCore.getNewIndexDir New index directory detected: old=null new=.\org.apache.solr.cloud.SyncSliceTest-1351568219940/jetty1\index/
[junit4:junit4]   2> 4963 T788 oasc.SolrCore.initIndex WARNING [collection1] Solr index directory '.\org.apache.solr.cloud.SyncSliceTest-1351568219940\jetty1\index' doesn't exist. Creating new index...
[junit4:junit4]   2> 4966 T788 oasc.CachingDirectoryFactory.get return new directory for C:\Users\JenkinsSlave\workspace\Lucene-Solr-4.x-Windows\solr\build\solr-core\test\J0\.\org.apache.solr.cloud.SyncSliceTest-1351568219940\jetty1\index forceNew:false
[junit4:junit4]   2> 4981 T788 oasc.SolrDeletionPolicy.onCommit SolrDeletionPolicy.onCommit: commits:num=1
[junit4:junit4]   2> 		commit{dir=NRTCachingDirectory(org.apache.lucene.store.SimpleFSDirectory@C:\Users\JenkinsSlave\workspace\Lucene-Solr-4.x-Windows\solr\build\solr-core\test\J0\org.apache.solr.cloud.SyncSliceTest-1351568219940\jetty1\index lockFactory=org.apache.lucene.store.NativeFSLockFactory@1d44d8b; maxCacheMB=48.0 maxMergeSizeMB=4.0),segFN=segments_1,generation=1,filenames=[segments_1]
[junit4:junit4]   2> 4981 T788 oasc.SolrDeletionPolicy.updateCommits newest commit = 1
[junit4:junit4]   2> 4983 T788 oasc.SolrCore.initWriters created xml: solr.XMLResponseWriter
[junit4:junit4]   2> 4984 T788 oasup.UpdateRequestProcessorChain.init inserting DistributedUpdateProcessorFactory into updateRequestProcessorChain "dedupe"
[junit4:junit4]   2> 4986 T788 oasup.UpdateRequestProcessorChain.init inserting DistributedUpdateProcessorFactory into updateRequestProcessorChain "dedupe-allfields"
[junit4:junit4]   2> 4986 T788 oasup.UpdateRequestProcessorChain.init inserting DistributedUpdateProcessorFactory into updateRequestProcessorChain "stored_sig"
[junit4:junit4]   2> 4987 T788 oasup.UpdateRequestProcessorChain.init inserting DistributedUpdateProcessorFactory into updateRequestProcessorChain "uniq-fields"
[junit4:junit4]   2> 4987 T788 oasup.UpdateRequestProcessorChain.init inserting DistributedUpdateProcessorFactory into updateRequestProcessorChain "distrib-dup-test-chain-implicit"
[junit4:junit4]   2> 4987 T788 oasc.RequestHandlers.initHandlersFromConfig adding lazy requestHandler: solr.ReplicationHandler
[junit4:junit4]   2> 4988 T788 oasc.RequestHandlers.initHandlersFromConfig created /replication: solr.ReplicationHandler
[junit4:junit4]   2> 4988 T788 oasc.RequestHandlers.initHandlersFromConfig created standard: solr.StandardRequestHandler
[junit4:junit4]   2> 4989 T788 oasc.RequestHandlers.initHandlersFromConfig created /get: solr.RealTimeGetHandler
[junit4:junit4]   2> 4989 T788 oasc.RequestHandlers.initHandlersFromConfig created dismax: solr.SearchHandler
[junit4:junit4]   2> 4990 T788 oasc.RequestHandlers.initHandlersFromConfig created mock: org.apache.solr.core.MockQuerySenderListenerReqHandler
[junit4:junit4]   2> 4990 T788 oasc.RequestHandlers.initHandlersFromConfig created /admin/: org.apache.solr.handler.admin.AdminHandlers
[junit4:junit4]   2> 4992 T788 oasc.RequestHandlers.initHandlersFromConfig created defaults: solr.StandardRequestHandler
[junit4:junit4]   2> 4993 T788 oasc.RequestHandlers.initHandlersFromConfig adding lazy requestHandler: solr.StandardRequestHandler
[junit4:junit4]   2> 4993 T788 oasc.RequestHandlers.initHandlersFromConfig created lazy: solr.StandardRequestHandler
[junit4:junit4]   2> 4994 T788 oasc.RequestHandlers.initHandlersFromConfig created /update: solr.UpdateRequestHandler
[junit4:junit4]   2> 4994 T788 oasc.RequestHandlers.initHandlersFromConfig created /terms: org.apache.solr.handler.component.SearchHandler
[junit4:junit4]   2> 4995 T788 oasc.RequestHandlers.initHandlersFromConfig created spellCheckCompRH: org.apache.solr.handler.component.SearchHandler
[junit4:junit4]   2> 4995 T788 oasc.RequestHandlers.initHandlersFromConfig created spellCheckCompRH_Direct: org.apache.solr.handler.component.SearchHandler
[junit4:junit4]   2> 4996 T788 oasc.RequestHandlers.initHandlersFromConfig created spellCheckWithWordbreak: org.apache.solr.handler.component.SearchHandler
[junit4:junit4]   2> 4996 T788 oasc.RequestHandlers.initHandlersFromConfig created spellCheckWithWordbreak_Direct: org.apache.solr.handler.component.SearchHandler
[junit4:junit4]   2> 4999 T788 oasc.RequestHandlers.initHandlersFromConfig created spellCheckCompRH1: org.apache.solr.handler.component.SearchHandler
[junit4:junit4]   2> 4999 T788 oasc.RequestHandlers.initHandlersFromConfig created tvrh: org.apache.solr.handler.component.SearchHandler
[junit4:junit4]   2> 5000 T788 oasc.RequestHandlers.initHandlersFromConfig created /mlt: solr.MoreLikeThisHandler
[junit4:junit4]   2> 5000 T788 oasc.RequestHandlers.initHandlersFromConfig created /debug/dump: solr.DumpRequestHandler
[junit4:junit4]   2> 5009 T788 oashl.XMLLoader.init xsltCacheLifetimeSeconds=60
[junit4:junit4]   2> 5015 T788 oasc.SolrCore.initDeprecatedSupport WARNING solrconfig.xml uses deprecated <admin/gettableFiles>, Please update your config to use the ShowFileRequestHandler.
[junit4:junit4]   2> 5016 T788 oasc.SolrCore.initDeprecatedSupport WARNING adding ShowFileRequestHandler with hidden files: [SCHEMA.XML, OLD_SYNONYMS.TXT, STOPWORDS.TXT, PROTWORDS.TXT, OPEN-EXCHANGE-RATES.JSON, SYNONYMS.TXT, CURRENCY.XML, MAPPING-ISOLATIN1ACCENT.TXT]
[junit4:junit4]   2> 5023 T788 oass.SolrIndexSearcher.<init> Opening Searcher@1b24924 main
[junit4:junit4]   2> 5025 T788 oasu.CommitTracker.<init> Hard AutoCommit: disabled
[junit4:junit4]   2> 5026 T788 oasu.CommitTracker.<init> Soft AutoCommit: disabled
[junit4:junit4]   2> 5027 T788 oashc.SpellCheckComponent.inform Initializing spell checkers
[junit4:junit4]   2> 5039 T788 oass.DirectSolrSpellChecker.init init: {name=direct,classname=DirectSolrSpellChecker,field=lowerfilt,minQueryLength=3}
[junit4:junit4]   2> 5110 T823 oasc.SolrCore.registerSearcher [collection1] Registered new searcher Searcher@1b24924 main{StandardDirectoryReader(segments_1:1)}
[junit4:junit4]   2> 5113 T788 oasc.ZkController.publish numShards not found on descriptor - reading it from system property
[junit4:junit4]   2> 5165 T809 oascc.ZkStateReader.updateClusterState Updating cloud state from ZooKeeper... 
[junit4:junit4]   2> 5166 T809 oasc.Overseer$ClusterStateUpdater.updateState Update state numShards=1 message={
[junit4:junit4]   2> 	  "operation":"state",
[junit4:junit4]   2> 	  "numShards":"1",
[junit4:junit4]   2> 	  "shard":null,
[junit4:junit4]   2> 	  "roles":null,
[junit4:junit4]   2> 	  "state":"down",
[junit4:junit4]   2> 	  "core":"collection1",
[junit4:junit4]   2> 	  "collection":"collection1",
[junit4:junit4]   2> 	  "node_name":"127.0.0.1:52032_solr",
[junit4:junit4]   2> 	  "base_url":"http://127.0.0.1:52032/solr"}
[junit4:junit4]   2> 5166 T809 oasc.Overseer$ClusterStateUpdater.createCollection Create collection collection1 with numShards 1
[junit4:junit4]   2> 5176 T808 oascc.ZkStateReader$2.process A cluster state change has occurred - updating... (2)
[junit4:junit4]   2> 5176 T822 oascc.ZkStateReader$2.process A cluster state change has occurred - updating... (2)
[junit4:junit4]   2> 5726 T788 oasc.CoreContainer.register registering core: collection1
[junit4:junit4]   2> 5726 T788 oasc.ZkController.register Register shard - core:collection1 address:http://127.0.0.1:52032/solr shardId:shard1
[junit4:junit4]   2> 5729 T788 oascc.SolrZkClient.makePath makePath: /collections/collection1/leader_elect/shard1/election
[junit4:junit4]   2> 5752 T793 oazs.PrepRequestProcessor.pRequest Got user-level KeeperException when processing sessionid:0x13aafbe5f2e0003 type:delete cxid:0x43 zxid:0xfffffffffffffffe txntype:unknown reqpath:n/a Error Path:/solr/collections/collection1/leaders Error:KeeperErrorCode = NoNode for /solr/collections/collection1/leaders
[junit4:junit4]   2> 5756 T788 oasc.ShardLeaderElectionContext.runLeaderProcess Running the leader process.
[junit4:junit4]   2> 5757 T793 oazs.PrepRequestProcessor.pRequest Got user-level KeeperException when processing sessionid:0x13aafbe5f2e0003 type:create cxid:0x44 zxid:0xfffffffffffffffe txntype:unknown reqpath:n/a Error Path:/solr/overseer Error:KeeperErrorCode = NodeExists for /solr/overseer
[junit4:junit4]   2> 5765 T788 oasc.ShardLeaderElectionContext.waitForReplicasToComeUp Enough replicas found to continue.
[junit4:junit4]   2> 5767 T788 oasc.ShardLeaderElectionContext.runLeaderProcess I may be the new leader - try and sync
[junit4:junit4]   2> 5767 T788 oasc.SyncStrategy.sync Sync replicas to http://127.0.0.1:52032/solr/collection1/
[junit4:junit4]   2> 5768 T788 oasc.SyncStrategy.syncReplicas Sync Success - now sync replicas to me
[junit4:junit4]   2> 5769 T788 oasc.SyncStrategy.syncToMe http://127.0.0.1:52032/solr/collection1/ has no replicas
[junit4:junit4]   2> 5770 T788 oasc.ShardLeaderElectionContext.runLeaderProcess I am the new leader: http://127.0.0.1:52032/solr/collection1/
[junit4:junit4]   2> 5771 T788 oascc.SolrZkClient.makePath makePath: /collections/collection1/leaders/shard1
[junit4:junit4]   2> 5786 T793 oazs.PrepRequestProcessor.pRequest Got user-level KeeperException when processing sessionid:0x13aafbe5f2e0003 type:create cxid:0x4e zxid:0xfffffffffffffffe txntype:unknown reqpath:n/a Error Path:/solr/overseer Error:KeeperErrorCode = NodeExists for /solr/overseer
[junit4:junit4]   2> 5795 T809 oascc.ZkStateReader.updateClusterState Updating cloud state from ZooKeeper... 
[junit4:junit4]   2> 5822 T808 oascc.ZkStateReader$2.process A cluster state change has occurred - updating... (2)
[junit4:junit4]   2> 5823 T822 oascc.ZkStateReader$2.process A cluster state change has occurred - updating... (2)
[junit4:junit4]   2> 5856 T788 oasc.ZkController.register We are http://127.0.0.1:52032/solr/collection1/ and leader is http://127.0.0.1:52032/solr/collection1/
[junit4:junit4]   2> 5856 T788 oasc.ZkController.register No LogReplay needed for core=collection1 baseURL=http://127.0.0.1:52032/solr
[junit4:junit4]   2> 5856 T788 oasc.ZkController.checkRecovery I am the leader, no recovery necessary
[junit4:junit4]   2> 5858 T788 oasc.ZkController.publish numShards not found on descriptor - reading it from system property
[junit4:junit4]   2> 5865 T788 oascc.ZkStateReader.updateClusterState Updating cloud state from ZooKeeper... 
[junit4:junit4]   2> 5867 T788 oass.SolrDispatchFilter.init user.dir=C:\Users\JenkinsSlave\workspace\Lucene-Solr-4.x-Windows\solr\build\solr-core\test\J0
[junit4:junit4]   2> 5868 T788 oass.SolrDispatchFilter.init SolrDispatchFilter.init() done
[junit4:junit4]   2> 5869 T788 oascsi.HttpClientUtil.createClient Creating new http client, config:maxConnections=128&maxConnectionsPerHost=32&followRedirects=false
[junit4:junit4]   2> 6244 T788 oejs.Server.doStart jetty-8.1.2.v20120308
[junit4:junit4]   2> 6248 T788 oejs.AbstractConnector.doStart Started SelectChannelConnector@0.0.0.0:52038
[junit4:junit4]   2> 6248 T788 oasc.SolrResourceLoader.locateSolrHome JNDI not configured for solr (NoInitialContextEx)
[junit4:junit4]   2> 6249 T788 oasc.SolrResourceLoader.locateSolrHome using system property solr.solr.home: C:\Users\JenkinsSlave\workspace\Lucene-Solr-4.x-Windows\solr\build\solr-core\test\J0\.\solrtest-jetty2-1351568225825
[junit4:junit4]   2> 6249 T788 oasc.SolrResourceLoader.<init> new SolrResourceLoader for deduced Solr Home: 'C:\Users\JenkinsSlave\workspace\Lucene-Solr-4.x-Windows\solr\build\solr-core\test\J0\.\solrtest-jetty2-1351568225825\'
[junit4:junit4]   2> 6284 T788 oass.SolrDispatchFilter.init SolrDispatchFilter.init()
[junit4:junit4]   2> 6284 T788 oasc.SolrResourceLoader.locateSolrHome JNDI not configured for solr (NoInitialContextEx)
[junit4:junit4]   2> 6285 T788 oasc.SolrResourceLoader.locateSolrHome using system property solr.solr.home: C:\Users\JenkinsSlave\workspace\Lucene-Solr-4.x-Windows\solr\build\solr-core\test\J0\.\solrtest-jetty2-1351568225825
[junit4:junit4]   2> 6285 T788 oasc.CoreContainer$Initializer.initialize looking for solr.xml: C:\Users\JenkinsSlave\workspace\Lucene-Solr-4.x-Windows\solr\build\solr-core\test\J0\.\solrtest-jetty2-1351568225825\solr.xml
[junit4:junit4]   2> 6285 T788 oasc.CoreContainer.<init> New CoreContainer 23789034
[junit4:junit4]   2> 6287 T788 oasc.CoreContainer.load Loading CoreContainer using Solr Home: 'C:\Users\JenkinsSlave\workspace\Lucene-Solr-4.x-Windows\solr\build\solr-core\test\J0\.\solrtest-jetty2-1351568225825\'
[junit4:junit4]   2> 6287 T788 oasc.SolrResourceLoader.<init> new SolrResourceLoader for directory: 'C:\Users\JenkinsSlave\workspace\Lucene-Solr-4.x-Windows\solr\build\solr-core\test\J0\.\solrtest-jetty2-1351568225825\'
[junit4:junit4]   2> 6309 T788 oasc.CoreContainer.load Registering Log Listener
[junit4:junit4]   2> 6334 T788 oasc.CoreContainer.initZooKeeper Zookeeper client=127.0.0.1:52019/solr
[junit4:junit4]   2> 6335 T788 oaz.ZooKeeper.<init> Initiating client connection, connectString=127.0.0.1:52019/solr sessionTimeout=5000 watcher=org.apache.solr.common.cloud.ConnectionManager@117fcbc
[junit4:junit4]   2> 6336 T833 oaz.ClientCnxn$SendThread.startConnect Opening socket connection to server /127.0.0.1:52019
[junit4:junit4]   2> 6336 T788 oascc.ConnectionManager.waitForConnected Waiting for client to connect to ZooKeeper
[junit4:junit4]   2> 6339 T833 oaz.ClientCnxn$SendThread.primeConnection Socket connection established to 127.0.0.1/127.0.0.1:52019, initiating session
[junit4:junit4]   2> 6339 T790 oazs.NIOServerCnxn$Factory.run Accepted socket connection from /127.0.0.1:52043
[junit4:junit4]   2> 6340 T790 oazs.NIOServerCnxn.readConnectRequest Client attempting to establish new session at /127.0.0.1:52043
[junit4:junit4]   2> 6354 T792 oazs.NIOServerCnxn.finishSessionInit Established session 0x13aafbe5f2e0004 with negotiated timeout 5000 for client /127.0.0.1:52043
[junit4:junit4]   2> 6355 T833 oaz.ClientCnxn$SendThread.readConnectResult Session establishment complete on server 127.0.0.1/127.0.0.1:52019, sessionid = 0x13aafbe5f2e0004, negotiated timeout = 5000
[junit4:junit4]   2> 6355 T834 oascc.ConnectionManager.process Watcher org.apache.solr.common.cloud.ConnectionManager@117fcbc name:ZooKeeperConnection Watcher:127.0.0.1:52019/solr got event WatchedEvent state:SyncConnected type:None path:null path:null type:None
[junit4:junit4]   2> 6355 T788 oascc.ConnectionManager.waitForConnected Client is connected to ZooKeeper
[junit4:junit4]   2> 6356 T793 oazs.PrepRequestProcessor.pRequest Got user-level KeeperException when processing sessionid:0x13aafbe5f2e0004 type:create cxid:0x1 zxid:0xfffffffffffffffe txntype:unknown reqpath:n/a Error Path:/solr/overseer Error:KeeperErrorCode = NodeExists for /solr/overseer
[junit4:junit4]   2> 6374 T793 oazs.PrepRequestProcessor.pRequest Got user-level KeeperException when processing sessionid:0x13aafbe5f2e0004 type:create cxid:0x2 zxid:0xfffffffffffffffe txntype:unknown reqpath:n/a Error Path:/solr/overseer Error:KeeperErrorCode = NodeExists for /solr/overseer
[junit4:junit4]   2> 6411 T788 oasc.ZkController.createEphemeralLiveNode Register node as live in ZooKeeper:/live_nodes/127.0.0.1:52038_solr
[junit4:junit4]   2> 6412 T793 oazs.PrepRequestProcessor.pRequest Got user-level KeeperException when processing sessionid:0x13aafbe5f2e0004 type:delete cxid:0x4 zxid:0xfffffffffffffffe txntype:unknown reqpath:n/a Error Path:/solr/live_nodes/127.0.0.1:52038_solr Error:KeeperErrorCode = NoNode for /solr/live_nodes/127.0.0.1:52038_solr
[junit4:junit4]   2> 6434 T788 oascc.SolrZkClient.makePath makePath: /live_nodes/127.0.0.1:52038_solr
[junit4:junit4]   2> 6472 T822 oascc.ZkStateReader$3.process Updating live nodes... (3)
[junit4:junit4]   2> 6472 T808 oascc.ZkStateReader$3.process Updating live nodes... (3)
[junit4:junit4]   2> 6473 T788 oashc.HttpShardHandlerFactory.getParameter Setting socketTimeout to: 0
[junit4:junit4]   2> 6474 T788 oashc.HttpShardHandlerFactory.getParameter Setting urlScheme to: http://
[junit4:junit4]   2> 6474 T788 oashc.HttpShardHandlerFactory.getParameter Setting connTimeout to: 0
[junit4:junit4]   2> 6476 T809 oascc.ZkStateReader.updateClusterState Updating cloud state from ZooKeeper... 
[junit4:junit4]   2> 6476 T788 oashc.HttpShardHandlerFactory.getParameter Setting maxConnectionsPerHost to: 20
[junit4:junit4]   2> 6477 T788 oashc.HttpShardHandlerFactory.getParameter Setting corePoolSize to: 0
[junit4:junit4]   2> 6477 T809 oasc.Overseer$ClusterStateUpdater.updateState Update state numShards=1 message={
[junit4:junit4]   2> 	  "operation":"state",
[junit4:junit4]   2> 	  "numShards":"1",
[junit4:junit4]   2> 	  "shard":"shard1",
[junit4:junit4]   2> 	  "roles":null,
[junit4:junit4]   2> 	  "state":"active",
[junit4:junit4]   2> 	  "core":"collection1",
[junit4:junit4]   2> 	  "collection":"collection1",
[junit4:junit4]   2> 	  "node_name":"127.0.0.1:52032_solr",
[junit4:junit4]   2> 	  "base_url":"http://127.0.0.1:52032/solr"}
[junit4:junit4]   2> 6477 T788 oashc.HttpShardHandlerFactory.getParameter Setting maximumPoolSize to: 2147483647
[junit4:junit4]   2> 6478 T788 oashc.HttpShardHandlerFactory.getParameter Setting maxThreadIdleTime to: 5
[junit4:junit4]   2> 6478 T788 oashc.HttpShardHandlerFactory.getParameter Setting sizeOfQueue to: -1
[junit4:junit4]   2> 6479 T788 oashc.HttpShardHandlerFactory.getParameter Setting fairnessPolicy to: false
[junit4:junit4]   2> 6479 T788 oascsi.HttpClientUtil.createClient Creating new http client, config:maxConnectionsPerHost=20&maxConnections=10000&socketTimeout=0&connTimeout=0&retry=false
[junit4:junit4]   2> 6530 T788 oascc.ZkStateReader.createClusterStateWatchersAndUpdate Updating cluster state from ZooKeeper... 
[junit4:junit4]   2> 6534 T808 oascc.ZkStateReader$2.process A cluster state change has occurred - updating... (3)
[junit4:junit4]   2> 6536 T822 oascc.ZkStateReader$2.process A cluster state change has occurred - updating... (3)
[junit4:junit4]   2> 6536 T834 oaz.ClientCnxn$EventThread.processEvent SEVERE Error while calling watcher  java.lang.NullPointerException
[junit4:junit4]   2> 	at org.apache.solr.common.cloud.ZkStateReader$2.process(ZkStateReader.java:189)
[junit4:junit4]   2> 	at org.apache.zookeeper.ClientCnxn$EventThread.processEvent(ClientCnxn.java:526)
[junit4:junit4]   2> 	at org.apache.zookeeper.ClientCnxn$EventThread.run(ClientCnxn.java:502)
[junit4:junit4]   2> 
[junit4:junit4]   2> 6545 T788 oasc.CoreContainer.create Creating SolrCore 'collection1' using instanceDir: C:\Users\JenkinsSlave\workspace\Lucene-Solr-4.x-Windows\solr\build\solr-core\test\J0\.\solrtest-jetty2-1351568225825\collection1
[junit4:junit4]   2> 6545 T788 oasc.ZkController.createCollectionZkNode Check for collection zkNode:collection1
[junit4:junit4]   2> 6548 T788 oasc.ZkController.createCollectionZkNode Collection zkNode exists
[junit4:junit4]   2> 6548 T788 oasc.ZkController.readConfigName Load collection config from:/collections/collection1
[junit4:junit4]   2> 6551 T788 oasc.SolrResourceLoader.<init> new SolrResourceLoader for directory: 'C:\Users\JenkinsSlave\workspace\Lucene-Solr-4.x-Windows\solr\build\solr-core\test\J0\.\solrtest-jetty2-1351568225825\collection1\'
[junit4:junit4]   2> 6552 T788 oasc.SolrResourceLoader.replaceClassLoader Adding 'file:/C:/Users/JenkinsSlave/workspace/Lucene-Solr-4.x-Windows/solr/build/solr-core/test/J0/solrtest-jetty2-1351568225825/collection1/lib/classes/' to classloader
[junit4:junit4]   2> 6554 T788 oasc.SolrResourceLoader.replaceClassLoader Adding 'file:/C:/Users/JenkinsSlave/workspace/Lucene-Solr-4.x-Windows/solr/build/solr-core/test/J0/solrtest-jetty2-1351568225825/collection1/lib/README' to classloader
[junit4:junit4]   2> 6615 T788 oasc.SolrConfig.<init> Using Lucene MatchVersion: LUCENE_41
[junit4:junit4]   2> 6680 T788 oasc.SolrConfig.<init> Loaded SolrConfig: solrconfig.xml
[junit4:junit4]   2> 6683 T788 oass.IndexSchema.readSchema Reading Solr Schema
[junit4:junit4]   2> 6688 T788 oass.IndexSchema.readSchema Schema name=test
[junit4:junit4]   2> 7319 T788 oass.OpenExchangeRatesOrgProvider.init Initialized with rates=open-exchange-rates.json, refreshInterval=1440.
[junit4:junit4]   2> 7329 T788 oass.IndexSchema.readSchema default search field in schema is text
[junit4:junit4]   2> 7333 T788 oass.IndexSchema.readSchema unique key field: id
[junit4:junit4]   2> 7350 T788 oass.FileExchangeRateProvider.reload Reloading exchange rates from file currency.xml
[junit4:junit4]   2> 7355 T788 oass.FileExchangeRateProvider.reload Reloading exchange rates from file currency.xml
[junit4:junit4]   2> 7361 T788 oass.OpenExchangeRatesOrgProvider.reload Reloading exchange rates from open-exchange-rates.json
[junit4:junit4]   2> 7363 T788 oass.OpenExchangeRatesOrgProvider.reload Reloading exchange rates from open-exchange-rates.json
[junit4:junit4]   2> 7364 T788 oasc.SolrCore.<init> [collection1] Opening new SolrCore at C:\Users\JenkinsSlave\workspace\Lucene-Solr-4.x-Windows\solr\build\solr-core\test\J0\.\solrtest-jetty2-1351568225825\collection1\, dataDir=.\org.apache.solr.cloud.SyncSliceTest-1351568219940/jetty2\
[junit4:junit4]   2> 7365 T788 oasc.JmxMonitoredMap.<init> JMX monitoring is enabled. Adding Solr mbeans to JMX Server: com.sun.jmx.mbeanserver.JmxMBeanServer@180cf2a
[junit4:junit4]   2> 7366 T788 oasc.SolrCore.getNewIndexDir New index directory detected: old=null new=.\org.apache.solr.cloud.SyncSliceTest-1351568219940/jetty2\index/
[junit4:junit4]   2> 7368 T788 oasc.SolrCore.initIndex WARNING [collection1] Solr index directory '.\org.apache.solr.cloud.SyncSliceTest-1351568219940\jetty2\index' doesn't exist. Creating new index...
[junit4:junit4]   2> 7368 T788 oasc.CachingDirectoryFactory.get return new directory for C:\Users\JenkinsSlave\workspace\Lucene-Solr-4.x-Windows\solr\build\solr-core\test\J0\.\org.apache.solr.cloud.SyncSliceTest-1351568219940\jetty2\index forceNew:false
[junit4:junit4]   2> 7381 T788 oasc.SolrDeletionPolicy.onCommit SolrDeletionPolicy.onCommit: commits:num=1
[junit4:junit4]   2> 		commit{dir=NRTCachingDirectory(org.apache.lucene.store.SimpleFSDirectory@C:\Users\JenkinsSlave\workspace\Lucene-Solr-4.x-Windows\solr\build\solr-core\test\J0\org.apache.solr.cloud.SyncSliceTest-1351568219940\jetty2\index lockFactory=org.apache.lucene.store.NativeFSLockFactory@16ac13; maxCacheMB=48.0 maxMergeSizeMB=4.0),segFN=segments_1,generation=1,filenames=[segments_1]
[junit4:junit4]   2> 7382 T788 oasc.SolrDeletionPolicy.updateCommits newest commit = 1
[junit4:junit4]   2> 7384 T788 oasc.SolrCore.initWriters created xml: solr.XMLResponseWriter
[junit4:junit4]   2> 7385 T788 oasup.UpdateRequestProcessorChain.init inserting DistributedUpdateProcessorFactory into updateRequestProcessorChain "dedupe"
[junit4:junit4]   2> 7385 T788 oasup.UpdateRequestProcessorChain.init inserting DistributedUpdateProcessorFactory into updateRequestProcessorChain "dedupe-allfields"
[junit4:junit4]   2> 7385 T788 oasup.UpdateRequestProcessorChain.init inserting DistributedUpdateProcessorFactory into updateRequestProcessorChain "stored_sig"
[junit4:junit4]   2> 7385 T788 oasup.UpdateRequestProcessorChain.init inserting DistributedUpdateProcessorFactory into updateRequestProcessorChain "uniq-fields"
[junit4:junit4]   2> 7386 T788 oasup.UpdateRequestProcessorChain.init inserting DistributedUpdateProcessorFactory into updateRequestProcessorChain "distrib-dup-test-chain-implicit"
[junit4:junit4]   2> 7386 T788 oasc.RequestHandlers.initHandlersFromConfig adding lazy requestHandler: solr.ReplicationHandler
[junit4:junit4]   2> 7386 T788 oasc.RequestHandlers.initHandlersFromConfig created /replication: solr.ReplicationHandler
[junit4:junit4]   2> 7386 T788 oasc.RequestHandlers.initHandlersFromConfig created standard: solr.StandardRequestHandler
[junit4:junit4]   2> 7387 T788 oasc.RequestHandlers.initHandlersFromConfig created /get: solr.RealTimeGetHandler
[junit4:junit4]   2> 7388 T788 oasc.RequestHandlers.initHandlersFromConfig created dismax: solr.SearchHandler
[junit4:junit4]   2> 7388 T788 oasc.RequestHandlers.initHandlersFromConfig created mock: org.apache.solr.core.MockQuerySenderListenerReqHandler
[junit4:junit4]   2> 7390 T788 oasc.RequestHandlers.initHandlersFromConfig created /admin/: org.apache.solr.handler.admin.AdminHandlers
[junit4:junit4]   2> 7390 T788 oasc.RequestHandlers.initHandlersFromConfig created defaults: solr.StandardRequestHandler
[junit4:junit4]   2> 7390 T788 oasc.RequestHandlers.initHandlersFromConfig adding lazy requestHandler: solr.StandardRequestHandler
[junit4:junit4]   2> 7390 T788 oasc.RequestHandlers.initHandlersFromConfig created lazy: solr.StandardRequestHandler
[junit4:junit4]   2> 7391 T788 oasc.RequestHandlers.initHandlersFromConfig created /update: solr.UpdateRequestHandler
[junit4:junit4]   2> 7391 T788 oasc.RequestHandlers.initHandlersFromConfig created /terms: org.apache.solr.handler.component.SearchHandler
[junit4:junit4]   2> 7392 T788 oasc.RequestHandlers.initHandlersFromConfig created spellCheckCompRH: org.apache.solr.handler.component.SearchHandler
[junit4:junit4]   2> 7392 T788 oasc.RequestHandlers.initHandlersFromConfig created spellCheckCompRH_Direct: org.apache.solr.handler.component.SearchHandler
[junit4:junit4]   2> 7392 T788 oasc.RequestHandlers.initHandlersFromConfig created spellCheckWithWordbreak: org.apache.solr.handler.component.SearchHandler
[junit4:junit4]   2> 7393 T788 oasc.RequestHandlers.initHandlersFromConfig created spellCheckWithWordbreak_Direct: org.apache.solr.handler.component.SearchHandler
[junit4:junit4]   2> 7393 T788 oasc.RequestHandlers.initHandlersFromConfig created spellCheckCompRH1: org.apache.solr.handler.component.SearchHandler
[junit4:junit4]   2> 7393 T788 oasc.RequestHandlers.initHandlersFromConfig created tvrh: org.apache.solr.handler.component.SearchHandler
[junit4:junit4]   2> 7395 T788 oasc.RequestHandlers.initHandlersFromConfig created /mlt: solr.MoreLikeThisHandler
[junit4:junit4]   2> 7395 T788 oasc.RequestHandlers.initHandlersFromConfig created /debug/dump: solr.DumpRequestHandler
[junit4:junit4]   2> 7400 T788 oashl.XMLLoader.init xsltCacheLifetimeSeconds=60
[junit4:junit4]   2> 7404 T788 oasc.SolrCore.initDeprecatedSupport WARNING solrconfig.xml uses deprecated <admin/gettableFiles>, Please update your config to use the ShowFileRequestHandler.
[junit4:junit4]   2> 7407 T788 oasc.SolrCore.initDeprecatedSupport WARNING adding ShowFileRequestHandler with hidden files: [SCHEMA.XML, OLD_SYNONYMS.TXT, STOPWORDS.TXT, PROTWORDS.TXT, OPEN-EXCHANGE-RATES.JSON, SYNONYMS.TXT, CURRENCY.XML, MAPPING-ISOLATIN1ACCENT.TXT]
[junit4:junit4]   2> 7412 T788 oass.SolrIndexSearcher.<init> Opening Searcher@1f8ee8b main
[junit4:junit4]   2> 7414 T788 oasu.CommitTracker.<init> Hard AutoCommit: disabled
[junit4:junit4]   2> 7414 T788 oasu.CommitTracker.<init> Soft AutoCommit: disabled
[junit4:junit4]   2> 7415 T788 oashc.SpellCheckComponent.inform Initializing spell checkers
[junit4:junit4]   2> 7427 T788 oass.DirectSolrSpellChecker.init init: {name=direct,classname=DirectSolrSpellChecker,field=lowerfilt,minQueryLength=3}
[junit4:junit4]   2> 7499 T835 oasc.SolrCore.registerSearcher [collection1] Registered new searcher Searcher@1f8ee8b main{StandardDirectoryReader(segments_1:1)}
[junit4:junit4]   2> 7504 T788 oasc.ZkController.publish numShards not found on descriptor - reading it from system property
[junit4:junit4]   2> 7642 T809 oascc.ZkStateReader.updateClusterState Updating cloud state from ZooKeeper... 
[junit4:junit4]   2> 7644 T809 oasc.Overseer$ClusterStateUpdater.updateState Update state numShards=1 message={
[junit4:junit4]   2> 	  "operation":"state",
[junit4:junit4]   2> 	  "numShards":"1",
[junit4:junit4]   2> 	  "shard":null,
[junit4:junit4]   2> 	  "roles":null,
[junit4:junit4]   2> 	  "state":"down",
[junit4:junit4]   2> 	  "core":"collection1",
[junit4:junit4]   2> 	  "collection":"collection1",
[junit4:junit4]   2> 	  "node_name":"127.0.0.1:52038_solr",
[junit4:junit4]   2> 	  "base_url":"http://127.0.0.1:52038/solr"}
[junit4:junit4]   2> 7651 T808 oascc.ZkStateReader$2.process A cluster state change has occurred - updating... (3)
[junit4:junit4]   2> 7651 T822 oascc.ZkStateReader$2.process A cluster state change has occurred - updating... (3)
[junit4:junit4]   2> 67847 T788 oasc.SolrException.log SEVERE null:org.apache.solr.common.SolrException: Could not get shard_id for core: collection1
[junit4:junit4]   2> 		at org.apache.solr.cloud.ZkController.doGetShardIdProcess(ZkController.java:996)
[junit4:junit4]   2> 		at org.apache.solr.cloud.ZkController.preRegister(ZkController.java:1054)
[junit4:junit4]   2> 		at org.apache.solr.core.CoreContainer.register(CoreContainer.java:661)
[junit4:junit4]   2> 		at org.apache.solr.core.CoreContainer.load(CoreContainer.java:531)
[junit4:junit4]   2> 		at org.apache.solr.core.CoreContainer.load(CoreContainer.java:351)
[junit4:junit4]   2> 		at org.apache.solr.core.CoreContainer$Initializer.initialize(CoreContainer.java:303)
[junit4:junit4]   2> 		at org.apache.solr.servlet.SolrDispatchFilter.init(SolrDispatchFilter.java:107)
[junit4:junit4]   2> 		at org.eclipse.jetty.servlet.FilterHolder.doStart(FilterHolder.java:114)
[junit4:junit4]   2> 		at org.eclipse.jetty.util.component.AbstractLifeCycle.start(AbstractLifeCycle.java:59)
[junit4:junit4]   2> 		at org.eclipse.jetty.servlet.ServletHandler.initialize(ServletHandler.java:754)
[junit4:junit4]   2> 		at org.eclipse.jetty.servlet.ServletHandler.updateMappings(ServletHandler.java:1227)
[junit4:junit4]   2> 		at org.eclipse.jetty.servlet.ServletHandler.setFilterMappings(ServletHandler.java:1263)
[junit4:junit4]   2> 		at org.eclipse.jetty.servlet.ServletHandler.addFilterWithMapping(ServletHandler.java:965)
[junit4:junit4]   2> 		at org.eclipse.jetty.servlet.ServletHandler.addFilterWithMapping(ServletHandler.java:923)
[junit4:junit4]   2> 		at org.eclipse.jetty.servlet.ServletContextHandler.addFilter(ServletContextHandler.java:333)
[junit4:junit4]   2> 		at org.apache.solr.client.solrj.embedded.JettySolrRunner$1.lifeCycleStarted(JettySolrRunner.java:173)
[junit4:junit4]   2> 		at org.eclipse.jetty.util.component.AbstractLifeCycle.setStarted(AbstractLifeCycle.java:169)
[junit4:junit4]   2> 		at org.eclipse.jetty.util.component.AbstractLifeCycle.start(AbstractLifeCycle.java:60)
[junit4:junit4]   2> 		at org.apache.solr.client.solrj.embedded.JettySolrRunner.start(JettySolrRunner.java:225)
[junit4:junit4]   2> 		at org.apache.solr.client.solrj.embedded.JettySolrRunner.start(JettySolrRunner.java:205)
[junit4:junit4]   2> 		at org.apache.solr.BaseDistributedSearchTestCase.createJetty(BaseDistributedSearchTestCase.java:262)
[junit4:junit4]   2> 		at org.apache.solr.cloud.AbstractFullDistribZkTestBase.createJettys(AbstractFullDistribZkTestBase.java:294)
[junit4:junit4]   2> 		at org.apache.solr.cloud.AbstractFullDistribZkTestBase.createServers(AbstractFullDistribZkTestBase.java:268)
[junit4:junit4]   2> 		at org.apache.solr.BaseDistributedSearchTestCase.testDistribSearch(BaseDistributedSearchTestCase.java:693)
[junit4:junit4]   2> 		at sun.reflect.NativeMethodAccessorImpl.invoke0(Native Method)
[junit4:junit4]   2> 		at sun.reflect.NativeMethodAccessorImpl.invoke(NativeMethodAccessorImpl.java:39)
[junit4:junit4]   2> 		at sun.reflect.DelegatingMethodAccessorImpl.invoke(DelegatingMethodAccessorImpl.java:25)
[junit4:junit4]   2> 		at java.lang.reflect.Method.invoke(Method.java:597)
[junit4:junit4]   2> 		at com.carrotsearch.randomizedtesting.RandomizedRunner.invoke(RandomizedRunner.java:1559)
[junit4:junit4]   2> 		at com.carrotsearch.randomizedtesting.RandomizedRunner.access$600(RandomizedRunner.java:79)
[junit4:junit4]   2> 		at com.carrotsearch.randomizedtesting.RandomizedRunner$6.evaluate(RandomizedRunner.java:737)
[junit4:junit4]   2> 		at com.carrotsearch.randomizedtesting.RandomizedRunner$7.evaluate(RandomizedRunner.java:773)
[junit4:junit4]   2> 		at com.carrotsearch.randomizedtesting.RandomizedRunner$8.evaluate(RandomizedRunner.java:787)
[junit4:junit4]   2> 		at com.carrotsearch.randomizedtesting.rules.SystemPropertiesRestoreRule$1.evaluate(SystemPropertiesRestoreRule.java:53)
[junit4:junit4]   2> 		at org.apache.lucene.util.TestRuleSetupTeardownChained$1.evaluate(TestRuleSetupTeardownChained.java:50)
[junit4:junit4]   2> 		at org.apache.lucene.util.TestRuleFieldCacheSanity$1.evaluate(TestRuleFieldCacheSanity.java:51)
[junit4:junit4]   2> 		at org.apache.lucene.util.AbstractBeforeAfterRule$1.evaluate(AbstractBeforeAfterRule.java:45)
[junit4:junit4]   2> 		at com.carrotsearch.randomizedtesting.rules.SystemPropertiesInvariantRule$1.evaluate(SystemPropertiesInvariantRule.java:55)
[junit4:junit4]   2> 		at org.apache.lucene.util.TestRuleThreadAndTestName$1.evaluate(TestRuleThreadAndTestName.java:48)
[junit4:junit4]   2> 		at org.apache.lucene.util.TestRuleIgnoreAfterMaxFailures$1.evaluate(TestRuleIgnoreAfterMaxFailures.java:70)
[junit4:junit4]   2> 		at org.apache.lucene.util.TestRuleMarkFailure$1.evaluate(TestRuleMarkFailure.java:48)
[junit4:junit4]   2> 		at com.carrotsearch.randomizedtesting.rules.StatementAdapter.evaluate(StatementAdapter.java:36)
[junit4:junit4]   2> 		at com.carrotsearch.randomizedtesting.ThreadLeakControl$StatementRunner.run(ThreadLeakControl.java:358)
[junit4:junit4]   2> 		at com.carrotsearch.randomizedtesting.ThreadLeakControl.forkTimeoutingTask(ThreadLeakControl.java:782)
[junit4:junit4]   2> 		at com.carrotsearch.randomizedtesting.ThreadLeakControl$3.evaluate(ThreadLeakControl.java:442)
[junit4:junit4]   2> 		at com.carrotsearch.randomizedtesting.RandomizedRunner.runSingleTest(RandomizedRunner.java:746)
[junit4:junit4]   2> 		at com.carrotsearch.randomizedtesting.RandomizedRunner$3.evaluate(RandomizedRunner.java:648)
[junit4:junit4]   2> 		at com.carrotsearch.randomizedtesting.RandomizedRunner$4.evaluate(RandomizedRunner.java:682)
[junit4:junit4]   2> 		at com.carrotsearch.randomizedtesting.RandomizedRunner$5.evaluate(RandomizedRunner.java:693)
[junit4:junit4]   2> 		at com.carrotsearch.randomizedtesting.rules.StatementAdapter.evaluate(StatementAdapter.java:36)
[junit4:junit4]   2> 		at com.carrotsearch.randomizedtesting.rules.SystemPropertiesRestoreRule$1.evaluate(SystemPropertiesRestoreRule.java:53)
[junit4:junit4]   2> 		at org.apache.lucene.util.AbstractBeforeAfterRule$1.evaluate(AbstractBeforeAfterRule.java:45)
[junit4:junit4]   2> 		at org.apache.lucene.util.TestRuleStoreClassName$1.evaluate(TestRuleStoreClassName.java:42)
[junit4:junit4]   2> 		at com.carrotsearch.randomizedtesting.rules.SystemPropertiesInvariantRule$1.evaluate(SystemPropertiesInvariantRule.java:55)
[junit4:junit4]   2> 		at com.carrotsearch.randomizedtesting.rules.NoShadowingOrOverridesOnMethodsRule$1.evaluate(NoShadowingOrOverridesOnMethodsRule.java:39)
[junit4:junit4]   2> 		at com.carrotsearch.randomizedtesting.rules.NoShadowingOrOverridesOnMethodsRule$1.evaluate(NoShadowingOrOverridesOnMethodsRule.java:39)
[junit4:junit4]   2> 		at com.carrotsearch.randomizedtesting.rules.StatementAdapter.evaluate(StatementAdapter.java:36)
[junit4:junit4]   2> 		at org.apache.lucene.util.TestRuleAssertionsRequired$1.evaluate(TestRuleAssertionsRequired.java:43)
[junit4:junit4]   2> 		at org.apache.lucene.util.TestRuleMarkFailure$1.evaluate(TestRuleMarkFailure.java:48)
[junit4:junit4]   2> 		at org.apache.lucene.util.TestRuleIgnoreAfterMaxFailures$1.evaluate(TestRuleIgnoreAfterMaxFailures.java:70)
[junit4:junit4]   2> 		at org.apache.lucene.util.TestRuleIgnoreTestSuites$1.evaluate(TestRuleIgnoreTestSuites.java:55)
[junit4:junit4]   2> 		at com.carrotsearch.randomizedtesting.rules.StatementAdapter.evaluate(StatementAdapter.java:36)
[junit4:junit4]   2> 		at com.carrotsearch.randomizedtesting.ThreadLeakControl$StatementRunner.run(ThreadLeakControl.java:358)
[junit4:junit4]   2> 		at java.lang.Thread.run(Thread.java:662)
[junit4:junit4]   2> 	
[junit4:junit4]   2> 67847 T788 oasc.SolrCore.close [collection1]  CLOSING SolrCore org.apache.solr.core.SolrCore@193be92
[junit4:junit4]   2> 67853 T788 oasu.DirectUpdateHandler2.close closing DirectUpdateHandler2{commits=0,autocommits=0,soft autocommits=0,optimizes=0,rollbacks=0,expungeDeletes=0,docsPending=0,adds=0,deletesById=0,deletesByQuery=0,errors=0,cumulative_adds=0,cumulative_deletesById=0,cumulative_deletesByQuery=0,cumulative_errors=0}
[junit4:junit4]   2> 67853 T788 oasc.SolrCore.decrefSolrCoreState Closing SolrCoreState
[junit4:junit4]   2> 67853 T788 oasu.DefaultSolrCoreState.closeIndexWriter SolrCoreState ref count has reached 0 - closing IndexWriter
[junit4:junit4]   2> 67853 T788 oasu.DefaultSolrCoreState.closeIndexWriter closing IndexWriter with IndexWriterCloser
[junit4:junit4]   2> 67855 T788 oasc.SolrCore.closeSearcher [collection1] Closing main searcher on request.
[junit4:junit4]   2> 67855 T788 oass.SolrDispatchFilter.init user.dir=C:\Users\JenkinsSlave\workspace\Lucene-Solr-4.x-Windows\solr\build\solr-core\test\J0
[junit4:junit4]   2> 67855 T788 oass.SolrDispatchFilter.init SolrDispatchFilter.init() done
[junit4:junit4]   2> 67856 T788 oascsi.HttpClientUtil.createClient Creating new http client, config:maxConnections=128&maxConnectionsPerHost=32&followRedirects=false
[junit4:junit4]   2> 68153 T788 oejs.Server.doStart jetty-8.1.2.v20120308
[junit4:junit4]   2> 68155 T788 oejs.AbstractConnector.doStart Started SelectChannelConnector@0.0.0.0:52044
[junit4:junit4]   2> 68156 T788 oasc.SolrResourceLoader.locateSolrHome JNDI not configured for solr (NoInitialContextEx)
[junit4:junit4]   2> 68157 T788 oasc.SolrResourceLoader.locateSolrHome using system property solr.solr.home: C:\Users\JenkinsSlave\workspace\Lucene-Solr-4.x-Windows\solr\build\solr-core\test\J0\.\solrtest-jetty3-1351568287799
[junit4:junit4]   2> 68157 T788 oasc.SolrResourceLoader.<init> new SolrResourceLoader for deduced Solr Home: 'C:\Users\JenkinsSlave\workspace\Lucene-Solr-4.x-Windows\solr\build\solr-core\test\J0\.\solrtest-jetty3-1351568287799\'
[junit4:junit4]   2> 68189 T788 oass.SolrDispatchFilter.init SolrDispatchFilter.init()
[junit4:junit4]   2> 68190 T788 oasc.SolrResourceLoader.locateSolrHome JNDI not configured for solr (NoInitialContextEx)
[junit4:junit4]   2> 68190 T788 oasc.SolrResourceLoader.locateSolrHome using system property solr.solr.home: C:\Users\JenkinsSlave\workspace\Lucene-Solr-4.x-Windows\solr\build\solr-core\test\J0\.\solrtest-jetty3-1351568287799
[junit4:junit4]   2> 68190 T788 oasc.CoreContainer$Initializer.initialize looking for solr.xml: C:\Users\JenkinsSlave\workspace\Lucene-Solr-4.x-Windows\solr\build\solr-core\test\J0\.\solrtest-jetty3-1351568287799\solr.xml
[junit4:junit4]   2> 68191 T788 oasc.CoreContainer.<init> New CoreContainer 28319921
[junit4:junit4]   2> 68191 T788 oasc.CoreContainer.load Loading CoreContainer using Solr Home: 'C:\Users\JenkinsSlave\workspace\Lucene-Solr-4.x-Windows\solr\build\solr-core\test\J0\.\solrtest-jetty3-1351568287799\'
[junit4:junit4]   2> 68191 T788 oasc.SolrResourceLoader.<init> new SolrResourceLoader for directory: 'C:\Users\JenkinsSlave\workspace\Lucene-Solr-4.x-Windows\solr\build\solr-core\test\J0\.\solrtest-jetty3-1351568287799\'
[junit4:junit4]   2> 68216 T788 oasc.CoreContainer.load Registering Log Listener
[junit4:junit4]   2> 68238 T788 oasc.CoreContainer.initZooKeeper Zookeeper client=127.0.0.1:52019/solr
[junit4:junit4]   2> 68239 T788 oaz.ZooKeeper.<init> Initiating client connection, connectString=127.0.0.1:52019/solr sessionTimeout=5000 watcher=org.apache.solr.common.cloud.ConnectionManager@1578744
[junit4:junit4]   2> 68240 T845 oaz.ClientCnxn$SendThread.startConnect Opening socket connection to server /127.0.0.1:52019
[junit4:junit4]   2> 68240 T788 oascc.ConnectionManager.waitForConnected Waiting for client to connect to ZooKeeper
[junit4:junit4]   2> 68242 T845 oaz.ClientCnxn$SendThread.primeConnection Socket connection established to 127.0.0.1/127.0.0.1:52019, initiating session
[junit4:junit4]   2> 68242 T790 oazs.NIOServerCnxn$Factory.run Accepted socket connection from /127.0.0.1:52049
[junit4:junit4]   2> 68242 T790 oazs.NIOServerCnxn.readConnectRequest Client attempting to establish new session at /127.0.0.1:52049
[junit4:junit4]   2> 68263 T792 oazs.NIOServerCnxn.finishSessionInit Established session 0x13aafbe5f2e0005 with negotiated timeout 5000 for client /127.0.0.1:52049
[junit4:junit4]   2> 68263 T845 oaz.ClientCnxn$SendThread.readConnectResult Session establishment complete on server 127.0.0.1/127.0.0.1:52019, sessionid = 0x13aafbe5f2e0005, negotiated timeout = 5000
[junit4:junit4]   2> 68263 T846 oascc.ConnectionManager.process Watcher org.apache.solr.common.cloud.ConnectionManager@1578744 name:ZooKeeperConnection Watcher:127.0.0.1:52019/solr got event WatchedEvent state:SyncConnected type:None path:null path:null type:None
[junit4:junit4]   2> 68264 T788 oascc.ConnectionManager.waitForConnected Client is connected to ZooKeeper
[junit4:junit4]   2> 68265 T793 oazs.PrepRequestProcessor.pRequest Got user-level KeeperException when processing sessionid:0x13aafbe5f2e0005 type:create cxid:0x1 zxid:0xfffffffffffffffe txntype:unknown reqpath:n/a Error Path:/solr/overseer Error:KeeperErrorCode = NodeExists for /solr/overseer
[junit4:junit4]   2> 68267 T793 oazs.PrepRequestProcessor.pRequest Got user-level KeeperException when processing sessionid:0x13aafbe5f2e0005 type:create cxid:0x2 zxid:0xfffffffffffffffe txntype:unknown reqpath:n/a Error Path:/solr/overseer Error:KeeperErrorCode = NodeExists for /solr/overseer
[junit4:junit4]   2> 68269 T788 oasc.ZkController.createEphemeralLiveNode Register node as live in ZooKeeper:/live_nodes/127.0.0.1:52044_solr
[junit4:junit4]   2> 68270 T793 oazs.PrepRequestProcessor.pRequest Got user-level KeeperException when processing sessionid:0x13aafbe5f2e0005 type:delete cxid:0x4 zxid:0xfffffffffffffffe txntype:unknown reqpath:n/a Error Path:/solr/live_nodes/127.0.0.1:52044_solr Error:KeeperErrorCode = NoNode for /solr/live_nodes/127.0.0.1:52044_solr
[junit4:junit4]   2> 68271 T788 oascc.SolrZkClient.makePath makePath: /live_nodes/127.0.0.1:52044_solr
[junit4:junit4]   2> 68276 T808 oascc.ZkStateReader$3.process Updating live nodes... (4)
[junit4:junit4]   2> 68277 T822 oascc.ZkStateReader$3.process Updating live nodes... (4)
[junit4:junit4]   2> 68278 T834 oascc.ZkStateReader$3.process Updating live nodes... (4)
[junit4:junit4]   2> 68278 T788 oashc.HttpShardHandlerFactory.getParameter Setting socketTimeout to: 0
[junit4:junit4]   2> 68278 T788 oashc.HttpShardHandlerFactory.getParameter Setting urlScheme to: http://
[junit4:junit4]   2> 68279 T788 oashc.HttpShardHandlerFactory.getParameter Setting connTimeout to: 0
[junit4:junit4]   2> 68279 T788 oashc.HttpShardHandlerFactory.getParameter Setting maxConnectionsPerHost to: 20
[junit4:junit4]   2> 68279 T788 oashc.HttpShardHandlerFactory.getParameter Setting corePoolSize to: 0
[junit4:junit4]   2> 68280 T788 oashc.HttpShardHandlerFactory.getParameter Setting maximumPoolSize to: 2147483647
[junit4:junit4]   2> 68280 T788 oashc.HttpShardHandlerFactory.getParameter Setting maxThreadIdleTime to: 5
[junit4:junit4]   2> 68280 T788 oashc.HttpShardHandlerFactory.getParameter Setting sizeOfQueue to: -1
[junit4:junit4]   2> 68281 T788 oashc.HttpShardHandlerFactory.getParameter Setting fairnessPolicy to: false
[junit4:junit4]   2> 68281 T788 oascsi.HttpClientUtil.createClient Creating new http client, config:maxConnectionsPerHost=20&maxConnections=10000&socketTimeout=0&connTimeout=0&retry=false
[junit4:junit4]   2> 68293 T788 oascc.ZkStateReader.createClusterStateWatchersAndUpdate Updating cluster state from ZooKeeper... 
[junit4:junit4]   2> 68301 T788 oasc.CoreContainer.create Creating SolrCore 'collection1' using instanceDir: C:\Users\JenkinsSlave\workspace\Lucene-Solr-4.x-Windows\solr\build\solr-core\test\J0\.\solrtest-jetty3-1351568287799\collection1
[junit4:junit4]   2> 68301 T788 oasc.ZkController.createCollectionZkNode Check for collection zkNode:collection1
[junit4:junit4]   2> 68301 T788 oasc.ZkController.createCollectionZkNode Collection zkNode exists
[junit4:junit4]   2> 68301 T788 oasc.ZkController.readConfigName Load collection config from:/collections/collection1
[junit4:junit4]   2> 68304 T788 oasc.SolrResourceLoader.<init> new SolrResourceLoader for directory: 'C:\Users\JenkinsSlave\workspace\Lucene-Solr-4.x-Windows\solr\build\solr-core\test\J0\.\solrtest-jetty3-1351568287799\collection1\'
[junit4:junit4]   2> 68305 T788 oasc.SolrResourceLoader.replaceClassLoader Adding 'file:/C:/Users/JenkinsSlave/workspace/Lucene-Solr-4.x-Windows/solr/build/solr-core/test/J0/solrtest-jetty3-1351568287799/collection1/lib/classes/' to classloader
[junit4:junit4]   2> 68306 T788 oasc.SolrResourceLoader.replaceClassLoader Adding 'file:/C:/Users/JenkinsSlave/workspace/Lucene-Solr-4.x-Windows/solr/build/solr-core/test/J0/solrtest-jetty3-1351568287799/collection1/lib/README' to classloader
[junit4:junit4]   2> 68360 T788 oasc.SolrConfig.<init> Using Lucene MatchVersion: LUCENE_41
[junit4:junit4]   2> 68431 T788 oasc.SolrConfig.<init> Loaded SolrConfig: solrconfig.xml
[junit4:junit4]   2> 68433 T788 oass.IndexSchema.readSchema Reading Solr Schema
[junit4:junit4]   2> 68439 T788 oass.IndexSchema.readSchema Schema name=test
[junit4:junit4]   2> 69069 T788 oass.OpenExchangeRatesOrgProvider.init Initialized with rates=open-exchange-rates.json, refreshInterval=1440.
[junit4:junit4]   2> 69080 T788 oass.IndexSchema.readSchema default search field in schema is text
[junit4:junit4]   2> 69085 T788 oass.IndexSchema.readSchema unique key field: id
[junit4:junit4]   2> 69101 T788 oass.FileExchangeRateProvider.reload Reloading exchange rates from file currency.xml
[junit4:junit4]   2> 69108 T788 oass.FileExchangeRateProvider.reload Reloading exchange rates from file currency.xml
[junit4:junit4]   2> 69116 T788 oass.OpenExchangeRatesOrgProvider.reload Reloading exchange rates from open-exchange-rates.json
[junit4:junit4]   2> 69118 T788 oass.OpenExchangeRatesOrgProvider.reload Reloading exchange rates from open-exchange-rates.json
[junit4:junit4]   2> 69119 T788 oasc.SolrCore.<init> [collection1] Opening new SolrCore at C:\Users\JenkinsSlave\workspace\Lucene-Solr-4.x-Windows\solr\build\solr-core\test\J0\.\solrtest-jetty3-1351568287799\collection1\, dataDir=.\org.apache.solr.cloud.SyncSliceTest-1351568219940/jetty3\
[junit4:junit4]   2> 69119 T788 oasc.JmxMonitoredMap.<init> JMX monitoring is enabled. Adding Solr mbeans to JMX Server: com.sun.jmx.mbeanserver.JmxMBeanServer@180cf2a
[junit4:junit4]   2> 69120 T788 oasc.SolrCore.getNewIndexDir New index directory detected: old=null new=.\org.apache.solr.cloud.SyncSliceTest-1351568219940/jetty3\index/
[junit4:junit4]   2> 69121 T788 oasc.SolrCore.initIndex WARNING [collection1] Solr index directory '.\org.apache.solr.cloud.SyncSliceTest-1351568219940\jetty3\index' doesn't exist. Creating new index...
[junit4:junit4]   2> 69122 T788 oasc.CachingDirectoryFactory.get return new directory for C:\Users\JenkinsSlave\workspace\Lucene-Solr-4.x-Windows\solr\build\solr-core\test\J0\.\org.apache.solr.cloud.SyncSliceTest-1351568219940\jetty3\index forceNew:false
[junit4:junit4]   2> 69136 T788 oasc.SolrDeletionPolicy.onCommit SolrDeletionPolicy.onCommit: commits:num=1
[junit4:junit4]   2> 		commit{dir=NRTCachingDirectory(org.apache.lucene.store.SimpleFSDirectory@C:\Users\JenkinsSlave\workspace\Lucene-Solr-4.x-Windows\solr\build\solr-core\test\J0\org.apache.solr.cloud.SyncSliceTest-1351568219940\jetty3\index lockFactory=org.apache.lucene.store.NativeFSLockFactory@84888a; maxCacheMB=48.0 maxMergeSizeMB=4.0),segFN=segments_1,generation=1,filenames=[segments_1]
[junit4:junit4]   2> 69136 T788 oasc.SolrDeletionPolicy.updateCommits newest commit = 1
[junit4:junit4]   2> 69139 T788 oasc.SolrCore.initWriters created xml: solr.XMLResponseWriter
[junit4:junit4]   2> 69140 T788 oasup.UpdateRequestProcessorChain.init inserting DistributedUpdateProcessorFactory into updateRequestProcessorChain "dedupe"
[junit4:junit4]   2> 69140 T788 oasup.UpdateRequestProcessorChain.init inserting DistributedUpdateProcessorFactory into updateRequestProcessorChain "dedupe-allfields"
[junit4:junit4]   2> 69141 T788 oasup.UpdateRequestProcessorChain.init inserting DistributedUpdateProcessorFactory into updateRequestProcessorChain "stored_sig"
[junit4:junit4]   2> 69141 T788 oasup.UpdateRequestProcessorChain.init inserting DistributedUpdateProcessorFactory into updateRequestProcessorChain "uniq-fields"
[junit4:junit4]   2> 69141 T788 oasup.UpdateRequestProcessorChain.init inserting DistributedUpdateProcessorFactory into updateRequestProcessorChain "distrib-dup-test-chain-implicit"
[junit4:junit4]   2> 69142 T788 oasc.RequestHandlers.initHandlersFromConfig adding lazy requestHandler: solr.ReplicationHandler
[junit4:junit4]   2> 69142 T788 oasc.RequestHandlers.initHandlersFromConfig created /replication: solr.ReplicationHandler
[junit4:junit4]   2> 69142 T788 oasc.RequestHandlers.initHandlersFromConfig created standard: solr.StandardRequestHandler
[junit4:junit4]   2> 69143 T788 oasc.RequestHandlers.initHandlersFromConfig created /get: solr.RealTimeGetHandler
[junit4:junit4]   2> 69144 T788 oasc.RequestHandlers.initHandlersFromConfig created dismax: solr.SearchHandler
[junit4:junit4]   2> 69144 T788 oasc.RequestHandlers.initHandlersFromConfig created mock: org.apache.solr.core.MockQuerySenderListenerReqHandler
[junit4:junit4]   2> 69144 T788 oasc.RequestHandlers.initHandlersFromConfig created /admin/: org.apache.solr.handler.admin.AdminHandlers
[junit4:junit4]   2> 69146 T788 oasc.RequestHandlers.initHandlersFromConfig created defaults: solr.StandardRequestHandler
[junit4:junit4]   2> 69146 T788 oasc.RequestHandlers.initHandlersFromConfig adding lazy requestHandler: solr.StandardRequestHandler
[junit4:junit4]   2> 69146 T788 oasc.RequestHandlers.initHandlersFromConfig created lazy: solr.StandardRequestHandler
[junit4:junit4]   2> 69147 T788 oasc.RequestHandlers.initHandlersFromConfig created /update: solr.UpdateRequestHandler
[junit4:junit4]   2> 69147 T788 oasc.RequestHandlers.initHandlersFromConfig created /terms: org.apache.solr.handler.component.SearchHandler
[junit4:junit4]   2> 69147 T788 oasc.RequestHandlers.initHandlersFromConfig created spellCheckCompRH: org.apache.solr.handler.component.SearchHandler
[junit4:junit4]   2> 69148 T788 oasc.RequestHandlers.initHandlersFromConfig created spellCheckCompRH_Direct: org.apache.solr.handler.component.SearchHandler
[junit4:junit4]   2> 69148 T788 oasc.RequestHandlers.initHandlersFromConfig created spellCheckWithWordbreak: org.apache.solr.handler.component.SearchHandler
[junit4:junit4]   2> 69148 T788 oasc.RequestHandlers.initHandlersFromConfig created spellCheckWithWordbreak_Direct: org.apache.solr.handler.component.SearchHandler
[junit4:junit4]   2> 69149 T788 oasc.RequestHandlers.initHandlersFromConfig created spellCheckCompRH1: org.apache.solr.handler.component.SearchHandler
[junit4:junit4]   2> 69149 T788 oasc.RequestHandlers.initHandlersFromConfig created tvrh: org.apache.solr.handler.component.SearchHandler
[junit4:junit4]   2> 69150 T788 oasc.RequestHandlers.initHandlersFromConfig created /mlt: solr.MoreLikeThisHandler
[junit4:junit4]   2> 69150 T788 oasc.RequestHandlers.initHandlersFromConfig created /debug/dump: solr.DumpRequestHandler
[junit4:junit4]   2> 69158 T788 oashl.XMLLoader.init xsltCacheLifetimeSeconds=60
[junit4:junit4]   2> 69163 T788 oasc.SolrCore.initDeprecatedSupport WARNING solrconfig.xml uses deprecated <admin/gettableFiles>, Please update your config to use the ShowFileRequestHandler.
[junit4:junit4]   2> 69165 T788 oasc.SolrCore.initDeprecatedSupport WARNING adding ShowFileRequestHandler with hidden files: [SCHEMA.XML, OLD_SYNONYMS.TXT, STOPWORDS.TXT, PROTWORDS.TXT, OPEN-EXCHANGE-RATES.JSON, SYNONYMS.TXT, CURRENCY.XML, MAPPING-ISOLATIN1ACCENT.TXT]
[junit4:junit4]   2> 69169 T788 oass.SolrIndexSearcher.<init> Opening Searcher@5c89f main
[junit4:junit4]   2> 69171 T788 oasu.CommitTracker.<init> Hard AutoCommit: disabled
[junit4:junit4]   2> 69172 T788 oasu.CommitTracker.<init> Soft AutoCommit: disabled
[junit4:junit4]   2> 69172 T788 oashc.SpellCheckComponent.inform Initializing spell checkers
[junit4:junit4]   2> 69182 T788 oass.DirectSolrSpellChecker.init init: {name=direct,classname=DirectSolrSpellChecker,field=lowerfilt,minQueryLength=3}
[junit4:junit4]   2> 69236 T847 oasc.SolrCore.registerSearcher [collection1] Registered new searcher Searcher@5c89f main{StandardDirectoryReader(segments_1:1)}
[junit4:junit4]   2> 69239 T788 oasc.ZkController.publish numShards not found on descriptor - reading it from system property
[junit4:junit4]   2> 69715 T809 oascc.ZkStateReader.updateClusterState Updating cloud state from ZooKeeper... 
[junit4:junit4]   2> 69716 T809 oasc.Overseer$ClusterStateUpdater.updateState Update state numShards=1 message={
[junit4:junit4]   2> 	  "operation":"state",
[junit4:junit4]   2> 	  "numShards":"1",
[junit4:junit4]   2> 	  "shard":null,
[junit4:junit4]   2> 	  "roles":null,
[junit4:junit4]   2> 	  "state":"down",
[junit4:junit4]   2> 	  "core":"collection1",
[junit4:junit4]   2> 	  "collection":"collection1",
[junit4:junit4]   2> 	  "node_name":"127.0.0.1:52044_solr",
[junit4:junit4]   2> 	  "base_url":"http://127.0.0.1:52044/solr"}
[junit4:junit4]   2> 69722 T808 oascc.ZkStateReader$2.process A cluster state change has occurred - updating... (4)
[junit4:junit4]   2> 69723 T822 oascc.ZkStateReader$2.process A cluster state change has occurred - updating... (4)
[junit4:junit4]   2> 69723 T846 oascc.ZkStateReader$2.process A cluster state change has occurred - updating... (4)
[junit4:junit4]   2> 69741 T788 oasc.CoreContainer.register registering core: collection1
[junit4:junit4]   2> 69741 T788 oasc.ZkController.register Register shard - core:collection1 address:http://127.0.0.1:52044/solr shardId:shard1
[junit4:junit4]   2> 69745 T788 oasc.ZkController.register We are http://127.0.0.1:52044/solr/collection1/ and leader is http://127.0.0.1:52032/solr/collection1/
[junit4:junit4]   2> 69746 T788 oasc.ZkController.register No LogReplay needed for core=collection1 baseURL=http://127.0.0.1:52044/solr
[junit4:junit4]   2> 69746 T788 oasc.ZkController.checkRecovery Core needs to recover:collection1
[junit4:junit4]   2> 69746 T788 oasu.DefaultSolrCoreState.doRecovery Running recovery - first canceling any ongoing recovery
[junit4:junit4]   2> ASYNC  NEW_CORE C45 name=collection1 org.apache.solr.core.SolrCore@bdcf4a url=http://127.0.0.1:52044/solr/collection1 node=127.0.0.1:52044_solr
[junit4:junit4]   2> 69747 T848 C45 P52044 oasc.RecoveryStrategy.run Starting recovery process.  core=collection1 recoveringAfterStartup=true
[junit4:junit4]   2> 69748 T848 C45 P52044 oasc.RecoveryStrategy.doRecovery ###### startupVersions=[]
[junit4:junit4]   2> 69748 T848 C45 P52044 oasc.ZkController.publish numShards not found on descriptor - reading it from system property
[junit4:junit4]   2> 69748 T788 oascc.ZkStateReader.updateClusterState Updating cloud state from ZooKeeper... 
[junit4:junit4]   2> 69750 T848 C45 P52044 oasc.RecoveryStrategy.doRecovery Attempting to PeerSync from http://127.0.0.1:52032/solr/collection1/ core=collection1 - recoveringAfterStartup=true
[junit4:junit4]   2> 69750 T848 C45 P52044 oasu.PeerSync.sync PeerSync: core=collection1 url=http://127.0.0.1:52044/solr START replicas=[http://127.0.0.1:52032/solr/collection1/] nUpdates=100
[junit4:junit4]   2> 69750 T788 oass.SolrDispatchFilter.init user.dir=C:\Users\JenkinsSlave\workspace\Lucene-Solr-4.x-Windows\solr\build\solr-core\test\J0
[junit4:junit4]   2> 69750 T848 C45 P52044 oasu.PeerSync.sync WARNING no frame of reference to tell of we've missed updates
[junit4:junit4]   2> 69750 T788 oass.SolrDispatchFilter.init SolrDispatchFilter.init() done
[junit4:junit4]   2> 69751 T788 oascsi.HttpClientUtil.createClient Creating new http client, config:maxConnections=128&maxConnectionsPerHost=32&followRedirects=false
[junit4:junit4]   2> 69751 T848 C45 P52044 oasc.RecoveryStrategy.doRecovery PeerSync Recovery was not successful - trying replication. core=collection1
[junit4:junit4]   2> 69752 T848 C45 P52044 oasc.RecoveryStrategy.doRecovery Starting Replication Recovery. core=collection1
[junit4:junit4]   2> 69752 T848 C45 P52044 oascsi.HttpClientUtil.createClient Creating new http client, config:maxConnections=128&maxConnectionsPerHost=32&followRedirects=false
[junit4:junit4]   2> ASYNC  NEW_CORE C46 name=collection1 org.apache.solr.core.SolrCore@16aaae3 url=http://127.0.0.1:52032/solr/collection1 node=127.0.0.1:52032_solr
[junit4:junit4]   2> 69766 T819 C46 P52032 REQ /get {distrib=false&qt=/get&wt=javabin&version=2&getVersions=100} status=0 QTime=1 
[junit4:junit4]   2> 70052 T788 oejs.Server.doStart jetty-8.1.2.v20120308
[junit4:junit4]   2> 70056 T788 oejs.AbstractConnector.doStart Started SelectChannelConnector@0.0.0.0:52052
[junit4:junit4]   2> 70057 T788 oasc.SolrResourceLoader.locateSolrHome JNDI not configured for solr (NoInitialContextEx)
[junit4:junit4]   2> 70057 T788 oasc.SolrResourceLoader.locateSolrHome using system property solr.solr.home: C:\Users\JenkinsSlave\workspace\Lucene-Solr-4.x-Windows\solr\build\solr-core\test\J0\.\solrtest-jetty4-1351568289697
[junit4:junit4]   2> 70058 T788 oasc.SolrResourceLoader.<init> new SolrResourceLoader for deduced Solr Home: 'C:\Users\JenkinsSlave\workspace\Lucene-Solr-4.x-Windows\solr\build\solr-core\test\J0\.\solrtest-jetty4-1351568289697\'
[junit4:junit4]   2> 70092 T788 oass.SolrDispatchFilter.init SolrDispatchFilter.init()
[junit4:junit4]   2> 70093 T788 oasc.SolrResourceLoader.locateSolrHome JNDI not configured for solr (NoInitialContextEx)
[junit4:junit4]   2> 70093 T788 oasc.SolrResourceLoader.locateSolrHome using system property solr.solr.home: C:\Users\JenkinsSlave\workspace\Lucene-Solr-4.x-Windows\solr\build\solr-core\test\J0\.\solrtest-jetty4-1351568289697
[junit4:junit4]   2> 70093 T788 oasc.CoreContainer$Initializer.initialize looking for solr.xml: C:\Users\JenkinsSlave\workspace\Lucene-Solr-4.x-Windows\solr\build\solr-core\test\J0\.\solrtest-jetty4-1351568289697\solr.xml
[junit4:junit4]   2> 70093 T788 oasc.CoreContainer.<init> New CoreContainer 9598138
[junit4:junit4]   2> 70093 T788 oasc.CoreContainer.load Loading CoreContainer using Solr Home: 'C:\Users\JenkinsSlave\workspace\Lucene-Solr-4.x-Windows\solr\build\solr-core\test\J0\.\solrtest-jetty4-1351568289697\'
[junit4:junit4]   2> 70094 T788 oasc.SolrResourceLoader.<init> new SolrResourceLoader for directory: 'C:\Users\JenkinsSlave\workspace\Lucene-Solr-4.x-Windows\solr\build\solr-core\test\J0\.\solrtest-jetty4-1351568289697\'
[junit4:junit4]   2> 70118 T788 oasc.CoreContainer.load Registering Log Listener
[junit4:junit4]   2> 70136 T788 oasc.CoreContainer.initZooKeeper Zookeeper client=127.0.0.1:52019/solr
[junit4:junit4]   2> 70136 T788 oaz.ZooKeeper.<init> Initiating client connection, connectString=127.0.0.1:52019/solr sessionTimeout=5000 watcher=org.apache.solr.common.cloud.ConnectionManager@1ed7afd
[junit4:junit4]   2> 70138 T859 oaz.ClientCnxn$SendThread.startConnect Opening socket connection to server /127.0.0.1:52019
[junit4:junit4]   2> 70138 T788 oascc.ConnectionManager.waitForConnected Waiting for client to connect to ZooKeeper
[junit4:junit4]   2> 70140 T859 oaz.ClientCnxn$SendThread.primeConnection Socket connection established to 127.0.0.1/127.0.0.1:52019, initiating session
[junit4:junit4]   2> 70140 T790 oazs.NIOServerCnxn$Factory.run Accepted socket connection from /127.0.0.1:52057
[junit4:junit4]   2> 70145 T790 oazs.NIOServerCnxn.readConnectRequest Client attempting to establish new session at /127.0.0.1:52057
[junit4:junit4]   2> 70156 T792 oazs.NIOServerCnxn.finishSessionInit Established session 0x13aafbe5f2e0006 with negotiated timeout 5000 for client /127.0.0.1:52057
[junit4:junit4]   2> 70156 T859 oaz.ClientCnxn$SendThread.readConnectResult Session establishment complete on server 127.0.0.1/127.0.0.1:52019, sessionid = 0x13aafbe5f2e0006, negotiated timeout = 5000
[junit4:junit4]   2> 70156 T860 oascc.ConnectionManager.process Watcher org.apache.solr.common.cloud.ConnectionManager@1ed7afd name:ZooKeeperConnection Watcher:127.0.0.1:52019/solr got event WatchedEvent state:SyncConnected type:None path:null path:null type:None
[junit4:junit4]   2> 70156 T788 oascc.ConnectionManager.waitForConnected Client is connected to ZooKeeper
[junit4:junit4]   2> 70157 T793 oazs.PrepRequestProcessor.pRequest Got user-level KeeperException when processing sessionid:0x13aafbe5f2e0006 type:create cxid:0x1 zxid:0xfffffffffffffffe txntype:unknown reqpath:n/a Error Path:/solr/overseer Error:KeeperErrorCode = NodeExists for /solr/overseer
[junit4:junit4]   2> 70159 T793 oazs.PrepRequestProcessor.pRequest Got user-level KeeperException when processing sessionid:0x13aafbe5f2e0006 type:create cxid:0x2 zxid:0xfffffffffffffffe txntype:unknown reqpath:n/a Error Path:/solr/overseer Error:KeeperErrorCode = NodeExists for /solr/overseer
[junit4:junit4]   2> 70161 T788 oasc.ZkController.createEphemeralLiveNode Register node as live in ZooKeeper:/live_nodes/127.0.0.1:52052_solr
[junit4:junit4]   2> 70162 T793 oazs.PrepRequestProcessor.pRequest Got user-level KeeperException when processing sessionid:0x13aafbe5f2e0006 type:delete cxid:0x4 zxid:0xfffffffffffffffe txntype:unknown reqpath:n/a Error Path:/solr/live_nodes/127.0.0.1:52052_solr Error:KeeperErrorCode = NoNode for /solr/live_nodes/127.0.0.1:52052_solr
[junit4:junit4]   2> 70164 T788 oascc.SolrZkClient.makePath makePath: /live_nodes/127.0.0.1:52052_solr
[junit4:junit4]   2> 70168 T808 oascc.ZkStateReader$3.process Updating live nodes... (5)
[junit4:junit4]   2> 70168 T846 oascc.ZkStateReader$3.process Updating live nodes... (5)
[junit4:junit4]   2> 70168 T822 oascc.ZkStateReader$3.process Updating live nodes... (5)
[junit4:junit4]   2> 70169 T834 oascc.ZkStateReader$3.process Updating live nodes... (5)
[junit4:junit4]   2> 70169 T788 oashc.HttpShardHandlerFactory.getParameter Setting socketTimeout to: 0
[junit4:junit4]   2> 70169 T788 oashc.HttpShardHandlerFactory.getParameter Setting urlScheme to: http://
[junit4:junit4]   2> 70169 T788 oashc.HttpShardHandlerFactory.getParameter Setting connTimeout to: 0
[junit4:junit4]   2> 70171 T788 oashc.HttpShardHandlerFactory.getParameter Setting maxConnectionsPerHost to: 20
[junit4:junit4]   2> 70171 T788 oashc.HttpShardHandlerFactory.getParameter Setting corePoolSize to: 0
[junit4:junit4]   2> 70171 T788 oashc.HttpShardHandlerFactory.getParameter Setting maximumPoolSize to: 2147483647
[junit4:junit4]   2> 70171 T788 oashc.HttpShardHandlerFactory.getParameter Setting maxThreadIdleTime to: 5
[junit4:junit4]   2> 70172 T788 oashc.HttpShardHandlerFactory.getParameter Setting sizeOfQueue to: -1
[junit4:junit4]   2> 70172 T788 oashc.HttpShardHandlerFactory.getParameter Setting fairnessPolicy to: false
[junit4:junit4]   2> 70172 T788 oascsi.HttpClientUtil.createClient Creating new http client, config:maxConnectionsPerHost=20&maxConnections=10000&socketTimeout=0&connTimeout=0&retry=false
[junit4:junit4]   2> 70185 T788 oascc.ZkStateReader.createClusterStateWatchersAndUpdate Updating cluster state from ZooKeeper... 
[junit4:junit4]   2> 70193 T788 oasc.CoreContainer.create Creating SolrCore 'collection1' using instanceDir: C:\Users\JenkinsSlave\workspace\Lucene-Solr-4.x-Windows\solr\build\solr-core\test\J0\.\solrtest-jetty4-1351568289697\collection1
[junit4:junit4]   2> 70194 T788 oasc.ZkController.createCollectionZkNode Check for collection zkNode:collection1
[junit4:junit4]   2> 70195 T788 oasc.ZkController.createCollectionZkNode Collection zkNode exists
[junit4:junit4]   2> 70195 T788 oasc.ZkController.readConfigName Load collection config from:/collections/collection1
[junit4:junit4]   2> 70198 T788 oasc.SolrResourceLoader.<init> new SolrResourceLoader for directory: 'C:\Users\JenkinsSlave\workspace\Lucene-Solr-4.x-Windows\solr\build\solr-core\test\J0\.\solrtest-jetty4-1351568289697\collection1\'
[junit4:junit4]   2> 70199 T788 oasc.SolrResourceLoader.replaceClassLoader Adding 'file:/C:/Users/JenkinsSlave/workspace/Lucene-Solr-4.x-Windows/solr/build/solr-core/test/J0/solrtest-jetty4-1351568289697/collection1/lib/classes/' to classloader
[junit4:junit4]   2> 70200 T788 oasc.SolrResourceLoader.replaceClassLoader Adding 'file:/C:/Users/JenkinsSlave/workspace/Lucene-Solr-4.x-Windows/solr/build/solr-core/test/J0/solrtest-jetty4-1351568289697/collection1/lib/README' to classloader
[junit4:junit4]   2> 70228 T809 oascc.ZkStateReader.updateClusterState Updating cloud state from ZooKeeper... 
[junit4:junit4]   2> 70230 T809 oasc.Overseer$ClusterStateUpdater.updateState Update state numShards=1 message={
[junit4:junit4]   2> 	  "operation":"state",
[junit4:junit4]   2> 	  "numShards":"1",
[junit4:junit4]   2> 	  "shard":"shard1",
[junit4:junit4]   2> 	  "roles":null,
[junit4:junit4]   2> 	  "state":"recovering",
[junit4:junit4]   2> 	  "core":"collection1",
[junit4:junit4]   2> 	  "collection":"collection1",
[junit4:junit4]   2> 	  "node_name":"127.0.0.1:52044_solr",
[junit4:junit4]   2> 	  "base_url":"http://127.0.0.1:52044/solr"}
[junit4:junit4]   2> 70237 T808 oascc.ZkStateReader$2.process A cluster state change has occurred - updating... (5)
[junit4:junit4]   2> 70238 T846 oascc.ZkStateReader$2.process A cluster state change has occurred - updating... (5)
[junit4:junit4]   2> 70239 T822 oascc.ZkStateReader$2.process A cluster state change has occurred - updating... (5)
[junit4:junit4]   2> 70239 T860 oascc.ZkStateReader$2.process A cluster state change has occurred - updating... (5)
[junit4:junit4]   2> 70260 T788 oasc.SolrConfig.<init> Using Lucene MatchVersion: LUCENE_41
[junit4:junit4]   2> 70347 T788 oasc.SolrConfig.<init> Loaded SolrConfig: solrconfig.xml
[junit4:junit4]   2> 70349 T788 oass.IndexSchema.readSchema Reading Solr Schema
[junit4:junit4]   2> 70355 T788 oass.IndexSchema.readSchema Schema name=test
[junit4:junit4]   2> 71027 T788 oass.OpenExchangeRatesOrgProvider.init Initialized with rates=open-exchange-rates.json, refreshInterval=1440.
[junit4:junit4]   2> 71039 T788 oass.IndexSchema.readSchema default search field in schema is text
[junit4:junit4]   2> 71043 T788 oass.IndexSchema.readSchema unique key field: id
[junit4:junit4]   2> 71059 T788 oass.FileExchangeRateProvider.reload Reloading exchange rates from file currency.xml
[junit4:junit4]   2> 71065 T788 oass.FileExchangeRateProvider.reload Reloading exchange rates from file currency.xml
[junit4:junit4]   2> 71079 T788 oass.OpenExchangeRatesOrgProvider.reload Reloading exchange rates from open-exchange-rates.json
[junit4:junit4]   2> 71081 T788 oass.OpenExchangeRatesOrgProvider.reload Reloading exchange rates from open-exchange-rates.json
[junit4:junit4]   2> 71083 T788 oasc.SolrCore.<init> [collection1] Opening new SolrCore at C:\Users\JenkinsSlave\workspace\Lucene-Solr-4.x-Windows\solr\build\solr-core\test\J0\.\solrtest-jetty4-1351568289697\collection1\, dataDir=.\org.apache.solr.cloud.SyncSliceTest-1351568219940/jetty4\
[junit4:junit4]   2> 71084 T788 oasc.JmxMonitoredMap.<init> JMX monitoring is enabled. Adding Solr mbeans to JMX Server: com.sun.jmx.mbeanserver.JmxMBeanServer@180cf2a
[junit4:junit4]   2> 71086 T788 oasc.SolrCore.getNewIndexDir New index directory detected: old=null new=.\org.apache.solr.cloud.SyncSliceTest-1351568219940/jetty4\index/
[junit4:junit4]   2> 71088 T788 oasc.SolrCore.initIndex WARNING [collection1] Solr index directory '.\org.apache.solr.cloud.SyncSliceTest-1351568219940\jetty4\index' doesn't exist. Creating new index...
[junit4:junit4]   2> 71088 T788 oasc.CachingDirectoryFactory.get return new directory for C:\Users\JenkinsSlave\workspace\Lucene-Solr-4.x-Windows\solr\build\solr-core\test\J0\.\org.apache.solr.cloud.SyncSliceTest-1351568219940\jetty4\index forceNew:false
[junit4:junit4]   2> 71100 T788 oasc.SolrDeletionPolicy.onCommit SolrDeletionPolicy.onCommit: commits:num=1
[junit4:junit4]   2> 		commit{dir=NRTCachingDirectory(org.apache.lucene.store.SimpleFSDirectory@C:\Users\JenkinsSlave\workspace\Lucene-Solr-4.x-Windows\solr\build\solr-core\test\J0\org.apache.solr.cloud.SyncSliceTest-1351568219940\jetty4\index lockFactory=org.apache.lucene.store.NativeFSLockFactory@c4b821; maxCacheMB=48.0 maxMergeSizeMB=4.0),segFN=segments_1,generation=1,filenames=[segments_1]
[junit4:junit4]   2> 71102 T788 oasc.SolrDeletionPolicy.updateCommits newest commit = 1
[junit4:junit4]   2> 71105 T788 oasc.SolrCore.initWriters created xml: solr.XMLResponseWriter
[junit4:junit4]   2> 71106 T788 oasup.UpdateRequestProcessorChain.init inserting DistributedUpdateProcessorFactory into updateRequestProcessorChain "dedupe"
[junit4:junit4]   2> 71107 T788 oasup.UpdateRequestProcessorChain.init inserting DistributedUpdateProcessorFactory into updateRequestProcessorChain "dedupe-allfields"
[junit4:junit4]   2> 71108 T788 oasup.UpdateRequestProcessorChain.init inserting DistributedUpdateProcessorFactory into updateRequestProcessorChain "stored_sig"
[junit4:junit4]   2> 71108 T788 oasup.UpdateRequestProcessorChain.init inserting DistributedUpdateProcessorFactory into updateRequestProcessorChain "uniq-fields"
[junit4:junit4]   2> 71110 T788 oasup.UpdateRequestProcessorChain.init inserting DistributedUpdateProcessorFactory into updateRequestProcessorChain "distrib-dup-test-chain-implicit"
[junit4:junit4]   2> 71110 T788 oasc.RequestHandlers.initHandlersFromConfig adding lazy requestHandler: solr.ReplicationHandler
[junit4:junit4]   2> 71111 T788 oasc.RequestHandlers.initHandlersFromConfig created /replication: solr.ReplicationHandler
[junit4:junit4]   2> 71111 T788 oasc.RequestHandlers.initHandlersFromConfig created standard: solr.StandardRequestHandler
[junit4:junit4]   2> 71112 T788 oasc.RequestHandlers.initHandlersFromConfig created /get: solr.RealTimeGetHandler
[junit4:junit4]   2> 71113 T788 oasc.RequestHandlers.initHandlersFromConfig created dismax: solr.SearchHandler
[junit4:junit4]   2> 71114 T788 oasc.RequestHandlers.initHandlersFromConfig created mock: org.apache.solr.core.MockQuerySenderListenerReqHandler
[junit4:junit4]   2> 71114 T788 oasc.RequestHandlers.initHandlersFromConfig created /admin/: org.apache.solr.handler.admin.AdminHandlers
[junit4:junit4]   2> 71116 T788 oasc.RequestHandlers.initHandlersFromConfig created defaults: solr.StandardRequestHandler
[junit4:junit4]   2> 71116 T788 oasc.RequestHandlers.initHandlersFromConfig adding lazy requestHandler: solr.StandardRequestHandler
[junit4:junit4]   2> 71117 T788 oasc.RequestHandlers.initHandlersFromConfig created lazy: solr.StandardRequestHandler
[junit4:junit4]   2> 71118 T788 oasc.RequestHandlers.initHandlersFromConfig created /update: solr.UpdateRequestHandler
[junit4:junit4]   2> 71119 T788 oasc.RequestHandlers.initHandlersFromConfig created /terms: org.apache.solr.handler.component.SearchHandler
[junit4:junit4]   2> 71119 T788 oasc.RequestHandlers.initHandlersFromConfig created spellCheckCompRH: org.apache.solr.handler.component.SearchHandler
[junit4:junit4]   2> 71120 T788 oasc.RequestHandlers.initHandlersFromConfig created spellCheckCompRH_Direct: org.apache.solr.handler.component.SearchHandler
[junit4:junit4]   2> 71121 T788 oasc.RequestHandlers.initHandlersFromConfig created spellCheckWithWordbreak: org.apache.solr.handler.component.SearchHandler
[junit4:junit4]   2> 71121 T788 oasc.RequestHandlers.initHandlersFromConfig created spellCheckWithWordbreak_Direct: org.apache.solr.handler.component.SearchHandler
[junit4:junit4]   2> 71122 T788 oasc.RequestHandlers.initHandlersFromConfig created spellCheckCompRH1: org.apache.solr.handler.component.SearchHandler
[junit4:junit4]   2> 71123 T788 oasc.RequestHandlers.initHandlersFromConfig created tvrh: org.apache.solr.handler.component.SearchHandler
[junit4:junit4]   2> 71123 T788 oasc.RequestHandlers.initHandlersFromConfig created /mlt: solr.MoreLikeThisHandler
[junit4:junit4]   2> 71124 T788 oasc.RequestHandlers.initHandlersFromConfig created /debug/dump: solr.DumpRequestHandler
[junit4:junit4]   2> 71131 T788 oashl.XMLLoader.init xsltCacheLifetimeSeconds=60
[junit4:junit4]   2> 71136 T788 oasc.SolrCore.initDeprecatedSupport WARNING solrconfig.xml uses deprecated <admin/gettableFiles>, Please update your config to use the ShowFileRequestHandler.
[junit4:junit4]   2> 71137 T788 oasc.SolrCore.initDeprecatedSupport WARNING adding ShowFileRequestHandler with hidden files: [SCHEMA.XML, OLD_SYNONYMS.TXT, STOPWORDS.TXT, PROTWORDS.TXT, OPEN-EXCHANGE-RATES.JSON, SYNONYMS.TXT, CURRENCY.XML, MAPPING-ISOLATIN1ACCENT.TXT]
[junit4:junit4]   2> 71143 T788 oass.SolrIndexSearcher.<init> Opening Searcher@1338143 main
[junit4:junit4]   2> 71144 T788 oasu.CommitTracker.<init> Hard AutoCommit: disabled
[junit4:junit4]   2> 71145 T788 oasu.CommitTracker.<init> Soft AutoCommit: disabled
[junit4:junit4]   2> 71145 T788 oashc.SpellCheckComponent.inform Initializing spell checkers
[junit4:junit4]   2> 71160 T788 oass.DirectSolrSpellChecker.init init: {name=direct,classname=DirectSolrSpellChecker,field=lowerfilt,minQueryLength=3}
[junit4:junit4]   2> 71218 T861 oasc.SolrCore.registerSearcher [collection1] Registered new searcher Searcher@1338143 main{StandardDirectoryReader(segments_1:1)}
[junit4:junit4]   2> 71220 T788 oasc.ZkController.publish numShards not found on descriptor - reading it from system property
[junit4:junit4]   2> 71250 T809 oascc.ZkStateReader.updateClusterState Updating cloud state from ZooKeeper... 
[junit4:junit4]   2> 71252 T809 oasc.Overseer$ClusterStateUpdater.updateState Update state numShards=1 message={
[junit4:junit4]   2> 	  "operation":"state",
[junit4:junit4]   2> 	  "numShards":"1",
[junit4:junit4]   2> 	  "shard":null,
[junit4:junit4]   2> 	  "roles":null,
[junit4:junit4]   2> 	  "state":"down",
[junit4:junit4]   2> 	  "core":"collection1",
[junit4:junit4]   2> 	  "collection":"collection1",
[junit4:junit4]   2> 	  "node_name":"127.0.0.1:52052_solr",
[junit4:junit4]   2> 	  "base_url":"http://127.0.0.1:52052/solr"}
[junit4:junit4]   2> 71264 T808 oascc.ZkStateReader$2.process A cluster state change has occurred - updating... (5)
[junit4:junit4]   2> 71266 T822 oascc.ZkStateReader$2.process A cluster state change has occurred - updating... (5)
[junit4:junit4]   2> 71266 T846 oascc.ZkStateReader$2.process A cluster state change has occurred - updating... (5)
[junit4:junit4]   2> 71266 T860 oascc.ZkStateReader$2.process A cluster state change has occurred - updating... (5)
[junit4:junit4]   2> 71723 T788 oasc.CoreContainer.register registering core: collection1
[junit4:junit4]   2> 71724 T788 oasc.ZkController.register Register shard - core:collection1 address:http://127.0.0.1:52052/solr shardId:shard1
[junit4:junit4]   2> 71733 T788 oasc.ZkController.register We are http://127.0.0.1:52052/solr/collection1/ and leader is http://127.0.0.1:52032/solr/collection1/
[junit4:junit4]   2> 71734 T788 oasc.ZkController.register No LogReplay needed for core=collection1 baseURL=http://127.0.0.1:52052/solr
[junit4:junit4]   2> 71734 T788 oasc.ZkController.checkRecovery Core needs to recover:collection1
[junit4:junit4]   2> 71735 T788 oasu.DefaultSolrCoreState.doRecovery Running recovery - first canceling any ongoing recovery
[junit4:junit4]   2> ASYNC  NEW_CORE C47 name=collection1 org.apache.solr.core.SolrCore@156e175 url=http://127.0.0.1:52052/solr/collection1 node=127.0.0.1:52052_solr
[junit4:junit4]   2> 71738 T862 C47 P52052 oasc.RecoveryStrategy.run Starting recovery process.  core=collection1 recoveringAfterStartup=true
[junit4:junit4]   2> 71738 T788 oascc.ZkStateReader.updateClusterState Updating cloud state from ZooKeeper... 
[junit4:junit4]   2> 71742 T862 C47 P52052 oasc.RecoveryStrategy.doRecovery ###### startupVersions=[]
[junit4:junit4]   2> 71743 T862 C47 P52052 oasc.ZkController.publish numShards not found on descriptor - reading it from system property
[junit4:junit4]   2> 71744 T788 oass.SolrDispatchFilter.init user.dir=C:\Users\JenkinsSlave\workspace\Lucene-Solr-4.x-Windows\solr\build\solr-core\test\J0
[junit4:junit4]   2> 71746 T788 oass.SolrDispatchFilter.init SolrDispatchFilter.init() done
[junit4:junit4]   2> 71747 T862 C47 P52052 oasc.RecoveryStrategy.doRecovery Attempting to PeerSync from http://127.0.0.1:52032/solr/collection1/ core=collection1 - recoveringAfterStartup=true
[junit4:junit4]   2> 71747 T788 oascsi.HttpClientUtil.createClient Creating new http client, config:maxConnections=128&maxConnectionsPerHost=32&followRedirects=false
[junit4:junit4]   2> 71747 T862 C47 P52052 oasu.PeerSync.sync PeerSync: core=collection1 url=http://127.0.0.1:52052/solr START replicas=[http://127.0.0.1:52032/solr/collection1/] nUpdates=100
[junit4:junit4]   2> 71749 T862 C47 P52052 oasu.PeerSync.sync WARNING no frame of reference to tell of we've missed updates
[junit4:junit4]   2> 71750 T862 C47 P52052 oasc.RecoveryStrategy.doRecovery PeerSync Recovery was not successful - trying replication. core=collection1
[junit4:junit4]   2> 71750 T862 C47 P52052 oasc.RecoveryStrategy.doRecovery Starting Replication Recovery. core=collection1
[junit4:junit4]   2> 71751 T862 C47 P52052 oascsi.HttpClientUtil.createClient Creating new http client, config:maxConnections=128&maxConnectionsPerHost=32&followRedirects=false
[junit4:junit4]   2> 71768 T788 oaz.ZooKeeper.<init> Initiating client connection, connectString=127.0.0.1:52019/solr sessionTimeout=10000 watcher=org.apache.solr.common.cloud.ConnectionManager@116b1d9
[junit4:junit4]   2> 71769 T815 C46 P52032 REQ /get {distrib=false&qt=/get&wt=javabin&version=2&getVersions=100} status=0 QTime=0 
[junit4:junit4]   2> 71769 T788 oascc.ConnectionManager.waitForConnected Waiting for client to connect to ZooKeeper
[junit4:junit4]   2> 71770 T864 oaz.ClientCnxn$SendThread.startConnect Opening socket connection to server /127.0.0.1:52019
[junit4:junit4]   2> 71771 T864 oaz.ClientCnxn$SendThread.primeConnection Socket connection established to 127.0.0.1/127.0.0.1:52019, initiating session
[junit4:junit4]   2> 71771 T790 oazs.NIOServerCnxn$Factory.run Accepted socket connection from /127.0.0.1:52061
[junit4:junit4]   2> 71771 T790 oazs.NIOServerCnxn.readConnectRequest Client attempting to establish new session at /127.0.0.1:52061
[junit4:junit4]   2> 71773 T792 oazs.NIOServerCnxn.finishSessionInit Established session 0x13aafbe5f2e0007 with negotiated timeout 10000 for client /127.0.0.1:52061
[junit4:junit4]   2> 71773 T864 oaz.ClientCnxn$SendThread.readConnectResult Session establishment complete on server 127.0.0.1/127.0.0.1:52019, sessionid = 0x13aafbe5f2e0007, negotiated timeout = 10000
[junit4:junit4]   2> 71773 T865 oascc.ConnectionManager.process Watcher org.apache.solr.common.cloud.ConnectionManager@116b1d9 name:ZooKeeperConnection Watcher:127.0.0.1:52019/solr got event WatchedEvent state:SyncConnected type:None path:null path:null type:None
[junit4:junit4]   2> 71775 T788 oascc.ConnectionManager.waitForConnected Client is connected to ZooKeeper
[junit4:junit4]   2> 71776 T788 oascc.ZkStateReader.createClusterStateWatchersAndUpdate Updating cluster state from ZooKeeper... 
[junit4:junit4]   2> 71777 T809 oascc.ZkStateReader.updateClusterState Updating cloud state from ZooKeeper... 
[junit4:junit4]   2> 71778 T809 oasc.Overseer$ClusterStateUpdater.updateState Update state numShards=1 message={
[junit4:junit4]   2> 	  "operation":"state",
[junit4:junit4]   2> 	  "numShards":"1",
[junit4:junit4]   2> 	  "shard":"shard1",
[junit4:junit4]   2> 	  "roles":null,
[junit4:junit4]   2> 	  "state":"recovering",
[junit4:junit4]   2> 	  "core":"collection1",
[junit4:junit4]   2> 	  "collection":"collection1",
[junit4:junit4]   2> 	  "node_name":"127.0.0.1:52052_solr",
[junit4:junit4]   2> 	  "base_url":"http://127.0.0.1:52052/solr"}
[junit4:junit4]   2> 71778 T788 oasc.ChaosMonkey.monkeyLog monkey: init - expire sessions:true cause connection loss:true
[junit4:junit4]   2> 71780 T788 oascsi.HttpClientUtil.createClient Creating new http client, config:
[junit4:junit4]   2> 71786 T788 oascc.ZkStateReader.updateClusterState Updating cloud state from ZooKeeper... 
[junit4:junit4]   2> 71786 T788 oasc.AbstractFullDistribZkTestBase.waitForThingsToLevelOut Wait for recoveries to finish - wait 15 for each attempt
[junit4:junit4]   2> 71787 T788 oasc.AbstractDistribZkTestBase.waitForRecoveriesToFinish Wait for recoveries to finish - collection: collection1 failOnTimeout:true timeout (sec):15
[junit4:junit4]   2> 71788 T808 oascc.ZkStateReader$2.process A cluster state change has occurred - updating... (5)
[junit4:junit4]   2> 71788 T846 oascc.ZkStateReader$2.process A cluster state change has occurred - updating... (5)
[junit4:junit4]   2> 71789 T822 oascc.ZkStateReader$2.process A cluster state change has occurred - updating... (5)
[junit4:junit4]   2> 71789 T788 oascc.ZkStateReader.updateClusterState Updating cloud state from ZooKeeper... 
[junit4:junit4]   2> 71788 T865 oascc.ZkStateReader$2.process A cluster state change has occurred - updating... (5)
[junit4:junit4]   2> 71789 T860 oascc.ZkStateReader$2.process A cluster state change has occurred - updating... (5)
[junit4:junit4]   2>  C45_STATE=coll:collection1 core:collection1 props:{shard=shard1, roles=null, state=recovering, core=collection1, collection=collection1, node_name=127.0.0.1:52044_solr, base_url=http://127.0.0.1:52044/solr}
[junit4:junit4]   2> 72766 T848 C45 P52044 oasc.RecoveryStrategy.doRecovery Begin buffering updates. core=collection1
[junit4:junit4]   2> 72766 T848 C45 P52044 oasu.UpdateLog.bufferUpdates Starting to buffer updates. FSUpdateLog{state=ACTIVE, tlog=null}
[junit4:junit4]   2> 72766 T848 C45 P52044 oasc.RecoveryStrategy.replicate Attempting to replicate from http://127.0.0.1:52032/solr/collection1/. core=collection1
[junit4:junit4]   2> 72766 T848 C45 P52044 oascsi.HttpClientUtil.createClient Creating new http client, config:maxConnections=128&maxConnectionsPerHost=32&followRedirects=false
[junit4:junit4]   2> 72777 T819 C46 P52032 oasu.DirectUpdateHandler2.commit start commit{flags=0,_version_=0,optimize=false,openSearcher=false,waitSearcher=true,expungeDeletes=false,softCommit=false}
[junit4:junit4]   2> 72784 T819 C46 P52032 oasc.SolrDeletionPolicy.onInit SolrDeletionPolicy.onInit: commits:num=1
[junit4:junit4]   2> 		commit{dir=NRTCachingDirectory(org.apache.lucene.store.SimpleFSDirectory@C:\Users\JenkinsSlave\workspace\Lucene-Solr-4.x-Windows\solr\build\solr-core\test\J0\org.apache.solr.cloud.SyncSliceTest-1351568219940\jetty1\index lockFactory=org.apache.lucene.store.NativeFSLockFactory@1d44d8b; maxCacheMB=48.0 maxMergeSizeMB=4.0),segFN=segments_1,generation=1,filenames=[segments_1]
[junit4:junit4]   2> 72785 T819 C46 P52032 oasc.SolrDeletionPolicy.updateCommits newest commit = 1
[junit4:junit4]   2> 72785 T819 C46 P52032 oass.SolrIndexSearcher.<init> Opening Searcher@1e0521c realtime
[junit4:junit4]   2> 72786 T819 C46 P52032 oasu.DirectUpdateHandler2.commit end_commit_flush
[junit4:junit4]   2> 72786 T819 C46 P52032 /update {waitSearcher=true&openSearcher=false&commit=true&commit_end_point=true&wt=javabin&softCommit=false&version=2} {commit=} 0 9
[junit4:junit4]   2> 72788 T848 C45 P52044 oash.ReplicationHandler.inform Commits will be reserved for  10000
[junit4:junit4]   2> 72788 T848 C45 P52044 oash.SnapPuller.<init>  No value set for 'pollInterval'. Timer Task not started.
[junit4:junit4]   2> 72790 T817 C46 P52032 oash.ReplicationHandler.inform Commits will be reserved for  10000
[junit4:junit4]   2> 72790 T817 C46 P52032 REQ /replication {command=indexversion&wt=javabin&qt=/replication&version=2} status=0 QTime=1 
[junit4:junit4]   2> 72793 T788 oascc.ZkStateReader.updateClusterState Updating cloud state from ZooKeeper... 
[junit4:junit4]   2> 72798 T848 C45 P52044 oasc.SolrDeletionPolicy.onInit SolrDeletionPolicy.onInit: commits:num=1
[junit4:junit4]   2> 		commit{dir=NRTCachingDirectory(org.apache.lucene.store.SimpleFSDirectory@C:\Users\JenkinsSlave\workspace\Lucene-Solr-4.x-Windows\solr\build\solr-core\test\J0\org.apache.solr.cloud.SyncSliceTest-1351568219940\jetty3\index lockFactory=org.apache.lucene.store.NativeFSLockFactory@84888a; maxCacheMB=48.0 maxMergeSizeMB=4.0),segFN=segments_1,generation=1,filenames=[segments_1]
[junit4:junit4]   2> 72799 T848 C45 P52044 oasc.SolrDeletionPolicy.updateCommits newest commit = 1
[junit4:junit4]   2> 72799 T848 C45 P52044 oasu.DirectUpdateHandler2.commit start commit{flags=0,_version_=0,optimize=false,openSearcher=true,waitSearcher=true,expungeDeletes=false,softCommit=false}
[junit4:junit4]   2> 72808 T848 C45 P52044 oasc.SolrDeletionPolicy.onCommit SolrDeletionPolicy.onCommit: commits:num=2
[junit4:junit4]   2> 		commit{dir=NRTCachingDirectory(org.apache.lucene.store.SimpleFSDirectory@C:\Users\JenkinsSlave\workspace\Lucene-Solr-4.x-Windows\solr\build\solr-core\test\J0\org.apache.solr.cloud.SyncSliceTest-1351568219940\jetty3\index lockFactory=org.apache.lucene.store.NativeFSLockFactory@84888a; maxCacheMB=48.0 maxMergeSizeMB=4.0),segFN=segments_1,generation=1,filenames=[segments_1]
[junit4:junit4]   2> 		commit{dir=NRTCachingDirectory(org.apache.lucene.store.SimpleFSDirectory@C:\Users\JenkinsSlave\workspace\Lucene-Solr-4.x-Windows\solr\build\solr-core\test\J0\org.apache.solr.cloud.SyncSliceTest-1351568219940\jetty3\index lockFactory=org.apache.lucene.store.NativeFSLockFactory@84888a; maxCacheMB=48.0 maxMergeSizeMB=4.0),segFN=segments_2,generation=2,filenames=[segments_2]
[junit4:junit4]   2> 72808 T848 C45 P52044 oasc.SolrDeletionPolicy.updateCommits newest commit = 2
[junit4:junit4]   2> 72812 T848 C45 P52044 oass.SolrIndexSearcher.<init> Opening Searcher@135193b main
[junit4:junit4]   2> 72812 T848 C45 P52044 oasu.DirectUpdateHandler2.commit end_commit_flush
[junit4:junit4]   2> 72815 T847 oasc.SolrCore.registerSearcher [collection1] Registered new searcher Searcher@135193b main{StandardDirectoryReader(segments_2:2)}
[junit4:junit4]   2> 72815 T848 C45 P52044 oasc.RecoveryStrategy.replay No replay needed. core=collection1
[junit4:junit4]   2> 72815 T848 C45 P52044 oasc.RecoveryStrategy.doRecovery Replication Recovery was successful - registering as Active. core=collection1
[junit4:junit4]   2> 72815 T848 C45 P52044 oasc.ZkController.publish numShards not found on descriptor - reading it from system property
[junit4:junit4]   2> 72825 T848 C45 P52044 oasc.RecoveryStrategy.doRecovery Finished recovery process. core=collection1
[junit4:junit4]   2> 73298 T809 oascc.ZkStateReader.updateClusterState Updating cloud state from ZooKeeper... 
[junit4:junit4]   2> 73299 T809 oasc.Overseer$ClusterStateUpdater.updateState Update state numShards=1 message={
[junit4:junit4]   2> 	  "operation":"state",
[junit4:junit4]   2> 	  "numShards":"1",
[junit4:junit4]   2> 	  "shard":"shard1",
[junit4:junit4]   2> 	  "roles":null,
[junit4:junit4]   2> 	  "state":"active",
[junit4:junit4]   2> 	  "core":"collection1",
[junit4:junit4]   2> 	  "collection":"collection1",
[junit4:junit4]   2> 	  "node_name":"127.0.0.1:52044_solr",
[junit4:junit4]   2> 	  "base_url":"http://127.0.0.1:52044/solr"}
[junit4:junit4]   2> 73305 T808 oascc.ZkStateReader$2.process A cluster state change has occurred - updating... (5)
[junit4:junit4]   2> 73305 T846 oascc.ZkStateReader$2.process A cluster state change has occurred - updating... (5)
[junit4:junit4]   2> 73305 T865 oascc.ZkStateReader$2.process A cluster state change has occurred - updating... (5)
[junit4:junit4]   2> 73305 T822 oascc.ZkStateReader$2.process A cluster state change has occurred - updating... (5)
[junit4:junit4]   2> 73306 T860 oascc.ZkStateReader$2.process A cluster state change has occurred - updating... (5)
[junit4:junit4]   2> 73794 T788 oascc.ZkStateReader.updateClusterState Updating cloud state from ZooKeeper... 
[junit4:junit4]   2>  C47_STATE=coll:collection1 core:collection1 props:{shard=shard1, roles=null, state=recovering, core=collection1, collection=collection1, node_name=127.0.0.1:52052_solr, base_url=http://127.0.0.1:52052/solr}
[junit4:junit4]   2> 74770 T862 C47 P52052 oasc.RecoveryStrategy.doRecovery Begin buffering updates. core=collection1
[junit4:junit4]   2> 74770 T862 C47 P52052 oasu.UpdateLog.bufferUpdates Starting to buffer updates. FSUpdateLog{state=ACTIVE, tlog=null}
[junit4:junit4]   2> 74770 T862 C47 P52052 oasc.RecoveryStrategy.replicate Attempting to replicate from http://127.0.0.1:52032/solr/collection1/. core=collection1
[junit4:junit4]   2> 74770 T862 C47 P52052 oascsi.HttpClientUtil.createClient Creating new http client, config:maxConnections=128&maxConnectionsPerHost=32&followRedirects=false
[junit4:junit4]   2> 74787 T819 C46 P52032 oasu.DirectUpdateHandler2.commit start commit{flags=0,_version_=0,optimize=false,openSearcher=false,waitSearcher=true,expungeDeletes=false,softCommit=false}
[junit4:junit4]   2> 74788 T819 C46 P52032 oasu.DirectUpdateHandler2.commit end_commit_flush
[junit4:junit4]   2> 74789 T819 C46 P52032 /update {waitSearcher=true&openSearcher=false&commit=true&commit_end_point=true&wt=javabin&softCommit=false&version=2} {commit=} 0 2
[junit4:junit4]   2> 74790 T862 C47 P52052 oash.ReplicationHandler.inform Commits will be reserved for  10000
[junit4:junit4]   2> 74790 T862 C47 P52052 oash.SnapPuller.<init>  No value set for 'pollInterval'. Timer Task not started.
[junit4:junit4]   2> 74792 T817 C46 P52032 REQ /replication {command=indexversion&wt=javabin&qt=/replication&version=2} status=0 QTime=0 
[junit4:junit4]   2> 74797 T788 oascc.ZkStateReader.updateClusterState Updating cloud state from ZooKeeper... 
[junit4:junit4]   2> 74800 T862 C47 P52052 oasc.SolrDeletionPolicy.onInit SolrDeletionPolicy.onInit: commits:num=1
[junit4:junit4]   2> 		commit{dir=NRTCachingDirectory(org.apache.lucene.store.SimpleFSDirectory@C:\Users\JenkinsSlave\workspace\Lucene-Solr-4.x-Windows\solr\build\solr-core\test\J0\org.apache.solr.cloud.SyncSliceTest-1351568219940\jetty4\index lockFactory=org.apache.lucene.store.NativeFSLockFactory@c4b821; maxCacheMB=48.0 maxMergeSizeMB=4.0),segFN=segments_1,generation=1,filenames=[segments_1]
[junit4:junit4]   2> 74801 T862 C47 P52052 oasc.SolrDeletionPolicy.updateCommits newest commit = 1
[junit4:junit4]   2> 74801 T862 C47 P52052 oasu.DirectUpdateHandler2.commit start commit{flags=0,_version_=0,optimize=false,openSearcher=true,waitSearcher=true,expungeDeletes=false,softCommit=false}
[junit4:junit4]   2> 74810 T862 C47 P52052 oasc.SolrDeletionPolicy.onCommit SolrDeletionPolicy.onCommit: commits:num=2
[junit4:junit4]   2> 		commit{dir=NRTCachingDirectory(org.apache.lucene.store.SimpleFSDirectory@C:\Users\JenkinsSlave\workspace\Lucene-Solr-4.x-Windows\solr\build\solr-core\test\J0\org.apache.solr.cloud.SyncSliceTest-1351568219940\jetty4\index lockFactory=org.apache.lucene.store.NativeFSLockFactory@c4b821; maxCacheMB=48.0 maxMergeSizeMB=4.0),segFN=segments_1,generation=1,filenames=[segments_1]
[junit4:junit4]   2> 		commit{dir=NRTCachingDirectory(org.apache.lucene.store.SimpleFSDirectory@C:\Users\JenkinsSlave\workspace\Lucene-Solr-4.x-Windows\solr\build\solr-core\test\J0\org.apache.solr.cloud.SyncSliceTest-1351568219940\jetty4\index lockFactory=org.apache.lucene.store.NativeFSLockFactory@c4b821; maxCacheMB=48.0 maxMergeSizeMB=4.0),segFN=segments_2,generation=2,filenames=[segments_2]
[junit4:junit4]   2> 74810 T862 C47 P52052 oasc.SolrDeletionPolicy.updateCommits newest commit = 2
[junit4:junit4]   2> 74814 T862 C47 P52052 oass.SolrIndexSearcher.<init> Opening Searcher@1136442 main
[junit4:junit4]   2> 74815 T862 C47 P52052 oasu.DirectUpdateHandler2.commit end_commit_flush
[junit4:junit4]   2> 74816 T861 oasc.SolrCore.registerSearcher [collection1] Registered new searcher Searcher@1136442 main{StandardDirectoryReader(segments_2:2)}
[junit4:junit4]   2> 74817 T862 C47 P52052 oasc.RecoveryStrategy.replay No replay needed. core=collection1
[junit4:junit4]   2> 74817 T862 C47 P52052 oasc.RecoveryStrategy.doRecovery Replication Recovery was successful - registering as Active. core=collection1
[junit4:junit4]   2> 74817 T862 C47 P52052 oasc.ZkController.publish numShards not found on descriptor - reading it from system property
[junit4:junit4]   2> 74820 T862 C47 P52052 oasc.RecoveryStrategy.doRecovery Finished recovery process. core=collection1
[junit4:junit4]   2> 75318 T809 oascc.ZkStateReader.updateClusterState Updating cloud state from ZooKeeper... 
[junit4:junit4]   2> 75319 T809 oasc.Overseer$ClusterStateUpdater.updateState Update state numShards=1 message={
[junit4:junit4]   2> 	  "operation":"state",
[junit4:junit4]   2> 	  "numShards":"1",
[junit4:junit4]   2> 	  "shard":"shard1",
[junit4:junit4]   2> 	  "roles":null,
[junit4:junit4]   2> 	  "state":"active",
[junit4:junit4]   2> 	  "core":"collection1",
[junit4:junit4]   2> 	  "collection":"collection1",
[junit4:junit4]   2> 	  "node_name":"127.0.0.1:52052_solr",
[junit4:junit4]   2> 	  "base_url":"http://127.0.0.1:52052/solr"}
[junit4:junit4]   2> 75325 T808 oascc.ZkStateReader$2.process A cluster state change has occurred - updating... (5)
[junit4:junit4]   2> 75325 T846 oascc.ZkStateReader$2.process A cluster state change has occurred - updating... (5)
[junit4:junit4]   2> 75326 T865 oascc.ZkStateReader$2.process A cluster state change has occurred - updating... (5)
[junit4:junit4]   2> 75326 T860 oascc.ZkStateReader$2.process A cluster state change has occurred - updating... (5)
[junit4:junit4]   2> 75326 T822 oascc.ZkStateReader$2.process A cluster state change has occurred - updating... (5)
[junit4:junit4]   2> 75798 T788 oascc.ZkStateReader.updateClusterState Updating cloud state from ZooKeeper... 
[junit4:junit4]   2> 76799 T788 oascc.ZkStateReader.updateClusterState Updating cloud state from ZooKeeper... 
[junit4:junit4]   2> 77878 T788 oascc.ZkStateReader.updateClusterState Updating cloud state from ZooKeeper... 
[junit4:junit4]   2> 78979 T788 oascc.ZkStateReader.updateClusterState Updating cloud state from ZooKeeper... 
[junit4:junit4]   2> 80082 T788 oascc.ZkStateReader.updateClusterState Updating cloud state from ZooKeeper... 
[junit4:junit4]   2> 81183 T788 oascc.ZkStateReader.updateClusterState Updating cloud state from ZooKeeper... 
[junit4:junit4]   2> 82284 T788 oascc.ZkStateReader.updateClusterState Updating cloud state from ZooKeeper... 
[junit4:junit4]   2> 83386 T788 oascc.ZkStateReader.updateClusterState Updating cloud state from ZooKeeper... 
[junit4:junit4]   2> 84488 T788 oascc.ZkStateReader.updateClusterState Updating cloud state from ZooKeeper... 
[junit4:junit4]   2> 85589 T788 oascc.ZkStateReader.updateClusterState Updating cloud state from ZooKeeper... 
[junit4:junit4]   2> 86691 T788 oascc.ZkStateReader.updateClusterState Updating cloud state from ZooKeeper... 
[junit4:junit4]   2> 87794 T788 oascc.ZkStateReader.updateClusterState Updating cloud state from ZooKeeper... 
[junit4:junit4]   1> 
[junit4:junit4]   1> Thread[HashSessionScavenger-26,5,TGRP-SyncSliceTest]
[junit4:junit4]   1> java.lang.Object.wait(Native Method)
[junit4:junit4]   1> java.util.TimerThread.mainLoop(Timer.java:509)
[junit4:junit4]   1> java.util.TimerThread.run(Timer.java:462)
[junit4:junit4]   1> 
[junit4:junit4]   1> Thread[qtp7573114-803,5,TGRP-SyncSliceTest]
[junit4:junit4]   1> sun.misc.Unsafe.park(Native Method)
[junit4:junit4]   1> java.util.concurrent.locks.LockSupport.parkNanos(LockSupport.java:196)
[junit4:junit4]   1> java.util.concurrent.locks.AbstractQueuedSynchronizer$ConditionObject.awaitNanos(AbstractQueuedSynchronizer.java:2025)
[junit4:junit4]   1> org.eclipse.jetty.util.BlockingArrayQueue.poll(BlockingArrayQueue.java:337)
[junit4:junit4]   1> org.eclipse.jetty.util.thread.QueuedThreadPool.idleJobPoll(QueuedThreadPool.java:517)
[junit4:junit4]   1> org.eclipse.jetty.util.thread.QueuedThreadPool.access$600(QueuedThreadPool.java:39)
[junit4:junit4]   1> org.eclipse.jetty.util.thread.QueuedThreadPool$3.run(QueuedThreadPool.java:563)
[junit4:junit4]   1> java.lang.Thread.run(Thread.java:662)
[junit4:junit4]   1> 
[junit4:junit4]   1> Thread[qtp26194395-830,5,TGRP-SyncSliceTest]
[junit4:junit4]   1> sun.misc.Unsafe.park(Native Method)
[junit4:junit4]   1> java.util.concurrent.locks.LockSupport.parkNanos(LockSupport.java:196)
[junit4:junit4]   1> java.util.concurrent.locks.AbstractQueuedSynchronizer$ConditionObject.awaitNanos(AbstractQueuedSynchronizer.java:2025)
[junit4:junit4]   1> org.eclipse.jetty.util.BlockingArrayQueue.poll(BlockingArrayQueue.java:337)
[junit4:junit4]   1> org.eclipse.jetty.util.thread.QueuedThreadPool.idleJobPoll(QueuedThreadPool.java:517)
[junit4:junit4]   1> org.eclipse.jetty.util.thread.QueuedThreadPool.access$600(QueuedThreadPool.java:39)
[junit4:junit4]   1> org.eclipse.jetty.util.thread.QueuedThreadPool$3.run(QueuedThreadPool.java:563)
[junit4:junit4]   1> java.lang.Thread.run(Thread.java:662)
[junit4:junit4]   1> 
[junit4:junit4]   1> Thread[TEST-SyncSliceTest.testDistribSearch-seed#[654008ECAB1AD0A]-SendThread(127.0.0.1:52019),5,TGRP-SyncSliceTest]
[junit4:junit4]   1> sun.nio.ch.WindowsSelectorImpl$SubSelector.poll0(Native Method)
[junit4:junit4]   1> sun.nio.ch.WindowsSelectorImpl$SubSelector.poll(WindowsSelectorImpl.java:273)
[junit4:junit4]   1> sun.nio.ch.WindowsSelectorImpl$SubSelector.access$400(WindowsSelectorImpl.java:255)
[junit4:junit4]   1> sun.nio.ch.WindowsSelectorImpl.doSelect(WindowsSelectorImpl.java:136)
[junit4:junit4]   1> sun.nio.ch.SelectorImpl.lockAndDoSelect(SelectorImpl.java:69)
[junit4:junit4]   1> sun.nio.ch.SelectorImpl.select(SelectorImpl.java:80)
[junit4:junit4]   1> org.apache.zookeeper.ClientCnxn$SendThread.run(ClientCnxn.java:1131)
[junit4:junit4]   1> 
[junit4:junit4]   1> Thread[Thread-315,5,Overseer state updater.]
[junit4:junit4]   1> java.lang.Thread.sleep(Native Method)
[junit4:junit4]   1> org.apache.solr.cloud.Overseer$ClusterStateUpdater.run(Overseer.java:156)
[junit4:junit4]   1> java.lang.Thread.run(Thread.java:662)
[junit4:junit4]   1> 
[junit4:junit4]   1> Thread[qtp26194395-827 Acceptor0 SelectChannelConnector@0.0.0.0:52038,5,TGRP-SyncSliceTest]
[junit4:junit4]   1> sun.nio.ch.ServerSocketChannelImpl.accept0(Native Method)
[junit4:junit4]   1> sun.nio.ch.ServerSocketChannelImpl.accept(ServerSocketChannelImpl.java:150)
[junit4:junit4]   1> org.eclipse.jetty.server.nio.SelectChannelConnector.accept(SelectChannelConnector.java:104)
[junit4:junit4]   1> org.eclipse.jetty.server.AbstractConnector$Acceptor.run(AbstractConnector.java:933)
[junit4:junit4]   1> org.eclipse.jetty.util.thread.QueuedThreadPool.runJob(QueuedThreadPool.java:599)
[junit4:junit4]   1> org.eclipse.jetty.util.thread.QueuedThreadPool$3.run(QueuedThreadPool.java:534)
[junit4:junit4]   1> java.lang.Thread.run(Thread.java:662)
[junit4:junit4]   1> 
[junit4:junit4]   1> Thread[TEST-SyncSliceTest.testDistribSearch-seed#[654008ECAB1AD0A]-SendThread(127.0.0.1:52019),5,TGRP-SyncSliceTest]
[junit4:junit4]   1> sun.nio.ch.WindowsSelectorImpl$SubSelector.poll0(Native Method)
[junit4:junit4]   1> sun.nio.ch.WindowsSelectorImpl$SubSelector.poll(WindowsSelectorImpl.java:273)
[junit4:junit4]   1> sun.nio.ch.WindowsSelectorImpl$SubSelector.access$400(WindowsSelectorImpl.java:255)
[junit4:junit4]   1> sun.nio.ch.WindowsSelectorImpl.doSelect(WindowsSelectorImpl.java:136)
[junit4:junit4]   1> sun.nio.ch.SelectorImpl.lockAndDoSelect(SelectorImpl.java:69)
[junit4:junit4]   1> sun.nio.ch.SelectorImpl.select(SelectorImpl.java:80)
[junit4:junit4]   1> org.apache.zookeeper.ClientCnxn$SendThread.run(ClientCnxn.java:1131)
[junit4:junit4]   1> 
[junit4:junit4]   1> Thread[qtp7573114-799 Selector0,5,TGRP-SyncSliceTest]
[junit4:junit4]   1> sun.nio.ch.WindowsSelectorImpl$SubSelector.poll0(Native Method)
[junit4:junit4]   1> sun.nio.ch.WindowsSelectorImpl$SubSelector.poll(WindowsSelectorImpl.java:273)
[junit4:junit4]   1> sun.nio.ch.WindowsSelectorImpl$SubSelector.access$400(WindowsSelectorImpl.java:255)
[junit4:junit4]   1> sun.nio.ch.WindowsSelectorImpl.doSelect(WindowsSelectorImpl.java:136)
[junit4:junit4]   1> sun.nio.ch.SelectorImpl.lockAndDoSelect(SelectorImpl.java:69)
[junit4:junit4]   1> sun.nio.ch.SelectorImpl.select(SelectorImpl.java:80)
[junit4:junit4]   1> org.eclipse.jetty.io.nio.SelectorManager$SelectSet.doSelect(SelectorManager.java:564)
[junit4:junit4]   1> org.eclipse.jetty.io.nio.SelectorManager$1.run(SelectorManager.java:285)
[junit4:junit4]   1> org.eclipse.jetty.util.thread.QueuedThreadPool.runJob(QueuedThreadPool.java:599)
[junit4:junit4]   1> org.eclipse.jetty.util.thread.QueuedThreadPool$3.run(QueuedThreadPool.java:534)
[junit4:junit4]   1> java.lang.Thread.run(Thread.java:662)
[junit4:junit4]   1> 
[junit4:junit4]   1> Thread[SUITE-SyncSliceTest-seed#[654008ECAB1AD0A],5,TGRP-SyncSliceTest]
[junit4:junit4]   1> java.lang.Object.wait(Native Method)
[junit4:junit4]   1> java.lang.Thread.join(Thread.java:1194)
[junit4:junit4]   1> com.carrotsearch.randomizedtesting.ThreadLeakControl.forkTimeoutingTask(ThreadLeakControl.java:787)
[junit4:junit4]   1> com.carrotsearch.randomizedtesting.ThreadLeakControl$2.evaluate(ThreadLeakControl.java:385)
[junit4:junit4]   1> com.carrotsearch.randomizedtesting.RandomizedRunner.runSuite(RandomizedRunner.java:556)
[junit4:junit4]   1> com.carrotsearch.randomizedtesting.RandomizedRunner.access$200(RandomizedRunner.java:79)
[junit4:junit4]   1> com.carrotsearch.randomizedtesting.RandomizedRunner$1.run(RandomizedRunner.java:492)
[junit4:junit4]   1> 
[junit4:junit4]   1> Thread[qtp24836051-856,5,TGRP-SyncSliceTest]
[junit4:junit4]   1> sun.misc.Unsafe.park(Native Method)
[junit4:junit4]   1> java.util.concurrent.locks.LockSupport.parkNanos(LockSupport.java:196)
[junit4:junit4]   1> java.util.concurrent.locks.AbstractQueuedSynchronizer$ConditionObject.awaitNanos(AbstractQueuedSynchronizer.java:2025)
[junit4:junit4]   1> org.eclipse.jetty.util.BlockingArrayQueue.poll(BlockingArrayQueue.java:337)
[junit4:junit4]   1> org.eclipse.jetty.util.thread.QueuedThreadPool.idleJobPoll(QueuedThreadPool.java:517)
[junit4:junit4]   1> org.eclipse.jetty.util.thread.QueuedThreadPool.access$600(QueuedThreadPool.java:39)
[junit4:junit4]   1> org.eclipse.jetty.util.thread.QueuedThreadPool$3.run(QueuedThreadPool.java:563)
[junit4:junit4]   1> java.lang.Thread.run(Thread.java:662)
[junit4:junit4]   1> 
[junit4:junit4]   1> Thread[NIOServerCxn.Factory:0.0.0.0/0.0.0.0:0,5,TGRP-SyncSliceTest]
[junit4:junit4]   1> sun.nio.ch.WindowsSelectorImpl$SubSelector.poll0(Native Method)
[junit4:junit4]   1> sun.nio.ch.WindowsSelectorImpl$SubSelector.poll(WindowsSelectorImpl.java:273)
[junit4:junit4]   1> sun.nio.ch.WindowsSelectorImpl$SubSelector.access$400(WindowsSelectorImpl.java:255)
[junit4:junit4]   1> sun.nio.ch.WindowsSelectorImpl.doSelect(WindowsSelectorImpl.java:136)
[junit4:junit4]   1> sun.nio.ch.SelectorImpl.lockAndDoSelect(SelectorImpl.java:69)
[junit4:junit4]   1> sun.nio.ch.SelectorImpl.select(SelectorImpl.java:80)
[junit4:junit4]   1> org.apache.zookeeper.server.NIOServerCnxn$Factory.run(NIOServerCnxn.java:232)
[junit4:junit4]   1> 
[junit4:junit4]   1> Thread[ProcessThread:-1,5,TGRP-SyncSliceTest]
[junit4:junit4]   1> sun.misc.Unsafe.park(Native Method)
[junit4:junit4]   1> java.util.concurrent.locks.LockSupport.park(LockSupport.java:156)
[junit4:junit4]   1> java.util.concurrent.locks.AbstractQueuedSynchronizer$ConditionObject.await(AbstractQueuedSynchronizer.java:1987)
[junit4:junit4]   1> java.util.concurrent.LinkedBlockingQueue.take(LinkedBlockingQueue.java:399)
[junit4:junit4]   1> org.apache.zookeeper.server.PrepRequestProcessor.run(PrepRequestProcessor.java:105)
[junit4:junit4]   1> 
[junit4:junit4]   1> Thread[TEST-SyncSliceTest.testDistribSearch-seed#[654008ECAB1AD0A]-SendThread(127.0.0.1:52019),5,TGRP-SyncSliceTest]
[junit4:junit4]   1> sun.nio.ch.WindowsSelectorImpl$SubSelector.poll0(Native Method)
[junit4:junit4]   1> sun.nio.ch.WindowsSelectorImpl$SubSelector.poll(WindowsSelectorImpl.java:273)
[junit4:junit4]   1> sun.nio.ch.WindowsSelectorImpl$SubSelector.access$400(WindowsSelectorImpl.java:255)
[junit4:junit4]   1> sun.nio.ch.WindowsSelectorImpl.doSelect(WindowsSelectorImpl.java:136)
[junit4:junit4]   1> sun.nio.ch.SelectorImpl.lockAndDoSelect(SelectorImpl.java:69)
[junit4:junit4]   1> sun.nio.ch.SelectorImpl.select(SelectorImpl.java:80)
[junit4:junit4]   1> org.apache.zookeeper.ClientCnxn$SendThread.run(ClientCnxn.java:1131)
[junit4:junit4]   1> 
[junit4:junit4]   1> Thread[qtp21747359-818,5,TGRP-SyncSliceTest]
[junit4:junit4]   1> sun.misc.Unsafe.park(Native Method)
[junit4:junit4]   1> java.util.concurrent.locks.LockSupport.parkNanos(LockSupport.java:196)
[junit4:junit4]   1> java.util.concurrent.locks.AbstractQueuedSynchronizer$ConditionObject.awaitNanos(AbstractQueuedSynchronizer.java:2025)
[junit4:junit4]   1> org.eclipse.jetty.util.BlockingArrayQueue.poll(BlockingArrayQueue.java:337)
[junit4:junit4]   1> org.eclipse.jetty.util.thread.QueuedThreadPool.idleJobPoll(QueuedThreadPool.java:517)
[junit4:junit4]   1> org.eclipse.jetty.util.thread.QueuedThreadPool.access$600(QueuedThreadPool.java:39)
[junit4:junit4]   1> org.eclipse.jetty.util.thread.QueuedThreadPool$3.run(QueuedThreadPool.java:563)
[junit4:junit4]   1> java.lang.Thread.run(Thread.java:662)
[junit4:junit4]   1> 
[junit4:junit4]   1> Thread[TEST-SyncSliceTest.testDistribSearch-seed#[654008ECAB1AD0A]-EventThread,5,TGRP-SyncSliceTest]
[junit4:junit4]   1> sun.misc.Unsafe.park(Native Method)
[junit4:junit4]   1> java.util.concurrent.locks.LockSupport.park(LockSupport.java:156)
[junit4:junit4]   1> java.util.concurrent.locks.AbstractQueuedSynchronizer$ConditionObject.await(AbstractQueuedSynchronizer.java:1987)
[junit4:junit4]   1> java.util.concurrent.LinkedBlockingQueue.take(LinkedBlockingQueue.java:399)
[junit4:junit4]   1> org.apache.zookeeper.ClientCnxn$EventThread.run(ClientCnxn.java:498)
[junit4:junit4]   1> 
[junit4:junit4]   1> Thread[searcherExecutor-414-thread-1,5,TGRP-SyncSliceTest]
[junit4:junit4]   1> sun.misc.Unsafe.park(Native Method)
[junit4:junit4]   1> java.util.concurrent.locks.LockSupport.park(LockSupport.java:156)
[junit4:junit4]   1> java.util.concurrent.locks.AbstractQueuedSynchronizer$ConditionObject.await(AbstractQueuedSynchronizer.java:1987)
[junit4:junit4]   1> java.util.concurrent.LinkedBlockingQueue.take(LinkedBlockingQueue.java:399)
[junit4:junit4]   1> java.util.concurrent.ThreadPoolExecutor.getTask(ThreadPoolExecutor.java:947)
[junit4:junit4]   1> java.util.concurrent.ThreadPoolExecutor$Worker.run(ThreadPoolExecutor.java:907)
[junit4:junit4]   1> java.lang.Thread.run(Thread.java:662)
[junit4:junit4]   1> 
[junit4:junit4]   1> Thread[qtp24575812-844,5,TGRP-SyncSliceTest]
[junit4:junit4]   1> sun.misc.Unsafe.park(Native Method)
[junit4:junit4]   1> java.util.concurrent.locks.LockSupport.parkNanos(LockSupport.java:196)
[junit4:junit4]   1> java.util.concurrent.locks.AbstractQueuedSynchronizer$ConditionObject.awaitNanos(AbstractQueuedSynchronizer.java:2025)
[junit4:junit4]   1> org.eclipse.jetty.util.BlockingArrayQueue.poll(BlockingArrayQueue.java:337)
[junit4:junit4]   1> org.eclipse.jetty.util.thread.QueuedThreadPool.idleJobPoll(QueuedThreadPool.java:517)
[junit4:junit4]   1> org.eclipse.jetty.util.thread.QueuedThreadPool.access$600(QueuedThreadPool.java:39)
[junit4:junit4]   1> org.eclipse.jetty.util.thread.QueuedThreadPool$3.run(QueuedThreadPool.java:563)
[junit4:junit4]   1> java.lang.Thread.run(Thread.java:662)
[junit4:junit4]   1> 
[junit4:junit4]   1> Thread[qtp26194395-831,5,TGRP-SyncSliceTest]
[junit4:junit4]   1> sun.misc.Unsafe.park(Native Method)
[junit4:junit4]   1> java.util.concurrent.locks.LockSupport.parkNanos(LockSupport.java:196)
[junit4:junit4]   1> java.util.concurrent.locks.AbstractQueuedSynchronizer$ConditionObject.awaitNanos(AbstractQueuedSynchronizer.java:2025)
[junit4:junit4]   1> org.eclipse.jetty.util.BlockingArrayQueue.poll(BlockingArrayQueue.java:337)
[junit4:junit4]   1> org.eclipse.jetty.util.thread.QueuedThreadPool.idleJobPoll(QueuedThreadPool.java:517)
[junit4:junit4]   1> org.eclipse.jetty.util.thread.QueuedThreadPool.access$600(QueuedThreadPool.java:39)
[junit4:junit4]   1> org.eclipse.jetty.util.thread.QueuedThreadPool$3.run(QueuedThreadPool.java:563)
[junit4:junit4]   1> java.lang.Thread.run(Thread.java:662)
[junit4:junit4]   1> 
[junit4:junit4]   1> Thread[qtp24575812-837 Selector0,5,TGRP-SyncSliceTest]
[junit4:junit4]   1> sun.nio.ch.WindowsSelectorImpl$SubSelector.poll0(Native Method)
[junit4:junit4]   1> sun.nio.ch.WindowsSelectorImpl$SubSelector.poll(WindowsSelectorImpl.java:273)
[junit4:junit4]   1> sun.nio.ch.WindowsSelectorImpl$SubSelector.access$400(WindowsSelectorImpl.java:255)
[junit4:junit4]   1> sun.nio.ch.WindowsSelectorImpl.doSelect(WindowsSelectorImpl.java:136)
[junit4:junit4]   1> sun.nio.ch.SelectorImpl.lockAndDoSelect(SelectorImpl.java:69)
[junit4:junit4]   1> sun.nio.ch.SelectorImpl.select(SelectorImpl.java:80)
[junit4:junit4]   1> org.eclipse.jetty.io.nio.SelectorManager$SelectSet.doSelect(SelectorManager.java:564)
[junit4:junit4]   1> org.eclipse.jetty.io.nio.SelectorManager$1.run(SelectorManager.java:285)
[junit4:junit4]   1> org.eclipse.jetty.util.thread.QueuedThreadPool.runJob(QueuedThreadPool.java:599)
[junit4:junit4]   1> org.eclipse.jetty.util.thread.QueuedThreadPool$3.run(QueuedThreadPool.java:534)
[junit4:junit4]   1> java.lang.Thread.run(Thread.java:662)
[junit4:junit4]   1> 
[junit4:junit4]   1> Thread[qtp24836051-855,5,TGRP-SyncSliceTest]
[junit4:junit4]   1> sun.misc.Unsafe.park(Native Method)
[junit4:junit4]   1> java.util.concurrent.locks.LockSupport.parkNanos(LockSupport.java:196)
[junit4:junit4]   1> java.util.concurrent.locks.AbstractQueuedSynchronizer$ConditionObject.awaitNanos(AbstractQueuedSynchronizer.java:2025)
[junit4:junit4]   1> org.eclipse.jetty.util.BlockingArrayQueue.poll(BlockingArrayQueue.java:337)
[junit4:junit4]   1> org.eclipse.jetty.util.thread.QueuedThreadPool.idleJobPoll(QueuedThreadPool.java:517)
[junit4:junit4]   1> org.eclipse.jetty.util.thread.QueuedThreadPool.access$600(QueuedThreadPool.java:39)
[junit4:junit4]   1> org.eclipse.jetty.util.thread.QueuedThreadPool$3.run(QueuedThreadPool.java:563)
[junit4:junit4]   1> java.lang.Thread.run(Thread.java:662)
[junit4:junit4]   1> 
[junit4:junit4]   1> Thread[qtp7573114-806,5,TGRP-SyncSliceTest]
[junit4:junit4]   1> sun.misc.Unsafe.park(Native Method)
[junit4:junit4]   1> java.util.concurrent.locks.LockSupport.parkNanos(LockSupport.java:196)
[junit4:junit4]   1> java.util.concurrent.locks.AbstractQueuedSynchronizer$ConditionObject.awaitNanos(AbstractQueuedSynchronizer.java:2025)
[junit4:junit4]   1> org.eclipse.jetty.util.BlockingArrayQueue.poll(BlockingArrayQueue.java:337)
[junit4:junit4]   1> org.eclipse.jetty.util.thread.QueuedThreadPool.idleJobPoll(QueuedThreadPool.java:517)
[junit4:junit4]   1> org.eclipse.jetty.util.thread.QueuedThreadPool.access$600(QueuedThreadPool.java:39)
[junit4:junit4]   1> org.eclipse.jetty.util.thread.QueuedThreadPool$3.run(QueuedThreadPool.java:563)
[junit4:junit4]   1> java.lang.Thread.run(Thread.java:662)
[junit4:junit4]   1> 
[junit4:junit4]   1> Thread[qtp21747359-820,5,TGRP-SyncSliceTest]
[junit4:junit4]   1> sun.misc.Unsafe.park(Native Method)
[junit4:junit4]   1> java.util.concurrent.locks.LockSupport.parkNanos(LockSupport.java:196)
[junit4:junit4]   1> java.util.concurrent.locks.AbstractQueuedSynchronizer$ConditionObject.awaitNanos(AbstractQueuedSynchronizer.java:2025)
[junit4:junit4]   1> org.eclipse.jetty.util.BlockingArrayQueue.poll(BlockingArrayQueue.java:337)
[junit4:junit4]   1> org.eclipse.jetty.util.thread.QueuedThreadPool.idleJobPoll(QueuedThreadPool.java:517)
[junit4:junit4]   1> org.eclipse.jetty.util.thread.QueuedThreadPool.access$600(QueuedThreadPool.java:39)
[junit4:junit4]   1> org.eclipse.jetty.util.thread.QueuedThreadPool$3.run(QueuedThreadPool.java:563)
[junit4:junit4]   1> java.lang.Thread.run(Thread.java:662)
[junit4:junit4]   1> 
[junit4:junit4]   1> Thread[qtp21747359-815,5,TGRP-SyncSliceTest]
[junit4:junit4]   1> sun.misc.Unsafe.park(Native Method)
[junit4:junit4]   1> java.util.concurrent.locks.LockSupport.parkNanos(LockSupport.java:196)
[junit4:junit4]   1> java.util.concurrent.locks.AbstractQueuedSynchronizer$ConditionObject.awaitNanos(AbstractQueuedSynchronizer.java:2025)
[junit4:junit4]   1> org.eclipse.jetty.util.BlockingArrayQueue.poll(BlockingArrayQueue.java:337)
[junit4:junit4]   1> org.eclipse.jetty.util.thread.QueuedThreadPool.idleJobPoll(QueuedThreadPool.java:517)
[junit4:junit4]   1> org.eclipse.jetty.util.thread.QueuedThreadPool.access$600(QueuedThreadPool.java:39)
[junit4:junit4]   1> org.eclipse.jetty.util.thread.QueuedThreadPool$3.run(QueuedThreadPool.java:563)
[junit4:junit4]   1> java.lang.Thread.run(Thread.java:662)
[junit4:junit4]   1> 
[junit4:junit4]   1> Thread[TEST-SyncSliceTest.testDistribSearch-seed#[654008ECAB1AD0A]-EventThread,5,TGRP-SyncSliceTest]
[junit4:junit4]   1> sun.misc.Unsafe.park(Native Method)
[junit4:junit4]   1> java.util.concurrent.locks.LockSupport.park(LockSupport.java:156)
[junit4:junit4]   1> java.util.concurrent.locks.AbstractQueuedSynchronizer$ConditionObject.await(AbstractQueuedSynchronizer.java:1987)
[junit4:junit4]   1> java.util.concurrent.LinkedBlockingQueue.take(LinkedBlockingQueue.java:399)
[junit4:junit4]   1> org.apache.zookeeper.ClientCnxn$EventThread.run(ClientCnxn.java:498)
[junit4:junit4]   1> 
[junit4:junit4]   1> Thread[qtp24836051-854,5,TGRP-SyncSliceTest]
[junit4:junit4]   1> sun.misc.Unsafe.park(Native Method)
[junit4:junit4]   1> java.util.concurrent.locks.LockSupport.parkNanos(LockSupport.java:196)
[junit4:junit4]   1> java.util.concurrent.locks.AbstractQueuedSynchronizer$ConditionObject.awaitNanos(AbstractQueuedSynchronizer.java:2025)
[junit4:junit4]   1> org.eclipse.jetty.util.BlockingArrayQueue.poll(BlockingArrayQueue.java:337)
[junit4:junit4]   1> org.eclipse.jetty.util.thread.QueuedThreadPool.idleJobPoll(QueuedThreadPool.java:517)
[junit4:junit4]   1> org.eclipse.jetty.util.thread.QueuedThreadPool.access$600(QueuedThreadPool.java:39)
[junit4:junit4]   1> org.eclipse.jetty.util.thread.QueuedThreadPool$3.run(QueuedThreadPool.java:563)
[junit4:junit4]   1> java.lang.Thread.run(Thread.java:662)
[junit4:junit4]   1> 
[junit4:junit4]   1> Thread[HashSessionScavenger-24,5,TGRP-SyncSliceTest]
[junit4:junit4]   1> java.lang.Object.wait(Native Method)
[junit4:junit4]   1> java.util.TimerThread.mainLoop(Timer.java:509)
[junit4:junit4]   1> java.util.TimerThread.run(Timer.java:462)
[junit4:junit4]   1> 
[junit4:junit4]   1> Thread[qtp21747359-813 Selector0,5,TGRP-SyncSliceTest]
[junit4:junit4]   1> sun.nio.ch.WindowsSelectorImpl$SubSelector.poll0(Native Method)
[junit4:junit4]   1> sun.nio.ch.WindowsSelectorImpl$SubSelector.poll(WindowsSelectorImpl.java:273)
[junit4:junit4]   1> sun.nio.ch.WindowsSelectorImpl$SubSelector.access$400(WindowsSelectorImpl.java:255)
[junit4:junit4]   1> sun.nio.ch.WindowsSelectorImpl.doSelect(WindowsSelectorImpl.java:136)
[junit4:junit4]   1> sun.nio.ch.SelectorImpl.lockAndDoSelect(SelectorImpl.java:69)
[junit4:junit4]   1> sun.nio.ch.SelectorImpl.select(SelectorImpl.java:80)
[junit4:junit4]   1> org.eclipse.jetty.io.nio.SelectorManager$SelectSet.doSelect(SelectorManager.java:564)
[junit4:junit4]   1> org.eclipse.jetty.io.nio.SelectorManager$1.run(SelectorManager.java:285)
[junit4:junit4]   1> org.eclipse.jetty.util.thread.QueuedThreadPool.runJob(QueuedThreadPool.java:599)
[junit4:junit4]   1> org.eclipse.jetty.util.thread.QueuedThreadPool$3.run(QueuedThreadPool.java:534)
[junit4:junit4]   1> java.lang.Thread.run(Thread.java:662)
[junit4:junit4]   1> 
[junit4:junit4]   1> Thread[qtp24575812-843,5,TGRP-SyncSliceTest]
[junit4:junit4]   1> sun.misc.Unsafe.park(Native Method)
[junit4:junit4]   1> java.util.concurrent.locks.LockSupport.parkNanos(LockSupport.java:196)
[junit4:junit4]   1> java.util.concurrent.locks.AbstractQueuedSynchronizer$ConditionObject.awaitNanos(AbstractQueuedSynchronizer.java:2025)
[junit4:junit4]   1> org.eclipse.jetty.util.BlockingArrayQueue.poll(BlockingArrayQueue.java:337)
[junit4:junit4]   1> org.eclipse.jetty.util.thread.QueuedThreadPool.idleJobPoll(QueuedThreadPool.java:517)
[junit4:junit4]   1> org.eclipse.jetty.util.thread.QueuedThreadPool.access$600(QueuedThreadPool.java:39)
[junit4:junit4]   1> org.eclipse.jetty.util.thread.QueuedThreadPool$3.run(QueuedThreadPool.java:563)
[junit4:junit4]   1> java.lang.Thread.run(Thread.java:662)
[junit4:junit4]   1> 
[junit4:junit4]   1> Thread[qtp24836051-858,5,TGRP-SyncSliceTest]
[junit4:junit4]   1> sun.misc.Unsafe.park(Native Method)
[junit4:junit4]   1> java.util.concurrent.locks.LockSupport.parkNanos(LockSupport.java:196)
[junit4:junit4]   1> java.util.concurrent.locks.AbstractQueuedSynchronizer$ConditionObject.awaitNanos(AbstractQueuedSynchronizer.java:2025)
[junit4:junit4]   1> org.eclipse.jetty.util.BlockingArrayQueue.poll(BlockingArrayQueue.java:337)
[junit4:junit4]   1> org.eclipse.jetty.util.thread.QueuedThreadPool.idleJobPoll(QueuedThreadPool.java:517)
[junit4:junit4]   1> org.eclipse.jetty.util.thread.QueuedThreadPool.access$600(QueuedThreadPool.java:39)
[junit4:junit4]   1> org.eclipse.jetty.util.thread.QueuedThreadPool$3.run(QueuedThreadPool.java:563)
[junit4:junit4]   1> java.lang.Thread.run(Thread.java:662)
[junit4:junit4]   1> 
[junit4:junit4]   1> Thread[qtp24836051-851 Selector0,5,TGRP-SyncSliceTest]
[junit4:junit4]   1> sun.nio.ch.WindowsSelectorImpl$SubSelector.poll0(Native Method)
[junit4:junit4]   1> sun.nio.ch.WindowsSelectorImpl$SubSelector.poll(WindowsSelectorImpl.java:273)
[junit4:junit4]   1> sun.nio.ch.WindowsSelectorImpl$SubSelector.access$400(WindowsSelectorImpl.java:255)
[junit4:junit4]   1> sun.nio.ch.WindowsSelectorImpl.doSelect(WindowsSelectorImpl.java:136)
[junit4:junit4]   1> sun.nio.ch.SelectorImpl.lockAndDoSelect(SelectorImpl.java:69)
[junit4:junit4]   1> sun.nio.ch.SelectorImpl.select(SelectorImpl.java:80)
[junit4:junit4]   1> org.eclipse.jetty.io.nio.SelectorManager$SelectSet.doSelect(SelectorManager.java:564)
[junit4:junit4]   1> org.eclipse.jetty.io.nio.SelectorManager$1.run(SelectorManager.java:285)
[junit4:junit4]   1> org.eclipse.jetty.util.thread.QueuedThreadPool.runJob(QueuedThreadPool.java:599)
[junit4:junit4]   1> org.eclipse.jetty.util.thread.QueuedThreadPool$3.run(QueuedThreadPool.java:534)
[junit4:junit4]   1> java.lang.Thread.run(Thread.java:662)
[junit4:junit4]   1> 
[junit4:junit4]   1> Thread[qtp26194395-826,5,TGRP-SyncSliceTest]
[junit4:junit4]   1> sun.misc.Unsafe.park(Native Method)
[junit4:junit4]   1> java.util.concurrent.locks.LockSupport.parkNanos(LockSupport.java:196)
[junit4:junit4]   1> java.util.concurrent.locks.AbstractQueuedSynchronizer$ConditionObject.awaitNanos(AbstractQueuedSynchronizer.java:2025)
[junit4:junit4]   1> org.eclipse.jetty.util.BlockingArrayQueue.poll(BlockingArrayQueue.java:337)
[junit4:junit4]   1> org.eclipse.jetty.util.thread.QueuedThreadPool.idleJobPoll(QueuedThreadPool.java:517)
[junit4:junit4]   1> org.eclipse.jetty.util.thread.QueuedThreadPool.access$600(QueuedThreadPool.java:39)
[junit4:junit4]   1> org.eclipse.jetty.util.thread.QueuedThreadPool$3.run(QueuedThreadPool.java:563)
[junit4:junit4]   1> java.lang.Thread.run(Thread.java:662)
[junit4:junit4]   1> 
[junit4:junit4]   1> Thread[Signal Dispatcher,9,system]
[junit4:junit4]   1> 
[junit4:junit4]   1> Thread[qtp7573114-801,5,TGRP-SyncSliceTest]
[junit4:junit4]   1> sun.misc.Unsafe.park(Native Method)
[junit4:junit4]   1> java.util.concurrent.locks.LockSupport.parkNanos(LockSupport.java:196)
[junit4:junit4]   1> java.util.concurrent.locks.AbstractQueuedSynchronizer$ConditionObject.awaitNanos(AbstractQueuedSynchronizer.java:2025)
[junit4:junit4]   1> org.eclipse.jetty.util.BlockingArrayQueue.poll(BlockingArrayQueue.java:337)
[junit4:junit4]   1> org.eclipse.jetty.util.thread.QueuedThreadPool.idleJobPoll(QueuedThreadPool.java:517)
[junit4:junit4]   1> org.eclipse.jetty.util.thread.QueuedThreadPool.access$600(QueuedThreadPool.java:39)
[junit4:junit4]   1> org.eclipse.jetty.util.thread.QueuedThreadPool$3.run(QueuedThreadPool.java:563)
[junit4:junit4]   1> java.lang.Thread.run(Thread.java:662)
[junit4:junit4]   1> 
[junit4:junit4]   1> Thread[qtp24575812-842,5,TGRP-SyncSliceTest]
[junit4:junit4]   1> sun.misc.Unsafe.park(Native Method)
[junit4:junit4]   1> java.util.concurrent.locks.LockSupport.parkNanos(LockSupport.java:196)
[junit4:junit4]   1> java.util.concurrent.locks.AbstractQueuedSynchronizer$ConditionObject.awaitNanos(AbstractQueuedSynchronizer.java:2025)
[junit4:junit4]   1> org.eclipse.jetty.util.BlockingArrayQueue.poll(BlockingArrayQueue.java:337)
[junit4:junit4]   1> org.eclipse.jetty.util.thread.QueuedThreadPool.idleJobPoll(QueuedThreadPool.java:517)
[junit4:junit4]   1> org.eclipse.jetty.util.thread.QueuedThreadPool.access$600(QueuedThreadPool.java:39)
[junit4:junit4]   1> org.eclipse.jetty.util.thread.QueuedThreadPool$3.run(QueuedThreadPool.java:563)
[junit4:junit4]   1> java.lang.Thread.run(Thread.java:662)
[junit4:junit4]   1> 
[junit4:junit4]   1> Thread[Finalizer,8,system]
[junit4:junit4]   1> java.lang.Object.wait(Native Method)
[junit4:junit4]   1> java.lang.ref.ReferenceQueue.remove(ReferenceQueue.java:118)
[junit4:junit4]   1> java.lang.ref.ReferenceQueue.remove(ReferenceQueue.java:134)
[junit4:junit4]   1> java.lang.ref.Finalizer$FinalizerThread.run(Finalizer.java:159)
[junit4:junit4]   1> 
[junit4:junit4]   1> Thread[qtp21747359-816,5,TGRP-SyncSliceTest]
[junit4:junit4]   1> sun.misc.Unsafe.park(Native Method)
[junit4:junit4]   1> java.util.concurrent.locks.LockSupport.parkNanos(LockSupport.java:196)
[junit4:junit4]   1> java.util.concurrent.locks.AbstractQueuedSynchronizer$ConditionObject.awaitNanos(AbstractQueuedSynchronizer.java:2025)
[junit4:junit4]   1> org.eclipse.jetty.util.BlockingArrayQueue.poll(BlockingArrayQueue.java:337)
[junit4:junit4]   1> org.eclipse.jetty.util.thread.QueuedThreadPool.idleJobPoll(QueuedThreadPool.java:517)
[junit4:junit4]   1> org.eclipse.jetty.util.thread.QueuedThreadPool.access$600(QueuedThreadPool.java:39)
[junit4:junit4]   1> org.eclipse.jetty.util.thread.QueuedThreadPool$3.run(QueuedThreadPool.java:563)
[junit4:junit4]   1> java.lang.Thread.run(Thread.java:662)
[junit4:junit4]   1> 
[junit4:junit4]   1> Thread[qtp24575812-840,5,TGRP-SyncSliceTest]
[junit4:junit4]   1> sun.misc.Unsafe.park(Native Method)
[junit4:junit4]   1> java.util.concurrent.locks.LockSupport.parkNanos(LockSupport.java:196)
[junit4:junit4]   1> java.util.concurrent.locks.AbstractQueuedSynchronizer$ConditionObject.awaitNanos(AbstractQueuedSynchronizer.java:2025)
[junit4:junit4]   1> org.eclipse.jetty.util.BlockingArrayQueue.poll(BlockingArrayQueue.java:337)
[junit4:junit4]   1> org.eclipse.jetty.util.thread.QueuedThreadPool.idleJobPoll(QueuedThreadPool.java:517)
[junit4:junit4]   1> org.eclipse.jetty.util.thread.QueuedThreadPool.access$600(QueuedThreadPool.java:39)
[junit4:junit4]   1> org.eclipse.jetty.util.thread.QueuedThreadPool$3.run(QueuedThreadPool.java:563)
[junit4:junit4]   1> java.lang.Thread.run(Thread.java:662)
[junit4:junit4]   1> 
[junit4:junit4]   1> Session Sets (11):
[junit4:junit4]   1> 0 expire at Mon Oct 29 19:38:28 PST 2012:
[junit4:junit4]   1> 0 expire at Mon Oct 29 19:38:29 PST 2012:
[junit4:junit4]   1> 0 expire at Mon Oct 29 19:38:30 PST 2012:
[junit4:junit4]   1> 1 expire at Mon Oct 29 19:38:31 PST 2012:
[junit4:junit4]   1> 	0x13aafbe5f2e0004
[junit4:junit4]   1> 3 expire at Mon Oct 29 19:38:32 PST 2012:
[junit4:junit4]   1> 	0x13aafbe5f2e0005
[junit4:junit4]   1> 	0x13aafbe5f2e0006
[junit4:junit4]   1> 	0x13aafbe5f2e0003
[junit4:junit4]   1> 1 expire at Mon Oct 29 19:38:33 PST 2012:
[junit4:junit4]   1> 	0x13aafbe5f2e0002
[junit4:junit4]   1> 0 expire at Mon Oct 29 19:38:34 PST 2012:
[junit4:junit4]   1> 0 expire at Mon Oct 29 19:38:35 PST 2012:
[junit4:junit4]   1> 0 expire at Mon Oct 29 19:38:36 PST 2012:
[junit4:junit4]   1> 0 expire at Mon Oct 29 19:38:37 PST 2012:
[junit4:junit4]   1> 1 expire at Mon Oct 29 19:38:38 PST 2012:
[junit4:junit4]   1> 	0x13aafbe5f2e0007
[junit4:junit4]   1> 
[junit4:junit4]   1> java.lang.Object.wait(Native Method)
[junit4:junit4]   1> org.apache.zookeeper.server.SessionTrackerImpl.run(SessionTrackerImpl.java:145)
[junit4:junit4]   1> 
[junit4:junit4]   1> Thread[qtp21747359-819,5,TGRP-SyncSliceTest]
[junit4:junit4]   1> sun.misc.Unsafe.park(Native Method)
[junit4:junit4]   1> java.util.concurrent.locks.LockSupport.parkNanos(LockSupport.java:196)
[junit4:junit4]   1> java.util.concurrent.locks.AbstractQueuedSynchronizer$ConditionObject.awaitNanos(AbstractQueuedSynchronizer.java:2025)
[junit4:junit4]   1> org.eclipse.jetty.util.BlockingArrayQueue.poll(BlockingArrayQueue.java:337)
[junit4:junit4]   1> org.eclipse.jetty.util.thread.QueuedThreadPool.idleJobPoll(QueuedThreadPool.java:517)
[junit4:junit4]   1> org.eclipse.jetty.util.thread.QueuedThreadPool.access$600(QueuedThreadPool.java:39)
[junit4:junit4]   1> org.eclipse.jetty.util.thread.QueuedThreadPool$3.run(QueuedThreadPool.java:563)
[junit4:junit4]   1> java.lang.Thread.run(Thread.java:662)
[junit4:junit4]   1> 
[junit4:junit4]   1> Thread[qtp26194395-832,5,TGRP-SyncSliceTest]
[junit4:junit4]   1> sun.misc.Unsafe.park(Native Method)
[junit4:junit4]   1> java.util.concurrent.locks.LockSupport.parkNanos(LockSupport.java:196)
[junit4:junit4]   1> java.util.concurrent.locks.AbstractQueuedSynchronizer$ConditionObject.awaitNanos(AbstractQueuedSynchronizer.java:2025)
[junit4:junit4]   1> org.eclipse.jetty.util.BlockingArrayQueue.poll(BlockingArrayQueue.java:337)
[junit4:junit4]   1> org.eclipse.jetty.util.thread.QueuedThreadPool.idleJobPoll(QueuedThreadPool.java:517)
[junit4:junit4]   1> org.eclipse.jetty.util.thread.QueuedThreadPool.access$600(QueuedThreadPool.java:39)
[junit4:junit4]   1> org.eclipse.jetty.util.thread.QueuedThreadPool$3.run(QueuedThreadPool.java:563)
[junit4:junit4]   1> java.lang.Thread.run(Thread.java:662)
[junit4:junit4]   1> 
[junit4:junit4]   1> Thread[main,5,main]
[junit4:junit4]   1> java.lang.Object.wait(Native Method)
[junit4:junit4]   1> java.lang.Thread.join(Thread.java:1186)
[junit4:junit4]   1> java.lang.Thread.join(Thread.java:1239)
[junit4:junit4]   1> com.carrotsearch.randomizedtesting.RandomizedRunner.runSuite(RandomizedRunner.java:502)
[junit4:junit4]   1> com.carrotsearch.randomizedtesting.RandomizedRunner.run(RandomizedRunner.java:399)
[junit4:junit4]   1> com.carrotsearch.ant.tasks.junit4.slave.SlaveMain.execute(SlaveMain.java:161)
[junit4:junit4]   1> com.carrotsearch.ant.tasks.junit4.slave.SlaveMain.main(SlaveMain.java:255)
[junit4:junit4]   1> com.carrotsearch.ant.tasks.junit4.slave.SlaveMainSafe.main(SlaveMainSafe.java:12)
[junit4:junit4]   1> 
[junit4:junit4]   1> Thread[qtp24836051-857,5,TGRP-SyncSliceTest]
[junit4:junit4]   1> sun.misc.Unsafe.park(Native Method)
[junit4:junit4]   1> java.util.concurrent.locks.LockSupport.parkNanos(LockSupport.java:196)
[junit4:junit4]   1> java.util.concurrent.locks.AbstractQueuedSynchronizer$ConditionObject.awaitNanos(AbstractQueuedSynchronizer.java:2025)
[junit4:junit4]   1> org.eclipse.jetty.util.BlockingArrayQueue.poll(BlockingArrayQueue.java:337)
[junit4:junit4]   1> org.eclipse.jetty.util.thread.QueuedThreadPool.idleJobPoll(QueuedThreadPool.java:517)
[junit4:junit4]   1> org.eclipse.jetty.util.thread.QueuedThreadPool.access$600(QueuedThreadPool.java:39)
[junit4:junit4]   1> org.eclipse.jetty.util.thread.QueuedThreadPool$3.run(QueuedThreadPool.java:563)
[junit4:junit4]   1> java.lang.Thread.run(Thread.java:662)
[junit4:junit4]   1> 
[junit4:junit4]   1> Thread[searcherExecutor-439-thread-1,5,TGRP-SyncSliceTest]
[junit4:junit4]   1> sun.misc.Unsafe.park(Native Method)
[junit4:junit4]   1> java.util.concurrent.locks.LockSupport.park(LockSupport.java:156)
[junit4:junit4]   1> java.util.concurrent.locks.AbstractQueuedSynchronizer$ConditionObject.await(AbstractQueuedSynchronizer.java:1987)
[junit4:junit4]   1> java.util.concurrent.LinkedBlockingQueue.take(LinkedBlockingQueue.java:399)
[junit4:junit4]   1> java.util.concurrent.ThreadPoolExecutor.getTask(ThreadPoolExecutor.java:947)
[junit4:junit4]   1> java.util.concurrent.ThreadPoolExecutor$Worker.run(ThreadPoolExecutor.java:907)
[junit4:junit4]   1> java.lang.Thread.run(Thread.java:662)
[junit4:junit4]   1> 
[junit4:junit4]   1> Thread[qtp26194395-825 Selector0,5,TGRP-SyncSliceTest]
[junit4:junit4]   1> sun.nio.ch.WindowsSelectorImpl$SubSelector.poll0(Native Method)
[junit4:junit4]   1> sun.nio.ch.WindowsSelectorImpl$SubSelector.poll(WindowsSelectorImpl.java:273)
[junit4:junit4]   1> sun.nio.ch.WindowsSelectorImpl$SubSelector.access$400(WindowsSelectorImpl.java:255)
[junit4:junit4]   1> sun.nio.ch.WindowsSelectorImpl.doSelect(WindowsSelectorImpl.java:136)
[junit4:junit4]   1> sun.nio.ch.SelectorImpl.lockAndDoSelect(SelectorImpl.java:69)
[junit4:junit4]   1> sun.nio.ch.SelectorImpl.select(SelectorImpl.java:80)
[junit4:junit4]   1> org.eclipse.jetty.io.nio.SelectorManager$SelectSet.doSelect(SelectorManager.java:564)
[junit4:junit4]   1> org.eclipse.jetty.io.nio.SelectorManager$1.run(SelectorManager.java:285)
[junit4:junit4]   1> org.eclipse.jetty.util.thread.QueuedThreadPool.runJob(QueuedThreadPool.java:599)
[junit4:junit4]   1> org.eclipse.jetty.util.thread.QueuedThreadPool$3.run(QueuedThreadPool.java:534)
[junit4:junit4]   1> java.lang.Thread.run(Thread.java:662)
[junit4:junit4]   1> 
[junit4:junit4]   1> Thread[SyncThread:0,5,TGRP-SyncSliceTest]
[junit4:junit4]   1> sun.misc.Unsafe.park(Native Method)
[junit4:junit4]   1> java.util.concurrent.locks.LockSupport.park(LockSupport.java:156)
[junit4:junit4]   1> java.util.concurrent.locks.AbstractQueuedSynchronizer$ConditionObject.await(AbstractQueuedSynchronizer.java:1987)
[junit4:junit4]   1> java.util.concurrent.LinkedBlockingQueue.take(LinkedBlockingQueue.java:399)
[junit4:junit4]   1> org.apache.zookeeper.server.SyncRequestProcessor.run(SyncRequestProcessor.java:94)
[junit4:junit4]   1> 
[junit4:junit4]   1> Thread[searcherExecutor-449-thread-1,5,TGRP-SyncSliceTest]
[junit4:junit4]   1> sun.misc.Unsafe.park(Native Method)
[junit4:junit4]   1> java.util.concurrent.locks.LockSupport.park(LockSupport.java:156)
[junit4:junit4]   1> java.util.concurrent.locks.AbstractQueuedSynchronizer$ConditionObject.await(AbstractQueuedSynchronizer.java:1987)
[junit4:junit4]   1> java.util.concurrent.LinkedBlockingQueue.take(LinkedBlockingQueue.java:399)
[junit4:junit4]   1> java.util.concurrent.ThreadPoolExecutor.getTask(ThreadPoolExecutor.java:947)
[junit4:junit4]   1> java.util.concurrent.ThreadPoolExecutor$Worker.run(ThreadPoolExecutor.java:907)
[junit4:junit4]   1> java.lang.Thread.run(Thread.java:662)
[junit4:junit4]   1> 
[junit4:junit4]   1> Thread[qtp21747359-814 Acceptor0 SelectChannelConnector@0.0.0.0:52032,5,TGRP-SyncSliceTest]
[junit4:junit4]   1> sun.nio.ch.ServerSocketChannelImpl.accept0(Native Method)
[junit4:junit4]   1> sun.nio.ch.ServerSocketChannelImpl.accept(ServerSocketChannelImpl.java:150)
[junit4:junit4]   1> org.eclipse.jetty.server.nio.SelectChannelConnector.accept(SelectChannelConnector.java:104)
[junit4:junit4]   1> org.eclipse.jetty.server.AbstractConnector$Acceptor.run(AbstractConnector.java:933)
[junit4:junit4]   1> org.eclipse.jetty.util.thread.QueuedThreadPool.runJob(QueuedThreadPool.java:599)
[junit4:junit4]   1> org.eclipse.jetty.util.thread.QueuedThreadPool$3.run(QueuedThreadPool.java:534)
[junit4:junit4]   1> java.lang.Thread.run(Thread.java:662)
[junit4:junit4]   1> 
[junit4:junit4]   1> Thread[qtp24575812-839,5,TGRP-SyncSliceTest]
[junit4:junit4]   1> sun.misc.Unsafe.park(Native Method)
[junit4:junit4]   1> java.util.concurrent.locks.LockSupport.parkNanos(LockSupport.java:196)
[junit4:junit4]   1> java.util.concurrent.locks.AbstractQueuedSynchronizer$ConditionObject.awaitNanos(AbstractQueuedSynchronizer.java:2025)
[junit4:junit4]   1> org.eclipse.jetty.util.BlockingArrayQueue.poll(BlockingArrayQueue.java:337)
[junit4:junit4]   1> org.eclipse.jetty.util.thread.QueuedThreadPool.idleJobPoll(QueuedThreadPool.java:517)
[junit4:junit4]   1> org.eclipse.jetty.util.thread.QueuedThreadPool.access$600(QueuedThreadPool.java:39)
[junit4:junit4]   1> org.eclipse.jetty.util.thread.QueuedThreadPool$3.run(QueuedThreadPool.java:563)
[junit4:junit4]   1> java.lang.Thread.run(Thread.java:662)
[junit4:junit4]   1> 
[junit4:junit4]   1> Thread[qtp24575812-841,5,TGRP-SyncSliceTest]
[junit4:junit4]   1> sun.misc.Unsafe.park(Native Method)
[junit4:junit4]   1> java.util.concurrent.locks.LockSupport.parkNanos(LockSupport.java:196)
[junit4:junit4]   1> java.util.concurrent.locks.AbstractQueuedSynchronizer$ConditionObject.awaitNanos(AbstractQueuedSynchronizer.java:2025)
[junit4:junit4]   1> org.eclipse.jetty.util.BlockingArrayQueue.poll(BlockingArrayQueue.java:337)
[junit4:junit4]   1> org.eclipse.jetty.util.thread.QueuedThreadPool.idleJobPoll(QueuedThreadPool.java:517)
[junit4:junit4]   1> org.eclipse.jetty.util.thread.QueuedThreadPool.access$600(QueuedThreadPool.java:39)
[junit4:junit4]   1> org.eclipse.jetty.util.thread.QueuedThreadPool$3.run(QueuedThreadPool.java:563)
[junit4:junit4]   1> java.lang.Thread.run(Thread.java:662)
[junit4:junit4]   1> 
[junit4:junit4]   1> Thread[TEST-SyncSliceTest.testDistribSearch-seed#[654008ECAB1AD0A],5,TGRP-SyncSliceTest]
[junit4:junit4]   1> java.lang.Thread.dumpThreads(Native Method)
[junit4:junit4]   1> java.lang.Thread.getAllStackTraces(Thread.java:1530)
[junit4:junit4]   1> org.apache.solr.cloud.AbstractDistribZkTestBase.waitForRecoveriesToFinish(AbstractDistribZkTestBase.java:156)
[junit4:junit4]   1> org.apache.solr.cloud.AbstractFullDistribZkTestBase.waitForRecoveriesToFinish(AbstractFullDistribZkTestBase.java:558)
[junit4:junit4]   1> org.apache.solr.cloud.AbstractFullDistribZkTestBase.waitForThingsToLevelOut(AbstractFullDistribZkTestBase.java:1133)
[junit4:junit4]   1> org.apache.solr.cloud.SyncSliceTest.doTest(SyncSliceTest.java:89)
[junit4:junit4]   1> org.apache.solr.BaseDistributedSearchTestCase.testDistribSearch(BaseDistributedSearchTestCase.java:695)
[junit4:junit4]   1> sun.reflect.NativeMethodAccessorImpl.invoke0(Native Method)
[junit4:junit4]   1> sun.reflect.NativeMethodAccessorImpl.invoke(NativeMethodAccessorImpl.java:39)
[junit4:junit4]   1> sun.reflect.DelegatingMethodAccessorImpl.invoke(DelegatingMethodAccessorImpl.java:25)
[junit4:junit4]   1> java.lang.reflect.Method.invoke(Method.java:597)
[junit4:junit4]   1> com.carrotsearch.randomizedtesting.RandomizedRunner.invoke(RandomizedRunner.java:1559)
[junit4:junit4]   1> com.carrotsearch.randomizedtesting.RandomizedRunner.access$600(RandomizedRunner.java:79)
[junit4:junit4]   1> com.carrotsearch.randomizedtesting.RandomizedRunner$6.evaluate(RandomizedRunner.java:737)
[junit4:junit4]   1> com.carrotsearch.randomizedtesting.RandomizedRunner$7.evaluate(RandomizedRunner.java:773)
[junit4:junit4]   1> com.carrotsearch.randomizedtesting.RandomizedRunner$8.evaluate(RandomizedRunner.java:787)
[junit4:junit4]   1> com.carrotsearch.randomizedtesting.rules.SystemPropertiesRestoreRule$1.evaluate(SystemPropertiesRestoreRule.java:53)
[junit4:junit4]   1> org.apache.lucene.util.TestRuleSetupTeardownChained$1.evaluate(TestRuleSetupTeardownChained.java:50)
[junit4:junit4]   1> org.apache.lucene.util.TestRuleFieldCacheSanity$1.evaluate(TestRuleFieldCacheSanity.java:51)
[junit4:junit4]   1> org.apache.lucene.util.AbstractBeforeAfterRule$1.evaluate(AbstractBeforeAfterRule.java:45)
[junit4:junit4]   1> com.carrotsearch.randomizedtesting.rules.SystemPropertiesInvariantRule$1.evaluate(SystemPropertiesInvariantRule.java:55)
[junit4:junit4]   1> org.apache.lucene.util.TestRuleThreadAndTestName$1.evaluate(TestRuleThreadAndTestName.java:48)
[junit4:junit4]   1> org.apache.lucene.util.TestRuleIgnoreAfterMaxFailures$1.evaluate(TestRuleIgnoreAfterMaxFailures.java:70)
[junit4:junit4]   1> org.apache.lucene.util.TestRuleMarkFailure$1.evaluate(TestRuleMarkFailure.java:48)
[junit4:junit4]   1> com.carrotsearch.randomizedtesting.rules.StatementAdapter.evaluate(StatementAdapter.java:36)
[junit4:junit4]   1> com.carrotsearch.randomizedtesting.ThreadLeakControl$StatementRunner.run(ThreadLeakControl.java:358)
[junit4:junit4]   1> com.carrotsearch.randomizedtesting.ThreadLeakControl.forkTimeoutingTask(ThreadLeakControl.java:782)
[junit4:junit4]   1> com.carrotsearch.randomizedtesting.ThreadLeakControl$3.evaluate(ThreadLeakControl.java:442)
[junit4:junit4]   1> com.carrotsearch.randomizedtesting.RandomizedRunner.runSingleTest(RandomizedRunner.java:746)
[junit4:junit4]   1> com.carrotsearch.randomizedtesting.RandomizedRunner$3.evaluate(RandomizedRunner.java:648)
[junit4:junit4]   1> com.carrotsearch.randomizedtesting.RandomizedRunner$4.evaluate(RandomizedRunner.java:682)
[junit4:junit4]   1> com.carrotsearch.randomizedtesting.RandomizedRunner$5.evaluate(RandomizedRunner.java:693)
[junit4:junit4]   1> com.carrotsearch.randomizedtesting.rules.StatementAdapter.evaluate(StatementAdapter.java:36)
[junit4:junit4]   1> com.carrotsearch.randomizedtesting.rules.SystemPropertiesRestoreRule$1.evaluate(SystemPropertiesRestoreRule.java:53)
[junit4:junit4]   1> org.apache.lucene.util.AbstractBeforeAfterRule$1.evaluate(AbstractBeforeAfterRule.java:45)
[junit4:junit4]   1> org.apache.lucene.util.TestRuleStoreClassName$1.evaluate(TestRuleStoreClassName.java:42)
[junit4:junit4]   1> com.carrotsearch.randomizedtesting.rules.SystemPropertiesInvariantRule$1.evaluate(SystemPropertiesInvariantRule.java:55)
[junit4:junit4]   1> com.carrotsearch.randomizedtesting.rules.NoShadowingOrOverridesOnMethodsRule$1.evaluate(NoShadowingOrOverridesOnMethodsRule.java:39)
[junit4:junit4]   1> com.carrotsearch.randomizedtesting.rules.NoShadowingOrOverridesOnMethodsRule$1.evaluate(NoShadowingOrOverridesOnMethodsRule.java:39)
[junit4:junit4]   1> com.carrotsearch.randomizedtesting.rules.StatementAdapter.evaluate(StatementAdapter.java:36)
[junit4:junit4]   1> org.apache.lucene.util.TestRuleAssertionsRequired$1.evaluate(TestRuleAssertionsRequired.java:43)
[junit4:junit4]   1> org.apache.lucene.util.TestRuleMarkFailure$1.evaluate(TestRuleMarkFailure.java:48)
[junit4:junit4]   1> org.apache.lucene.util.TestRuleIgnoreAfterMaxFailures$1.evaluate(TestRuleIgnoreAfterMaxFailures.java:70)
[junit4:junit4]   1> org.apache.lucene.util.TestRuleIgnoreTestSuites$1.evaluate(TestRuleIgnoreTestSuites.java:55)
[junit4:junit4]   1> com.carrotsearch.randomizedtesting.rules.StatementAdapter.evaluate(StatementAdapter.java:36)
[junit4:junit4]   1> com.carrotsearch.randomizedtesting.ThreadLeakControl$StatementRunner.run(ThreadLeakControl.java:358)
[junit4:junit4]   1> java.lang.Thread.run(Thread.java:662)
[junit4:junit4]   1> 
[junit4:junit4]   1> Thread[qtp21747359-817,5,TGRP-SyncSliceTest]
[junit4:junit4]   1> sun.misc.Unsafe.park(Native Method)
[junit4:junit4]   1> java.util.concurrent.locks.LockSupport.parkNanos(LockSupport.java:196)
[junit4:junit4]   1> java.util.concurrent.locks.AbstractQueuedSynchronizer$ConditionObject.awaitNanos(AbstractQueuedSynchronizer.java:2025)
[junit4:junit4]   1> org.eclipse.jetty.util.BlockingArrayQueue.poll(BlockingArrayQueue.java:337)
[junit4:junit4]   1> org.eclipse.jetty.util.thread.QueuedThreadPool.idleJobPoll(QueuedThreadPool.java:517)
[junit4:junit4]   1> org.eclipse.jetty.util.thread.QueuedThreadPool.access$600(QueuedThreadPool.java:39)
[junit4:junit4]   1> org.eclipse.jetty.util.thread.QueuedThreadPool$3.run(QueuedThreadPool.java:563)
[junit4:junit4]   1> java.lang.Thread.run(Thread.java:662)
[junit4:junit4]   1> 
[junit4:junit4]   1> Thread[HashSessionScavenger-25,5,TGRP-SyncSliceTest]
[junit4:junit4]   1> java.lang.Object.wait(Native Method)
[junit4:junit4]   1> java.util.TimerThread.mainLoop(Timer.java:509)
[junit4:junit4]   1> java.util.TimerThread.run(Timer.java:462)
[junit4:junit4]   1> 
[junit4:junit4]   1> Thread[qtp7573114-802,5,TGRP-SyncSliceTest]
[junit4:junit4]   1> sun.misc.Unsafe.park(Native Method)
[junit4:junit4]   1> java.util.concurrent.locks.LockSupport.parkNanos(LockSupport.java:196)
[junit4:junit4]   1> java.util.concurrent.locks.AbstractQueuedSynchronizer$ConditionObject.awaitNanos(AbstractQueuedSynchronizer.java:2025)
[junit4:junit4]   1> org.eclipse.jetty.util.BlockingArrayQueue.poll(BlockingArrayQueue.java:337)
[junit4:junit4]   1> org.eclipse.jetty.util.thread.QueuedThreadPool.idleJobPoll(QueuedThreadPool.java:517)
[junit4:junit4]   1> org.eclipse.jetty.util.thread.QueuedThreadPool.access$600(QueuedThreadPool.java:39)
[junit4:junit4]   1> org.eclipse.jetty.util.thread.QueuedThreadPool$3.run(QueuedThreadPool.java:563)
[junit4:junit4]   1> java.lang.Thread.run(Thread.java:662)
[junit4:junit4]   1> 
[junit4:junit4]   1> Thread[qtp7573114-800 Acceptor0 SelectChannelConnector@0.0.0.0:52026,5,TGRP-SyncSliceTest]
[junit4:junit4]   1> sun.nio.ch.ServerSocketChannelImpl.accept0(Native Method)
[junit4:junit4]   1> sun.nio.ch.ServerSocketChannelImpl.accept(ServerSocketChannelImpl.java:150)
[junit4:junit4]   1> org.eclipse.jetty.server.nio.SelectChannelConnector.accept(SelectChannelConnector.java:104)
[junit4:junit4]   1> org.eclipse.jetty.server.AbstractConnector$Acceptor.run(AbstractConnector.java:933)
[junit4:junit4]   1> org.eclipse.jetty.util.thread.QueuedThreadPool.runJob(QueuedThreadPool.java:599)
[junit4:junit4]   1> org.eclipse.jetty.util.thread.QueuedThreadPool$3.run(QueuedThreadPool.java:534)
[junit4:junit4]   1> java.lang.Thread.run(Thread.java:662)
[junit4:junit4]   1> 
[junit4:junit4]   1> Thread[qtp24575812-838 Acceptor0 SelectChannelConnector@0.0.0.0:52044,5,TGRP-SyncSliceTest]
[junit4:junit4]   1> sun.nio.ch.ServerSocketChannelImpl.accept0(Native Method)
[junit4:junit4]   1> sun.nio.ch.ServerSocketChannelImpl.accept(ServerSocketChannelImpl.java:150)
[junit4:junit4]   1> org.eclipse.jetty.server.nio.SelectChannelConnector.accept(SelectChannelConnector.java:104)
[junit4:junit4]   1> org.eclipse.jetty.server.AbstractConnector$Acceptor.run(AbstractConnector.java:933)
[junit4:junit4]   1> org.eclipse.jetty.util.thread.QueuedThreadPool.runJob(QueuedThreadPool.java:599)
[junit4:junit4]   1> org.eclipse.jetty.util.thread.QueuedThreadPool$3.run(QueuedThreadPool.java:534)
[junit4:junit4]   1> java.lang.Thread.run(Thread.java:662)
[junit4:junit4]   1> 
[junit4:junit4]   1> Thread[TEST-SyncSliceTest.testDistribSearch-seed#[654008ECAB1AD0A]-SendThread(127.0.0.1:52019),5,TGRP-SyncSliceTest]
[junit4:junit4]   1> sun.nio.ch.WindowsSelectorImpl$SubSelector.poll0(Native Method)
[junit4:junit4]   1> sun.nio.ch.WindowsSelectorImpl$SubSelector.poll(WindowsSelectorImpl.java:273)
[junit4:junit4]   1> sun.nio.ch.WindowsSelectorImpl$SubSelector.access$400(WindowsSelectorImpl.java:255)
[junit4:junit4]   1> sun.nio.ch.WindowsSelectorImpl.doSelect(WindowsSelectorImpl.java:136)
[junit4:junit4]   1> sun.nio.ch.SelectorImpl.lockAndDoSelect(SelectorImpl.java:69)
[junit4:junit4]   1> sun.nio.ch.SelectorImpl.select(SelectorImpl.java:80)
[junit4:junit4]   1> org.apache.zookeeper.ClientCnxn$SendThread.run(ClientCnxn.java:1131)
[junit4:junit4]   1> 
[junit4:junit4]   1> Thread[TEST-SyncSliceTest.testDistribSearch-seed#[654008ECAB1AD0A]-EventThread,5

[...truncated too long message...]

     "node_name":"127.0.0.1:52044_solr",
[junit4:junit4]   1>                 "base_url":"http://127.0.0.1:52044/solr"},
[junit4:junit4]   1>               "127.0.0.1:52052_solr_collection1":{
[junit4:junit4]   1>                 "shard":"shard1",
[junit4:junit4]   1>                 "roles":null,
[junit4:junit4]   1>                 "state":"active",
[junit4:junit4]   1>                 "core":"collection1",
[junit4:junit4]   1>                 "collection":"collection1",
[junit4:junit4]   1>                 "node_name":"127.0.0.1:52052_solr",
[junit4:junit4]   1>                 "base_url":"http://127.0.0.1:52052/solr"}}}},
[junit4:junit4]   1>         "control_collection":{"control_shard":{"replicas":{"127.0.0.1:52026_solr_collection1":{
[junit4:junit4]   1>                 "shard":"control_shard",
[junit4:junit4]   1>                 "roles":null,
[junit4:junit4]   1>                 "state":"active",
[junit4:junit4]   1>                 "core":"collection1",
[junit4:junit4]   1>                 "collection":"control_collection",
[junit4:junit4]   1>                 "node_name":"127.0.0.1:52026_solr",
[junit4:junit4]   1>                 "base_url":"http://127.0.0.1:52026/solr",
[junit4:junit4]   1>                 "leader":"true"}}}}}
[junit4:junit4]   1>  /zookeeper (1)
[junit4:junit4]   1>  DATA:
[junit4:junit4]   1>      
[junit4:junit4]   1> 
[junit4:junit4]   2> NOTE: reproduce with: ant test  -Dtestcase=SyncSliceTest -Dtests.method=testDistribSearch -Dtests.seed=654008ECAB1AD0A -Dtests.slow=true -Dtests.locale=no -Dtests.timezone=America/Santa_Isabel -Dtests.file.encoding=ISO-8859-1
[junit4:junit4] FAILURE 96.4s | SyncSliceTest.testDistribSearch <<<
[junit4:junit4]    > Throwable #1: java.lang.AssertionError: There are still nodes recoverying - waited for 15 seconds
[junit4:junit4]    > 	at __randomizedtesting.SeedInfo.seed([654008ECAB1AD0A:87B28E96BDEECD36]:0)
[junit4:junit4]    > 	at org.junit.Assert.fail(Assert.java:93)
[junit4:junit4]    > 	at org.apache.solr.cloud.AbstractDistribZkTestBase.waitForRecoveriesToFinish(AbstractDistribZkTestBase.java:165)
[junit4:junit4]    > 	at org.apache.solr.cloud.AbstractFullDistribZkTestBase.waitForRecoveriesToFinish(AbstractFullDistribZkTestBase.java:558)
[junit4:junit4]    > 	at org.apache.solr.cloud.AbstractFullDistribZkTestBase.waitForThingsToLevelOut(AbstractFullDistribZkTestBase.java:1133)
[junit4:junit4]    > 	at org.apache.solr.cloud.SyncSliceTest.doTest(SyncSliceTest.java:89)
[junit4:junit4]    > 	at org.apache.solr.BaseDistributedSearchTestCase.testDistribSearch(BaseDistributedSearchTestCase.java:695)
[junit4:junit4]    > 	at sun.reflect.NativeMethodAccessorImpl.invoke0(Native Method)
[junit4:junit4]    > 	at sun.reflect.NativeMethodAccessorImpl.invoke(NativeMethodAccessorImpl.java:39)
[junit4:junit4]    > 	at sun.reflect.DelegatingMethodAccessorImpl.invoke(DelegatingMethodAccessorImpl.java:25)
[junit4:junit4]    > 	at java.lang.reflect.Method.invoke(Method.java:597)
[junit4:junit4]    > 	at com.carrotsearch.randomizedtesting.RandomizedRunner.invoke(RandomizedRunner.java:1559)
[junit4:junit4]    > 	at com.carrotsearch.randomizedtesting.RandomizedRunner.access$600(RandomizedRunner.java:79)
[junit4:junit4]    > 	at com.carrotsearch.randomizedtesting.RandomizedRunner$6.evaluate(RandomizedRunner.java:737)
[junit4:junit4]    > 	at com.carrotsearch.randomizedtesting.RandomizedRunner$7.evaluate(RandomizedRunner.java:773)
[junit4:junit4]    > 	at com.carrotsearch.randomizedtesting.RandomizedRunner$8.evaluate(RandomizedRunner.java:787)
[junit4:junit4]    > 	at com.carrotsearch.randomizedtesting.rules.SystemPropertiesRestoreRule$1.evaluate(SystemPropertiesRestoreRule.java:53)
[junit4:junit4]    > 	at org.apache.lucene.util.TestRuleSetupTeardownChained$1.evaluate(TestRuleSetupTeardownChained.java:50)
[junit4:junit4]    > 	at org.apache.lucene.util.TestRuleFieldCacheSanity$1.evaluate(TestRuleFieldCacheSanity.java:51)
[junit4:junit4]    > 	at org.apache.lucene.util.AbstractBeforeAfterRule$1.evaluate(AbstractBeforeAfterRule.java:45)
[junit4:junit4]    > 	at com.carrotsearch.randomizedtesting.rules.SystemPropertiesInvariantRule$1.evaluate(SystemPropertiesInvariantRule.java:55)
[junit4:junit4]    > 	at org.apache.lucene.util.TestRuleThreadAndTestName$1.evaluate(TestRuleThreadAndTestName.java:48)
[junit4:junit4]    > 	at org.apache.lucene.util.TestRuleIgnoreAfterMaxFailures$1.evaluate(TestRuleIgnoreAfterMaxFailures.java:70)
[junit4:junit4]    > 	at org.apache.lucene.util.TestRuleMarkFailure$1.evaluate(TestRuleMarkFailure.java:48)
[junit4:junit4]    > 	at com.carrotsearch.randomizedtesting.rules.StatementAdapter.evaluate(StatementAdapter.java:36)
[junit4:junit4]    > 	at com.carrotsearch.randomizedtesting.ThreadLeakControl$StatementRunner.run(ThreadLeakControl.java:358)
[junit4:junit4]    > 	at com.carrotsearch.randomizedtesting.ThreadLeakControl.forkTimeoutingTask(ThreadLeakControl.java:782)
[junit4:junit4]    > 	at com.carrotsearch.randomizedtesting.ThreadLeakControl$3.evaluate(ThreadLeakControl.java:442)
[junit4:junit4]    > 	at com.carrotsearch.randomizedtesting.RandomizedRunner.runSingleTest(RandomizedRunner.java:746)
[junit4:junit4]    > 	at com.carrotsearch.randomizedtesting.RandomizedRunner$3.evaluate(RandomizedRunner.java:648)
[junit4:junit4]    > 	at com.carrotsearch.randomizedtesting.RandomizedRunner$4.evaluate(RandomizedRunner.java:682)
[junit4:junit4]    > 	at com.carrotsearch.randomizedtesting.RandomizedRunner$5.evaluate(RandomizedRunner.java:693)
[junit4:junit4]    > 	at com.carrotsearch.randomizedtesting.rules.StatementAdapter.evaluate(StatementAdapter.java:36)
[junit4:junit4]    > 	at com.carrotsearch.randomizedtesting.rules.SystemPropertiesRestoreRule$1.evaluate(SystemPropertiesRestoreRule.java:53)
[junit4:junit4]    > 	at org.apache.lucene.util.AbstractBeforeAfterRule$1.evaluate(AbstractBeforeAfterRule.java:45)
[junit4:junit4]    > 	at org.apache.lucene.util.TestRuleStoreClassName$1.evaluate(TestRuleStoreClassName.java:42)
[junit4:junit4]    > 	at com.carrotsearch.randomizedtesting.rules.SystemPropertiesInvariantRule$1.evaluate(SystemPropertiesInvariantRule.java:55)
[junit4:junit4]    > 	at com.carrotsearch.randomizedtesting.rules.NoShadowingOrOverridesOnMethodsRule$1.evaluate(NoShadowingOrOverridesOnMethodsRule.java:39)
[junit4:junit4]    > 	at com.carrotsearch.randomizedtesting.rules.NoShadowingOrOverridesOnMethodsRule$1.evaluate(NoShadowingOrOverridesOnMethodsRule.java:39)
[junit4:junit4]    > 	at com.carrotsearch.randomizedtesting.rules.StatementAdapter.evaluate(StatementAdapter.java:36)
[junit4:junit4]    > 	at org.apache.lucene.util.TestRuleAssertionsRequired$1.evaluate(TestRuleAssertionsRequired.java:43)
[junit4:junit4]    > 	at org.apache.lucene.util.TestRuleMarkFailure$1.evaluate(TestRuleMarkFailure.java:48)
[junit4:junit4]    > 	at org.apache.lucene.util.TestRuleIgnoreAfterMaxFailures$1.evaluate(TestRuleIgnoreAfterMaxFailures.java:70)
[junit4:junit4]    > 	at org.apache.lucene.util.TestRuleIgnoreTestSuites$1.evaluate(TestRuleIgnoreTestSuites.java:55)
[junit4:junit4]    > 	at com.carrotsearch.randomizedtesting.rules.StatementAdapter.evaluate(StatementAdapter.java:36)
[junit4:junit4]    > 	at com.carrotsearch.randomizedtesting.ThreadLeakControl$StatementRunner.run(ThreadLeakControl.java:358)
[junit4:junit4]    > 	at java.lang.Thread.run(Thread.java:662)
[junit4:junit4]   2> 96448 T788 oas.SolrTestCaseJ4.deleteCore ###deleteCore
[junit4:junit4]   2> NOTE: test params are: codec=Appending, sim=RandomSimilarityProvider(queryNorm=false,coord=no): {}, locale=no, timezone=America/Santa_Isabel
[junit4:junit4]   2> NOTE: Windows 7 6.1 x86/Sun Microsystems Inc. 1.6.0_35 (32-bit)/cpus=2,threads=1,free=51152272,total=167444480
[junit4:junit4]   2> NOTE: All tests run in this JVM: [OpenExchangeRatesOrgProviderTest, IndexBasedSpellCheckerTest, SoftAutoCommitTest, CurrencyFieldTest, XsltUpdateRequestHandlerTest, DisMaxRequestHandlerTest, TestCSVLoader, TestFoldingMultitermQuery, IndexSchemaRuntimeFieldTest, TestSolrCoreProperties, ConvertedLegacyTest, SimplePostToolTest, DistributedQueryElevationComponentTest, TestSystemIdResolver, TestLuceneMatchVersion, SuggesterTSTTest, TestSurroundQueryParser, FieldAnalysisRequestHandlerTest, BasicFunctionalityTest, JSONWriterTest, TestCSVResponseWriter, WordBreakSolrSpellCheckerTest, OutputWriterTest, TestFaceting, SpatialFilterTest, LeaderElectionTest, FullSolrCloudDistribCmdsTest, TestLMDirichletSimilarityFactory, BadIndexSchemaTest, LeaderElectionIntegrationTest, TestSolrQueryParser, EchoParamsTest, RecoveryZkTest, ZkCLITest, BasicZkTest, TermVectorComponentDistributedTest, SortByFunctionTest, TestConfig, ScriptEngineTest, SyncSliceTest]
[junit4:junit4] Completed in 96.47s, 1 test, 1 failure <<< FAILURES!

[...truncated 582 lines...]
BUILD FAILED
C:\Users\JenkinsSlave\workspace\Lucene-Solr-4.x-Windows\build.xml:335: The following error occurred while executing this line:
C:\Users\JenkinsSlave\workspace\Lucene-Solr-4.x-Windows\build.xml:39: The following error occurred while executing this line:
C:\Users\JenkinsSlave\workspace\Lucene-Solr-4.x-Windows\solr\build.xml:178: The following error occurred while executing this line:
C:\Users\JenkinsSlave\workspace\Lucene-Solr-4.x-Windows\lucene\module-build.xml:61: The following error occurred while executing this line:
C:\Users\JenkinsSlave\workspace\Lucene-Solr-4.x-Windows\lucene\common-build.xml:1159: The following error occurred while executing this line:
C:\Users\JenkinsSlave\workspace\Lucene-Solr-4.x-Windows\lucene\common-build.xml:827: There were test failures: 233 suites, 965 tests, 1 failure, 12 ignored (7 assumptions)

Total time: 40 minutes 17 seconds
Build step 'Invoke Ant' marked build as failure
Archiving artifacts
Recording test results
Description set: Java: 32bit/jdk1.6.0_35 -server -XX:+UseParallelGC
Email was triggered for: Failure
Sending email for trigger: Failure



Mime
View raw message