lucene-dev mailing list archives

Site index · List index
Message view « Date » · « Thread »
Top « Date » · « Thread »
From Policeman Jenkins Server <jenk...@sd-datasolutions.de>
Subject [JENKINS] Lucene-Solr-trunk-Linux (32bit/jdk1.7.0_07) - Build # 2110 - Still Failing!
Date Wed, 31 Oct 2012 10:45:07 GMT
Build: http://jenkins.sd-datasolutions.de/job/Lucene-Solr-trunk-Linux/2110/
Java: 32bit/jdk1.7.0_07 -client -XX:+UseParallelGC

2 tests failed.
FAILED:  junit.framework.TestSuite.org.apache.solr.client.solrj.embedded.JettyWebappTest

Error Message:
2 threads leaked from SUITE scope at org.apache.solr.client.solrj.embedded.JettyWebappTest:
    1) Thread[id=15, name=metrics-meter-tick-thread-1, state=TIMED_WAITING, group=TGRP-JettyWebappTest]
        at sun.misc.Unsafe.park(Native Method)         at java.util.concurrent.locks.LockSupport.parkNanos(LockSupport.java:226)
        at java.util.concurrent.locks.AbstractQueuedSynchronizer$ConditionObject.awaitNanos(AbstractQueuedSynchronizer.java:2082)
        at java.util.concurrent.ScheduledThreadPoolExecutor$DelayedWorkQueue.take(ScheduledThreadPoolExecutor.java:1090)
        at java.util.concurrent.ScheduledThreadPoolExecutor$DelayedWorkQueue.take(ScheduledThreadPoolExecutor.java:807)
        at java.util.concurrent.ThreadPoolExecutor.getTask(ThreadPoolExecutor.java:1043) 
       at java.util.concurrent.ThreadPoolExecutor.runWorker(ThreadPoolExecutor.java:1103)
        at java.util.concurrent.ThreadPoolExecutor$Worker.run(ThreadPoolExecutor.java:603)
        at java.lang.Thread.run(Thread.java:722)    2) Thread[id=16, name=metrics-meter-tick-thread-2,
state=WAITING, group=TGRP-JettyWebappTest]         at sun.misc.Unsafe.park(Native Method)
        at java.util.concurrent.locks.LockSupport.park(LockSupport.java:186)         at java.util.concurrent.locks.AbstractQueuedSynchronizer$ConditionObject.await(AbstractQueuedSynchronizer.java:2043)
        at java.util.concurrent.ScheduledThreadPoolExecutor$DelayedWorkQueue.take(ScheduledThreadPoolExecutor.java:1085)
        at java.util.concurrent.ScheduledThreadPoolExecutor$DelayedWorkQueue.take(ScheduledThreadPoolExecutor.java:807)
        at java.util.concurrent.ThreadPoolExecutor.getTask(ThreadPoolExecutor.java:1043) 
       at java.util.concurrent.ThreadPoolExecutor.runWorker(ThreadPoolExecutor.java:1103)
        at java.util.concurrent.ThreadPoolExecutor$Worker.run(ThreadPoolExecutor.java:603)
        at java.lang.Thread.run(Thread.java:722)

Stack Trace:
com.carrotsearch.randomizedtesting.ThreadLeakError: 2 threads leaked from SUITE scope at org.apache.solr.client.solrj.embedded.JettyWebappTest:

   1) Thread[id=15, name=metrics-meter-tick-thread-1, state=TIMED_WAITING, group=TGRP-JettyWebappTest]
        at sun.misc.Unsafe.park(Native Method)
        at java.util.concurrent.locks.LockSupport.parkNanos(LockSupport.java:226)
        at java.util.concurrent.locks.AbstractQueuedSynchronizer$ConditionObject.awaitNanos(AbstractQueuedSynchronizer.java:2082)
        at java.util.concurrent.ScheduledThreadPoolExecutor$DelayedWorkQueue.take(ScheduledThreadPoolExecutor.java:1090)
        at java.util.concurrent.ScheduledThreadPoolExecutor$DelayedWorkQueue.take(ScheduledThreadPoolExecutor.java:807)
        at java.util.concurrent.ThreadPoolExecutor.getTask(ThreadPoolExecutor.java:1043)
        at java.util.concurrent.ThreadPoolExecutor.runWorker(ThreadPoolExecutor.java:1103)
        at java.util.concurrent.ThreadPoolExecutor$Worker.run(ThreadPoolExecutor.java:603)
        at java.lang.Thread.run(Thread.java:722)
   2) Thread[id=16, name=metrics-meter-tick-thread-2, state=WAITING, group=TGRP-JettyWebappTest]
        at sun.misc.Unsafe.park(Native Method)
        at java.util.concurrent.locks.LockSupport.park(LockSupport.java:186)
        at java.util.concurrent.locks.AbstractQueuedSynchronizer$ConditionObject.await(AbstractQueuedSynchronizer.java:2043)
        at java.util.concurrent.ScheduledThreadPoolExecutor$DelayedWorkQueue.take(ScheduledThreadPoolExecutor.java:1085)
        at java.util.concurrent.ScheduledThreadPoolExecutor$DelayedWorkQueue.take(ScheduledThreadPoolExecutor.java:807)
        at java.util.concurrent.ThreadPoolExecutor.getTask(ThreadPoolExecutor.java:1043)
        at java.util.concurrent.ThreadPoolExecutor.runWorker(ThreadPoolExecutor.java:1103)
        at java.util.concurrent.ThreadPoolExecutor$Worker.run(ThreadPoolExecutor.java:603)
        at java.lang.Thread.run(Thread.java:722)
	at __randomizedtesting.SeedInfo.seed([9CFB5181C8DD256]:0)


FAILED:  junit.framework.TestSuite.org.apache.solr.client.solrj.embedded.JettyWebappTest

Error Message:
There are still zombie threads that couldn't be terminated:    1) Thread[id=15, name=metrics-meter-tick-thread-1,
state=WAITING, group=TGRP-JettyWebappTest]         at sun.misc.Unsafe.park(Native Method)
        at java.util.concurrent.locks.LockSupport.park(LockSupport.java:186)         at java.util.concurrent.locks.AbstractQueuedSynchronizer$ConditionObject.await(AbstractQueuedSynchronizer.java:2043)
        at java.util.concurrent.ScheduledThreadPoolExecutor$DelayedWorkQueue.take(ScheduledThreadPoolExecutor.java:1085)
        at java.util.concurrent.ScheduledThreadPoolExecutor$DelayedWorkQueue.take(ScheduledThreadPoolExecutor.java:807)
        at java.util.concurrent.ThreadPoolExecutor.getTask(ThreadPoolExecutor.java:1043) 
       at java.util.concurrent.ThreadPoolExecutor.runWorker(ThreadPoolExecutor.java:1103)
        at java.util.concurrent.ThreadPoolExecutor$Worker.run(ThreadPoolExecutor.java:603)
        at java.lang.Thread.run(Thread.java:722)    2) Thread[id=16, name=metrics-meter-tick-thread-2,
state=TIMED_WAITING, group=TGRP-JettyWebappTest]         at sun.misc.Unsafe.park(Native Method)
        at java.util.concurrent.locks.LockSupport.parkNanos(LockSupport.java:226)        
at java.util.concurrent.locks.AbstractQueuedSynchronizer$ConditionObject.awaitNanos(AbstractQueuedSynchronizer.java:2082)
        at java.util.concurrent.ScheduledThreadPoolExecutor$DelayedWorkQueue.take(ScheduledThreadPoolExecutor.java:1090)
        at java.util.concurrent.ScheduledThreadPoolExecutor$DelayedWorkQueue.take(ScheduledThreadPoolExecutor.java:807)
        at java.util.concurrent.ThreadPoolExecutor.getTask(ThreadPoolExecutor.java:1043) 
       at java.util.concurrent.ThreadPoolExecutor.runWorker(ThreadPoolExecutor.java:1103)
        at java.util.concurrent.ThreadPoolExecutor$Worker.run(ThreadPoolExecutor.java:603)
        at java.lang.Thread.run(Thread.java:722)

Stack Trace:
com.carrotsearch.randomizedtesting.ThreadLeakError: There are still zombie threads that couldn't
be terminated:
   1) Thread[id=15, name=metrics-meter-tick-thread-1, state=WAITING, group=TGRP-JettyWebappTest]
        at sun.misc.Unsafe.park(Native Method)
        at java.util.concurrent.locks.LockSupport.park(LockSupport.java:186)
        at java.util.concurrent.locks.AbstractQueuedSynchronizer$ConditionObject.await(AbstractQueuedSynchronizer.java:2043)
        at java.util.concurrent.ScheduledThreadPoolExecutor$DelayedWorkQueue.take(ScheduledThreadPoolExecutor.java:1085)
        at java.util.concurrent.ScheduledThreadPoolExecutor$DelayedWorkQueue.take(ScheduledThreadPoolExecutor.java:807)
        at java.util.concurrent.ThreadPoolExecutor.getTask(ThreadPoolExecutor.java:1043)
        at java.util.concurrent.ThreadPoolExecutor.runWorker(ThreadPoolExecutor.java:1103)
        at java.util.concurrent.ThreadPoolExecutor$Worker.run(ThreadPoolExecutor.java:603)
        at java.lang.Thread.run(Thread.java:722)
   2) Thread[id=16, name=metrics-meter-tick-thread-2, state=TIMED_WAITING, group=TGRP-JettyWebappTest]
        at sun.misc.Unsafe.park(Native Method)
        at java.util.concurrent.locks.LockSupport.parkNanos(LockSupport.java:226)
        at java.util.concurrent.locks.AbstractQueuedSynchronizer$ConditionObject.awaitNanos(AbstractQueuedSynchronizer.java:2082)
        at java.util.concurrent.ScheduledThreadPoolExecutor$DelayedWorkQueue.take(ScheduledThreadPoolExecutor.java:1090)
        at java.util.concurrent.ScheduledThreadPoolExecutor$DelayedWorkQueue.take(ScheduledThreadPoolExecutor.java:807)
        at java.util.concurrent.ThreadPoolExecutor.getTask(ThreadPoolExecutor.java:1043)
        at java.util.concurrent.ThreadPoolExecutor.runWorker(ThreadPoolExecutor.java:1103)
        at java.util.concurrent.ThreadPoolExecutor$Worker.run(ThreadPoolExecutor.java:603)
        at java.lang.Thread.run(Thread.java:722)
	at __randomizedtesting.SeedInfo.seed([9CFB5181C8DD256]:0)




Build Log:
[...truncated 9407 lines...]
[junit4:junit4] Suite: org.apache.solr.client.solrj.embedded.JettyWebappTest
[junit4:junit4]   2> -7 T11 oejs.Server.doStart jetty-8.1.2.v20120308
[junit4:junit4]   2> 227 T11 oejw.StandardDescriptorProcessor.visitServlet NO JSP Support
for /test, did not find org.apache.jasper.servlet.JspServlet
[junit4:junit4]   2> 272 T11 oejsh.ContextHandler.callContextInitialized started o.e.j.w.WebAppContext{/test,file:/mnt/ssd/jenkins/workspace/Lucene-Solr-trunk-Linux/solr/webapp/web/},/mnt/ssd/jenkins/workspace/Lucene-Solr-trunk-Linux/solr/webapp/web
[junit4:junit4]   2> 273 T11 oejsh.ContextHandler.callContextInitialized started o.e.j.w.WebAppContext{/test,file:/mnt/ssd/jenkins/workspace/Lucene-Solr-trunk-Linux/solr/webapp/web/},/mnt/ssd/jenkins/workspace/Lucene-Solr-trunk-Linux/solr/webapp/web
[junit4:junit4]   2> 319 T11 oasc.SolrResourceLoader.locateSolrHome JNDI not configured
for solr (NoInitialContextEx)
[junit4:junit4]   2> 320 T11 oasc.SolrResourceLoader.locateSolrHome using system property
solr.solr.home: /mnt/ssd/jenkins/workspace/Lucene-Solr-trunk-Linux/solr/example/solr
[junit4:junit4]   2> 320 T11 oasc.SolrResourceLoader.<init> new SolrResourceLoader
for deduced Solr Home: '/mnt/ssd/jenkins/workspace/Lucene-Solr-trunk-Linux/solr/example/solr/'
[junit4:junit4]   2> 479 T11 oass.SolrDispatchFilter.init SolrDispatchFilter.init()
[junit4:junit4]   2> 480 T11 oasc.SolrResourceLoader.locateSolrHome JNDI not configured
for solr (NoInitialContextEx)
[junit4:junit4]   2> 481 T11 oasc.SolrResourceLoader.locateSolrHome using system property
solr.solr.home: /mnt/ssd/jenkins/workspace/Lucene-Solr-trunk-Linux/solr/example/solr
[junit4:junit4]   2> 491 T11 oasc.CoreContainer$Initializer.initialize looking for solr.xml:
/mnt/ssd/jenkins/workspace/Lucene-Solr-trunk-Linux/solr/example/solr/solr.xml
[junit4:junit4]   2> 493 T11 oasc.CoreContainer.<init> New CoreContainer 7902566
[junit4:junit4]   2> 494 T11 oasc.CoreContainer.load Loading CoreContainer using Solr Home:
'/mnt/ssd/jenkins/workspace/Lucene-Solr-trunk-Linux/solr/example/solr/'
[junit4:junit4]   2> 494 T11 oasc.SolrResourceLoader.<init> new SolrResourceLoader
for directory: '/mnt/ssd/jenkins/workspace/Lucene-Solr-trunk-Linux/solr/example/solr/'
[junit4:junit4]   2> 534 T11 oasc.CoreContainer.load Registering Log Listener
[junit4:junit4]   2> 618 T11 oasc.CoreContainer.create Creating SolrCore 'collection1'
using instanceDir: /mnt/ssd/jenkins/workspace/Lucene-Solr-trunk-Linux/solr/example/solr/collection1
[junit4:junit4]   2> 619 T11 oasc.SolrResourceLoader.<init> new SolrResourceLoader
for directory: '/mnt/ssd/jenkins/workspace/Lucene-Solr-trunk-Linux/solr/example/solr/collection1/'
[junit4:junit4]   2> 668 T11 oasc.SolrConfig.initLibs Adding specified lib dirs to ClassLoader
[junit4:junit4]   2> 714 T11 oasc.SolrConfig.<init> Using Lucene MatchVersion: LUCENE_50
[junit4:junit4]   2> 838 T11 oasc.SolrConfig.<init> Loaded SolrConfig: solrconfig.xml
[junit4:junit4]   2> 848 T11 oass.IndexSchema.readSchema Reading Solr Schema
[junit4:junit4]   2> 874 T11 oass.IndexSchema.readSchema Schema name=example
[junit4:junit4]   2> 1741 T11 oass.IndexSchema.readSchema unique key field: id
[junit4:junit4]   2> 1843 T11 oass.FileExchangeRateProvider.reload Reloading exchange rates
from file currency.xml
[junit4:junit4]   2> 1850 T11 oass.FileExchangeRateProvider.reload Reloading exchange rates
from file currency.xml
[junit4:junit4]   2> 1955 T11 oasc.SolrCore.<init> [collection1] Opening new SolrCore
at /mnt/ssd/jenkins/workspace/Lucene-Solr-trunk-Linux/solr/example/solr/collection1/, dataDir=/mnt/ssd/jenkins/workspace/Lucene-Solr-trunk-Linux/solr/build/solr-solrj/test/J1/org.apache.solr.client.solrj.embedded.JettyWebappTest-1351680255366/
[junit4:junit4]   2> 1957 T11 oasc.JmxMonitoredMap.<init> JMX monitoring is enabled.
Adding Solr mbeans to JMX Server: com.sun.jmx.mbeanserver.JmxMBeanServer@373b5c
[junit4:junit4]   2> 1967 T11 oasc.SolrCore.initListeners [collection1] Added SolrEventListener
for newSearcher: org.apache.solr.core.QuerySenderListener{queries=[]}
[junit4:junit4]   2> 1968 T11 oasc.SolrCore.initListeners [collection1] Added SolrEventListener
for firstSearcher: org.apache.solr.core.QuerySenderListener{queries=[{q=static firstSearcher
warming in solrconfig.xml}]}
[junit4:junit4]   2> 1971 T11 oasc.SolrCore.initDirectoryFactory org.apache.solr.core.MockDirectoryFactory
[junit4:junit4]   2> 1997 T11 oasc.CachingDirectoryFactory.injectLockFactory WARNING No
lockType configured for MockDirWrapper(NRTCachingDirectory(org.apache.lucene.store.RAMDirectory@e9ac75
lockFactory=org.apache.lucene.store.SingleInstanceLockFactory@139473b; maxCacheMB=0.640625
maxMergeSizeMB=0.68359375)) assuming 'simple'
[junit4:junit4]   2> 1998 T11 oasc.CachingDirectoryFactory.get return new directory for
/mnt/ssd/jenkins/workspace/Lucene-Solr-trunk-Linux/solr/build/solr-solrj/test/J1/org.apache.solr.client.solrj.embedded.JettyWebappTest-1351680255366
forceNew:false
[junit4:junit4]   2> 1999 T11 oasc.CachingDirectoryFactory.close Releasing directory:/mnt/ssd/jenkins/workspace/Lucene-Solr-trunk-Linux/solr/build/solr-solrj/test/J1/org.apache.solr.client.solrj.embedded.JettyWebappTest-1351680255366
[junit4:junit4]   2> 1999 T11 oasc.SolrCore.getNewIndexDir New index directory detected:
old=null new=/mnt/ssd/jenkins/workspace/Lucene-Solr-trunk-Linux/solr/build/solr-solrj/test/J1/org.apache.solr.client.solrj.embedded.JettyWebappTest-1351680255366/index/
[junit4:junit4]   2> 2000 T11 oasc.SolrCore.initIndex WARNING [collection1] Solr index
directory '/mnt/ssd/jenkins/workspace/Lucene-Solr-trunk-Linux/solr/build/solr-solrj/test/J1/org.apache.solr.client.solrj.embedded.JettyWebappTest-1351680255366/index'
doesn't exist. Creating new index...
[junit4:junit4]   2> 2009 T11 oasc.CachingDirectoryFactory.get return new directory for
/mnt/ssd/jenkins/workspace/Lucene-Solr-trunk-Linux/solr/build/solr-solrj/test/J1/org.apache.solr.client.solrj.embedded.JettyWebappTest-1351680255366/index
forceNew:false
[junit4:junit4]   2> 2092 T11 oasc.SolrDeletionPolicy.onCommit SolrDeletionPolicy.onCommit:
commits:num=1
[junit4:junit4]   2> 		commit{dir=MockDirWrapper(org.apache.lucene.store.RAMDirectory@16a9883
lockFactory=org.apache.lucene.store.NativeFSLockFactory@56bfad),segFN=segments_1,generation=1,filenames=[segments_1]
[junit4:junit4]   2> 2092 T11 oasc.SolrDeletionPolicy.updateCommits newest commit = 1[segments_1]
[junit4:junit4]   2> 2093 T11 oasc.CachingDirectoryFactory.close Releasing directory:/mnt/ssd/jenkins/workspace/Lucene-Solr-trunk-Linux/solr/build/solr-solrj/test/J1/org.apache.solr.client.solrj.embedded.JettyWebappTest-1351680255366/index
[junit4:junit4]   2> 2099 T11 oasc.SolrCore.initWriters created json: solr.JSONResponseWriter
[junit4:junit4]   2> 2100 T11 oasc.SolrCore.initWriters adding lazy queryResponseWriter:
solr.VelocityResponseWriter
[junit4:junit4]   2> 2101 T11 oasc.SolrCore.initWriters created velocity: solr.VelocityResponseWriter
[junit4:junit4]   2> 2108 T11 oasc.SolrCore.initWriters created xslt: solr.XSLTResponseWriter
[junit4:junit4]   2> 2109 T11 oasr.XSLTResponseWriter.init xsltCacheLifetimeSeconds=5
[junit4:junit4]   2> 2366 T11 oasc.RequestHandlers.initHandlersFromConfig created /select:
solr.SearchHandler
[junit4:junit4]   2> 2368 T11 oasc.RequestHandlers.initHandlersFromConfig created /query:
solr.SearchHandler
[junit4:junit4]   2> 2374 T11 oasc.RequestHandlers.initHandlersFromConfig created /get:
solr.RealTimeGetHandler
[junit4:junit4]   2> 2376 T11 oasc.RequestHandlers.initHandlersFromConfig created /browse:
solr.SearchHandler
[junit4:junit4]   2> 2385 T11 oasc.RequestHandlers.initHandlersFromConfig created /update:
solr.UpdateRequestHandler
[junit4:junit4]   2> 2391 T11 oasc.RequestHandlers.initHandlersFromConfig created /update/json:
solr.JsonUpdateRequestHandler
[junit4:junit4]   2> 2396 T11 oasc.RequestHandlers.initHandlersFromConfig created /update/csv:
solr.CSVRequestHandler
[junit4:junit4]   2> 2397 T11 oasc.RequestHandlers.initHandlersFromConfig adding lazy requestHandler:
solr.extraction.ExtractingRequestHandler
[junit4:junit4]   2> 2398 T11 oasc.RequestHandlers.initHandlersFromConfig created /update/extract:
solr.extraction.ExtractingRequestHandler
[junit4:junit4]   2> 2399 T11 oasc.RequestHandlers.initHandlersFromConfig adding lazy requestHandler:
solr.FieldAnalysisRequestHandler
[junit4:junit4]   2> 2399 T11 oasc.RequestHandlers.initHandlersFromConfig created /analysis/field:
solr.FieldAnalysisRequestHandler
[junit4:junit4]   2> 2400 T11 oasc.RequestHandlers.initHandlersFromConfig adding lazy requestHandler:
solr.DocumentAnalysisRequestHandler
[junit4:junit4]   2> 2400 T11 oasc.RequestHandlers.initHandlersFromConfig created /analysis/document:
solr.DocumentAnalysisRequestHandler
[junit4:junit4]   2> 2405 T11 oasc.RequestHandlers.initHandlersFromConfig created /admin/:
solr.admin.AdminHandlers
[junit4:junit4]   2> 2411 T11 oasc.RequestHandlers.initHandlersFromConfig created /admin/ping:
solr.PingRequestHandler
[junit4:junit4]   2> 2417 T11 oasc.RequestHandlers.initHandlersFromConfig created /debug/dump:
solr.DumpRequestHandler
[junit4:junit4]   2> 2435 T11 oasc.RequestHandlers.initHandlersFromConfig created /replication:
solr.ReplicationHandler
[junit4:junit4]   2> 2436 T11 oasc.RequestHandlers.initHandlersFromConfig adding lazy requestHandler:
solr.SearchHandler
[junit4:junit4]   2> 2436 T11 oasc.RequestHandlers.initHandlersFromConfig created /spell:
solr.SearchHandler
[junit4:junit4]   2> 2437 T11 oasc.RequestHandlers.initHandlersFromConfig adding lazy requestHandler:
solr.SearchHandler
[junit4:junit4]   2> 2438 T11 oasc.RequestHandlers.initHandlersFromConfig created /tvrh:
solr.SearchHandler
[junit4:junit4]   2> 2438 T11 oasc.RequestHandlers.initHandlersFromConfig adding lazy requestHandler:
solr.SearchHandler
[junit4:junit4]   2> 2439 T11 oasc.RequestHandlers.initHandlersFromConfig created /terms:
solr.SearchHandler
[junit4:junit4]   2> 2439 T11 oasc.RequestHandlers.initHandlersFromConfig adding lazy requestHandler:
solr.SearchHandler
[junit4:junit4]   2> 2440 T11 oasc.RequestHandlers.initHandlersFromConfig created /elevate:
solr.SearchHandler
[junit4:junit4]   2> 2470 T11 oashl.XMLLoader.init xsltCacheLifetimeSeconds=60
[junit4:junit4]   2> 2476 T11 oashl.XMLLoader.init xsltCacheLifetimeSeconds=60
[junit4:junit4]   2> 2478 T11 oashl.XMLLoader.init xsltCacheLifetimeSeconds=60
[junit4:junit4]   2> 2483 T11 oasc.CachingDirectoryFactory.close Releasing directory:/mnt/ssd/jenkins/workspace/Lucene-Solr-trunk-Linux/solr/build/solr-solrj/test/J1/org.apache.solr.client.solrj.embedded.JettyWebappTest-1351680255366
[junit4:junit4]   2> 2495 T11 oass.SolrIndexSearcher.<init> Opening Searcher@1cb817b
main
[junit4:junit4]   2> 2525 T11 oasu.CommitTracker.<init> Hard AutoCommit: if uncommited
for 15000ms; 
[junit4:junit4]   2> 2525 T11 oasu.CommitTracker.<init> Soft AutoCommit: disabled
[junit4:junit4]   2> 2526 T11 oashc.SpellCheckComponent.inform Initializing spell checkers
[junit4:junit4]   2> 2544 T11 oass.DirectSolrSpellChecker.init init: {name=default,field=name,classname=solr.DirectSolrSpellChecker,distanceMeasure=internal,accuracy=0.5,maxEdits=2,minPrefix=1,maxInspections=5,minQueryLength=4,maxQueryFrequency=0.01}
[junit4:junit4]   2> 2560 T11 oashc.SpellCheckComponent.inform No queryConverter defined,
using default converter
[junit4:junit4]   2> 2564 T11 oashc.QueryElevationComponent.inform Loading QueryElevation
from: /mnt/ssd/jenkins/workspace/Lucene-Solr-trunk-Linux/solr/example/solr/collection1/conf/elevate.xml
[junit4:junit4]   2> 2617 T11 oashc.HttpShardHandlerFactory.getParameter Setting socketTimeout
to: 0
[junit4:junit4]   2> 2617 T11 oashc.HttpShardHandlerFactory.getParameter Setting urlScheme
to: http://
[junit4:junit4]   2> 2618 T11 oashc.HttpShardHandlerFactory.getParameter Setting connTimeout
to: 0
[junit4:junit4]   2> 2618 T11 oashc.HttpShardHandlerFactory.getParameter Setting maxConnectionsPerHost
to: 20
[junit4:junit4]   2> 2619 T11 oashc.HttpShardHandlerFactory.getParameter Setting corePoolSize
to: 0
[junit4:junit4]   2> 2619 T11 oashc.HttpShardHandlerFactory.getParameter Setting maximumPoolSize
to: 2147483647
[junit4:junit4]   2> 2620 T11 oashc.HttpShardHandlerFactory.getParameter Setting maxThreadIdleTime
to: 5
[junit4:junit4]   2> 2620 T11 oashc.HttpShardHandlerFactory.getParameter Setting sizeOfQueue
to: -1
[junit4:junit4]   2> 2621 T11 oashc.HttpShardHandlerFactory.getParameter Setting fairnessPolicy
to: false
[junit4:junit4]   2> 2629 T11 oascsi.HttpClientUtil.createClient Creating new http client,
config:maxConnectionsPerHost=20&maxConnections=10000&socketTimeout=0&connTimeout=0&retry=false
[junit4:junit4]   2> 2829 T11 oash.ReplicationHandler.inform Commits will be reserved for
 10000
[junit4:junit4]   2> 2830 T17 oasc.QuerySenderListener.newSearcher QuerySenderListener
sending requests to Searcher@1cb817b main{StandardDirectoryReader(segments_1:1)}
[junit4:junit4]   2> 2837 T11 oasc.CachingDirectoryFactory.close Releasing directory:/mnt/ssd/jenkins/workspace/Lucene-Solr-trunk-Linux/solr/build/solr-solrj/test/J1/org.apache.solr.client.solrj.embedded.JettyWebappTest-1351680255366/index
[junit4:junit4]   2> ASYNC  NEW_CORE C0 name=collection1 org.apache.solr.core.SolrCore@979401
[junit4:junit4]   2> 2925 T17 C0 REQ [collection1] webapp=null path=null params={event=firstSearcher&q=static+firstSearcher+warming+in+solrconfig.xml&distrib=false}
hits=0 status=0 QTime=91 
[junit4:junit4]   2> 2927 T17 oasc.QuerySenderListener.newSearcher QuerySenderListener
done.
[junit4:junit4]   2> 2927 T17 oashc.SpellCheckComponent$SpellCheckerListener.newSearcher
Loading spell index for spellchecker: default
[junit4:junit4]   2> 2927 T17 oashc.SpellCheckComponent$SpellCheckerListener.newSearcher
Loading spell index for spellchecker: wordbreak
[junit4:junit4]   2> 2929 T17 oasc.SolrCore.registerSearcher [collection1] Registered new
searcher Searcher@1cb817b main{StandardDirectoryReader(segments_1:1)}
[junit4:junit4]   2> 2933 T11 oasc.CoreContainer.registerCore registering core: collection1
[junit4:junit4]   2> 2933 T11 oass.SolrDispatchFilter.init user.dir=/mnt/ssd/jenkins/workspace/Lucene-Solr-trunk-Linux/solr/build/solr-solrj/test/J1
[junit4:junit4]   2> 2933 T11 oass.SolrDispatchFilter.init SolrDispatchFilter.init() done
[junit4:junit4]   2> 2973 T11 oejs.AbstractConnector.doStart Started SocketConnector@0.0.0.0:36087
[junit4:junit4]   2> 3294 T11 oasc.CoreContainer.shutdown Shutting down CoreContainer instance=7902566
[junit4:junit4]   2> 3294 T11 oasc.SolrCore.close [collection1]  CLOSING SolrCore org.apache.solr.core.SolrCore@979401
[junit4:junit4]   2> 3305 T11 oasc.CachingDirectoryFactory.close Releasing directory:/mnt/ssd/jenkins/workspace/Lucene-Solr-trunk-Linux/solr/build/solr-solrj/test/J1/org.apache.solr.client.solrj.embedded.JettyWebappTest-1351680255366/index
[junit4:junit4]   2> 3306 T11 oasc.CachingDirectoryFactory.close Releasing directory:/mnt/ssd/jenkins/workspace/Lucene-Solr-trunk-Linux/solr/build/solr-solrj/test/J1/org.apache.solr.client.solrj.embedded.JettyWebappTest-1351680255366/index
[junit4:junit4]   2> 3312 T11 oasc.CachingDirectoryFactory.close Releasing directory:/mnt/ssd/jenkins/workspace/Lucene-Solr-trunk-Linux/solr/build/solr-solrj/test/J1/org.apache.solr.client.solrj.embedded.JettyWebappTest-1351680255366/index
[junit4:junit4]   2> 3313 T11 oasc.CachingDirectoryFactory.close Releasing directory:/mnt/ssd/jenkins/workspace/Lucene-Solr-trunk-Linux/solr/build/solr-solrj/test/J1/org.apache.solr.client.solrj.embedded.JettyWebappTest-1351680255366/index
[junit4:junit4]   2> 3319 T11 oasu.DirectUpdateHandler2.close closing DirectUpdateHandler2{commits=0,autocommit
maxTime=15000ms,autocommits=0,soft autocommits=0,optimizes=0,rollbacks=0,expungeDeletes=0,docsPending=0,adds=0,deletesById=0,deletesByQuery=0,errors=0,cumulative_adds=0,cumulative_deletesById=0,cumulative_deletesByQuery=0,cumulative_errors=0}
[junit4:junit4]   2> 3320 T11 oasc.SolrCore.decrefSolrCoreState Closing SolrCoreState
[junit4:junit4]   2> 3320 T11 oasu.DefaultSolrCoreState.closeIndexWriter SolrCoreState
ref count has reached 0 - closing IndexWriter
[junit4:junit4]   2> 3321 T11 oasu.DefaultSolrCoreState.closeIndexWriter closing IndexWriter
with IndexWriterCloser
[junit4:junit4]   2> 3322 T11 oasc.SolrCore.closeSearcher [collection1] Closing main searcher
on request.
[junit4:junit4]   2> 3322 T11 oasc.CachingDirectoryFactory.close Releasing directory:/mnt/ssd/jenkins/workspace/Lucene-Solr-trunk-Linux/solr/build/solr-solrj/test/J1/org.apache.solr.client.solrj.embedded.JettyWebappTest-1351680255366/index
[junit4:junit4]   2> 3328 T11 oejsh.ContextHandler.doStop stopped o.e.j.w.WebAppContext{/test,file:/mnt/ssd/jenkins/workspace/Lucene-Solr-trunk-Linux/solr/webapp/web/},/mnt/ssd/jenkins/workspace/Lucene-Solr-trunk-Linux/solr/webapp/web
[junit4:junit4]   2> 3392 T10 ccr.ThreadLeakControl.checkThreadLeaks WARNING Will linger
awaiting termination of 2 leaked thread(s).
[junit4:junit4]   2> 23457 T10 ccr.ThreadLeakControl.checkThreadLeaks SEVERE 2 threads
leaked from SUITE scope at org.apache.solr.client.solrj.embedded.JettyWebappTest: 
[junit4:junit4]   2> 	   1) Thread[id=15, name=metrics-meter-tick-thread-1, state=TIMED_WAITING,
group=TGRP-JettyWebappTest]
[junit4:junit4]   2> 	        at sun.misc.Unsafe.park(Native Method)
[junit4:junit4]   2> 	        at java.util.concurrent.locks.LockSupport.parkNanos(LockSupport.java:226)
[junit4:junit4]   2> 	        at java.util.concurrent.locks.AbstractQueuedSynchronizer$ConditionObject.awaitNanos(AbstractQueuedSynchronizer.java:2082)
[junit4:junit4]   2> 	        at java.util.concurrent.ScheduledThreadPoolExecutor$DelayedWorkQueue.take(ScheduledThreadPoolExecutor.java:1090)
[junit4:junit4]   2> 	        at java.util.concurrent.ScheduledThreadPoolExecutor$DelayedWorkQueue.take(ScheduledThreadPoolExecutor.java:807)
[junit4:junit4]   2> 	        at java.util.concurrent.ThreadPoolExecutor.getTask(ThreadPoolExecutor.java:1043)
[junit4:junit4]   2> 	        at java.util.concurrent.ThreadPoolExecutor.runWorker(ThreadPoolExecutor.java:1103)
[junit4:junit4]   2> 	        at java.util.concurrent.ThreadPoolExecutor$Worker.run(ThreadPoolExecutor.java:603)
[junit4:junit4]   2> 	        at java.lang.Thread.run(Thread.java:722)
[junit4:junit4]   2> 	   2) Thread[id=16, name=metrics-meter-tick-thread-2, state=WAITING,
group=TGRP-JettyWebappTest]
[junit4:junit4]   2> 	        at sun.misc.Unsafe.park(Native Method)
[junit4:junit4]   2> 	        at java.util.concurrent.locks.LockSupport.park(LockSupport.java:186)
[junit4:junit4]   2> 	        at java.util.concurrent.locks.AbstractQueuedSynchronizer$ConditionObject.await(AbstractQueuedSynchronizer.java:2043)
[junit4:junit4]   2> 	        at java.util.concurrent.ScheduledThreadPoolExecutor$DelayedWorkQueue.take(ScheduledThreadPoolExecutor.java:1085)
[junit4:junit4]   2> 	        at java.util.concurrent.ScheduledThreadPoolExecutor$DelayedWorkQueue.take(ScheduledThreadPoolExecutor.java:807)
[junit4:junit4]   2> 	        at java.util.concurrent.ThreadPoolExecutor.getTask(ThreadPoolExecutor.java:1043)
[junit4:junit4]   2> 	        at java.util.concurrent.ThreadPoolExecutor.runWorker(ThreadPoolExecutor.java:1103)
[junit4:junit4]   2> 	        at java.util.concurrent.ThreadPoolExecutor$Worker.run(ThreadPoolExecutor.java:603)
[junit4:junit4]   2> 	        at java.lang.Thread.run(Thread.java:722)
[junit4:junit4]   2> 23459 T10 ccr.ThreadLeakControl.tryToInterruptAll Starting to interrupt
leaked threads:
[junit4:junit4]   2> 	   1) Thread[id=15, name=metrics-meter-tick-thread-1, state=TIMED_WAITING,
group=TGRP-JettyWebappTest]
[junit4:junit4]   2> 	   2) Thread[id=16, name=metrics-meter-tick-thread-2, state=WAITING,
group=TGRP-JettyWebappTest]
[junit4:junit4]   2> 26467 T10 ccr.ThreadLeakControl.tryToInterruptAll SEVERE There are
still zombie threads that couldn't be terminated:
[junit4:junit4]   2> 	   1) Thread[id=15, name=metrics-meter-tick-thread-1, state=WAITING,
group=TGRP-JettyWebappTest]
[junit4:junit4]   2> 	        at sun.misc.Unsafe.park(Native Method)
[junit4:junit4]   2> 	        at java.util.concurrent.locks.LockSupport.park(LockSupport.java:186)
[junit4:junit4]   2> 	        at java.util.concurrent.locks.AbstractQueuedSynchronizer$ConditionObject.await(AbstractQueuedSynchronizer.java:2043)
[junit4:junit4]   2> 	        at java.util.concurrent.ScheduledThreadPoolExecutor$DelayedWorkQueue.take(ScheduledThreadPoolExecutor.java:1085)
[junit4:junit4]   2> 	        at java.util.concurrent.ScheduledThreadPoolExecutor$DelayedWorkQueue.take(ScheduledThreadPoolExecutor.java:807)
[junit4:junit4]   2> 	        at java.util.concurrent.ThreadPoolExecutor.getTask(ThreadPoolExecutor.java:1043)
[junit4:junit4]   2> 	        at java.util.concurrent.ThreadPoolExecutor.runWorker(ThreadPoolExecutor.java:1103)
[junit4:junit4]   2> 	        at java.util.concurrent.ThreadPoolExecutor$Worker.run(ThreadPoolExecutor.java:603)
[junit4:junit4]   2> 	        at java.lang.Thread.run(Thread.java:722)
[junit4:junit4]   2> 	   2) Thread[id=16, name=metrics-meter-tick-thread-2, state=TIMED_WAITING,
group=TGRP-JettyWebappTest]
[junit4:junit4]   2> 	        at sun.misc.Unsafe.park(Native Method)
[junit4:junit4]   2> 	        at java.util.concurrent.locks.LockSupport.parkNanos(LockSupport.java:226)
[junit4:junit4]   2> 	        at java.util.concurrent.locks.AbstractQueuedSynchronizer$ConditionObject.awaitNanos(AbstractQueuedSynchronizer.java:2082)
[junit4:junit4]   2> 	        at java.util.concurrent.ScheduledThreadPoolExecutor$DelayedWorkQueue.take(ScheduledThreadPoolExecutor.java:1090)
[junit4:junit4]   2> 	        at java.util.concurrent.ScheduledThreadPoolExecutor$DelayedWorkQueue.take(ScheduledThreadPoolExecutor.java:807)
[junit4:junit4]   2> 	        at java.util.concurrent.ThreadPoolExecutor.getTask(ThreadPoolExecutor.java:1043)
[junit4:junit4]   2> 	        at java.util.concurrent.ThreadPoolExecutor.runWorker(ThreadPoolExecutor.java:1103)
[junit4:junit4]   2> 	        at java.util.concurrent.ThreadPoolExecutor$Worker.run(ThreadPoolExecutor.java:603)
[junit4:junit4]   2> 	        at java.lang.Thread.run(Thread.java:722)
[junit4:junit4]   2> NOTE: test params are: codec=Asserting, sim=RandomSimilarityProvider(queryNorm=false,coord=yes):
{}, locale=ar_AE, timezone=America/Nassau
[junit4:junit4]   2> NOTE: Linux 3.2.0-32-generic i386/Oracle Corporation 1.7.0_07 (32-bit)/cpus=8,threads=3,free=99097480,total=150142976
[junit4:junit4]   2> NOTE: All tests run in this JVM: [IteratorChainTest, JettyWebappTest]
[junit4:junit4]   2> NOTE: reproduce with: ant test  -Dtestcase=JettyWebappTest -Dtests.seed=9CFB5181C8DD256
-Dtests.multiplier=3 -Dtests.slow=true -Dtests.locale=ar_AE -Dtests.timezone=America/Nassau
-Dtests.file.encoding=ISO-8859-1
[junit4:junit4] ERROR   0.00s J1 | JettyWebappTest (suite) <<<
[junit4:junit4]    > Throwable #1: com.carrotsearch.randomizedtesting.ThreadLeakError:
2 threads leaked from SUITE scope at org.apache.solr.client.solrj.embedded.JettyWebappTest:

[junit4:junit4]    >    1) Thread[id=15, name=metrics-meter-tick-thread-1, state=TIMED_WAITING,
group=TGRP-JettyWebappTest]
[junit4:junit4]    >         at sun.misc.Unsafe.park(Native Method)
[junit4:junit4]    >         at java.util.concurrent.locks.LockSupport.parkNanos(LockSupport.java:226)
[junit4:junit4]    >         at java.util.concurrent.locks.AbstractQueuedSynchronizer$ConditionObject.awaitNanos(AbstractQueuedSynchronizer.java:2082)
[junit4:junit4]    >         at java.util.concurrent.ScheduledThreadPoolExecutor$DelayedWorkQueue.take(ScheduledThreadPoolExecutor.java:1090)
[junit4:junit4]    >         at java.util.concurrent.ScheduledThreadPoolExecutor$DelayedWorkQueue.take(ScheduledThreadPoolExecutor.java:807)
[junit4:junit4]    >         at java.util.concurrent.ThreadPoolExecutor.getTask(ThreadPoolExecutor.java:1043)
[junit4:junit4]    >         at java.util.concurrent.ThreadPoolExecutor.runWorker(ThreadPoolExecutor.java:1103)
[junit4:junit4]    >         at java.util.concurrent.ThreadPoolExecutor$Worker.run(ThreadPoolExecutor.java:603)
[junit4:junit4]    >         at java.lang.Thread.run(Thread.java:722)
[junit4:junit4]    >    2) Thread[id=16, name=metrics-meter-tick-thread-2, state=WAITING,
group=TGRP-JettyWebappTest]
[junit4:junit4]    >         at sun.misc.Unsafe.park(Native Method)
[junit4:junit4]    >         at java.util.concurrent.locks.LockSupport.park(LockSupport.java:186)
[junit4:junit4]    >         at java.util.concurrent.locks.AbstractQueuedSynchronizer$ConditionObject.await(AbstractQueuedSynchronizer.java:2043)
[junit4:junit4]    >         at java.util.concurrent.ScheduledThreadPoolExecutor$DelayedWorkQueue.take(ScheduledThreadPoolExecutor.java:1085)
[junit4:junit4]    >         at java.util.concurrent.ScheduledThreadPoolExecutor$DelayedWorkQueue.take(ScheduledThreadPoolExecutor.java:807)
[junit4:junit4]    >         at java.util.concurrent.ThreadPoolExecutor.getTask(ThreadPoolExecutor.java:1043)
[junit4:junit4]    >         at java.util.concurrent.ThreadPoolExecutor.runWorker(ThreadPoolExecutor.java:1103)
[junit4:junit4]    >         at java.util.concurrent.ThreadPoolExecutor$Worker.run(ThreadPoolExecutor.java:603)
[junit4:junit4]    >         at java.lang.Thread.run(Thread.java:722)
[junit4:junit4]    > 	at __randomizedtesting.SeedInfo.seed([9CFB5181C8DD256]:0)
[junit4:junit4]    > Throwable #2: com.carrotsearch.randomizedtesting.ThreadLeakError:
There are still zombie threads that couldn't be terminated:
[junit4:junit4]    >    1) Thread[id=15, name=metrics-meter-tick-thread-1, state=WAITING,
group=TGRP-JettyWebappTest]
[junit4:junit4]    >         at sun.misc.Unsafe.park(Native Method)
[junit4:junit4]    >         at java.util.concurrent.locks.LockSupport.park(LockSupport.java:186)
[junit4:junit4]    >         at java.util.concurrent.locks.AbstractQueuedSynchronizer$ConditionObject.await(AbstractQueuedSynchronizer.java:2043)
[junit4:junit4]    >         at java.util.concurrent.ScheduledThreadPoolExecutor$DelayedWorkQueue.take(ScheduledThreadPoolExecutor.java:1085)
[junit4:junit4]    >         at java.util.concurrent.ScheduledThreadPoolExecutor$DelayedWorkQueue.take(ScheduledThreadPoolExecutor.java:807)
[junit4:junit4]    >         at java.util.concurrent.ThreadPoolExecutor.getTask(ThreadPoolExecutor.java:1043)
[junit4:junit4]    >         at java.util.concurrent.ThreadPoolExecutor.runWorker(ThreadPoolExecutor.java:1103)
[junit4:junit4]    >         at java.util.concurrent.ThreadPoolExecutor$Worker.run(ThreadPoolExecutor.java:603)
[junit4:junit4]    >         at java.lang.Thread.run(Thread.java:722)
[junit4:junit4]    >    2) Thread[id=16, name=metrics-meter-tick-thread-2, state=TIMED_WAITING,
group=TGRP-JettyWebappTest]
[junit4:junit4]    >         at sun.misc.Unsafe.park(Native Method)
[junit4:junit4]    >         at java.util.concurrent.locks.LockSupport.parkNanos(LockSupport.java:226)
[junit4:junit4]    >         at java.util.concurrent.locks.AbstractQueuedSynchronizer$ConditionObject.awaitNanos(AbstractQueuedSynchronizer.java:2082)
[junit4:junit4]    >         at java.util.concurrent.ScheduledThreadPoolExecutor$DelayedWorkQueue.take(ScheduledThreadPoolExecutor.java:1090)
[junit4:junit4]    >         at java.util.concurrent.ScheduledThreadPoolExecutor$DelayedWorkQueue.take(ScheduledThreadPoolExecutor.java:807)
[junit4:junit4]    >         at java.util.concurrent.ThreadPoolExecutor.getTask(ThreadPoolExecutor.java:1043)
[junit4:junit4]    >         at java.util.concurrent.ThreadPoolExecutor.runWorker(ThreadPoolExecutor.java:1103)
[junit4:junit4]    >         at java.util.concurrent.ThreadPoolExecutor$Worker.run(ThreadPoolExecutor.java:603)
[junit4:junit4]    >         at java.lang.Thread.run(Thread.java:722)
[junit4:junit4]    > 	at __randomizedtesting.SeedInfo.seed([9CFB5181C8DD256]:0)
[junit4:junit4] Completed on J1 in 26.65s, 1 test, 2 errors <<< FAILURES!

[...truncated 100 lines...]
BUILD FAILED
/mnt/ssd/jenkins/workspace/Lucene-Solr-trunk-Linux/build.xml:335: The following error occurred
while executing this line:
/mnt/ssd/jenkins/workspace/Lucene-Solr-trunk-Linux/build.xml:39: The following error occurred
while executing this line:
/mnt/ssd/jenkins/workspace/Lucene-Solr-trunk-Linux/solr/build.xml:185: The following error
occurred while executing this line:
/mnt/ssd/jenkins/workspace/Lucene-Solr-trunk-Linux/lucene/module-build.xml:61: The following
error occurred while executing this line:
/mnt/ssd/jenkins/workspace/Lucene-Solr-trunk-Linux/lucene/common-build.xml:1163: The following
error occurred while executing this line:
/mnt/ssd/jenkins/workspace/Lucene-Solr-trunk-Linux/lucene/common-build.xml:827: There were
test failures: 43 suites, 239 tests, 2 suite-level errors, 173 ignored

Total time: 51 minutes 33 seconds
Build step 'Invoke Ant' marked build as failure
Archiving artifacts
Recording test results
Description set: Java: 32bit/jdk1.7.0_07 -client -XX:+UseParallelGC
Email was triggered for: Failure
Sending email for trigger: Failure



Mime
View raw message