lucene-dev mailing list archives

Site index · List index
Message view « Date » · « Thread »
Top « Date » · « Thread »
From Charlie Cron <hudsonsevilt...@gmail.com>
Subject Build failed in Jenkins: slow-io-beasting #5116
Date Tue, 30 Oct 2012 08:17:33 GMT
See <http://sierranevada.servebeer.com:8080/job/slow-io-beasting/5116/>

------------------------------------------
[...truncated 15375 lines...]
[junit4:junit4]   2> 7220661 T72 oasc.CoreContainer.shutdown Shutting down CoreContainer
instance=6217468
[junit4:junit4]   2> 7220661 T138 oaz.ClientCnxn$SendThread.startConnect WARNING Unexpected
exception java.lang.InterruptedException: sleep interrupted
[junit4:junit4]   2> 	at java.lang.Thread.sleep(Native Method)
[junit4:junit4]   2> 	at org.apache.zookeeper.ClientCnxn$SendThread.startConnect(ClientCnxn.java:1038)
[junit4:junit4]   2> 	at org.apache.zookeeper.ClientCnxn$SendThread.run(ClientCnxn.java:1101)
[junit4:junit4]   2> 
[junit4:junit4]   2> 7220661 T132 oaz.ClientCnxn$SendThread.startConnect WARNING Unexpected
exception java.lang.InterruptedException: sleep interrupted
[junit4:junit4]   2> 	at java.lang.Thread.sleep(Native Method)
[junit4:junit4]   2> 	at org.apache.zookeeper.ClientCnxn$SendThread.startConnect(ClientCnxn.java:1038)
[junit4:junit4]   2> 	at org.apache.zookeeper.ClientCnxn$SendThread.run(ClientCnxn.java:1101)
[junit4:junit4]   2> 
[junit4:junit4]   2> 7220661 T135 oaz.ClientCnxn$SendThread.startConnect WARNING Unexpected
exception java.lang.InterruptedException: sleep interrupted
[junit4:junit4]   2> 	at java.lang.Thread.sleep(Native Method)
[junit4:junit4]   2> 	at org.apache.zookeeper.ClientCnxn$SendThread.startConnect(ClientCnxn.java:1038)
[junit4:junit4]   2> 	at org.apache.zookeeper.ClientCnxn$SendThread.run(ClientCnxn.java:1101)
[junit4:junit4]   2> 
[junit4:junit4]   2> 7220661 T72 oasc.SolrCore.close [collection1]  CLOSING SolrCore org.apache.solr.core.SolrCore@f92ae2
[junit4:junit4]   2> 7220663 T72 oasu.DirectUpdateHandler2.close closing DirectUpdateHandler2{commits=0,autocommits=0,soft
autocommits=0,optimizes=0,rollbacks=0,expungeDeletes=0,docsPending=0,adds=0,deletesById=0,deletesByQuery=0,errors=0,cumulative_adds=0,cumulative_deletesById=0,cumulative_deletesByQuery=0,cumulative_errors=0}
[junit4:junit4]   2> 7220663 T72 oasc.SolrCore.decrefSolrCoreState Closing SolrCoreState
[junit4:junit4]   2> 7220663 T72 oasu.DefaultSolrCoreState.closeIndexWriter SolrCoreState
ref count has reached 0 - closing IndexWriter
[junit4:junit4]   2> 7220663 T72 oasu.DefaultSolrCoreState.closeIndexWriter closing IndexWriter
with IndexWriterCloser
[junit4:junit4]   2> 7220664 T72 oasc.SolrCore.closeSearcher [collection1] Closing main
searcher on request.
[junit4:junit4]   2> 7221171 T129 oaz.ClientCnxn$SendThread.startConnect WARNING Unexpected
exception java.lang.InterruptedException: sleep interrupted
[junit4:junit4]   2> 	at java.lang.Thread.sleep(Native Method)
[junit4:junit4]   2> 	at org.apache.zookeeper.ClientCnxn$SendThread.startConnect(ClientCnxn.java:1045)
[junit4:junit4]   2> 	at org.apache.zookeeper.ClientCnxn$SendThread.run(ClientCnxn.java:1101)
[junit4:junit4]   2> 
[junit4:junit4]   2> 7221171 T135 oaz.ClientCnxn$SendThread.startConnect WARNING Unexpected
exception java.lang.InterruptedException: sleep interrupted
[junit4:junit4]   2> 	at java.lang.Thread.sleep(Native Method)
[junit4:junit4]   2> 	at org.apache.zookeeper.ClientCnxn$SendThread.startConnect(ClientCnxn.java:1045)
[junit4:junit4]   2> 	at org.apache.zookeeper.ClientCnxn$SendThread.run(ClientCnxn.java:1101)
[junit4:junit4]   2> 
[junit4:junit4]   2> 7221171 T138 oaz.ClientCnxn$SendThread.startConnect WARNING Unexpected
exception java.lang.InterruptedException: sleep interrupted
[junit4:junit4]   2> 	at java.lang.Thread.sleep(Native Method)
[junit4:junit4]   2> 	at org.apache.zookeeper.ClientCnxn$SendThread.startConnect(ClientCnxn.java:1045)
[junit4:junit4]   2> 	at org.apache.zookeeper.ClientCnxn$SendThread.run(ClientCnxn.java:1101)
[junit4:junit4]   2> 
[junit4:junit4]   2> 7221171 T121 oaz.ClientCnxn$SendThread.startConnect WARNING Unexpected
exception java.lang.InterruptedException: sleep interrupted
[junit4:junit4]   2> 	at java.lang.Thread.sleep(Native Method)
[junit4:junit4]   2> 	at org.apache.zookeeper.ClientCnxn$SendThread.startConnect(ClientCnxn.java:1045)
[junit4:junit4]   2> 	at org.apache.zookeeper.ClientCnxn$SendThread.run(ClientCnxn.java:1101)
[junit4:junit4]   2> 
[junit4:junit4]   2> 7221171 T138 oaz.ClientCnxn$SendThread.startConnect Opening socket
connection to server 127.0.0.1/127.0.0.1:60692
[junit4:junit4]   2> 7221171 T135 oaz.ClientCnxn$SendThread.startConnect Opening socket
connection to server 127.0.0.1/127.0.0.1:60692
[junit4:junit4]   2> 7221171 T132 oaz.ClientCnxn$SendThread.startConnect WARNING Unexpected
exception java.lang.InterruptedException: sleep interrupted
[junit4:junit4]   2> 	at java.lang.Thread.sleep(Native Method)
[junit4:junit4]   2> 	at org.apache.zookeeper.ClientCnxn$SendThread.startConnect(ClientCnxn.java:1045)
[junit4:junit4]   2> 	at org.apache.zookeeper.ClientCnxn$SendThread.run(ClientCnxn.java:1101)
[junit4:junit4]   2> 
[junit4:junit4]   2> 7221172 T129 oaz.ClientCnxn$SendThread.startConnect Opening socket
connection to server 127.0.0.1/127.0.0.1:60692
[junit4:junit4]   2> 7221171 T126 oaz.ClientCnxn$SendThread.startConnect WARNING Unexpected
exception java.lang.InterruptedException: sleep interrupted
[junit4:junit4]   2> 	at java.lang.Thread.sleep(Native Method)
[junit4:junit4]   2> 	at org.apache.zookeeper.ClientCnxn$SendThread.startConnect(ClientCnxn.java:1045)
[junit4:junit4]   2> 	at org.apache.zookeeper.ClientCnxn$SendThread.run(ClientCnxn.java:1101)
[junit4:junit4]   2> 
[junit4:junit4]   2> 7221172 T132 oaz.ClientCnxn$SendThread.startConnect Opening socket
connection to server 127.0.0.1/127.0.0.1:60692
[junit4:junit4]   2> 7221172 T126 oaz.ClientCnxn$SendThread.startConnect Opening socket
connection to server 127.0.0.1/127.0.0.1:60692
[junit4:junit4]   2> 7221172 T121 oaz.ClientCnxn$SendThread.startConnect Opening socket
connection to server 127.0.0.1/127.0.0.1:60692
[junit4:junit4]   2> 7221171 T72 oaz.ZooKeeper.close Session: 0x13ab05151da0004 closed
[junit4:junit4]   2> 7221173 T72 oasc.CoreContainer.shutdown Shutting down CoreContainer
instance=15631272
[junit4:junit4]   2> 7221173 T72 oasc.SolrCore.close [collection1]  CLOSING SolrCore org.apache.solr.core.SolrCore@1f519ae
[junit4:junit4]   2> 7221174 T72 oasu.DirectUpdateHandler2.close closing DirectUpdateHandler2{commits=0,autocommits=0,soft
autocommits=0,optimizes=0,rollbacks=0,expungeDeletes=0,docsPending=0,adds=0,deletesById=0,deletesByQuery=0,errors=0,cumulative_adds=0,cumulative_deletesById=0,cumulative_deletesByQuery=0,cumulative_errors=0}
[junit4:junit4]   2> 7221174 T72 oasc.SolrCore.decrefSolrCoreState Closing SolrCoreState
[junit4:junit4]   2> 7221174 T72 oasu.DefaultSolrCoreState.closeIndexWriter SolrCoreState
ref count has reached 0 - closing IndexWriter
[junit4:junit4]   2> 7221174 T72 oasu.DefaultSolrCoreState.closeIndexWriter closing IndexWriter
with IndexWriterCloser
[junit4:junit4]   2> 7221175 T72 oasc.SolrCore.closeSearcher [collection1] Closing main
searcher on request.
[junit4:junit4]   2> 7221662 T141 oaz.ClientCnxn$SendThread.startConnect Opening socket
connection to server 127.0.0.1/127.0.0.1:60692
[junit4:junit4]   2> 7221680 T72 oaz.ZooKeeper.close Session: 0x13ab05151da0005 closed
[junit4:junit4]   2> 7221680 T72 oasc.CoreContainer.shutdown Shutting down CoreContainer
instance=14815347
[junit4:junit4]   2> 7221680 T72 oasc.SolrCore.close [collection1]  CLOSING SolrCore org.apache.solr.core.SolrCore@1050e86
[junit4:junit4]   2> 7221681 T72 oasu.DirectUpdateHandler2.close closing DirectUpdateHandler2{commits=0,autocommits=0,soft
autocommits=0,optimizes=0,rollbacks=0,expungeDeletes=0,docsPending=0,adds=0,deletesById=0,deletesByQuery=0,errors=0,cumulative_adds=0,cumulative_deletesById=0,cumulative_deletesByQuery=0,cumulative_errors=0}
[junit4:junit4]   2> 7221681 T72 oasc.SolrCore.decrefSolrCoreState Closing SolrCoreState
[junit4:junit4]   2> 7221682 T72 oasu.DefaultSolrCoreState.closeIndexWriter SolrCoreState
ref count has reached 0 - closing IndexWriter
[junit4:junit4]   2> 7221682 T72 oasu.DefaultSolrCoreState.closeIndexWriter closing IndexWriter
with IndexWriterCloser
[junit4:junit4]   2> 7221684 T72 oasc.SolrCore.closeSearcher [collection1] Closing main
searcher on request.
[junit4:junit4]   2> 7222168 T72 oaz.ZooKeeper.close Session: 0x13ab05151da0002 closed
[junit4:junit4]   2> 7222168 T72 oasc.CoreContainer.shutdown Shutting down CoreContainer
instance=29556531
[junit4:junit4]   2> 7222169 T72 oasc.SolrCore.close [collection1]  CLOSING SolrCore org.apache.solr.core.SolrCore@dfbc0d
[junit4:junit4]   2> 7222171 T72 oasu.DirectUpdateHandler2.close closing DirectUpdateHandler2{commits=0,autocommits=0,soft
autocommits=0,optimizes=0,rollbacks=0,expungeDeletes=0,docsPending=0,adds=0,deletesById=0,deletesByQuery=0,errors=0,cumulative_adds=0,cumulative_deletesById=0,cumulative_deletesByQuery=0,cumulative_errors=0}
[junit4:junit4]   2> 7222171 T72 oasc.SolrCore.decrefSolrCoreState Closing SolrCoreState
[junit4:junit4]   2> 7222171 T72 oasu.DefaultSolrCoreState.closeIndexWriter SolrCoreState
ref count has reached 0 - closing IndexWriter
[junit4:junit4]   2> 7222172 T72 oasu.DefaultSolrCoreState.closeIndexWriter closing IndexWriter
with IndexWriterCloser
[junit4:junit4]   2> 7222172 T72 oasc.SolrCore.closeSearcher [collection1] Closing main
searcher on request.
[junit4:junit4]   2> 7222173 T72 oaz.ZooKeeper.close Session: 0x13ab05151da0003 closed
[junit4:junit4]   2> 7222173 T72 oasc.CoreContainer.shutdown Shutting down CoreContainer
instance=21815681
[junit4:junit4]   2> 7222173 T72 oasc.SolrCore.close [collection1]  CLOSING SolrCore org.apache.solr.core.SolrCore@73f761
[junit4:junit4]   2> 7222174 T72 oasu.DirectUpdateHandler2.close closing DirectUpdateHandler2{commits=0,autocommits=0,soft
autocommits=0,optimizes=0,rollbacks=0,expungeDeletes=0,docsPending=0,adds=0,deletesById=0,deletesByQuery=0,errors=0,cumulative_adds=0,cumulative_deletesById=0,cumulative_deletesByQuery=0,cumulative_errors=0}
[junit4:junit4]   2> 7222174 T72 oasc.SolrCore.decrefSolrCoreState Closing SolrCoreState
[junit4:junit4]   2> 7222174 T72 oasu.DefaultSolrCoreState.closeIndexWriter SolrCoreState
ref count has reached 0 - closing IndexWriter
[junit4:junit4]   2> 7222175 T72 oasu.DefaultSolrCoreState.closeIndexWriter closing IndexWriter
with IndexWriterCloser
[junit4:junit4]   2> 7222175 T135 oaz.ClientCnxn$SendThread.run WARNING Session 0x13ab05151da0006
for server null, unexpected error, closing socket connection and attempting reconnect java.nio.channels.ClosedByInterruptException
[junit4:junit4]   2> 	at java.nio.channels.spi.AbstractInterruptibleChannel.end(AbstractInterruptibleChannel.java:184)
[junit4:junit4]   2> 	at sun.nio.ch.SocketChannelImpl.finishConnect(SocketChannelImpl.java:603)
[junit4:junit4]   2> 	at org.apache.zookeeper.ClientCnxn$SendThread.run(ClientCnxn.java:1143)
[junit4:junit4]   2> 
[junit4:junit4]   2> 7222175 T72 oasc.SolrCore.closeSearcher [collection1] Closing main
searcher on request.
[junit4:junit4]   2> 7222182 T135 oaz.ClientCnxn$SendThread.startConnect WARNING Unexpected
exception java.lang.InterruptedException: sleep interrupted
[junit4:junit4]   2> 	at java.lang.Thread.sleep(Native Method)
[junit4:junit4]   2> 	at org.apache.zookeeper.ClientCnxn$SendThread.startConnect(ClientCnxn.java:1038)
[junit4:junit4]   2> 	at org.apache.zookeeper.ClientCnxn$SendThread.run(ClientCnxn.java:1101)
[junit4:junit4]   2> 
[junit4:junit4]   2> 7222182 T72 oaz.ZooKeeper.close Session: 0x13ab05151da0006 closed
[junit4:junit4]   2> 7222182 T72 oasc.CoreContainer.shutdown Shutting down CoreContainer
instance=24384208
[junit4:junit4]   2> 7222182 T72 oasc.SolrCore.close SEVERE Too many close [count:-1] on
org.apache.solr.core.SolrCore@152dd7b. Please report this exception to solr-user@lucene.apache.org
[junit4:junit4]   2> 7222185 T72 oaz.ZooKeeper.close Session: 0x13ab05151da0007 closed
[junit4:junit4]   2> 7222185 T115 oazs.SyncRequestProcessor.run SyncRequestProcessor exited!
[junit4:junit4]   2> 7222185 T72 oazs.FinalRequestProcessor.shutdown shutdown of request
processor complete
[junit4:junit4]   2> 7222654 T141 oaz.ClientCnxn$SendThread.run WARNING Session 0x0 for
server null, unexpected error, closing socket connection and attempting reconnect java.net.ConnectException:
Connection refused: no further information
[junit4:junit4]   2> 	at sun.nio.ch.SocketChannelImpl.checkConnect(Native Method)
[junit4:junit4]   2> 	at sun.nio.ch.SocketChannelImpl.finishConnect(SocketChannelImpl.java:567)
[junit4:junit4]   2> 	at org.apache.zookeeper.ClientCnxn$SendThread.run(ClientCnxn.java:1143)
[junit4:junit4]   2> 
[junit4:junit4]   2> 7222686 T135 oaz.ClientCnxn$SendThread.startConnect WARNING Unexpected
exception java.lang.InterruptedException: sleep interrupted
[junit4:junit4]   2> 	at java.lang.Thread.sleep(Native Method)
[junit4:junit4]   2> 	at org.apache.zookeeper.ClientCnxn$SendThread.startConnect(ClientCnxn.java:1045)
[junit4:junit4]   2> 	at org.apache.zookeeper.ClientCnxn$SendThread.run(ClientCnxn.java:1101)
[junit4:junit4]   2> 
[junit4:junit4]   2> 7224437 T135 oaz.ClientCnxn$SendThread.startConnect Opening socket
connection to server 127.0.0.1/127.0.0.1:60692
[junit4:junit4]   2> 7224437 T71 ccr.ThreadLeakControl.tryToInterruptAll SEVERE There are
still zombie threads that couldn't be terminated:
[junit4:junit4]   2> 	   1) Thread[id=135, name=TEST-LeaderElectionIntegrationTest.testLeaderElectionAfterClientTimeout-seed#[4046DFC00924F87E]-SendThread(127.0.0.1:60692),
state=RUNNABLE, group=TGRP-LeaderElectionIntegrationTest]
[junit4:junit4]   2> 	        at java.util.logging.StreamHandler.publish(StreamHandler.java:174)
[junit4:junit4]   2> 	        at java.util.logging.ConsoleHandler.publish(ConsoleHandler.java:88)
[junit4:junit4]   2> 	        at java.util.logging.Logger.log(Logger.java:481)
[junit4:junit4]   2> 	        at org.slf4j.impl.JDK14LoggerAdapter.log(JDK14LoggerAdapter.java:579)
[junit4:junit4]   2> 	        at org.slf4j.impl.JDK14LoggerAdapter.log(JDK14LoggerAdapter.java:651)
[junit4:junit4]   2> 	        at org.apache.log4j.Category.differentiatedLog(Category.java:186)
[junit4:junit4]   2> 	        at org.apache.log4j.Category.warn(Category.java:255)
[junit4:junit4]   2> 	        at org.apache.zookeeper.ClientCnxn$SendThread.startConnect(ClientCnxn.java:1047)
[junit4:junit4]   2> 	        at org.apache.zookeeper.ClientCnxn$SendThread.run(ClientCnxn.java:1101)
[junit4:junit4]   2> 	   2) Thread[id=72, name=TEST-LeaderElectionIntegrationTest.testLeaderElectionAfterClientTimeout-seed#[4046DFC00924F87E],
state=RUNNABLE, group=TGRP-LeaderElectionIntegrationTest]
[junit4:junit4]   2> 	        at java.util.AbstractList$ListItr.nextIndex(AbstractList.java:399)
[junit4:junit4]   2> 	        at java.util.SubList$1.nextIndex(AbstractList.java:713)
[junit4:junit4]   2> 	        at java.util.SubList$1.hasNext(AbstractList.java:691)
[junit4:junit4]   2> 	        at java.util.AbstractCollection.toArray(AbstractCollection.java:165)
[junit4:junit4]   2> 	        at java.util.regex.Pattern.split(Pattern.java:1027)
[junit4:junit4]   2> 	        at java.lang.String.split(String.java:2292)
[junit4:junit4]   2> 	        at sun.net.util.IPAddressUtil.textToNumericFormatV4(IPAddressUtil.java:29)
[junit4:junit4]   2> 	        at java.net.SocketPermission.init(SocketPermission.java:433)
[junit4:junit4]   2> 	        at java.net.SocketPermission.<init>(SocketPermission.java:266)
[junit4:junit4]   2> 	        at java.lang.SecurityManager.checkConnect(SecurityManager.java:1034)
[junit4:junit4]   2> 	        at java.net.Socket.connect(Socket.java:522)
[junit4:junit4]   2> 	        at java.net.Socket.connect(Socket.java:478)
[junit4:junit4]   2> 	        at java.net.Socket.<init>(Socket.java:375)
[junit4:junit4]   2> 	        at java.net.Socket.<init>(Socket.java:189)
[junit4:junit4]   2> 	        at org.apache.solr.cloud.ZkTestServer.send4LetterWord(ZkTestServer.java:296)
[junit4:junit4]   2> 	        at org.apache.solr.cloud.ZkTestServer.waitForServerDown(ZkTestServer.java:258)
[junit4:junit4]   2> 	        at org.apache.solr.cloud.ZkTestServer$ZKServerMain.shutdown(ZkTestServer.java:122)
[junit4:junit4]   2> 	        at org.apache.solr.cloud.ZkTestServer.shutdown(ZkTestServer.java:249)
[junit4:junit4]   2> 	        at org.apache.solr.cloud.LeaderElectionIntegrationTest.tearDown(LeaderElectionIntegrationTest.java:292)
[junit4:junit4]   2> 	        at sun.reflect.NativeMethodAccessorImpl.invoke0(Native Method)
[junit4:junit4]   2> 	        at sun.reflect.NativeMethodAccessorImpl.invoke(NativeMethodAccessorImpl.java:39)
[junit4:junit4]   2> 	        at sun.reflect.DelegatingMethodAccessorImpl.invoke(DelegatingMethodAccessorImpl.java:25)
[junit4:junit4]   2> 	        at java.lang.reflect.Method.invoke(Method.java:597)
[junit4:junit4]   2> 	        at com.carrotsearch.randomizedtesting.RandomizedRunner.invoke(RandomizedRunner.java:1559)
[junit4:junit4]   2> 	        at com.carrotsearch.randomizedtesting.RandomizedRunner.access$600(RandomizedRunner.java:79)
[junit4:junit4]   2> 	        at com.carrotsearch.randomizedtesting.RandomizedRunner$8.evaluate(RandomizedRunner.java:795)
[junit4:junit4]   2> 	        at com.carrotsearch.randomizedtesting.rules.SystemPropertiesRestoreRule$1.evaluate(SystemPropertiesRestoreRule.java:53)
[junit4:junit4]   2> 	        at org.apache.lucene.util.TestRuleSetupTeardownChained$1.evaluate(TestRuleSetupTeardownChained.java:50)
[junit4:junit4]   2> 	        at org.apache.lucene.util.TestRuleFieldCacheSanity$1.evaluate(TestRuleFieldCacheSanity.java:51)
[junit4:junit4]   2> 	        at org.apache.lucene.util.AbstractBeforeAfterRule$1.evaluate(AbstractBeforeAfterRule.java:45)
[junit4:junit4]   2> 	        at com.carrotsearch.randomizedtesting.rules.SystemPropertiesInvariantRule$1.evaluate(SystemPropertiesInvariantRule.java:55)
[junit4:junit4]   2> 	        at org.apache.lucene.util.TestRuleThreadAndTestName$1.evaluate(TestRuleThreadAndTestName.java:48)
[junit4:junit4]   2> 	        at org.apache.lucene.util.TestRuleIgnoreAfterMaxFailures$1.evaluate(TestRuleIgnoreAfterMaxFailures.java:70)
[junit4:junit4]   2> 	        at org.apache.lucene.util.TestRuleMarkFailure$1.evaluate(TestRuleMarkFailure.java:48)
[junit4:junit4]   2> 	        at com.carrotsearch.randomizedtesting.rules.StatementAdapter.evaluate(StatementAdapter.java:36)
[junit4:junit4]   2> 	        at com.carrotsearch.randomizedtesting.ThreadLeakControl$StatementRunner.run(ThreadLeakControl.java:358)
[junit4:junit4]   2> 	        at com.carrotsearch.randomizedtesting.ThreadLeakControl.forkTimeoutingTask(ThreadLeakControl.java:782)
[junit4:junit4]   2> 	        at com.carrotsearch.randomizedtesting.ThreadLeakControl$3.evaluate(ThreadLeakControl.java:442)
[junit4:junit4]   2> 	        at com.carrotsearch.randomizedtesting.RandomizedRunner.runSingleTest(RandomizedRunner.java:746)
[junit4:junit4]   2> 	        at com.carrotsearch.randomizedtesting.RandomizedRunner$3.evaluate(RandomizedRunner.java:648)
[junit4:junit4]   2> 	        at com.carrotsearch.randomizedtesting.RandomizedRunner$4.evaluate(RandomizedRunner.java:682)
[junit4:junit4]   2> 	        at com.carrotsearch.randomizedtesting.RandomizedRunner$5.evaluate(RandomizedRunner.java:693)
[junit4:junit4]   2> 	        at com.carrotsearch.randomizedtesting.rules.StatementAdapter.evaluate(StatementAdapter.java:36)
[junit4:junit4]   2> 	        at com.carrotsearch.randomizedtesting.rules.SystemPropertiesRestoreRule$1.evaluate(SystemPropertiesRestoreRule.java:53)
[junit4:junit4]   2> 	        at org.apache.lucene.util.AbstractBeforeAfterRule$1.evaluate(AbstractBeforeAfterRule.java:45)
[junit4:junit4]   2> 	        at org.apache.lucene.util.TestRuleStoreClassName$1.evaluate(TestRuleStoreClassName.java:42)
[junit4:junit4]   2> 	        at com.carrotsearch.randomizedtesting.rules.SystemPropertiesInvariantRule$1.evaluate(SystemPropertiesInvariantRule.java:55)
[junit4:junit4]   2> 	        at com.carrotsearch.randomizedtesting.rules.NoShadowingOrOverridesOnMethodsRule$1.evaluate(NoShadowingOrOverridesOnMethodsRule.java:39)
[junit4:junit4]   2> 	        at com.carrotsearch.randomizedtesting.rules.NoShadowingOrOverridesOnMethodsRule$1.evaluate(NoShadowingOrOverridesOnMethodsRule.java:39)
[junit4:junit4]   2> 	        at com.carrotsearch.randomizedtesting.rules.StatementAdapter.evaluate(StatementAdapter.java:36)
[junit4:junit4]   2> 	        at org.apache.lucene.util.TestRuleAssertionsRequired$1.evaluate(TestRuleAssertionsRequired.java:43)
[junit4:junit4]   2> 	        at org.apache.lucene.util.TestRuleMarkFailure$1.evaluate(TestRuleMarkFailure.java:48)
[junit4:junit4]   2> 	        at org.apache.lucene.util.TestRuleIgnoreAfterMaxFailures$1.evaluate(TestRuleIgnoreAfterMaxFailures.java:70)
[junit4:junit4]   2> 	        at org.apache.lucene.util.TestRuleIgnoreTestSuites$1.evaluate(TestRuleIgnoreTestSuites.java:55)
[junit4:junit4]   2> 	        at com.carrotsearch.randomizedtesting.rules.StatementAdapter.evaluate(StatementAdapter.java:36)
[junit4:junit4]   2> 	        at com.carrotsearch.randomizedtesting.ThreadLeakControl$StatementRunner.run(ThreadLeakControl.java:358)
[junit4:junit4]   2> 	        at java.lang.Thread.run(Thread.java:662)
[junit4:junit4]   2> 7224437 T72 oazs.FinalRequestProcessor.shutdown shutdown of request
processor complete
[junit4:junit4]   2> 7224438 T72 oas.SolrTestCaseJ4.tearDown ###Ending testLeaderElectionAfterClientTimeout
[junit4:junit4]   2> 7224440 T72 oas.SolrTestCaseJ4.deleteCore ###deleteCore
[junit4:junit4]   2> NOTE: test params are: codec=Lucene3x, sim=RandomSimilarityProvider(queryNorm=true,coord=yes):
{}, locale=ar, timezone=NST
[junit4:junit4]   2> NOTE: Windows Vista 6.0 x86/Sun Microsystems Inc. 1.6.0_23 (32-bit)/cpus=4,threads=5,free=5635064,total=19423232
[junit4:junit4]   2> NOTE: All tests run in this JVM: [TestRealTimeGet, SortByFunctionTest,
TestNumberUtils, CurrencyFieldTest, SoftAutoCommitTest, FileUtilsTest, UniqFieldsUpdateProcessorFactoryTest,
TestHashPartitioner, LeaderElectionIntegrationTest]
[junit4:junit4]   2> NOTE: reproduce with: ant test  -Dtestcase=LeaderElectionIntegrationTest
-Dtests.seed=4046DFC00924F87E -Dtests.slow=true -Dtests.locale=ar -Dtests.timezone=NST -Dtests.file.encoding=US-ASCII
[junit4:junit4] ERROR   0.00s J6 | LeaderElectionIntegrationTest (suite) <<<
[junit4:junit4]    > Throwable #1: java.lang.Exception: Suite timeout exceeded (>= 7200000
msec).
[junit4:junit4]    > 	at __randomizedtesting.SeedInfo.seed([4046DFC00924F87E]:0)
[junit4:junit4] Completed on J6 in 7224.52s, 2 tests, 2 errors <<< FAILURES!
[junit4:junit4] 
[junit4:junit4] Suite: org.apache.solr.update.processor.FieldMutatingUpdateProcessorTest
[junit4:junit4] Completed on J6 in 0.03s, 26 tests, 26 skipped
[junit4:junit4] 
[junit4:junit4] Suite: org.apache.solr.internal.csv.writer.CSVWriterTest
[junit4:junit4] Completed on J6 in 0.12s, 2 tests
[junit4:junit4] 
[junit4:junit4] Suite: org.apache.solr.cloud.TestMultiCoreConfBootstrap
[junit4:junit4] Completed on J6 in 0.01s, 1 test, 1 skipped
[junit4:junit4] 
[junit4:junit4] Suite: org.apache.solr.internal.csv.CSVParserTest
[junit4:junit4] Completed on J6 in 0.14s, 23 tests
[junit4:junit4] 
[junit4:junit4] Suite: org.apache.solr.handler.component.SearchHandlerTest
[junit4:junit4] Completed on J6 in 0.01s, 1 test, 1 skipped
[junit4:junit4] 
[junit4:junit4] Suite: org.apache.solr.cloud.ClusterStateUpdateTest
[junit4:junit4] Completed on J6 in 0.01s, 1 test, 1 skipped
[junit4:junit4] 
[junit4:junit4] Suite: org.apache.solr.handler.CSVRequestHandlerTest
[junit4:junit4] Completed on J6 in 0.01s, 1 test, 1 skipped
[junit4:junit4] 
[junit4:junit4] Suite: org.apache.solr.util.TimeZoneUtilsTest
[junit4:junit4] Completed on J6 in 0.01s, 5 tests, 5 skipped
[junit4:junit4] 
[junit4:junit4] 
[junit4:junit4] Tests with failures:
[junit4:junit4]   - org.apache.solr.cloud.LeaderElectionIntegrationTest.testLeaderElectionAfterClientTimeout
[junit4:junit4]   - org.apache.solr.cloud.LeaderElectionIntegrationTest (suite)
[junit4:junit4] 
[junit4:junit4] 
[junit4:junit4] JVM J0:     3.22 ..   268.24 =   265.01s
[junit4:junit4] JVM J1:     2.48 ..   267.54 =   265.06s
[junit4:junit4] JVM J2:     2.73 ..   275.77 =   273.03s
[junit4:junit4] JVM J3:     3.48 ..   268.54 =   265.06s
[junit4:junit4] JVM J4:     2.25 ..   271.37 =   269.12s
[junit4:junit4] JVM J5:     2.47 ..   314.35 =   311.87s
[junit4:junit4] JVM J6:     2.25 ..  7355.00 =  7352.75s
[junit4:junit4] JVM J7:     2.73 ..   277.03 =   274.30s
[junit4:junit4] Execution time total: 2 hours 2 minutes 35 seconds
[junit4:junit4] Tests summary: 233 suites, 965 tests, 1 suite-level error, 1 error, 47 ignored
(7 assumptions)

BUILD FAILED
<http://sierranevada.servebeer.com:8080/job/slow-io-beasting/ws/build.xml>:39: The following
error occurred while executing this line:
<http://sierranevada.servebeer.com:8080/job/slow-io-beasting/ws/solr/build.xml>:178:
The following error occurred while executing this line:
<http://sierranevada.servebeer.com:8080/job/slow-io-beasting/ws/lucene/module-build.xml>:61:
The following error occurred while executing this line:
<http://sierranevada.servebeer.com:8080/job/slow-io-beasting/ws/lucene/common-build.xml>:1159:
The following error occurred while executing this line:
<http://sierranevada.servebeer.com:8080/job/slow-io-beasting/ws/lucene/common-build.xml>:827:
There were test failures: 233 suites, 965 tests, 1 suite-level error, 1 error, 47 ignored
(7 assumptions)

Total time: 131 minutes 0 seconds
Build step 'Invoke Ant' marked build as failure

---------------------------------------------------------------------
To unsubscribe, e-mail: dev-unsubscribe@lucene.apache.org
For additional commands, e-mail: dev-help@lucene.apache.org


Mime
View raw message