lucene-dev mailing list archives

Site index · List index
Message view « Date » · « Thread »
Top « Date » · « Thread »
From Apache Jenkins Server <jenk...@builds.apache.org>
Subject [JENKINS] Lucene-Solr-Tests-4.x-java7 - Build # 599 - Still Failing
Date Tue, 30 Oct 2012 19:36:43 GMT
Build: https://builds.apache.org/job/Lucene-Solr-Tests-4.x-java7/599/

4 tests failed.
FAILED:  junit.framework.TestSuite.org.apache.solr.cloud.BasicDistributedZkTest

Error Message:
12 threads leaked from SUITE scope at org.apache.solr.cloud.BasicDistributedZkTest:     1) Thread[id=133, name=qtp462026823-133 Acceptor1 SelectChannelConnector@0.0.0.0:51712, state=BLOCKED, group=TGRP-BasicDistributedZkTest]         at sun.nio.ch.ServerSocketChannelImpl.accept(ServerSocketChannelImpl.java:210)         at org.eclipse.jetty.server.nio.SelectChannelConnector.accept(SelectChannelConnector.java:104)         at org.eclipse.jetty.server.AbstractConnector$Acceptor.run(AbstractConnector.java:933)         at org.eclipse.jetty.util.thread.QueuedThreadPool.runJob(QueuedThreadPool.java:599)         at org.eclipse.jetty.util.thread.QueuedThreadPool$3.run(QueuedThreadPool.java:534)         at java.lang.Thread.run(Thread.java:722)    2) Thread[id=135, name=qtp462026823-135 Acceptor3 SelectChannelConnector@0.0.0.0:51712, state=RUNNABLE, group=TGRP-BasicDistributedZkTest]         at sun.nio.ch.ServerSocketChannelImpl.accept0(Native Method)         at sun.nio.ch.ServerSocketChannelImpl.accept(ServerSocketChannelImpl.java:226)         at org.eclipse.jetty.server.nio.SelectChannelConnector.accept(SelectChannelConnector.java:104)         at org.eclipse.jetty.server.AbstractConnector$Acceptor.run(AbstractConnector.java:933)         at org.eclipse.jetty.util.thread.QueuedThreadPool.runJob(QueuedThreadPool.java:599)         at org.eclipse.jetty.util.thread.QueuedThreadPool$3.run(QueuedThreadPool.java:534)         at java.lang.Thread.run(Thread.java:722)    3) Thread[id=151, name=qtp1633289861-151 Acceptor1 SelectChannelConnector@0.0.0.0:51719, state=BLOCKED, group=TGRP-BasicDistributedZkTest]         at sun.nio.ch.ServerSocketChannelImpl.accept(ServerSocketChannelImpl.java:210)         at org.eclipse.jetty.server.nio.SelectChannelConnector.accept(SelectChannelConnector.java:104)         at org.eclipse.jetty.server.AbstractConnector$Acceptor.run(AbstractConnector.java:933)         at org.eclipse.jetty.util.thread.QueuedThreadPool.runJob(QueuedThreadPool.java:599)         at org.eclipse.jetty.util.thread.QueuedThreadPool$3.run(QueuedThreadPool.java:534)         at java.lang.Thread.run(Thread.java:722)    4) Thread[id=83, name=qtp1642399029-83 Acceptor1 SelectChannelConnector@0.0.0.0:57117, state=BLOCKED, group=TGRP-BasicDistributedZkTest]         at sun.nio.ch.ServerSocketChannelImpl.accept(ServerSocketChannelImpl.java:210)         at org.eclipse.jetty.server.nio.SelectChannelConnector.accept(SelectChannelConnector.java:104)         at org.eclipse.jetty.server.AbstractConnector$Acceptor.run(AbstractConnector.java:933)         at org.eclipse.jetty.util.thread.QueuedThreadPool.runJob(QueuedThreadPool.java:599)         at org.eclipse.jetty.util.thread.QueuedThreadPool$3.run(QueuedThreadPool.java:534)         at java.lang.Thread.run(Thread.java:722)    5) Thread[id=153, name=qtp1633289861-153 Acceptor3 SelectChannelConnector@0.0.0.0:51719, state=BLOCKED, group=TGRP-BasicDistributedZkTest]         at sun.nio.ch.ServerSocketChannelImpl.accept(ServerSocketChannelImpl.java:210)         at org.eclipse.jetty.server.nio.SelectChannelConnector.accept(SelectChannelConnector.java:104)         at org.eclipse.jetty.server.AbstractConnector$Acceptor.run(AbstractConnector.java:933)         at org.eclipse.jetty.util.thread.QueuedThreadPool.runJob(QueuedThreadPool.java:599)         at org.eclipse.jetty.util.thread.QueuedThreadPool$3.run(QueuedThreadPool.java:534)         at java.lang.Thread.run(Thread.java:722)    6) Thread[id=152, name=qtp1633289861-152 Acceptor2 SelectChannelConnector@0.0.0.0:51719, state=BLOCKED, group=TGRP-BasicDistributedZkTest]         at sun.nio.ch.ServerSocketChannelImpl.accept(ServerSocketChannelImpl.java:210)         at org.eclipse.jetty.server.nio.SelectChannelConnector.accept(SelectChannelConnector.java:104)         at org.eclipse.jetty.server.AbstractConnector$Acceptor.run(AbstractConnector.java:933)         at org.eclipse.jetty.util.thread.QueuedThreadPool.runJob(QueuedThreadPool.java:599)         at org.eclipse.jetty.util.thread.QueuedThreadPool$3.run(QueuedThreadPool.java:534)         at java.lang.Thread.run(Thread.java:722)    7) Thread[id=150, name=qtp1633289861-150 Acceptor0 SelectChannelConnector@0.0.0.0:51719, state=RUNNABLE, group=TGRP-BasicDistributedZkTest]         at sun.nio.ch.ServerSocketChannelImpl.accept0(Native Method)         at sun.nio.ch.ServerSocketChannelImpl.accept(ServerSocketChannelImpl.java:226)         at org.eclipse.jetty.server.nio.SelectChannelConnector.accept(SelectChannelConnector.java:104)         at org.eclipse.jetty.server.AbstractConnector$Acceptor.run(AbstractConnector.java:933)         at org.eclipse.jetty.util.thread.QueuedThreadPool.runJob(QueuedThreadPool.java:599)         at org.eclipse.jetty.util.thread.QueuedThreadPool$3.run(QueuedThreadPool.java:534)         at java.lang.Thread.run(Thread.java:722)    8) Thread[id=82, name=qtp1642399029-82 Acceptor0 SelectChannelConnector@0.0.0.0:57117, state=BLOCKED, group=TGRP-BasicDistributedZkTest]         at sun.nio.ch.ServerSocketChannelImpl.accept(ServerSocketChannelImpl.java:210)         at org.eclipse.jetty.server.nio.SelectChannelConnector.accept(SelectChannelConnector.java:104)         at org.eclipse.jetty.server.AbstractConnector$Acceptor.run(AbstractConnector.java:933)         at org.eclipse.jetty.util.thread.QueuedThreadPool.runJob(QueuedThreadPool.java:599)         at org.eclipse.jetty.util.thread.QueuedThreadPool$3.run(QueuedThreadPool.java:534)         at java.lang.Thread.run(Thread.java:722)    9) Thread[id=84, name=qtp1642399029-84 Acceptor2 SelectChannelConnector@0.0.0.0:57117, state=RUNNABLE, group=TGRP-BasicDistributedZkTest]         at sun.nio.ch.ServerSocketChannelImpl.accept0(Native Method)         at sun.nio.ch.ServerSocketChannelImpl.accept(ServerSocketChannelImpl.java:226)         at org.eclipse.jetty.server.nio.SelectChannelConnector.accept(SelectChannelConnector.java:104)         at org.eclipse.jetty.server.AbstractConnector$Acceptor.run(AbstractConnector.java:933)         at org.eclipse.jetty.util.thread.QueuedThreadPool.runJob(QueuedThreadPool.java:599)         at org.eclipse.jetty.util.thread.QueuedThreadPool$3.run(QueuedThreadPool.java:534)         at java.lang.Thread.run(Thread.java:722)   10) Thread[id=132, name=qtp462026823-132 Acceptor0 SelectChannelConnector@0.0.0.0:51712, state=BLOCKED, group=TGRP-BasicDistributedZkTest]         at sun.nio.ch.ServerSocketChannelImpl.accept(ServerSocketChannelImpl.java:210)         at org.eclipse.jetty.server.nio.SelectChannelConnector.accept(SelectChannelConnector.java:104)         at org.eclipse.jetty.server.AbstractConnector$Acceptor.run(AbstractConnector.java:933)         at org.eclipse.jetty.util.thread.QueuedThreadPool.runJob(QueuedThreadPool.java:599)         at org.eclipse.jetty.util.thread.QueuedThreadPool$3.run(QueuedThreadPool.java:534)         at java.lang.Thread.run(Thread.java:722)   11) Thread[id=85, name=qtp1642399029-85 Acceptor3 SelectChannelConnector@0.0.0.0:57117, state=BLOCKED, group=TGRP-BasicDistributedZkTest]         at sun.nio.ch.ServerSocketChannelImpl.accept(ServerSocketChannelImpl.java:210)         at org.eclipse.jetty.server.nio.SelectChannelConnector.accept(SelectChannelConnector.java:104)         at org.eclipse.jetty.server.AbstractConnector$Acceptor.run(AbstractConnector.java:933)         at org.eclipse.jetty.util.thread.QueuedThreadPool.runJob(QueuedThreadPool.java:599)         at org.eclipse.jetty.util.thread.QueuedThreadPool$3.run(QueuedThreadPool.java:534)         at java.lang.Thread.run(Thread.java:722)   12) Thread[id=134, name=qtp462026823-134 Acceptor2 SelectChannelConnector@0.0.0.0:51712, state=BLOCKED, group=TGRP-BasicDistributedZkTest]         at sun.nio.ch.ServerSocketChannelImpl.accept(ServerSocketChannelImpl.java:210)         at org.eclipse.jetty.server.nio.SelectChannelConnector.accept(SelectChannelConnector.java:104)         at org.eclipse.jetty.server.AbstractConnector$Acceptor.run(AbstractConnector.java:933)         at org.eclipse.jetty.util.thread.QueuedThreadPool.runJob(QueuedThreadPool.java:599)         at org.eclipse.jetty.util.thread.QueuedThreadPool$3.run(QueuedThreadPool.java:534)         at java.lang.Thread.run(Thread.java:722)

Stack Trace:
com.carrotsearch.randomizedtesting.ThreadLeakError: 12 threads leaked from SUITE scope at org.apache.solr.cloud.BasicDistributedZkTest: 
   1) Thread[id=133, name=qtp462026823-133 Acceptor1 SelectChannelConnector@0.0.0.0:51712, state=BLOCKED, group=TGRP-BasicDistributedZkTest]
        at sun.nio.ch.ServerSocketChannelImpl.accept(ServerSocketChannelImpl.java:210)
        at org.eclipse.jetty.server.nio.SelectChannelConnector.accept(SelectChannelConnector.java:104)
        at org.eclipse.jetty.server.AbstractConnector$Acceptor.run(AbstractConnector.java:933)
        at org.eclipse.jetty.util.thread.QueuedThreadPool.runJob(QueuedThreadPool.java:599)
        at org.eclipse.jetty.util.thread.QueuedThreadPool$3.run(QueuedThreadPool.java:534)
        at java.lang.Thread.run(Thread.java:722)
   2) Thread[id=135, name=qtp462026823-135 Acceptor3 SelectChannelConnector@0.0.0.0:51712, state=RUNNABLE, group=TGRP-BasicDistributedZkTest]
        at sun.nio.ch.ServerSocketChannelImpl.accept0(Native Method)
        at sun.nio.ch.ServerSocketChannelImpl.accept(ServerSocketChannelImpl.java:226)
        at org.eclipse.jetty.server.nio.SelectChannelConnector.accept(SelectChannelConnector.java:104)
        at org.eclipse.jetty.server.AbstractConnector$Acceptor.run(AbstractConnector.java:933)
        at org.eclipse.jetty.util.thread.QueuedThreadPool.runJob(QueuedThreadPool.java:599)
        at org.eclipse.jetty.util.thread.QueuedThreadPool$3.run(QueuedThreadPool.java:534)
        at java.lang.Thread.run(Thread.java:722)
   3) Thread[id=151, name=qtp1633289861-151 Acceptor1 SelectChannelConnector@0.0.0.0:51719, state=BLOCKED, group=TGRP-BasicDistributedZkTest]
        at sun.nio.ch.ServerSocketChannelImpl.accept(ServerSocketChannelImpl.java:210)
        at org.eclipse.jetty.server.nio.SelectChannelConnector.accept(SelectChannelConnector.java:104)
        at org.eclipse.jetty.server.AbstractConnector$Acceptor.run(AbstractConnector.java:933)
        at org.eclipse.jetty.util.thread.QueuedThreadPool.runJob(QueuedThreadPool.java:599)
        at org.eclipse.jetty.util.thread.QueuedThreadPool$3.run(QueuedThreadPool.java:534)
        at java.lang.Thread.run(Thread.java:722)
   4) Thread[id=83, name=qtp1642399029-83 Acceptor1 SelectChannelConnector@0.0.0.0:57117, state=BLOCKED, group=TGRP-BasicDistributedZkTest]
        at sun.nio.ch.ServerSocketChannelImpl.accept(ServerSocketChannelImpl.java:210)
        at org.eclipse.jetty.server.nio.SelectChannelConnector.accept(SelectChannelConnector.java:104)
        at org.eclipse.jetty.server.AbstractConnector$Acceptor.run(AbstractConnector.java:933)
        at org.eclipse.jetty.util.thread.QueuedThreadPool.runJob(QueuedThreadPool.java:599)
        at org.eclipse.jetty.util.thread.QueuedThreadPool$3.run(QueuedThreadPool.java:534)
        at java.lang.Thread.run(Thread.java:722)
   5) Thread[id=153, name=qtp1633289861-153 Acceptor3 SelectChannelConnector@0.0.0.0:51719, state=BLOCKED, group=TGRP-BasicDistributedZkTest]
        at sun.nio.ch.ServerSocketChannelImpl.accept(ServerSocketChannelImpl.java:210)
        at org.eclipse.jetty.server.nio.SelectChannelConnector.accept(SelectChannelConnector.java:104)
        at org.eclipse.jetty.server.AbstractConnector$Acceptor.run(AbstractConnector.java:933)
        at org.eclipse.jetty.util.thread.QueuedThreadPool.runJob(QueuedThreadPool.java:599)
        at org.eclipse.jetty.util.thread.QueuedThreadPool$3.run(QueuedThreadPool.java:534)
        at java.lang.Thread.run(Thread.java:722)
   6) Thread[id=152, name=qtp1633289861-152 Acceptor2 SelectChannelConnector@0.0.0.0:51719, state=BLOCKED, group=TGRP-BasicDistributedZkTest]
        at sun.nio.ch.ServerSocketChannelImpl.accept(ServerSocketChannelImpl.java:210)
        at org.eclipse.jetty.server.nio.SelectChannelConnector.accept(SelectChannelConnector.java:104)
        at org.eclipse.jetty.server.AbstractConnector$Acceptor.run(AbstractConnector.java:933)
        at org.eclipse.jetty.util.thread.QueuedThreadPool.runJob(QueuedThreadPool.java:599)
        at org.eclipse.jetty.util.thread.QueuedThreadPool$3.run(QueuedThreadPool.java:534)
        at java.lang.Thread.run(Thread.java:722)
   7) Thread[id=150, name=qtp1633289861-150 Acceptor0 SelectChannelConnector@0.0.0.0:51719, state=RUNNABLE, group=TGRP-BasicDistributedZkTest]
        at sun.nio.ch.ServerSocketChannelImpl.accept0(Native Method)
        at sun.nio.ch.ServerSocketChannelImpl.accept(ServerSocketChannelImpl.java:226)
        at org.eclipse.jetty.server.nio.SelectChannelConnector.accept(SelectChannelConnector.java:104)
        at org.eclipse.jetty.server.AbstractConnector$Acceptor.run(AbstractConnector.java:933)
        at org.eclipse.jetty.util.thread.QueuedThreadPool.runJob(QueuedThreadPool.java:599)
        at org.eclipse.jetty.util.thread.QueuedThreadPool$3.run(QueuedThreadPool.java:534)
        at java.lang.Thread.run(Thread.java:722)
   8) Thread[id=82, name=qtp1642399029-82 Acceptor0 SelectChannelConnector@0.0.0.0:57117, state=BLOCKED, group=TGRP-BasicDistributedZkTest]
        at sun.nio.ch.ServerSocketChannelImpl.accept(ServerSocketChannelImpl.java:210)
        at org.eclipse.jetty.server.nio.SelectChannelConnector.accept(SelectChannelConnector.java:104)
        at org.eclipse.jetty.server.AbstractConnector$Acceptor.run(AbstractConnector.java:933)
        at org.eclipse.jetty.util.thread.QueuedThreadPool.runJob(QueuedThreadPool.java:599)
        at org.eclipse.jetty.util.thread.QueuedThreadPool$3.run(QueuedThreadPool.java:534)
        at java.lang.Thread.run(Thread.java:722)
   9) Thread[id=84, name=qtp1642399029-84 Acceptor2 SelectChannelConnector@0.0.0.0:57117, state=RUNNABLE, group=TGRP-BasicDistributedZkTest]
        at sun.nio.ch.ServerSocketChannelImpl.accept0(Native Method)
        at sun.nio.ch.ServerSocketChannelImpl.accept(ServerSocketChannelImpl.java:226)
        at org.eclipse.jetty.server.nio.SelectChannelConnector.accept(SelectChannelConnector.java:104)
        at org.eclipse.jetty.server.AbstractConnector$Acceptor.run(AbstractConnector.java:933)
        at org.eclipse.jetty.util.thread.QueuedThreadPool.runJob(QueuedThreadPool.java:599)
        at org.eclipse.jetty.util.thread.QueuedThreadPool$3.run(QueuedThreadPool.java:534)
        at java.lang.Thread.run(Thread.java:722)
  10) Thread[id=132, name=qtp462026823-132 Acceptor0 SelectChannelConnector@0.0.0.0:51712, state=BLOCKED, group=TGRP-BasicDistributedZkTest]
        at sun.nio.ch.ServerSocketChannelImpl.accept(ServerSocketChannelImpl.java:210)
        at org.eclipse.jetty.server.nio.SelectChannelConnector.accept(SelectChannelConnector.java:104)
        at org.eclipse.jetty.server.AbstractConnector$Acceptor.run(AbstractConnector.java:933)
        at org.eclipse.jetty.util.thread.QueuedThreadPool.runJob(QueuedThreadPool.java:599)
        at org.eclipse.jetty.util.thread.QueuedThreadPool$3.run(QueuedThreadPool.java:534)
        at java.lang.Thread.run(Thread.java:722)
  11) Thread[id=85, name=qtp1642399029-85 Acceptor3 SelectChannelConnector@0.0.0.0:57117, state=BLOCKED, group=TGRP-BasicDistributedZkTest]
        at sun.nio.ch.ServerSocketChannelImpl.accept(ServerSocketChannelImpl.java:210)
        at org.eclipse.jetty.server.nio.SelectChannelConnector.accept(SelectChannelConnector.java:104)
        at org.eclipse.jetty.server.AbstractConnector$Acceptor.run(AbstractConnector.java:933)
        at org.eclipse.jetty.util.thread.QueuedThreadPool.runJob(QueuedThreadPool.java:599)
        at org.eclipse.jetty.util.thread.QueuedThreadPool$3.run(QueuedThreadPool.java:534)
        at java.lang.Thread.run(Thread.java:722)
  12) Thread[id=134, name=qtp462026823-134 Acceptor2 SelectChannelConnector@0.0.0.0:51712, state=BLOCKED, group=TGRP-BasicDistributedZkTest]
        at sun.nio.ch.ServerSocketChannelImpl.accept(ServerSocketChannelImpl.java:210)
        at org.eclipse.jetty.server.nio.SelectChannelConnector.accept(SelectChannelConnector.java:104)
        at org.eclipse.jetty.server.AbstractConnector$Acceptor.run(AbstractConnector.java:933)
        at org.eclipse.jetty.util.thread.QueuedThreadPool.runJob(QueuedThreadPool.java:599)
        at org.eclipse.jetty.util.thread.QueuedThreadPool$3.run(QueuedThreadPool.java:534)
        at java.lang.Thread.run(Thread.java:722)
	at __randomizedtesting.SeedInfo.seed([64D3BA166035617A]:0)


FAILED:  junit.framework.TestSuite.org.apache.solr.cloud.BasicDistributedZkTest

Error Message:
There are still zombie threads that couldn't be terminated:    1) Thread[id=133, name=qtp462026823-133 Acceptor1 SelectChannelConnector@0.0.0.0:51712, state=BLOCKED, group=TGRP-BasicDistributedZkTest]         at sun.nio.ch.ServerSocketChannelImpl.accept(ServerSocketChannelImpl.java:210)         at org.eclipse.jetty.server.nio.SelectChannelConnector.accept(SelectChannelConnector.java:104)         at org.eclipse.jetty.server.AbstractConnector$Acceptor.run(AbstractConnector.java:933)         at org.eclipse.jetty.util.thread.QueuedThreadPool.runJob(QueuedThreadPool.java:599)         at org.eclipse.jetty.util.thread.QueuedThreadPool$3.run(QueuedThreadPool.java:534)         at java.lang.Thread.run(Thread.java:722)    2) Thread[id=84, name=qtp1642399029-84 Acceptor2 SelectChannelConnector@0.0.0.0:57117, state=RUNNABLE, group=TGRP-BasicDistributedZkTest]         at sun.nio.ch.ServerSocketChannelImpl.accept0(Native Method)         at sun.nio.ch.ServerSocketChannelImpl.accept(ServerSocketChannelImpl.java:226)         at org.eclipse.jetty.server.nio.SelectChannelConnector.accept(SelectChannelConnector.java:104)         at org.eclipse.jetty.server.AbstractConnector$Acceptor.run(AbstractConnector.java:933)         at org.eclipse.jetty.util.thread.QueuedThreadPool.runJob(QueuedThreadPool.java:599)         at org.eclipse.jetty.util.thread.QueuedThreadPool$3.run(QueuedThreadPool.java:534)         at java.lang.Thread.run(Thread.java:722)    3) Thread[id=135, name=qtp462026823-135 Acceptor3 SelectChannelConnector@0.0.0.0:51712, state=RUNNABLE, group=TGRP-BasicDistributedZkTest]         at sun.nio.ch.ServerSocketChannelImpl.accept0(Native Method)         at sun.nio.ch.ServerSocketChannelImpl.accept(ServerSocketChannelImpl.java:226)         at org.eclipse.jetty.server.nio.SelectChannelConnector.accept(SelectChannelConnector.java:104)         at org.eclipse.jetty.server.AbstractConnector$Acceptor.run(AbstractConnector.java:933)         at org.eclipse.jetty.util.thread.QueuedThreadPool.runJob(QueuedThreadPool.java:599)         at org.eclipse.jetty.util.thread.QueuedThreadPool$3.run(QueuedThreadPool.java:534)         at java.lang.Thread.run(Thread.java:722)    4) Thread[id=151, name=qtp1633289861-151 Acceptor1 SelectChannelConnector@0.0.0.0:51719, state=BLOCKED, group=TGRP-BasicDistributedZkTest]         at sun.nio.ch.ServerSocketChannelImpl.accept(ServerSocketChannelImpl.java:210)         at org.eclipse.jetty.server.nio.SelectChannelConnector.accept(SelectChannelConnector.java:104)         at org.eclipse.jetty.server.AbstractConnector$Acceptor.run(AbstractConnector.java:933)         at org.eclipse.jetty.util.thread.QueuedThreadPool.runJob(QueuedThreadPool.java:599)         at org.eclipse.jetty.util.thread.QueuedThreadPool$3.run(QueuedThreadPool.java:534)         at java.lang.Thread.run(Thread.java:722)    5) Thread[id=83, name=qtp1642399029-83 Acceptor1 SelectChannelConnector@0.0.0.0:57117, state=BLOCKED, group=TGRP-BasicDistributedZkTest]         at sun.nio.ch.ServerSocketChannelImpl.accept(ServerSocketChannelImpl.java:210)         at org.eclipse.jetty.server.nio.SelectChannelConnector.accept(SelectChannelConnector.java:104)         at org.eclipse.jetty.server.AbstractConnector$Acceptor.run(AbstractConnector.java:933)         at org.eclipse.jetty.util.thread.QueuedThreadPool.runJob(QueuedThreadPool.java:599)         at org.eclipse.jetty.util.thread.QueuedThreadPool$3.run(QueuedThreadPool.java:534)         at java.lang.Thread.run(Thread.java:722)    6) Thread[id=132, name=qtp462026823-132 Acceptor0 SelectChannelConnector@0.0.0.0:51712, state=BLOCKED, group=TGRP-BasicDistributedZkTest]         at sun.nio.ch.ServerSocketChannelImpl.accept(ServerSocketChannelImpl.java:210)         at org.eclipse.jetty.server.nio.SelectChannelConnector.accept(SelectChannelConnector.java:104)         at org.eclipse.jetty.server.AbstractConnector$Acceptor.run(AbstractConnector.java:933)         at org.eclipse.jetty.util.thread.QueuedThreadPool.runJob(QueuedThreadPool.java:599)         at org.eclipse.jetty.util.thread.QueuedThreadPool$3.run(QueuedThreadPool.java:534)         at java.lang.Thread.run(Thread.java:722)    7) Thread[id=85, name=qtp1642399029-85 Acceptor3 SelectChannelConnector@0.0.0.0:57117, state=BLOCKED, group=TGRP-BasicDistributedZkTest]         at sun.nio.ch.ServerSocketChannelImpl.accept(ServerSocketChannelImpl.java:210)         at org.eclipse.jetty.server.nio.SelectChannelConnector.accept(SelectChannelConnector.java:104)         at org.eclipse.jetty.server.AbstractConnector$Acceptor.run(AbstractConnector.java:933)         at org.eclipse.jetty.util.thread.QueuedThreadPool.runJob(QueuedThreadPool.java:599)         at org.eclipse.jetty.util.thread.QueuedThreadPool$3.run(QueuedThreadPool.java:534)         at java.lang.Thread.run(Thread.java:722)    8) Thread[id=153, name=qtp1633289861-153 Acceptor3 SelectChannelConnector@0.0.0.0:51719, state=BLOCKED, group=TGRP-BasicDistributedZkTest]         at sun.nio.ch.ServerSocketChannelImpl.accept(ServerSocketChannelImpl.java:210)         at org.eclipse.jetty.server.nio.SelectChannelConnector.accept(SelectChannelConnector.java:104)         at org.eclipse.jetty.server.AbstractConnector$Acceptor.run(AbstractConnector.java:933)         at org.eclipse.jetty.util.thread.QueuedThreadPool.runJob(QueuedThreadPool.java:599)         at org.eclipse.jetty.util.thread.QueuedThreadPool$3.run(QueuedThreadPool.java:534)         at java.lang.Thread.run(Thread.java:722)    9) Thread[id=152, name=qtp1633289861-152 Acceptor2 SelectChannelConnector@0.0.0.0:51719, state=BLOCKED, group=TGRP-BasicDistributedZkTest]         at sun.nio.ch.ServerSocketChannelImpl.accept(ServerSocketChannelImpl.java:210)         at org.eclipse.jetty.server.nio.SelectChannelConnector.accept(SelectChannelConnector.java:104)         at org.eclipse.jetty.server.AbstractConnector$Acceptor.run(AbstractConnector.java:933)         at org.eclipse.jetty.util.thread.QueuedThreadPool.runJob(QueuedThreadPool.java:599)         at org.eclipse.jetty.util.thread.QueuedThreadPool$3.run(QueuedThreadPool.java:534)         at java.lang.Thread.run(Thread.java:722)   10) Thread[id=134, name=qtp462026823-134 Acceptor2 SelectChannelConnector@0.0.0.0:51712, state=BLOCKED, group=TGRP-BasicDistributedZkTest]         at sun.nio.ch.ServerSocketChannelImpl.accept(ServerSocketChannelImpl.java:210)         at org.eclipse.jetty.server.nio.SelectChannelConnector.accept(SelectChannelConnector.java:104)         at org.eclipse.jetty.server.AbstractConnector$Acceptor.run(AbstractConnector.java:933)         at org.eclipse.jetty.util.thread.QueuedThreadPool.runJob(QueuedThreadPool.java:599)         at org.eclipse.jetty.util.thread.QueuedThreadPool$3.run(QueuedThreadPool.java:534)         at java.lang.Thread.run(Thread.java:722)   11) Thread[id=150, name=qtp1633289861-150 Acceptor0 SelectChannelConnector@0.0.0.0:51719, state=RUNNABLE, group=TGRP-BasicDistributedZkTest]         at sun.nio.ch.ServerSocketChannelImpl.accept0(Native Method)         at sun.nio.ch.ServerSocketChannelImpl.accept(ServerSocketChannelImpl.java:226)         at org.eclipse.jetty.server.nio.SelectChannelConnector.accept(SelectChannelConnector.java:104)         at org.eclipse.jetty.server.AbstractConnector$Acceptor.run(AbstractConnector.java:933)         at org.eclipse.jetty.util.thread.QueuedThreadPool.runJob(QueuedThreadPool.java:599)         at org.eclipse.jetty.util.thread.QueuedThreadPool$3.run(QueuedThreadPool.java:534)         at java.lang.Thread.run(Thread.java:722)   12) Thread[id=82, name=qtp1642399029-82 Acceptor0 SelectChannelConnector@0.0.0.0:57117, state=BLOCKED, group=TGRP-BasicDistributedZkTest]         at sun.nio.ch.ServerSocketChannelImpl.accept(ServerSocketChannelImpl.java:210)         at org.eclipse.jetty.server.nio.SelectChannelConnector.accept(SelectChannelConnector.java:104)         at org.eclipse.jetty.server.AbstractConnector$Acceptor.run(AbstractConnector.java:933)         at org.eclipse.jetty.util.thread.QueuedThreadPool.runJob(QueuedThreadPool.java:599)         at org.eclipse.jetty.util.thread.QueuedThreadPool$3.run(QueuedThreadPool.java:534)         at java.lang.Thread.run(Thread.java:722)

Stack Trace:
com.carrotsearch.randomizedtesting.ThreadLeakError: There are still zombie threads that couldn't be terminated:
   1) Thread[id=133, name=qtp462026823-133 Acceptor1 SelectChannelConnector@0.0.0.0:51712, state=BLOCKED, group=TGRP-BasicDistributedZkTest]
        at sun.nio.ch.ServerSocketChannelImpl.accept(ServerSocketChannelImpl.java:210)
        at org.eclipse.jetty.server.nio.SelectChannelConnector.accept(SelectChannelConnector.java:104)
        at org.eclipse.jetty.server.AbstractConnector$Acceptor.run(AbstractConnector.java:933)
        at org.eclipse.jetty.util.thread.QueuedThreadPool.runJob(QueuedThreadPool.java:599)
        at org.eclipse.jetty.util.thread.QueuedThreadPool$3.run(QueuedThreadPool.java:534)
        at java.lang.Thread.run(Thread.java:722)
   2) Thread[id=84, name=qtp1642399029-84 Acceptor2 SelectChannelConnector@0.0.0.0:57117, state=RUNNABLE, group=TGRP-BasicDistributedZkTest]
        at sun.nio.ch.ServerSocketChannelImpl.accept0(Native Method)
        at sun.nio.ch.ServerSocketChannelImpl.accept(ServerSocketChannelImpl.java:226)
        at org.eclipse.jetty.server.nio.SelectChannelConnector.accept(SelectChannelConnector.java:104)
        at org.eclipse.jetty.server.AbstractConnector$Acceptor.run(AbstractConnector.java:933)
        at org.eclipse.jetty.util.thread.QueuedThreadPool.runJob(QueuedThreadPool.java:599)
        at org.eclipse.jetty.util.thread.QueuedThreadPool$3.run(QueuedThreadPool.java:534)
        at java.lang.Thread.run(Thread.java:722)
   3) Thread[id=135, name=qtp462026823-135 Acceptor3 SelectChannelConnector@0.0.0.0:51712, state=RUNNABLE, group=TGRP-BasicDistributedZkTest]
        at sun.nio.ch.ServerSocketChannelImpl.accept0(Native Method)
        at sun.nio.ch.ServerSocketChannelImpl.accept(ServerSocketChannelImpl.java:226)
        at org.eclipse.jetty.server.nio.SelectChannelConnector.accept(SelectChannelConnector.java:104)
        at org.eclipse.jetty.server.AbstractConnector$Acceptor.run(AbstractConnector.java:933)
        at org.eclipse.jetty.util.thread.QueuedThreadPool.runJob(QueuedThreadPool.java:599)
        at org.eclipse.jetty.util.thread.QueuedThreadPool$3.run(QueuedThreadPool.java:534)
        at java.lang.Thread.run(Thread.java:722)
   4) Thread[id=151, name=qtp1633289861-151 Acceptor1 SelectChannelConnector@0.0.0.0:51719, state=BLOCKED, group=TGRP-BasicDistributedZkTest]
        at sun.nio.ch.ServerSocketChannelImpl.accept(ServerSocketChannelImpl.java:210)
        at org.eclipse.jetty.server.nio.SelectChannelConnector.accept(SelectChannelConnector.java:104)
        at org.eclipse.jetty.server.AbstractConnector$Acceptor.run(AbstractConnector.java:933)
        at org.eclipse.jetty.util.thread.QueuedThreadPool.runJob(QueuedThreadPool.java:599)
        at org.eclipse.jetty.util.thread.QueuedThreadPool$3.run(QueuedThreadPool.java:534)
        at java.lang.Thread.run(Thread.java:722)
   5) Thread[id=83, name=qtp1642399029-83 Acceptor1 SelectChannelConnector@0.0.0.0:57117, state=BLOCKED, group=TGRP-BasicDistributedZkTest]
        at sun.nio.ch.ServerSocketChannelImpl.accept(ServerSocketChannelImpl.java:210)
        at org.eclipse.jetty.server.nio.SelectChannelConnector.accept(SelectChannelConnector.java:104)
        at org.eclipse.jetty.server.AbstractConnector$Acceptor.run(AbstractConnector.java:933)
        at org.eclipse.jetty.util.thread.QueuedThreadPool.runJob(QueuedThreadPool.java:599)
        at org.eclipse.jetty.util.thread.QueuedThreadPool$3.run(QueuedThreadPool.java:534)
        at java.lang.Thread.run(Thread.java:722)
   6) Thread[id=132, name=qtp462026823-132 Acceptor0 SelectChannelConnector@0.0.0.0:51712, state=BLOCKED, group=TGRP-BasicDistributedZkTest]
        at sun.nio.ch.ServerSocketChannelImpl.accept(ServerSocketChannelImpl.java:210)
        at org.eclipse.jetty.server.nio.SelectChannelConnector.accept(SelectChannelConnector.java:104)
        at org.eclipse.jetty.server.AbstractConnector$Acceptor.run(AbstractConnector.java:933)
        at org.eclipse.jetty.util.thread.QueuedThreadPool.runJob(QueuedThreadPool.java:599)
        at org.eclipse.jetty.util.thread.QueuedThreadPool$3.run(QueuedThreadPool.java:534)
        at java.lang.Thread.run(Thread.java:722)
   7) Thread[id=85, name=qtp1642399029-85 Acceptor3 SelectChannelConnector@0.0.0.0:57117, state=BLOCKED, group=TGRP-BasicDistributedZkTest]
        at sun.nio.ch.ServerSocketChannelImpl.accept(ServerSocketChannelImpl.java:210)
        at org.eclipse.jetty.server.nio.SelectChannelConnector.accept(SelectChannelConnector.java:104)
        at org.eclipse.jetty.server.AbstractConnector$Acceptor.run(AbstractConnector.java:933)
        at org.eclipse.jetty.util.thread.QueuedThreadPool.runJob(QueuedThreadPool.java:599)
        at org.eclipse.jetty.util.thread.QueuedThreadPool$3.run(QueuedThreadPool.java:534)
        at java.lang.Thread.run(Thread.java:722)
   8) Thread[id=153, name=qtp1633289861-153 Acceptor3 SelectChannelConnector@0.0.0.0:51719, state=BLOCKED, group=TGRP-BasicDistributedZkTest]
        at sun.nio.ch.ServerSocketChannelImpl.accept(ServerSocketChannelImpl.java:210)
        at org.eclipse.jetty.server.nio.SelectChannelConnector.accept(SelectChannelConnector.java:104)
        at org.eclipse.jetty.server.AbstractConnector$Acceptor.run(AbstractConnector.java:933)
        at org.eclipse.jetty.util.thread.QueuedThreadPool.runJob(QueuedThreadPool.java:599)
        at org.eclipse.jetty.util.thread.QueuedThreadPool$3.run(QueuedThreadPool.java:534)
        at java.lang.Thread.run(Thread.java:722)
   9) Thread[id=152, name=qtp1633289861-152 Acceptor2 SelectChannelConnector@0.0.0.0:51719, state=BLOCKED, group=TGRP-BasicDistributedZkTest]
        at sun.nio.ch.ServerSocketChannelImpl.accept(ServerSocketChannelImpl.java:210)
        at org.eclipse.jetty.server.nio.SelectChannelConnector.accept(SelectChannelConnector.java:104)
        at org.eclipse.jetty.server.AbstractConnector$Acceptor.run(AbstractConnector.java:933)
        at org.eclipse.jetty.util.thread.QueuedThreadPool.runJob(QueuedThreadPool.java:599)
        at org.eclipse.jetty.util.thread.QueuedThreadPool$3.run(QueuedThreadPool.java:534)
        at java.lang.Thread.run(Thread.java:722)
  10) Thread[id=134, name=qtp462026823-134 Acceptor2 SelectChannelConnector@0.0.0.0:51712, state=BLOCKED, group=TGRP-BasicDistributedZkTest]
        at sun.nio.ch.ServerSocketChannelImpl.accept(ServerSocketChannelImpl.java:210)
        at org.eclipse.jetty.server.nio.SelectChannelConnector.accept(SelectChannelConnector.java:104)
        at org.eclipse.jetty.server.AbstractConnector$Acceptor.run(AbstractConnector.java:933)
        at org.eclipse.jetty.util.thread.QueuedThreadPool.runJob(QueuedThreadPool.java:599)
        at org.eclipse.jetty.util.thread.QueuedThreadPool$3.run(QueuedThreadPool.java:534)
        at java.lang.Thread.run(Thread.java:722)
  11) Thread[id=150, name=qtp1633289861-150 Acceptor0 SelectChannelConnector@0.0.0.0:51719, state=RUNNABLE, group=TGRP-BasicDistributedZkTest]
        at sun.nio.ch.ServerSocketChannelImpl.accept0(Native Method)
        at sun.nio.ch.ServerSocketChannelImpl.accept(ServerSocketChannelImpl.java:226)
        at org.eclipse.jetty.server.nio.SelectChannelConnector.accept(SelectChannelConnector.java:104)
        at org.eclipse.jetty.server.AbstractConnector$Acceptor.run(AbstractConnector.java:933)
        at org.eclipse.jetty.util.thread.QueuedThreadPool.runJob(QueuedThreadPool.java:599)
        at org.eclipse.jetty.util.thread.QueuedThreadPool$3.run(QueuedThreadPool.java:534)
        at java.lang.Thread.run(Thread.java:722)
  12) Thread[id=82, name=qtp1642399029-82 Acceptor0 SelectChannelConnector@0.0.0.0:57117, state=BLOCKED, group=TGRP-BasicDistributedZkTest]
        at sun.nio.ch.ServerSocketChannelImpl.accept(ServerSocketChannelImpl.java:210)
        at org.eclipse.jetty.server.nio.SelectChannelConnector.accept(SelectChannelConnector.java:104)
        at org.eclipse.jetty.server.AbstractConnector$Acceptor.run(AbstractConnector.java:933)
        at org.eclipse.jetty.util.thread.QueuedThreadPool.runJob(QueuedThreadPool.java:599)
        at org.eclipse.jetty.util.thread.QueuedThreadPool$3.run(QueuedThreadPool.java:534)
        at java.lang.Thread.run(Thread.java:722)
	at __randomizedtesting.SeedInfo.seed([64D3BA166035617A]:0)


FAILED:  junit.framework.TestSuite.org.apache.solr.handler.admin.ShowFileRequestHandlerTest

Error Message:
4 threads leaked from SUITE scope at org.apache.solr.handler.admin.ShowFileRequestHandlerTest:     1) Thread[id=579, name=qtp2146549712-579 Acceptor1 SelectChannelConnector@0.0.0.0:51926, state=BLOCKED, group=TGRP-ShowFileRequestHandlerTest]         at sun.nio.ch.ServerSocketChannelImpl.accept(ServerSocketChannelImpl.java:210)         at org.eclipse.jetty.server.nio.SelectChannelConnector.accept(SelectChannelConnector.java:104)         at org.eclipse.jetty.server.AbstractConnector$Acceptor.run(AbstractConnector.java:933)         at org.eclipse.jetty.util.thread.QueuedThreadPool.runJob(QueuedThreadPool.java:599)         at org.eclipse.jetty.util.thread.QueuedThreadPool$3.run(QueuedThreadPool.java:534)         at java.lang.Thread.run(Thread.java:722)    2) Thread[id=581, name=qtp2146549712-581 Acceptor3 SelectChannelConnector@0.0.0.0:51926, state=BLOCKED, group=TGRP-ShowFileRequestHandlerTest]         at sun.nio.ch.ServerSocketChannelImpl.accept(ServerSocketChannelImpl.java:210)         at org.eclipse.jetty.server.nio.SelectChannelConnector.accept(SelectChannelConnector.java:104)         at org.eclipse.jetty.server.AbstractConnector$Acceptor.run(AbstractConnector.java:933)         at org.eclipse.jetty.util.thread.QueuedThreadPool.runJob(QueuedThreadPool.java:599)         at org.eclipse.jetty.util.thread.QueuedThreadPool$3.run(QueuedThreadPool.java:534)         at java.lang.Thread.run(Thread.java:722)    3) Thread[id=580, name=qtp2146549712-580 Acceptor2 SelectChannelConnector@0.0.0.0:51926, state=RUNNABLE, group=TGRP-ShowFileRequestHandlerTest]         at sun.nio.ch.ServerSocketChannelImpl.accept0(Native Method)         at sun.nio.ch.ServerSocketChannelImpl.accept(ServerSocketChannelImpl.java:226)         at org.eclipse.jetty.server.nio.SelectChannelConnector.accept(SelectChannelConnector.java:104)         at org.eclipse.jetty.server.AbstractConnector$Acceptor.run(AbstractConnector.java:933)         at org.eclipse.jetty.util.thread.QueuedThreadPool.runJob(QueuedThreadPool.java:599)         at org.eclipse.jetty.util.thread.QueuedThreadPool$3.run(QueuedThreadPool.java:534)         at java.lang.Thread.run(Thread.java:722)    4) Thread[id=578, name=qtp2146549712-578 Acceptor0 SelectChannelConnector@0.0.0.0:51926, state=BLOCKED, group=TGRP-ShowFileRequestHandlerTest]         at sun.nio.ch.ServerSocketChannelImpl.accept(ServerSocketChannelImpl.java:210)         at org.eclipse.jetty.server.nio.SelectChannelConnector.accept(SelectChannelConnector.java:104)         at org.eclipse.jetty.server.AbstractConnector$Acceptor.run(AbstractConnector.java:933)         at org.eclipse.jetty.util.thread.QueuedThreadPool.runJob(QueuedThreadPool.java:599)         at org.eclipse.jetty.util.thread.QueuedThreadPool$3.run(QueuedThreadPool.java:534)         at java.lang.Thread.run(Thread.java:722)

Stack Trace:
com.carrotsearch.randomizedtesting.ThreadLeakError: 4 threads leaked from SUITE scope at org.apache.solr.handler.admin.ShowFileRequestHandlerTest: 
   1) Thread[id=579, name=qtp2146549712-579 Acceptor1 SelectChannelConnector@0.0.0.0:51926, state=BLOCKED, group=TGRP-ShowFileRequestHandlerTest]
        at sun.nio.ch.ServerSocketChannelImpl.accept(ServerSocketChannelImpl.java:210)
        at org.eclipse.jetty.server.nio.SelectChannelConnector.accept(SelectChannelConnector.java:104)
        at org.eclipse.jetty.server.AbstractConnector$Acceptor.run(AbstractConnector.java:933)
        at org.eclipse.jetty.util.thread.QueuedThreadPool.runJob(QueuedThreadPool.java:599)
        at org.eclipse.jetty.util.thread.QueuedThreadPool$3.run(QueuedThreadPool.java:534)
        at java.lang.Thread.run(Thread.java:722)
   2) Thread[id=581, name=qtp2146549712-581 Acceptor3 SelectChannelConnector@0.0.0.0:51926, state=BLOCKED, group=TGRP-ShowFileRequestHandlerTest]
        at sun.nio.ch.ServerSocketChannelImpl.accept(ServerSocketChannelImpl.java:210)
        at org.eclipse.jetty.server.nio.SelectChannelConnector.accept(SelectChannelConnector.java:104)
        at org.eclipse.jetty.server.AbstractConnector$Acceptor.run(AbstractConnector.java:933)
        at org.eclipse.jetty.util.thread.QueuedThreadPool.runJob(QueuedThreadPool.java:599)
        at org.eclipse.jetty.util.thread.QueuedThreadPool$3.run(QueuedThreadPool.java:534)
        at java.lang.Thread.run(Thread.java:722)
   3) Thread[id=580, name=qtp2146549712-580 Acceptor2 SelectChannelConnector@0.0.0.0:51926, state=RUNNABLE, group=TGRP-ShowFileRequestHandlerTest]
        at sun.nio.ch.ServerSocketChannelImpl.accept0(Native Method)
        at sun.nio.ch.ServerSocketChannelImpl.accept(ServerSocketChannelImpl.java:226)
        at org.eclipse.jetty.server.nio.SelectChannelConnector.accept(SelectChannelConnector.java:104)
        at org.eclipse.jetty.server.AbstractConnector$Acceptor.run(AbstractConnector.java:933)
        at org.eclipse.jetty.util.thread.QueuedThreadPool.runJob(QueuedThreadPool.java:599)
        at org.eclipse.jetty.util.thread.QueuedThreadPool$3.run(QueuedThreadPool.java:534)
        at java.lang.Thread.run(Thread.java:722)
   4) Thread[id=578, name=qtp2146549712-578 Acceptor0 SelectChannelConnector@0.0.0.0:51926, state=BLOCKED, group=TGRP-ShowFileRequestHandlerTest]
        at sun.nio.ch.ServerSocketChannelImpl.accept(ServerSocketChannelImpl.java:210)
        at org.eclipse.jetty.server.nio.SelectChannelConnector.accept(SelectChannelConnector.java:104)
        at org.eclipse.jetty.server.AbstractConnector$Acceptor.run(AbstractConnector.java:933)
        at org.eclipse.jetty.util.thread.QueuedThreadPool.runJob(QueuedThreadPool.java:599)
        at org.eclipse.jetty.util.thread.QueuedThreadPool$3.run(QueuedThreadPool.java:534)
        at java.lang.Thread.run(Thread.java:722)
	at __randomizedtesting.SeedInfo.seed([64D3BA166035617A]:0)


FAILED:  junit.framework.TestSuite.org.apache.solr.handler.admin.ShowFileRequestHandlerTest

Error Message:
There are still zombie threads that couldn't be terminated:    1) Thread[id=579, name=qtp2146549712-579 Acceptor1 SelectChannelConnector@0.0.0.0:51926, state=BLOCKED, group=TGRP-ShowFileRequestHandlerTest]         at sun.nio.ch.ServerSocketChannelImpl.accept(ServerSocketChannelImpl.java:210)         at org.eclipse.jetty.server.nio.SelectChannelConnector.accept(SelectChannelConnector.java:104)         at org.eclipse.jetty.server.AbstractConnector$Acceptor.run(AbstractConnector.java:933)         at org.eclipse.jetty.util.thread.QueuedThreadPool.runJob(QueuedThreadPool.java:599)         at org.eclipse.jetty.util.thread.QueuedThreadPool$3.run(QueuedThreadPool.java:534)         at java.lang.Thread.run(Thread.java:722)    2) Thread[id=581, name=qtp2146549712-581 Acceptor3 SelectChannelConnector@0.0.0.0:51926, state=BLOCKED, group=TGRP-ShowFileRequestHandlerTest]         at sun.nio.ch.ServerSocketChannelImpl.accept(ServerSocketChannelImpl.java:210)         at org.eclipse.jetty.server.nio.SelectChannelConnector.accept(SelectChannelConnector.java:104)         at org.eclipse.jetty.server.AbstractConnector$Acceptor.run(AbstractConnector.java:933)         at org.eclipse.jetty.util.thread.QueuedThreadPool.runJob(QueuedThreadPool.java:599)         at org.eclipse.jetty.util.thread.QueuedThreadPool$3.run(QueuedThreadPool.java:534)         at java.lang.Thread.run(Thread.java:722)    3) Thread[id=580, name=qtp2146549712-580 Acceptor2 SelectChannelConnector@0.0.0.0:51926, state=RUNNABLE, group=TGRP-ShowFileRequestHandlerTest]         at sun.nio.ch.ServerSocketChannelImpl.accept0(Native Method)         at sun.nio.ch.ServerSocketChannelImpl.accept(ServerSocketChannelImpl.java:226)         at org.eclipse.jetty.server.nio.SelectChannelConnector.accept(SelectChannelConnector.java:104)         at org.eclipse.jetty.server.AbstractConnector$Acceptor.run(AbstractConnector.java:933)         at org.eclipse.jetty.util.thread.QueuedThreadPool.runJob(QueuedThreadPool.java:599)         at org.eclipse.jetty.util.thread.QueuedThreadPool$3.run(QueuedThreadPool.java:534)         at java.lang.Thread.run(Thread.java:722)    4) Thread[id=578, name=qtp2146549712-578 Acceptor0 SelectChannelConnector@0.0.0.0:51926, state=BLOCKED, group=TGRP-ShowFileRequestHandlerTest]         at sun.nio.ch.ServerSocketChannelImpl.accept(ServerSocketChannelImpl.java:210)         at org.eclipse.jetty.server.nio.SelectChannelConnector.accept(SelectChannelConnector.java:104)         at org.eclipse.jetty.server.AbstractConnector$Acceptor.run(AbstractConnector.java:933)         at org.eclipse.jetty.util.thread.QueuedThreadPool.runJob(QueuedThreadPool.java:599)         at org.eclipse.jetty.util.thread.QueuedThreadPool$3.run(QueuedThreadPool.java:534)         at java.lang.Thread.run(Thread.java:722)

Stack Trace:
com.carrotsearch.randomizedtesting.ThreadLeakError: There are still zombie threads that couldn't be terminated:
   1) Thread[id=579, name=qtp2146549712-579 Acceptor1 SelectChannelConnector@0.0.0.0:51926, state=BLOCKED, group=TGRP-ShowFileRequestHandlerTest]
        at sun.nio.ch.ServerSocketChannelImpl.accept(ServerSocketChannelImpl.java:210)
        at org.eclipse.jetty.server.nio.SelectChannelConnector.accept(SelectChannelConnector.java:104)
        at org.eclipse.jetty.server.AbstractConnector$Acceptor.run(AbstractConnector.java:933)
        at org.eclipse.jetty.util.thread.QueuedThreadPool.runJob(QueuedThreadPool.java:599)
        at org.eclipse.jetty.util.thread.QueuedThreadPool$3.run(QueuedThreadPool.java:534)
        at java.lang.Thread.run(Thread.java:722)
   2) Thread[id=581, name=qtp2146549712-581 Acceptor3 SelectChannelConnector@0.0.0.0:51926, state=BLOCKED, group=TGRP-ShowFileRequestHandlerTest]
        at sun.nio.ch.ServerSocketChannelImpl.accept(ServerSocketChannelImpl.java:210)
        at org.eclipse.jetty.server.nio.SelectChannelConnector.accept(SelectChannelConnector.java:104)
        at org.eclipse.jetty.server.AbstractConnector$Acceptor.run(AbstractConnector.java:933)
        at org.eclipse.jetty.util.thread.QueuedThreadPool.runJob(QueuedThreadPool.java:599)
        at org.eclipse.jetty.util.thread.QueuedThreadPool$3.run(QueuedThreadPool.java:534)
        at java.lang.Thread.run(Thread.java:722)
   3) Thread[id=580, name=qtp2146549712-580 Acceptor2 SelectChannelConnector@0.0.0.0:51926, state=RUNNABLE, group=TGRP-ShowFileRequestHandlerTest]
        at sun.nio.ch.ServerSocketChannelImpl.accept0(Native Method)
        at sun.nio.ch.ServerSocketChannelImpl.accept(ServerSocketChannelImpl.java:226)
        at org.eclipse.jetty.server.nio.SelectChannelConnector.accept(SelectChannelConnector.java:104)
        at org.eclipse.jetty.server.AbstractConnector$Acceptor.run(AbstractConnector.java:933)
        at org.eclipse.jetty.util.thread.QueuedThreadPool.runJob(QueuedThreadPool.java:599)
        at org.eclipse.jetty.util.thread.QueuedThreadPool$3.run(QueuedThreadPool.java:534)
        at java.lang.Thread.run(Thread.java:722)
   4) Thread[id=578, name=qtp2146549712-578 Acceptor0 SelectChannelConnector@0.0.0.0:51926, state=BLOCKED, group=TGRP-ShowFileRequestHandlerTest]
        at sun.nio.ch.ServerSocketChannelImpl.accept(ServerSocketChannelImpl.java:210)
        at org.eclipse.jetty.server.nio.SelectChannelConnector.accept(SelectChannelConnector.java:104)
        at org.eclipse.jetty.server.AbstractConnector$Acceptor.run(AbstractConnector.java:933)
        at org.eclipse.jetty.util.thread.QueuedThreadPool.runJob(QueuedThreadPool.java:599)
        at org.eclipse.jetty.util.thread.QueuedThreadPool$3.run(QueuedThreadPool.java:534)
        at java.lang.Thread.run(Thread.java:722)
	at __randomizedtesting.SeedInfo.seed([64D3BA166035617A]:0)




Build Log:
[...truncated 8435 lines...]
[junit4:junit4] Suite: org.apache.solr.handler.admin.ShowFileRequestHandlerTest
[junit4:junit4]   2> 8 T571 oas.SolrTestCaseJ4.initCore ####initCore
[junit4:junit4]   2> Creating dataDir: /usr/home/hudson/hudson-slave/workspace/Lucene-Solr-Tests-4.x-java7/solr/build/solr-core/test/J1/./solrtest-ShowFileRequestHandlerTest-1351625524851
[junit4:junit4]   2> 9 T571 oas.SolrTestCaseJ4.initCore ####initCore end
[junit4:junit4]   2> 767 T571 oejs.Server.doStart jetty-8.1.2.v20120308
[junit4:junit4]   2> 1257 T571 oejs.AbstractConnector.doStart Started SelectChannelConnector@0.0.0.0:51926
[junit4:junit4]   2> 1315 T571 oasc.SolrResourceLoader.locateSolrHome JNDI not configured for solr (NoInitialContextEx)
[junit4:junit4]   2> 1315 T571 oasc.SolrResourceLoader.locateSolrHome using system property solr.solr.home: /usr/home/hudson/hudson-slave/workspace/Lucene-Solr-Tests-4.x-java7/solr/example/solr
[junit4:junit4]   2> 1316 T571 oasc.SolrResourceLoader.<init> new SolrResourceLoader for deduced Solr Home: '/usr/home/hudson/hudson-slave/workspace/Lucene-Solr-Tests-4.x-java7/solr/example/solr/'
[junit4:junit4]   2> 1379 T571 oass.SolrDispatchFilter.init SolrDispatchFilter.init()
[junit4:junit4]   2> 1380 T571 oasc.SolrResourceLoader.locateSolrHome JNDI not configured for solr (NoInitialContextEx)
[junit4:junit4]   2> 1380 T571 oasc.SolrResourceLoader.locateSolrHome using system property solr.solr.home: /usr/home/hudson/hudson-slave/workspace/Lucene-Solr-Tests-4.x-java7/solr/example/solr
[junit4:junit4]   2> 1380 T571 oasc.CoreContainer$Initializer.initialize looking for solr.xml: /usr/home/hudson/hudson-slave/workspace/Lucene-Solr-Tests-4.x-java7/solr/example/solr/solr.xml
[junit4:junit4]   2> 1381 T571 oasc.CoreContainer.<init> New CoreContainer 1422390012
[junit4:junit4]   2> 1382 T571 oasc.CoreContainer.load Loading CoreContainer using Solr Home: '/usr/home/hudson/hudson-slave/workspace/Lucene-Solr-Tests-4.x-java7/solr/example/solr/'
[junit4:junit4]   2> 1382 T571 oasc.SolrResourceLoader.<init> new SolrResourceLoader for directory: '/usr/home/hudson/hudson-slave/workspace/Lucene-Solr-Tests-4.x-java7/solr/example/solr/'
[junit4:junit4]   2> 1441 T571 oasc.CoreContainer.load Registering Log Listener
[junit4:junit4]   2> 1507 T571 oasc.CoreContainer.create Creating SolrCore 'collection1' using instanceDir: /usr/home/hudson/hudson-slave/workspace/Lucene-Solr-Tests-4.x-java7/solr/example/solr/collection1
[junit4:junit4]   2> 1508 T571 oasc.SolrResourceLoader.<init> new SolrResourceLoader for directory: '/usr/home/hudson/hudson-slave/workspace/Lucene-Solr-Tests-4.x-java7/solr/example/solr/collection1/'
[junit4:junit4]   2> 1545 T571 oasc.SolrConfig.initLibs Adding specified lib dirs to ClassLoader
[junit4:junit4]   2> 1641 T571 oasc.SolrConfig.<init> Using Lucene MatchVersion: LUCENE_41
[junit4:junit4]   2> 1771 T571 oasc.SolrConfig.<init> Loaded SolrConfig: solrconfig.xml
[junit4:junit4]   2> 1772 T571 oass.IndexSchema.readSchema Reading Solr Schema
[junit4:junit4]   2> 1796 T571 oass.IndexSchema.readSchema Schema name=example
[junit4:junit4]   2> 3265 T571 oass.IndexSchema.readSchema unique key field: id
[junit4:junit4]   2> 3316 T571 oass.FileExchangeRateProvider.reload Reloading exchange rates from file currency.xml
[junit4:junit4]   2> 3334 T571 oass.FileExchangeRateProvider.reload Reloading exchange rates from file currency.xml
[junit4:junit4]   2> 3713 T571 oasc.SolrCore.<init> [collection1] Opening new SolrCore at /usr/home/hudson/hudson-slave/workspace/Lucene-Solr-Tests-4.x-java7/solr/example/solr/collection1/, dataDir=/usr/home/hudson/hudson-slave/workspace/Lucene-Solr-Tests-4.x-java7/solr/build/solr-core/test/J1/solrtest-ShowFileRequestHandlerTest-1351625524851/
[junit4:junit4]   2> 3714 T571 oasc.JmxMonitoredMap.<init> JMX monitoring is enabled. Adding Solr mbeans to JMX Server: com.sun.jmx.mbeanserver.JmxMBeanServer@2d4bdc05
[junit4:junit4]   2> 3754 T571 oasc.SolrCore.initListeners [collection1] Added SolrEventListener for newSearcher: org.apache.solr.core.QuerySenderListener{queries=[]}
[junit4:junit4]   2> 3754 T571 oasc.SolrCore.initListeners [collection1] Added SolrEventListener for firstSearcher: org.apache.solr.core.QuerySenderListener{queries=[{q=static firstSearcher warming in solrconfig.xml}]}
[junit4:junit4]   2> 3755 T571 oasc.SolrCore.getNewIndexDir New index directory detected: old=null new=/usr/home/hudson/hudson-slave/workspace/Lucene-Solr-Tests-4.x-java7/solr/build/solr-core/test/J1/solrtest-ShowFileRequestHandlerTest-1351625524851/index/
[junit4:junit4]   2> 3756 T571 oasc.SolrCore.initIndex WARNING [collection1] Solr index directory '/usr/home/hudson/hudson-slave/workspace/Lucene-Solr-Tests-4.x-java7/solr/build/solr-core/test/J1/solrtest-ShowFileRequestHandlerTest-1351625524851/index' doesn't exist. Creating new index...
[junit4:junit4]   2> 3757 T571 oasc.CachingDirectoryFactory.get return new directory for /usr/home/hudson/hudson-slave/workspace/Lucene-Solr-Tests-4.x-java7/solr/build/solr-core/test/J1/solrtest-ShowFileRequestHandlerTest-1351625524851/index forceNew:false
[junit4:junit4]   2> 3760 T571 oasc.SolrDeletionPolicy.onCommit SolrDeletionPolicy.onCommit: commits:num=1
[junit4:junit4]   2> 		commit{dir=MockDirWrapper(NRTCachingDirectory(org.apache.lucene.store.RAMDirectory@25c50d1f lockFactory=org.apache.lucene.store.NativeFSLockFactory@4d2f5143; maxCacheMB=0.9921875 maxMergeSizeMB=0.9560546875)),segFN=segments_1,generation=1,filenames=[segments_1]
[junit4:junit4]   2> 3760 T571 oasc.SolrDeletionPolicy.updateCommits newest commit = 1
[junit4:junit4]   2> 3796 T571 oasc.SolrCore.initWriters created json: solr.JSONResponseWriter
[junit4:junit4]   2> 3796 T571 oasc.SolrCore.initWriters adding lazy queryResponseWriter: solr.VelocityResponseWriter
[junit4:junit4]   2> 3801 T571 oasc.SolrCore.initWriters created velocity: solr.VelocityResponseWriter
[junit4:junit4]   2> 3844 T571 oasc.SolrCore.initWriters created xslt: solr.XSLTResponseWriter
[junit4:junit4]   2> 3845 T571 oasr.XSLTResponseWriter.init xsltCacheLifetimeSeconds=5
[junit4:junit4]   2> 4047 T571 oasc.RequestHandlers.initHandlersFromConfig created /select: solr.SearchHandler
[junit4:junit4]   2> 4048 T571 oasc.RequestHandlers.initHandlersFromConfig created /query: solr.SearchHandler
[junit4:junit4]   2> 4049 T571 oasc.RequestHandlers.initHandlersFromConfig created /get: solr.RealTimeGetHandler
[junit4:junit4]   2> 4050 T571 oasc.RequestHandlers.initHandlersFromConfig created /browse: solr.SearchHandler
[junit4:junit4]   2> 4050 T571 oasc.RequestHandlers.initHandlersFromConfig created /update: solr.UpdateRequestHandler
[junit4:junit4]   2> 4073 T571 oasc.RequestHandlers.initHandlersFromConfig created /update/json: solr.JsonUpdateRequestHandler
[junit4:junit4]   2> 4091 T571 oasc.RequestHandlers.initHandlersFromConfig created /update/csv: solr.CSVRequestHandler
[junit4:junit4]   2> 4091 T571 oasc.RequestHandlers.initHandlersFromConfig adding lazy requestHandler: solr.extraction.ExtractingRequestHandler
[junit4:junit4]   2> 4092 T571 oasc.RequestHandlers.initHandlersFromConfig created /update/extract: solr.extraction.ExtractingRequestHandler
[junit4:junit4]   2> 4092 T571 oasc.RequestHandlers.initHandlersFromConfig adding lazy requestHandler: solr.FieldAnalysisRequestHandler
[junit4:junit4]   2> 4093 T571 oasc.RequestHandlers.initHandlersFromConfig created /analysis/field: solr.FieldAnalysisRequestHandler
[junit4:junit4]   2> 4093 T571 oasc.RequestHandlers.initHandlersFromConfig adding lazy requestHandler: solr.DocumentAnalysisRequestHandler
[junit4:junit4]   2> 4094 T571 oasc.RequestHandlers.initHandlersFromConfig created /analysis/document: solr.DocumentAnalysisRequestHandler
[junit4:junit4]   2> 4120 T571 oasc.RequestHandlers.initHandlersFromConfig created /admin/: solr.admin.AdminHandlers
[junit4:junit4]   2> 4140 T571 oasc.RequestHandlers.initHandlersFromConfig created /admin/ping: solr.PingRequestHandler
[junit4:junit4]   2> 4141 T571 oasc.RequestHandlers.initHandlersFromConfig created /debug/dump: solr.DumpRequestHandler
[junit4:junit4]   2> 4184 T571 oasc.RequestHandlers.initHandlersFromConfig created /replication: solr.ReplicationHandler
[junit4:junit4]   2> 4185 T571 oasc.RequestHandlers.initHandlersFromConfig adding lazy requestHandler: solr.SearchHandler
[junit4:junit4]   2> 4185 T571 oasc.RequestHandlers.initHandlersFromConfig created /spell: solr.SearchHandler
[junit4:junit4]   2> 4185 T571 oasc.RequestHandlers.initHandlersFromConfig adding lazy requestHandler: solr.SearchHandler
[junit4:junit4]   2> 4186 T571 oasc.RequestHandlers.initHandlersFromConfig created /tvrh: solr.SearchHandler
[junit4:junit4]   2> 4186 T571 oasc.RequestHandlers.initHandlersFromConfig adding lazy requestHandler: solr.SearchHandler
[junit4:junit4]   2> 4187 T571 oasc.RequestHandlers.initHandlersFromConfig created /terms: solr.SearchHandler
[junit4:junit4]   2> 4187 T571 oasc.RequestHandlers.initHandlersFromConfig adding lazy requestHandler: solr.SearchHandler
[junit4:junit4]   2> 4188 T571 oasc.RequestHandlers.initHandlersFromConfig created /elevate: solr.SearchHandler
[junit4:junit4]   2> 4202 T571 oashl.XMLLoader.init xsltCacheLifetimeSeconds=60
[junit4:junit4]   2> 4204 T571 oashl.XMLLoader.init xsltCacheLifetimeSeconds=60
[junit4:junit4]   2> 4206 T571 oashl.XMLLoader.init xsltCacheLifetimeSeconds=60
[junit4:junit4]   2> 4215 T571 oass.SolrIndexSearcher.<init> Opening Searcher@3cabdc0f main
[junit4:junit4]   2> 4215 T571 oass.SolrIndexSearcher.getIndexDir WARNING WARNING: Directory impl does not support setting indexDir: org.apache.lucene.store.MockDirectoryWrapper
[junit4:junit4]   2> 4258 T571 oasu.CommitTracker.<init> Hard AutoCommit: if uncommited for 15000ms; 
[junit4:junit4]   2> 4258 T571 oasu.CommitTracker.<init> Soft AutoCommit: disabled
[junit4:junit4]   2> 4259 T571 oashc.SpellCheckComponent.inform Initializing spell checkers
[junit4:junit4]   2> 4326 T571 oass.DirectSolrSpellChecker.init init: {name=default,field=name,classname=solr.DirectSolrSpellChecker,distanceMeasure=internal,accuracy=0.5,maxEdits=2,minPrefix=1,maxInspections=5,minQueryLength=4,maxQueryFrequency=0.01}
[junit4:junit4]   2> 4327 T571 oashc.SpellCheckComponent.inform No queryConverter defined, using default converter
[junit4:junit4]   2> 4351 T571 oashc.QueryElevationComponent.inform Loading QueryElevation from: /usr/home/hudson/hudson-slave/workspace/Lucene-Solr-Tests-4.x-java7/solr/example/solr/collection1/conf/elevate.xml
[junit4:junit4]   2> 4451 T571 oashc.HttpShardHandlerFactory.getParameter Setting socketTimeout to: 0
[junit4:junit4]   2> 4451 T571 oashc.HttpShardHandlerFactory.getParameter Setting urlScheme to: http://
[junit4:junit4]   2> 4452 T571 oashc.HttpShardHandlerFactory.getParameter Setting connTimeout to: 0
[junit4:junit4]   2> 4452 T571 oashc.HttpShardHandlerFactory.getParameter Setting maxConnectionsPerHost to: 20
[junit4:junit4]   2> 4453 T571 oashc.HttpShardHandlerFactory.getParameter Setting corePoolSize to: 0
[junit4:junit4]   2> 4453 T571 oashc.HttpShardHandlerFactory.getParameter Setting maximumPoolSize to: 2147483647
[junit4:junit4]   2> 4454 T571 oashc.HttpShardHandlerFactory.getParameter Setting maxThreadIdleTime to: 5
[junit4:junit4]   2> 4454 T571 oashc.HttpShardHandlerFactory.getParameter Setting sizeOfQueue to: -1
[junit4:junit4]   2> 4454 T571 oashc.HttpShardHandlerFactory.getParameter Setting fairnessPolicy to: false
[junit4:junit4]   2> 4455 T571 oascsi.HttpClientUtil.createClient Creating new http client, config:maxConnectionsPerHost=20&maxConnections=10000&socketTimeout=0&connTimeout=0&retry=false
[junit4:junit4]   2> 4494 T571 oash.ReplicationHandler.inform Commits will be reserved for  10000
[junit4:junit4]   2> 4495 T586 oasc.QuerySenderListener.newSearcher QuerySenderListener sending requests to Searcher@3cabdc0f main{StandardDirectoryReader(segments_1:1)}
[junit4:junit4]   2> ASYNC  NEW_CORE C10 name=collection1 org.apache.solr.core.SolrCore@2b70723d
[junit4:junit4]   2> 4547 T586 C10 REQ [collection1] webapp=null path=null params={event=firstSearcher&q=static+firstSearcher+warming+in+solrconfig.xml&distrib=false} hits=0 status=0 QTime=35 
[junit4:junit4]   2> 4547 T586 oasc.QuerySenderListener.newSearcher QuerySenderListener done.
[junit4:junit4]   2> 4548 T586 oashc.SpellCheckComponent$SpellCheckerListener.newSearcher Loading spell index for spellchecker: default
[junit4:junit4]   2> 4548 T586 oashc.SpellCheckComponent$SpellCheckerListener.newSearcher Loading spell index for spellchecker: wordbreak
[junit4:junit4]   2> 4551 T586 oasc.SolrCore.registerSearcher [collection1] Registered new searcher Searcher@3cabdc0f main{StandardDirectoryReader(segments_1:1)}
[junit4:junit4]   2> 4560 T571 oasc.CoreContainer.register registering core: collection1
[junit4:junit4]   2> 4561 T571 oass.SolrDispatchFilter.init user.dir=/usr/home/hudson/hudson-slave/workspace/Lucene-Solr-Tests-4.x-java7/solr/build/solr-core/test/J1
[junit4:junit4]   2> 4561 T571 oass.SolrDispatchFilter.init SolrDispatchFilter.init() done
[junit4:junit4]   2> 4562 T571 oas.SolrJettyTestBase.createJetty Jetty Assigned Port#51926
[junit4:junit4]   2> 4576 T571 oas.SolrTestCaseJ4.setUp ###Starting testGetRawFile
[junit4:junit4]   2> 4725 T571 oascsi.HttpClientUtil.createClient Creating new http client, config:maxConnections=128&maxConnectionsPerHost=32&followRedirects=false
[junit4:junit4]   2> 6026 T585 C10 REQ [collection1] webapp=/solr path=/admin/file params={wt=mock&file=schema.xml&version=2.2} status=0 QTime=9 
[junit4:junit4]   2> 6152 T571 oas.SolrTestCaseJ4.tearDown ###Ending testGetRawFile
[junit4:junit4]   2> 6159 T571 oas.SolrTestCaseJ4.setUp ###Starting testDirList
[junit4:junit4]   2> 6182 T583 C10 REQ [collection1] webapp=/solr path=/admin/file params={wt=javabin&version=2} status=0 QTime=8 
[junit4:junit4]   2> 6204 T571 oas.SolrTestCaseJ4.tearDown ###Ending testDirList
[junit4:junit4]   2> 6252 T571 oasc.CoreContainer.shutdown Shutting down CoreContainer instance=1422390012
[junit4:junit4]   2> 6252 T571 oasc.SolrCore.close [collection1]  CLOSING SolrCore org.apache.solr.core.SolrCore@2b70723d
[junit4:junit4]   2> 6267 T571 oasu.DirectUpdateHandler2.close closing DirectUpdateHandler2{commits=0,autocommit maxTime=15000ms,autocommits=0,soft autocommits=0,optimizes=0,rollbacks=0,expungeDeletes=0,docsPending=0,adds=0,deletesById=0,deletesByQuery=0,errors=0,cumulative_adds=0,cumulative_deletesById=0,cumulative_deletesByQuery=0,cumulative_errors=0}
[junit4:junit4]   2> 6267 T571 oasc.SolrCore.decrefSolrCoreState Closing SolrCoreState
[junit4:junit4]   2> 6268 T571 oasu.DefaultSolrCoreState.closeIndexWriter SolrCoreState ref count has reached 0 - closing IndexWriter
[junit4:junit4]   2> 6268 T571 oasu.DefaultSolrCoreState.closeIndexWriter closing IndexWriter with IndexWriterCloser
[junit4:junit4]   2> 6268 T571 oasc.SolrCore.closeSearcher [collection1] Closing main searcher on request.
[junit4:junit4]   2> 6270 T571 oejsh.ContextHandler.doStop stopped o.e.j.s.ServletContextHandler{/solr,null}
[junit4:junit4]   2> 6371 T571 oejut.QueuedThreadPool.doStop WARNING 4 threads could not be stopped
[junit4:junit4]   2> 6371 T571 oas.SolrTestCaseJ4.deleteCore ###deleteCore
[junit4:junit4]   2> 6377 T570 ccr.ThreadLeakControl.checkThreadLeaks WARNING Will linger awaiting termination of 4 leaked thread(s).
[junit4:junit4]   2> 26473 T570 ccr.ThreadLeakControl.checkThreadLeaks SEVERE 4 threads leaked from SUITE scope at org.apache.solr.handler.admin.ShowFileRequestHandlerTest: 
[junit4:junit4]   2> 	   1) Thread[id=579, name=qtp2146549712-579 Acceptor1 SelectChannelConnector@0.0.0.0:51926, state=BLOCKED, group=TGRP-ShowFileRequestHandlerTest]
[junit4:junit4]   2> 	        at sun.nio.ch.ServerSocketChannelImpl.accept(ServerSocketChannelImpl.java:210)
[junit4:junit4]   2> 	        at org.eclipse.jetty.server.nio.SelectChannelConnector.accept(SelectChannelConnector.java:104)
[junit4:junit4]   2> 	        at org.eclipse.jetty.server.AbstractConnector$Acceptor.run(AbstractConnector.java:933)
[junit4:junit4]   2> 	        at org.eclipse.jetty.util.thread.QueuedThreadPool.runJob(QueuedThreadPool.java:599)
[junit4:junit4]   2> 	        at org.eclipse.jetty.util.thread.QueuedThreadPool$3.run(QueuedThreadPool.java:534)
[junit4:junit4]   2> 	        at java.lang.Thread.run(Thread.java:722)
[junit4:junit4]   2> 	   2) Thread[id=581, name=qtp2146549712-581 Acceptor3 SelectChannelConnector@0.0.0.0:51926, state=BLOCKED, group=TGRP-ShowFileRequestHandlerTest]
[junit4:junit4]   2> 	        at sun.nio.ch.ServerSocketChannelImpl.accept(ServerSocketChannelImpl.java:210)
[junit4:junit4]   2> 	        at org.eclipse.jetty.server.nio.SelectChannelConnector.accept(SelectChannelConnector.java:104)
[junit4:junit4]   2> 	        at org.eclipse.jetty.server.AbstractConnector$Acceptor.run(AbstractConnector.java:933)
[junit4:junit4]   2> 	        at org.eclipse.jetty.util.thread.QueuedThreadPool.runJob(QueuedThreadPool.java:599)
[junit4:junit4]   2> 	        at org.eclipse.jetty.util.thread.QueuedThreadPool$3.run(QueuedThreadPool.java:534)
[junit4:junit4]   2> 	        at java.lang.Thread.run(Thread.java:722)
[junit4:junit4]   2> 	   3) Thread[id=580, name=qtp2146549712-580 Acceptor2 SelectChannelConnector@0.0.0.0:51926, state=RUNNABLE, group=TGRP-ShowFileRequestHandlerTest]
[junit4:junit4]   2> 	        at sun.nio.ch.ServerSocketChannelImpl.accept0(Native Method)
[junit4:junit4]   2> 	        at sun.nio.ch.ServerSocketChannelImpl.accept(ServerSocketChannelImpl.java:226)
[junit4:junit4]   2> 	        at org.eclipse.jetty.server.nio.SelectChannelConnector.accept(SelectChannelConnector.java:104)
[junit4:junit4]   2> 	        at org.eclipse.jetty.server.AbstractConnector$Acceptor.run(AbstractConnector.java:933)
[junit4:junit4]   2> 	        at org.eclipse.jetty.util.thread.QueuedThreadPool.runJob(QueuedThreadPool.java:599)
[junit4:junit4]   2> 	        at org.eclipse.jetty.util.thread.QueuedThreadPool$3.run(QueuedThreadPool.java:534)
[junit4:junit4]   2> 	        at java.lang.Thread.run(Thread.java:722)
[junit4:junit4]   2> 	   4) Thread[id=578, name=qtp2146549712-578 Acceptor0 SelectChannelConnector@0.0.0.0:51926, state=BLOCKED, group=TGRP-ShowFileRequestHandlerTest]
[junit4:junit4]   2> 	        at sun.nio.ch.ServerSocketChannelImpl.accept(ServerSocketChannelImpl.java:210)
[junit4:junit4]   2> 	        at org.eclipse.jetty.server.nio.SelectChannelConnector.accept(SelectChannelConnector.java:104)
[junit4:junit4]   2> 	        at org.eclipse.jetty.server.AbstractConnector$Acceptor.run(AbstractConnector.java:933)
[junit4:junit4]   2> 	        at org.eclipse.jetty.util.thread.QueuedThreadPool.runJob(QueuedThreadPool.java:599)
[junit4:junit4]   2> 	        at org.eclipse.jetty.util.thread.QueuedThreadPool$3.run(QueuedThreadPool.java:534)
[junit4:junit4]   2> 	        at java.lang.Thread.run(Thread.java:722)
[junit4:junit4]   2> 26474 T570 ccr.ThreadLeakControl.tryToInterruptAll Starting to interrupt leaked threads:
[junit4:junit4]   2> 	   1) Thread[id=579, name=qtp2146549712-579 Acceptor1 SelectChannelConnector@0.0.0.0:51926, state=BLOCKED, group=TGRP-ShowFileRequestHandlerTest]
[junit4:junit4]   2> 	   2) Thread[id=581, name=qtp2146549712-581 Acceptor3 SelectChannelConnector@0.0.0.0:51926, state=BLOCKED, group=TGRP-ShowFileRequestHandlerTest]
[junit4:junit4]   2> 	   3) Thread[id=580, name=qtp2146549712-580 Acceptor2 SelectChannelConnector@0.0.0.0:51926, state=RUNNABLE, group=TGRP-ShowFileRequestHandlerTest]
[junit4:junit4]   2> 	   4) Thread[id=578, name=qtp2146549712-578 Acceptor0 SelectChannelConnector@0.0.0.0:51926, state=BLOCKED, group=TGRP-ShowFileRequestHandlerTest]
[junit4:junit4]   2> 29518 T570 ccr.ThreadLeakControl.tryToInterruptAll SEVERE There are still zombie threads that couldn't be terminated:
[junit4:junit4]   2> 	   1) Thread[id=579, name=qtp2146549712-579 Acceptor1 SelectChannelConnector@0.0.0.0:51926, state=BLOCKED, group=TGRP-ShowFileRequestHandlerTest]
[junit4:junit4]   2> 	        at sun.nio.ch.ServerSocketChannelImpl.accept(ServerSocketChannelImpl.java:210)
[junit4:junit4]   2> 	        at org.eclipse.jetty.server.nio.SelectChannelConnector.accept(SelectChannelConnector.java:104)
[junit4:junit4]   2> 	        at org.eclipse.jetty.server.AbstractConnector$Acceptor.run(AbstractConnector.java:933)
[junit4:junit4]   2> 	        at org.eclipse.jetty.util.thread.QueuedThreadPool.runJob(QueuedThreadPool.java:599)
[junit4:junit4]   2> 	        at org.eclipse.jetty.util.thread.QueuedThreadPool$3.run(QueuedThreadPool.java:534)
[junit4:junit4]   2> 	        at java.lang.Thread.run(Thread.java:722)
[junit4:junit4]   2> 	   2) Thread[id=581, name=qtp2146549712-581 Acceptor3 SelectChannelConnector@0.0.0.0:51926, state=BLOCKED, group=TGRP-ShowFileRequestHandlerTest]
[junit4:junit4]   2> 	        at sun.nio.ch.ServerSocketChannelImpl.accept(ServerSocketChannelImpl.java:210)
[junit4:junit4]   2> 	        at org.eclipse.jetty.server.nio.SelectChannelConnector.accept(SelectChannelConnector.java:104)
[junit4:junit4]   2> 	        at org.eclipse.jetty.server.AbstractConnector$Acceptor.run(AbstractConnector.java:933)
[junit4:junit4]   2> 	        at org.eclipse.jetty.util.thread.QueuedThreadPool.runJob(QueuedThreadPool.java:599)
[junit4:junit4]   2> 	        at org.eclipse.jetty.util.thread.QueuedThreadPool$3.run(QueuedThreadPool.java:534)
[junit4:junit4]   2> 	        at java.lang.Thread.run(Thread.java:722)
[junit4:junit4]   2> 	   3) Thread[id=580, name=qtp2146549712-580 Acceptor2 SelectChannelConnector@0.0.0.0:51926, state=RUNNABLE, group=TGRP-ShowFileRequestHandlerTest]
[junit4:junit4]   2> 	        at sun.nio.ch.ServerSocketChannelImpl.accept0(Native Method)
[junit4:junit4]   2> 	        at sun.nio.ch.ServerSocketChannelImpl.accept(ServerSocketChannelImpl.java:226)
[junit4:junit4]   2> 	        at org.eclipse.jetty.server.nio.SelectChannelConnector.accept(SelectChannelConnector.java:104)
[junit4:junit4]   2> 	        at org.eclipse.jetty.server.AbstractConnector$Acceptor.run(AbstractConnector.java:933)
[junit4:junit4]   2> 	        at org.eclipse.jetty.util.thread.QueuedThreadPool.runJob(QueuedThreadPool.java:599)
[junit4:junit4]   2> 	        at org.eclipse.jetty.util.thread.QueuedThreadPool$3.run(QueuedThreadPool.java:534)
[junit4:junit4]   2> 	        at java.lang.Thread.run(Thread.java:722)
[junit4:junit4]   2> 	   4) Thread[id=578, name=qtp2146549712-578 Acceptor0 SelectChannelConnector@0.0.0.0:51926, state=BLOCKED, group=TGRP-ShowFileRequestHandlerTest]
[junit4:junit4]   2> 	        at sun.nio.ch.ServerSocketChannelImpl.accept(ServerSocketChannelImpl.java:210)
[junit4:junit4]   2> 	        at org.eclipse.jetty.server.nio.SelectChannelConnector.accept(SelectChannelConnector.java:104)
[junit4:junit4]   2> 	        at org.eclipse.jetty.server.AbstractConnector$Acceptor.run(AbstractConnector.java:933)
[junit4:junit4]   2> 	        at org.eclipse.jetty.util.thread.QueuedThreadPool.runJob(QueuedThreadPool.java:599)
[junit4:junit4]   2> 	        at org.eclipse.jetty.util.thread.QueuedThreadPool$3.run(QueuedThreadPool.java:534)
[junit4:junit4]   2> 	        at java.lang.Thread.run(Thread.java:722)
[junit4:junit4]   2> NOTE: test params are: codec=Lucene41: {}, sim=DefaultSimilarity, locale=es_PR, timezone=Europe/Tallinn
[junit4:junit4]   2> NOTE: FreeBSD 9.0-RELEASE amd64/Oracle Corporation 1.7.0_06 (64-bit)/cpus=16,threads=5,free=112151856,total=210763776
[junit4:junit4]   2> NOTE: All tests run in this JVM: [OpenExchangeRatesOrgProviderTest, DebugComponentTest, TestMergePolicyConfig, DisMaxRequestHandlerTest, TestSolrDeletionPolicy1, SuggesterTest, URLClassifyProcessorTest, TestUtils, TestSolrJ, TestSolrDeletionPolicy2, SoftAutoCommitTest, TestValueSourceCache, XmlUpdateRequestHandlerTest, OverseerTest, ShowFileRequestHandlerTest]
[junit4:junit4]   2> NOTE: reproduce with: ant test  -Dtestcase=ShowFileRequestHandlerTest -Dtests.seed=64D3BA166035617A -Dtests.multiplier=3 -Dtests.slow=true -Dtests.locale=es_PR -Dtests.timezone=Europe/Tallinn -Dtests.file.encoding=ISO-8859-1
[junit4:junit4] ERROR   0.00s J1 | ShowFileRequestHandlerTest (suite) <<<
[junit4:junit4]    > Throwable #1: com.carrotsearch.randomizedtesting.ThreadLeakError: 4 threads leaked from SUITE scope at org.apache.solr.handler.admin.ShowFileRequestHandlerTest: 
[junit4:junit4]    >    1) Thread[id=579, name=qtp2146549712-579 Acceptor1 SelectChannelConnector@0.0.0.0:51926, state=BLOCKED, group=TGRP-ShowFileRequestHandlerTest]
[junit4:junit4]    >         at sun.nio.ch.ServerSocketChannelImpl.accept(ServerSocketChannelImpl.java:210)
[junit4:junit4]    >         at org.eclipse.jetty.server.nio.SelectChannelConnector.accept(SelectChannelConnector.java:104)
[junit4:junit4]    >         at org.eclipse.jetty.server.AbstractConnector$Acceptor.run(AbstractConnector.java:933)
[junit4:junit4]    >         at org.eclipse.jetty.util.thread.QueuedThreadPool.runJob(QueuedThreadPool.java:599)
[junit4:junit4]    >         at org.eclipse.jetty.util.thread.QueuedThreadPool$3.run(QueuedThreadPool.java:534)
[junit4:junit4]    >         at java.lang.Thread.run(Thread.java:722)
[junit4:junit4]    >    2) Thread[id=581, name=qtp2146549712-581 Acceptor3 SelectChannelConnector@0.0.0.0:51926, state=BLOCKED, group=TGRP-ShowFileRequestHandlerTest]
[junit4:junit4]    >         at sun.nio.ch.ServerSocketChannelImpl.accept(ServerSocketChannelImpl.java:210)
[junit4:junit4]    >         at org.eclipse.jetty.server.nio.SelectChannelConnector.accept(SelectChannelConnector.java:104)
[junit4:junit4]    >         at org.eclipse.jetty.server.AbstractConnector$Acceptor.run(AbstractConnector.java:933)
[junit4:junit4]    >         at org.eclipse.jetty.util.thread.QueuedThreadPool.runJob(QueuedThreadPool.java:599)
[junit4:junit4]    >         at org.eclipse.jetty.util.thread.QueuedThreadPool$3.run(QueuedThreadPool.java:534)
[junit4:junit4]    >         at java.lang.Thread.run(Thread.java:722)
[junit4:junit4]    >    3) Thread[id=580, name=qtp2146549712-580 Acceptor2 SelectChannelConnector@0.0.0.0:51926, state=RUNNABLE, group=TGRP-ShowFileRequestHandlerTest]
[junit4:junit4]    >         at sun.nio.ch.ServerSocketChannelImpl.accept0(Native Method)
[junit4:junit4]    >         at sun.nio.ch.ServerSocketChannelImpl.accept(ServerSocketChannelImpl.java:226)
[junit4:junit4]    >         at org.eclipse.jetty.server.nio.SelectChannelConnector.accept(SelectChannelConnector.java:104)
[junit4:junit4]    >         at org.eclipse.jetty.server.AbstractConnector$Acceptor.run(AbstractConnector.java:933)
[junit4:junit4]    >         at org.eclipse.jetty.util.thread.QueuedThreadPool.runJob(QueuedThreadPool.java:599)
[junit4:junit4]    >         at org.eclipse.jetty.util.thread.QueuedThreadPool$3.run(QueuedThreadPool.java:534)
[junit4:junit4]    >         at java.lang.Thread.run(Thread.java:722)
[junit4:junit4]    >    4) Thread[id=578, name=qtp2146549712-578 Acceptor0 SelectChannelConnector@0.0.0.0:51926, state=BLOCKED, group=TGRP-ShowFileRequestHandlerTest]
[junit4:junit4]    >         at sun.nio.ch.ServerSocketChannelImpl.accept(ServerSocketChannelImpl.java:210)
[junit4:junit4]    >         at org.eclipse.jetty.server.nio.SelectChannelConnector.accept(SelectChannelConnector.java:104)
[junit4:junit4]    >         at org.eclipse.jetty.server.AbstractConnector$Acceptor.run(AbstractConnector.java:933)
[junit4:junit4]    >         at org.eclipse.jetty.util.thread.QueuedThreadPool.runJob(QueuedThreadPool.java:599)
[junit4:junit4]    >         at org.eclipse.jetty.util.thread.QueuedThreadPool$3.run(QueuedThreadPool.java:534)
[junit4:junit4]    >         at java.lang.Thread.run(Thread.java:722)
[junit4:junit4]    > 	at __randomizedtesting.SeedInfo.seed([64D3BA166035617A]:0)
[junit4:junit4]    > Throwable #2: com.carrotsearch.randomizedtesting.ThreadLeakError: There are still zombie threads that couldn't be terminated:
[junit4:junit4]    >    1) Thread[id=579, name=qtp2146549712-579 Acceptor1 SelectChannelConnector@0.0.0.0:51926, state=BLOCKED, group=TGRP-ShowFileRequestHandlerTest]
[junit4:junit4]    >         at sun.nio.ch.ServerSocketChannelImpl.accept(ServerSocketChannelImpl.java:210)
[junit4:junit4]    >         at org.eclipse.jetty.server.nio.SelectChannelConnector.accept(SelectChannelConnector.java:104)
[junit4:junit4]    >         at org.eclipse.jetty.server.AbstractConnector$Acceptor.run(AbstractConnector.java:933)
[junit4:junit4]    >         at org.eclipse.jetty.util.thread.QueuedThreadPool.runJob(QueuedThreadPool.java:599)
[junit4:junit4]    >         at org.eclipse.jetty.util.thread.QueuedThreadPool$3.run(QueuedThreadPool.java:534)
[junit4:junit4]    >         at java.lang.Thread.run(Thread.java:722)
[junit4:junit4]    >    2) Thread[id=581, name=qtp2146549712-581 Acceptor3 SelectChannelConnector@0.0.0.0:51926, state=BLOCKED, group=TGRP-ShowFileRequestHandlerTest]
[junit4:junit4]    >         at sun.nio.ch.ServerSocketChannelImpl.accept(ServerSocketChannelImpl.java:210)
[junit4:junit4]    >         at org.eclipse.jetty.server.nio.SelectChannelConnector.accept(SelectChannelConnector.java:104)
[junit4:junit4]    >         at org.eclipse.jetty.server.AbstractConnector$Acceptor.run(AbstractConnector.java:933)
[junit4:junit4]    >         at org.eclipse.jetty.util.thread.QueuedThreadPool.runJob(QueuedThreadPool.java:599)
[junit4:junit4]    >         at org.eclipse.jetty.util.thread.QueuedThreadPool$3.run(QueuedThreadPool.java:534)
[junit4:junit4]    >         at java.lang.Thread.run(Thread.java:722)
[junit4:junit4]    >    3) Thread[id=580, name=qtp2146549712-580 Acceptor2 SelectChannelConnector@0.0.0.0:51926, state=RUNNABLE, group=TGRP-ShowFileRequestHandlerTest]
[junit4:junit4]    >         at sun.nio.ch.ServerSocketChannelImpl.accept0(Native Method)
[junit4:junit4]    >         at sun.nio.ch.ServerSocketChannelImpl.accept(ServerSocketChannelImpl.java:226)
[junit4:junit4]    >         at org.eclipse.jetty.server.nio.SelectChannelConnector.accept(SelectChannelConnector.java:104)
[junit4:junit4]    >         at org.eclipse.jetty.server.AbstractConnector$Acceptor.run(AbstractConnector.java:933)
[junit4:junit4]    >         at org.eclipse.jetty.util.thread.QueuedThreadPool.runJob(QueuedThreadPool.java:599)
[junit4:junit4]    >         at org.eclipse.jetty.util.thread.QueuedThreadPool$3.run(QueuedThreadPool.java:534)
[junit4:junit4]    >         at java.lang.Thread.run(Thread.java:722)
[junit4:junit4]    >    4) Thread[id=578, name=qtp2146549712-578 Acceptor0 SelectChannelConnector@0.0.0.0:51926, state=BLOCKED, group=TGRP-ShowFileRequestHandlerTest]
[junit4:junit4]    >         at sun.nio.ch.ServerSocketChannelImpl.accept(ServerSocketChannelImpl.java:210)
[junit4:junit4]    >         at org.eclipse.jetty.server.nio.SelectChannelConnector.accept(SelectChannelConnector.java:104)
[junit4:junit4]    >         at org.eclipse.jetty.server.AbstractConnector$Acceptor.run(AbstractConnector.java:933)
[junit4:junit4]    >         at org.eclipse.jetty.util.thread.QueuedThreadPool.runJob(QueuedThreadPool.java:599)
[junit4:junit4]    >         at org.eclipse.jetty.util.thread.QueuedThreadPool$3.run(QueuedThreadPool.java:534)
[junit4:junit4]    >         at java.lang.Thread.run(Thread.java:722)
[junit4:junit4]    > 	at __randomizedtesting.SeedInfo.seed([64D3BA166035617A]:0)
[junit4:junit4] Completed on J1 in 29.71s, 2 tests, 2 errors <<< FAILURES!

[...truncated 478 lines...]
[junit4:junit4] Suite: org.apache.solr.cloud.BasicDistributedZkTest
[junit4:junit4]   2> 7 T66 oas.SolrTestCaseJ4.setUp ###Starting testDistribSearch
[junit4:junit4]   2> Creating dataDir: /usr/home/hudson/hudson-slave/workspace/Lucene-Solr-Tests-4.x-java7/solr/build/solr-core/test/J0/./solrtest-BasicDistributedZkTest-1351625475636
[junit4:junit4]   2> 19 T66 oasc.ZkTestServer.run STARTING ZK TEST SERVER
[junit4:junit4]   2> 167 T67 oaz.Environment.logEnv Server environment:zookeeper.version=3.3.6-1366786, built on 07/29/2012 06:22 GMT
[junit4:junit4]   2> 168 T67 oaz.Environment.logEnv Server environment:host.name=lucene.zones.apache.org
[junit4:junit4]   2> 168 T67 oaz.Environment.logEnv Server environment:java.version=1.7.0_06
[junit4:junit4]   2> 169 T67 oaz.Environment.logEnv Server environment:java.vendor=Oracle Corporation
[junit4:junit4]   2> 169 T67 oaz.Environment.logEnv Server environment:java.home=/usr/local/openjdk7/jre
[junit4:junit4]   2> 169 T67 oaz.Environment.logEnv Server environment:java.class.path=/usr/home/hudson/hudson-slave/workspace/Lucene-Solr-Tests-4.x-java7/solr/build/solr-core/classes/test:/usr/home/hudson/hudson-slave/workspace/Lucene-Solr-Tests-4.x-java7/solr/build/solr-test-framework/classes/java:/usr/home/hudson/hudson-slave/workspace/Lucene-Solr-Tests-4.x-java7/solr/build/solr-core/test-files:/usr/home/hudson/hudson-slave/workspace/Lucene-Solr-Tests-4.x-java7/lucene/build/test-framework/classes/java:/usr/home/hudson/hudson-slave/workspace/Lucene-Solr-Tests-4.x-java7/lucene/build/codecs/classes/java:/usr/home/hudson/hudson-slave/workspace/Lucene-Solr-Tests-4.x-java7/solr/build/solr-solrj/classes/java:/usr/home/hudson/hudson-slave/workspace/Lucene-Solr-Tests-4.x-java7/solr/build/solr-core/classes/java:/usr/home/hudson/hudson-slave/workspace/Lucene-Solr-Tests-4.x-java7/lucene/build/analysis/common/lucene-analyzers-common-4.1-SNAPSHOT.jar:/usr/home/hudson/hudson-slave/workspace/Lucene-Solr-Tests-4.x-java7/lucene/build/analysis/kuromoji/lucene-analyzers-kuromoji-4.1-SNAPSHOT.jar:/usr/home/hudson/hudson-slave/workspace/Lucene-Solr-Tests-4.x-java7/lucene/build/analysis/phonetic/lucene-analyzers-phonetic-4.1-SNAPSHOT.jar:/usr/home/hudson/hudson-slave/workspace/Lucene-Solr-Tests-4.x-java7/lucene/build/highlighter/lucene-highlighter-4.1-SNAPSHOT.jar:/usr/home/hudson/hudson-slave/workspace/Lucene-Solr-Tests-4.x-java7/lucene/build/memory/lucene-memory-4.1-SNAPSHOT.jar:/usr/home/hudson/hudson-slave/workspace/Lucene-Solr-Tests-4.x-java7/lucene/build/misc/lucene-misc-4.1-SNAPSHOT.jar:/usr/home/hudson/hudson-slave/workspace/Lucene-Solr-Tests-4.x-java7/lucene/build/spatial/lucene-spatial-4.1-SNAPSHOT.jar:/usr/home/hudson/hudson-slave/workspace/Lucene-Solr-Tests-4.x-java7/lucene/build/suggest/lucene-suggest-4.1-SNAPSHOT.jar:/usr/home/hudson/hudson-slave/workspace/Lucene-Solr-Tests-4.x-java7/lucene/build/grouping/lucene-grouping-4.1-SNAPSHOT.jar:/usr/home/hudson/hudson-slave/workspace/Lucene-Solr-Tests-4.x-java7/lucene/build/queries/lucene-queries-4.1-SNAPSHOT.jar:/usr/home/hudson/hudson-slave/workspace/Lucene-Solr-Tests-4.x-java7/lucene/build/queryparser/lucene-queryparser-4.1-SNAPSHOT.jar:/usr/home/hudson/hudson-slave/workspace/Lucene-Solr-Tests-4.x-java7/solr/core/lib/commons-cli-1.2.jar:/usr/home/hudson/hudson-slave/workspace/Lucene-Solr-Tests-4.x-java7/solr/core/lib/commons-codec-1.7.jar:/usr/home/hudson/hudson-slave/workspace/Lucene-Solr-Tests-4.x-java7/solr/core/lib/commons-fileupload-1.2.1.jar:/usr/home/hudson/hudson-slave/workspace/Lucene-Solr-Tests-4.x-java7/solr/core/lib/commons-lang-2.6.jar:/usr/home/hudson/hudson-slave/workspace/Lucene-Solr-Tests-4.x-java7/solr/core/lib/easymock-2.2.jar:/usr/home/hudson/hudson-slave/workspace/Lucene-Solr-Tests-4.x-java7/solr/core/lib/guava-r05.jar:/usr/home/hudson/hudson-slave/workspace/Lucene-Solr-Tests-4.x-java7/solr/core/lib/javax.servlet-api-3.0.1.jar:/usr/home/hudson/hudson-slave/workspace/Lucene-Solr-Tests-4.x-java7/solr/core/lib/spatial4j-0.3.jar:/usr/home/hudson/hudson-slave/workspace/Lucene-Solr-Tests-4.x-java7/solr/solrj/lib/commons-io-2.1.jar:/usr/home/hudson/hudson-slave/workspace/Lucene-Solr-Tests-4.x-java7/solr/solrj/lib/httpclient-4.1.3.jar:/usr/home/hudson/hudson-slave/workspace/Lucene-Solr-Tests-4.x-java7/solr/solrj/lib/httpcore-4.1.4.jar:/usr/home/hudson/hudson-slave/workspace/Lucene-Solr-Tests-4.x-java7/solr/solrj/lib/httpmime-4.1.3.jar:/usr/home/hudson/hudson-slave/workspace/Lucene-Solr-Tests-4.x-java7/solr/solrj/lib/jcl-over-slf4j-1.6.4.jar:/usr/home/hudson/hudson-slave/workspace/Lucene-Solr-Tests-4.x-java7/solr/solrj/lib/log4j-over-slf4j-1.6.4.jar:/usr/home/hudson/hudson-slave/workspace/Lucene-Solr-Tests-4.x-java7/solr/solrj/lib/slf4j-api-1.6.4.jar:/usr/home/hudson/hudson-slave/workspace/Lucene-Solr-Tests-4.x-java7/solr/solrj/lib/slf4j-jdk14-1.6.4.jar:/usr/home/hudson/hudson-slave/workspace/Lucene-Solr-Tests-4.x-java7/solr/solrj/lib/wstx-asl-3.2.7.jar:/usr/home/hudson/hudson-slave/workspace/Lucene-Solr-Tests-4.x-java7/solr/solrj/lib/zookeeper-3.3.6.jar:/usr/home/hudson/hudson-slave/workspace/Lucene-Solr-Tests-4.x-java7/solr/example/lib/jetty-continuation-8.1.2.v20120308.jar:/usr/home/hudson/hudson-slave/workspace/Lucene-Solr-Tests-4.x-java7/solr/example/lib/jetty-deploy-8.1.2.v20120308.jar:/usr/home/hudson/hudson-slave/workspace/Lucene-Solr-Tests-4.x-java7/solr/example/lib/jetty-http-8.1.2.v20120308.jar:/usr/home/hudson/hudson-slave/workspace/Lucene-Solr-Tests-4.x-java7/solr/example/lib/jetty-io-8.1.2.v20120308.jar:/usr/home/hudson/hudson-slave/workspace/Lucene-Solr-Tests-4.x-java7/solr/example/lib/jetty-jmx-8.1.2.v20120308.jar:/usr/home/hudson/hudson-slave/workspace/Lucene-Solr-Tests-4.x-java7/solr/example/lib/jetty-security-8.1.2.v20120308.jar:/usr/home/hudson/hudson-slave/workspace/Lucene-Solr-Tests-4.x-java7/solr/example/lib/jetty-server-8.1.2.v20120308.jar:/usr/home/hudson/hudson-slave/workspace/Lucene-Solr-Tests-4.x-java7/solr/example/lib/jetty-servlet-8.1.2.v20120308.jar:/usr/home/hudson/hudson-slave/workspace/Lucene-Solr-Tests-4.x-java7/solr/example/lib/jetty-util-8.1.2.v20120308.jar:/usr/home/hudson/hudson-slave/workspace/Lucene-Solr-Tests-4.x-java7/solr/example/lib/jetty-webapp-8.1.2.v20120308.jar:/usr/home/hudson/hudson-slave/workspace/Lucene-Solr-Tests-4.x-java7/solr/example/lib/jetty-xml-8.1.2.v20120308.jar:/usr/home/hudson/hudson-slave/workspace/Lucene-Solr-Tests-4.x-java7/solr/example/lib/servlet-api-3.0.jar:/usr/home/hudson/hudson-slave/workspace/Lucene-Solr-Tests-4.x-java7/solr/example/example-DIH/solr/db/lib/hsqldb-1.8.0.10.jar:/usr/home/hudson/hudson-slave/workspace/Lucene-Solr-Tests-4.x-java7/lucene/build/core/classes/java:/usr/home/hudson/hudson-slave/workspace/Lucene-Solr-Tests-4.x-java7/lucene/test-framework/lib/junit-4.10.jar:/usr/home/hudson/hudson-slave/workspace/Lucene-Solr-Tests-4.x-java7/lucene/test-framework/lib/randomizedtesting-runner-2.0.4.jar:/home/hudson/hudson-slave/tools/Ant/ant-1.8.2/lib/ant-launcher.jar:/home/hudson/.ant/lib/ivy-2.2.0.jar:/home/hudson/hudson-slave/tools/Ant/ant-1.8.2/lib/ant-apache-regexp.jar:/home/hudson/hudson-slave/tools/Ant/ant-1.8.2/lib/ant-junit.jar:/home/hudson/hudson-slave/tools/Ant/ant-1.8.2/lib/ant-apache-bsf.jar:/home/hudson/hudson-slave/tools/Ant/ant-1.8.2/lib/ant-commons-net.jar:/home/hudson/hudson-slave/tools/Ant/ant-1.8.2/lib/ant-antlr.jar:/home/hudson/hudson-slave/tools/Ant/ant-1.8.2/lib/ant-apache-log4j.jar:/home/hudson/hudson-slave/tools/Ant/ant-1.8.2/lib/ant-commons-logging.jar:/home/hudson/hudson-slave/tools/Ant/ant-1.8.2/lib/ant-apache-xalan2.jar:/home/hudson/hudson-slave/tools/Ant/ant-1.8.2/lib/ant-apache-oro.jar:/home/hudson/hudson-slave/tools/Ant/ant-1.8.2/lib/ant-junit4.jar:/home/hudson/hudson-slave/tools/Ant/ant-1.8.2/lib/ant-netrexx.jar:/home/hudson/hudson-slave/tools/Ant/ant-1.8.2/lib/ant-swing.jar:/home/hudson/hudson-slave/tools/Ant/ant-1.8.2/lib/ant-javamail.jar:/home/hudson/hudson-slave/tools/Ant/ant-1.8.2/lib/ant-jsch.jar:/home/hudson/hudson-slave/tools/Ant/ant-1.8.2/lib/ant-jmf.jar:/home/hudson/hudson-slave/tools/Ant/ant-1.8.2/lib/ant.jar:/home/hudson/hudson-slave/tools/Ant/ant-1.8.2/lib/ant-apache-bcel.jar:/home/hudson/hudson-slave/tools/Ant/ant-1.8.2/lib/ant-jai.jar:/home/hudson/hudson-slave/tools/Ant/ant-1.8.2/lib/ant-testutil.jar:/home/hudson/hudson-slave/tools/Ant/ant-1.8.2/lib/ant-apache-resolver.jar:/home/hudson/hudson-slave/tools/Ant/ant-1.8.2/lib/ant-jdepend.jar:/usr/local/openjdk7/lib/tools.jar:/home/hudson/.ivy2/cache/com.carrotsearch.randomizedtesting/junit4-ant/jars/junit4-ant-2.0.4.jar
[junit4:junit4]   2> 171 T67 oaz.Environment.logEnv Server environment:java.library.path=/usr/local/openjdk7/jre/lib/amd64/server:/usr/local/openjdk7/jre/lib/amd64:/usr/local/openjdk7/jre/../lib/amd64:/usr/local/openjdk6/jre/lib/amd64/server:/usr/local/openjdk6/jre/lib/amd64:/usr/local/openjdk6/jre/../lib/amd64:/usr/java/packages/lib/amd64:/lib:/usr/lib:/usr/local/lib
[junit4:junit4]   2> 171 T67 oaz.Environment.logEnv Server environment:java.io.tmpdir=.
[junit4:junit4]   2> 171 T67 oaz.Environment.logEnv Server environment:java.compiler=<NA>
[junit4:junit4]   2> 171 T67 oaz.Environment.logEnv Server environment:os.name=FreeBSD
[junit4:junit4]   2> 172 T67 oaz.Environment.logEnv Server environment:os.arch=amd64
[junit4:junit4]   2> 172 T67 oaz.Environment.logEnv Server environment:os.version=9.0-RELEASE
[junit4:junit4]   2> 172 T67 oaz.Environment.logEnv Server environment:user.name=hudson
[junit4:junit4]   2> 173 T67 oaz.Environment.logEnv Server environment:user.home=/home/hudson
[junit4:junit4]   2> 173 T67 oaz.Environment.logEnv Server environment:user.dir=/usr/home/hudson/hudson-slave/workspace/Lucene-Solr-Tests-4.x-java7/solr/build/solr-core/test/J0
[junit4:junit4]   2> 245 T67 oazs.ZooKeeperServer.setTickTime tickTime set to 1000
[junit4:junit4]   2> 302 T67 oazs.NIOServerCnxn$Factory.<init> binding to port 0.0.0.0/0.0.0.0:0
[junit4:junit4]   2> 332 T66 oasc.ZkTestServer.run start zk server on port:53891
[junit4:junit4]   2> 444 T67 oazsp.FileTxnSnapLog.save Snapshotting: 0
[junit4:junit4]   2> 524 T66 oaz.Environment.logEnv Client environment:zookeeper.version=3.3.6-1366786, built on 07/29/2012 06:22 GMT
[junit4:junit4]   2> 525 T66 oaz.Environment.logEnv Client environment:host.name=lucene.zones.apache.org
[junit4:junit4]   2> 526 T66 oaz.Environment.logEnv Client environment:java.version=1.7.0_06
[junit4:junit4]   2> 526 T66 oaz.Environment.logEnv Client environment:java.vendor=Oracle Corporation
[junit4:junit4]   2> 527 T66 oaz.Environment.logEnv Client environment:java.home=/usr/local/openjdk7/jre
[junit4:junit4]   2> 528 T66 oaz.Environment.logEnv Client environment:java.class.path=/usr/home/hudson/hudson-slave/workspace/Lucene-Solr-Tests-4.x-java7/solr/build/solr-core/classes/test:/usr/home/hudson/hudson-slave/workspace/Lucene-Solr-Tests-4.x-java7/solr/build/solr-test-framework/classes/java:/usr/home/hudson/hudson-slave/workspace/Lucene-Solr-Tests-4.x-java7/solr/build/solr-core/test-files:/usr/home/hudson/hudson-slave/workspace/Lucene-Solr-Tests-4.x-java7/lucene/build/test-framework/classes/java:/usr/home/hudson/hudson-slave/workspace/Lucene-Solr-Tests-4.x-java7/lucene/build/codecs/classes/java:/usr/home/hudson/hudson-slave/workspace/Lucene-Solr-Tests-4.x-java7/solr/build/solr-solrj/classes/java:/usr/home/hudson/hudson-slave/workspace/Lucene-Solr-Tests-4.x-java7/solr/build/solr-core/classes/java:/usr/home/hudson/hudson-slave/workspace/Lucene-Solr-Tests-4.x-java7/lucene/build/analysis/common/lucene-analyzers-common-4.1-SNAPSHOT.jar:/usr/home/hudson/hudson-slave/workspace/Lucene-Solr-Tests-4.x-java7/lucene/build/analysis/kuromoji/lucene-analyzers-kuromoji-4.1-SNAPSHOT.jar:/usr/home/hudson/hudson-slave/workspace/Lucene-Solr-Tests-4.x-java7/lucene/build/analysis/phonetic/lucene-analyzers-phonetic-4.1-SNAPSHOT.jar:/usr/home/hudson/hudson-slave/workspace/Lucene-Solr-Tests-4.x-java7/lucene/build/highlighter/lucene-highlighter-4.1-SNAPSHOT.jar:/usr/home/hudson/hudson-slave/workspace/Lucene-Solr-Tests-4.x-java7/lucene/build/memory/lucene-memory-4.1-SNAPSHOT.jar:/usr/home/hudson/hudson-slave/workspace/Lucene-Solr-Tests-4.x-java7/lucene/build/misc/lucene-misc-4.1-SNAPSHOT.jar:/usr/home/hudson/hudson-slave/workspace/Lucene-Solr-Tests-4.x-java7/lucene/build/spatial/lucene-spatial-4.1-SNAPSHOT.jar:/usr/home/hudson/hudson-slave/workspace/Lucene-Solr-Tests-4.x-java7/lucene/build/suggest/lucene-suggest-4.1-SNAPSHOT.jar:/usr/home/hudson/hudson-slave/workspace/Lucene-Solr-Tests-4.x-java7/lucene/build/grouping/lucene-grouping-4.1-SNAPSHOT.jar:/usr/home/hudson/hudson-slave/workspace/Lucene-Solr-Tests-4.x-java7/lucene/build/queries/lucene-queries-4.1-SNAPSHOT.jar:/usr/home/hudson/hudson-slave/workspace/Lucene-Solr-Tests-4.x-java7/lucene/build/queryparser/lucene-queryparser-4.1-SNAPSHOT.jar:/usr/home/hudson/hudson-slave/workspace/Lucene-Solr-Tests-4.x-java7/solr/core/lib/commons-cli-1.2.jar:/usr/home/hudson/hudson-slave/workspace/Lucene-Solr-Tests-4.x-java7/solr/core/lib/commons-codec-1.7.jar:/usr/home/hudson/hudson-slave/workspace/Lucene-Solr-Tests-4.x-java7/solr/core/lib/commons-fileupload-1.2.1.jar:/usr/home/hudson/hudson-slave/workspace/Lucene-Solr-Tests-4.x-java7/solr/core/lib/commons-lang-2.6.jar:/usr/home/hudson/hudson-slave/workspace/Lucene-Solr-Tests-4.x-java7/solr/core/lib/easymock-2.2.jar:/usr/home/hudson/hudson-slave/workspace/Lucene-Solr-Tests-4.x-java7/solr/core/lib/guava-r05.jar:/usr/home/hudson/hudson-slave/workspace/Lucene-Solr-Tests-4.x-java7/solr/core/lib/javax.servlet-api-3.0.1.jar:/usr/home/hudson/hudson-slave/workspace/Lucene-Solr-Tests-4.x-java7/solr/core/lib/spatial4j-0.3.jar:/usr/home/hudson/hudson-slave/workspace/Lucene-Solr-Tests-4.x-java7/solr/solrj/lib/commons-io-2.1.jar:/usr/home/hudson/hudson-slave/workspace/Lucene-Solr-Tests-4.x-java7/solr/solrj/lib/httpclient-4.1.3.jar:/usr/home/hudson/hudson-slave/workspace/Lucene-Solr-Tests-4.x-java7/solr/solrj/lib/httpcore-4.1.4.jar:/usr/home/hudson/hudson-slave/workspace/Lucene-Solr-Tests-4.x-java7/solr/solrj/lib/httpmime-4.1.3.jar:/usr/home/hudson/hudson-slave/workspace/Lucene-Solr-Tests-4.x-java7/solr/solrj/lib/jcl-over-slf4j-1.6.4.jar:/usr/home/hudson/hudson-slave/workspace/Lucene-Solr-Tests-4.x-java7/solr/solrj/lib/log4j-over-slf4j-1.6.4.jar:/usr/home/hudson/hudson-slave/workspace/Lucene-Solr-Tests-4.x-java7/solr/solrj/lib/slf4j-api-1.6.4.jar:/usr/home/hudson/hudson-slave/workspace/Lucene-Solr-Tests-4.x-java7/solr/solrj/lib/slf4j-jdk14-1.6.4.jar:/usr/home/hudson/hudson-slave/workspace/Lucene-Solr-Tests-4.x-java7/solr/solrj/lib/wstx-asl-3.2.7.jar:/usr/home/hudson/hudson-slave/workspace/Lucene-Solr-Tests-4.x-java7/solr/solrj/lib/zookeeper-3.3.6.jar:/usr/home/hudson/hudson-slave/workspace/Lucene-Solr-Tests-4.x-java7/solr/example/lib/jetty-continuation-8.1.2.v20120308.jar:/usr/home/hudson/hudson-slave/workspace/Lucene-Solr-Tests-4.x-java7/solr/example/lib/jetty-deploy-8.1.2.v20120308.jar:/usr/home/hudson/hudson-slave/workspace/Lucene-Solr-Tests-4.x-java7/solr/example/lib/jetty-http-8.1.2.v20120308.jar:/usr/home/hudson/hudson-slave/workspace/Lucene-Solr-Tests-4.x-java7/solr/example/lib/jetty-io-8.1.2.v20120308.jar:/usr/home/hudson/hudson-slave/workspace/Lucene-Solr-Tests-4.x-java7/solr/example/lib/jetty-jmx-8.1.2.v20120308.jar:/usr/home/hudson/hudson-slave/workspace/Lucene-Solr-Tests-4.x-java7/solr/example/lib/jetty-security-8.1.2.v20120308.jar:/usr/home/hudson/hudson-slave/workspace/Lucene-Solr-Tests-4.x-java7/solr/example/lib/jetty-server-8.1.2.v20120308.jar:/usr/home/hudson/hudson-slave/workspace/Lucene-Solr-Tests-4.x-java7/solr/example/lib/jetty-servlet-8.1.2.v20120308.jar:/usr/home/hudson/hudson-slave/workspace/Lucene-Solr-Tests-4.x-java7/solr/example/lib/jetty-util-8.1.2.v20120308.jar:/usr/home/hudson/hudson-slave/workspace/Lucene-Solr-Tests-4.x-java7/solr/example/lib/jetty-webapp-8.1.2.v20120308.jar:/usr/home/hudson/hudson-slave/workspace/Lucene-Solr-Tests-4.x-java7/solr/example/lib/jetty-xml-8.1.2.v20120308.jar:/usr/home/hudson/hudson-slave/workspace/Lucene-Solr-Tests-4.x-java7/solr/example/lib/servlet-api-3.0.jar:/usr/home/hudson/hudson-slave/workspace/Lucene-Solr-Tests-4.x-java7/solr/example/example-DIH/solr/db/lib/hsqldb-1.8.0.10.jar:/usr/home/hudson/hudson-slave/workspace/Lucene-Solr-Tests-4.x-java7/lucene/build/core/classes/java:/usr/home/hudson/hudson-slave/workspace/Lucene-Solr-Tests-4.x-java7/lucene/test-framework/lib/junit-4.10.jar:/usr/home/hudson/hudson-slave/workspace/Lucene-Solr-Tests-4.x-java7/lucene/test-framework/lib/randomizedtesting-runner-2.0.4.jar:/home/hudson/hudson-slave/tools/Ant/ant-1.8.2/lib/ant-launcher.jar:/home/hudson/.ant/lib/ivy-2.2.0.jar:/home/hudson/hudson-slave/tools/Ant/ant-1.8.2/lib/ant-apache-regexp.jar:/home/hudson/hudson-slave/tools/Ant/ant-1.8.2/lib/ant-junit.jar:/home/hudson/hudson-slave/tools/Ant/ant-1.8.2/lib/ant-apache-bsf.jar:/home/hudson/hudson-slave/tools/Ant/ant-1.8.2/lib/ant-commons-net.jar:/home/hudson/hudson-slave/tools/Ant/ant-1.8.2/lib/ant-antlr.jar:/home/hudson/hudson-slave/tools/Ant/ant-1.8.2/lib/ant-apache-log4j.jar:/home/hudson/hudson-slave/tools/Ant/ant-1.8.2/lib/ant-commons-logging.jar:/home/hudson/hudson-slave/tools/Ant/ant-1.8.2/lib/ant-apache-xalan2.jar:/home/hudson/hudson-slave/tools/Ant/ant-1.8.2/lib/ant-apache-oro.jar:/home/hudson/hudson-slave/tools/Ant/ant-1.8.2/lib/ant-junit4.jar:/home/hudson/hudson-slave/tools/Ant/ant-1.8.2/lib/ant-netrexx.jar:/home/hudson/hudson-slave/tools/Ant/ant-1.8.2/lib/ant-swing.jar:/home/hudson/hudson-slave/tools/Ant/ant-1.8.2/lib/ant-javamail.jar:/home/hudson/hudson-slave/tools/Ant/ant-1.8.2/lib/ant-jsch.jar:/home/hudson/hudson-slave/tools/Ant/ant-1.8.2/lib/ant-jmf.jar:/home/hudson/hudson-slave/tools/Ant/ant-1.8.2/lib/ant.jar:/home/hudson/hudson-slave/tools/Ant/ant-1.8.2/lib/ant-apache-bcel.jar:/home/hudson/hudson-slave/tools/Ant/ant-1.8.2/lib/ant-jai.jar:/home/hudson/hudson-slave/tools/Ant/ant-1.8.2/lib/ant-testutil.jar:/home/hudson/hudson-slave/tools/Ant/ant-1.8.2/lib/ant-apache-resolver.jar:/home/hudson/hudson-slave/tools/Ant/ant-1.8.2/lib/ant-jdepend.jar:/usr/local/openjdk7/lib/tools.jar:/home/hudson/.ivy2/cache/com.carrotsearch.randomizedtesting/junit4-ant/jars/junit4-ant-2.0.4.jar
[junit4:junit4]   2> 530 T66 oaz.Environment.logEnv Client environment:java.library.path=/usr/local/openjdk7/jre/lib/amd64/server:/usr/local/openjdk7/jre/lib/amd64:/usr/local/openjdk7/jre/../lib/amd64:/usr/local/openjdk6/jre/lib/amd64/server:/usr/local/openjdk6/jre/lib/amd64:/usr/local/openjdk6/jre/../lib/amd64:/usr/java/packages/lib/amd64:/lib:/usr/lib:/usr/local/lib
[junit4:junit4]   2> 531 T66 oaz.Environment.logEnv Client environment:java.io.tmpdir=.
[junit4:junit4]   2> 532 T66 oaz.Environment.logEnv Client environment:java.compiler=<NA>
[junit4:junit4]   2> 533 T66 oaz.Environment.logEnv Client environment:os.name=FreeBSD
[junit4:junit4]   2> 534 T66 oaz.Environment.logEnv Client environment:os.arch=amd64
[junit4:junit4]   2> 534 T66 oaz.Environment.logEnv Client environment:os.version=9.0-RELEASE
[junit4:junit4]   2> 535 T66 oaz.Environment.logEnv Client environment:user.name=hudson
[junit4:junit4]   2> 536 T66 oaz.Environment.logEnv Client environment:user.home=/home/hudson
[junit4:junit4]   2> 537 T66 oaz.Environment.logEnv Client environment:user.dir=/usr/home/hudson/hudson-slave/workspace/Lucene-Solr-Tests-4.x-java7/solr/build/solr-core/test/J0
[junit4:junit4]   2> 547 T66 oaz.ZooKeeper.<init> Initiating client connection, connectString=127.0.0.1:53891 sessionTimeout=10000 watcher=org.apache.solr.common.cloud.ConnectionManager@2df56f5f
[junit4:junit4]   2> 639 T71 oaz.ClientCnxn$SendThread.startConnect Opening socket connection to server /127.0.0.1:53891
[junit4:junit4]   2> 639 T66 oascc.ConnectionManager.waitForConnected Waiting for client to connect to ZooKeeper
[junit4:junit4]   2> 642 T71 oaz.ClientCnxn$SendThread.primeConnection Socket connection established to localhost/127.0.0.1:53891, initiating session
[junit4:junit4]   2> 643 T68 oazs.NIOServerCnxn$Factory.run Accepted socket connection from /140.211.11.196:11509
[junit4:junit4]   2> 668 T68 oazs.NIOServerCnxn.doIO WARNING Exception causing close of session 0x0 due to java.io.IOException: ZooKeeperServer not running
[junit4:junit4]   2> 668 T68 oazs.NIOServerCnxn.closeSock Closed socket connection for client /140.211.11.196:11509 (no session established for client)
[junit4:junit4]   2> 669 T71 oaz.ClientCnxn$SendThread.run Unable to read additional data from server sessionid 0x0, likely server has closed socket, closing socket connection and attempting reconnect
[junit4:junit4]   2> 2374 T71 oaz.ClientCnxn$SendThread.startConnect Opening socket connection to server localhost/127.0.0.1:53891
[junit4:junit4]   2> 2375 T71 oaz.ClientCnxn$SendThread.primeConnection Socket connection established to localhost/127.0.0.1:53891, initiating session
[junit4:junit4]   2> 2375 T68 oazs.NIOServerCnxn$Factory.run Accepted socket connection from /140.211.11.196:45743
[junit4:junit4]   2> 2376 T68 oazs.NIOServerCnxn.readConnectRequest Client attempting to establish new session at /140.211.11.196:45743
[junit4:junit4]   2> 2396 T70 oazsp.FileTxnLog.append Creating new log file: log.1
[junit4:junit4]   2> 2451 T70 oazs.NIOServerCnxn.finishSessionInit Established session 0x13ab32808390000 with negotiated timeout 10000 for client /140.211.11.196:45743
[junit4:junit4]   2> 2452 T71 oaz.ClientCnxn$SendThread.readConnectResult Session establishment complete on server localhost/127.0.0.1:53891, sessionid = 0x13ab32808390000, negotiated timeout = 10000
[junit4:junit4]   2> 2456 T73 oascc.ConnectionManager.process Watcher org.apache.solr.common.cloud.ConnectionManager@2df56f5f name:ZooKeeperConnection Watcher:127.0.0.1:53891 got event WatchedEvent state:SyncConnected type:None path:null path:null type:None
[junit4:junit4]   2> 2457 T66 oascc.ConnectionManager.waitForConnected Client is connected to ZooKeeper
[junit4:junit4]   2> 2462 T66 oascc.SolrZkClient.makePath makePath: /solr
[junit4:junit4]   2> 2560 T72 oazs.PrepRequestProcessor.pRequest Processed session termination for sessionid: 0x13ab32808390000
[junit4:junit4]   2> 2561 T73 oaz.ClientCnxn$EventThread.run EventThread shut down
[junit4:junit4]   2> 2561 T66 oaz.ZooKeeper.close Session: 0x13ab32808390000 closed
[junit4:junit4]   2> 2562 T68 oazs.NIOServerCnxn.closeSock Closed socket connection for client /140.211.11.196:45743 which had sessionid 0x13ab32808390000
[junit4:junit4]   2> 2563 T66 oaz.ZooKeeper.<init> Initiating client connection, connectString=127.0.0.1:53891/solr sessionTimeout=10000 watcher=org.apache.solr.common.cloud.ConnectionManager@6fa3d735
[junit4:junit4]   2> 2564 T74 oaz.ClientCnxn$SendThread.startConnect Opening socket connection to server /127.0.0.1:53891
[junit4:junit4]   2> 2564 T66 oascc.ConnectionManager.waitForConnected Waiting for client to connect to ZooKeeper
[junit4:junit4]   2> 2565 T74 oaz.ClientCnxn$SendThread.primeConnection Socket connection established to localhost/127.0.0.1:53891, initiating session
[junit4:junit4]   2> 2565 T68 oazs.NIOServerCnxn$Factory.run Accepted socket connection from /140.211.11.196:55008
[junit4:junit4]   2> 2566 T68 oazs.NIOServerCnxn.readConnectRequest Client attempting to establish new session at /140.211.11.196:55008
[junit4:junit4]   2> 2568 T70 oazs.NIOServerCnxn.finishSessionInit Established session 0x13ab32808390001 with negotiated timeout 10000 for client /140.211.11.196:55008
[junit4:junit4]   2> 2568 T74 oaz.ClientCnxn$SendThread.readConnectResult Session establishment complete on server localhost/127.0.0.1:53891, sessionid = 0x13ab32808390001, negotiated timeout = 10000
[junit4:junit4]   2> 2569 T75 oascc.ConnectionManager.process Watcher org.apache.solr.common.cloud.ConnectionManager@6fa3d735 name:ZooKeeperConnection Watcher:127.0.0.1:53891/solr got event WatchedEvent state:SyncConnected type:None path:null path:null type:None
[junit4:junit4]   2> 2569 T66 oascc.ConnectionManager.waitForConnected Client is connected to ZooKeeper
[junit4:junit4]   2> 2606 T66 oascc.SolrZkClient.makePath makePath: /collections/collection1
[junit4:junit4]   2> 2612 T66 oascc.SolrZkClient.makePath makePath: /collections/collection1/shards
[junit4:junit4]   2> 2617 T66 oascc.SolrZkClient.makePath makePath: /collections/control_collection
[junit4:junit4]   2> 2621 T66 oascc.SolrZkClient.makePath makePath: /collections/control_collection/shards
[junit4:junit4]   2> 2626 T66 oasc.AbstractZkTestCase.putConfig put /usr/home/hudson/hudson-slave/workspace/Lucene-Solr-Tests-4.x-java7/solr/build/solr-core/test-files/solr/collection1/conf/solrconfig.xml to /configs/conf1/solrconfig.xml
[junit4:junit4]   2> 2629 T66 oascc.SolrZkClient.makePath makePath: /configs/conf1/solrconfig.xml
[junit4:junit4]   2> 2637 T66 oasc.AbstractZkTestCase.putConfig put /usr/home/hudson/hudson-slave/workspace/Lucene-Solr-Tests-4.x-java7/solr/build/solr-core/test-files/solr/collection1/conf/schema.xml to /configs/conf1/schema.xml
[junit4:junit4]   2> 2641 T66 oascc.SolrZkClient.makePath makePath: /configs/conf1/schema.xml
[junit4:junit4]   2> 2747 T66 oasc.AbstractZkTestCase.putConfig put /usr/home/hudson/hudson-slave/workspace/Lucene-Solr-Tests-4.x-java7/solr/build/solr-core/test-files/solr/collection1/conf/solrconfig.xml to /configs/conf1/solrconfig.xml
[junit4:junit4]   2> 2749 T66 oascc.SolrZkClient.makePath makePath: /configs/conf1/solrconfig.xml
[junit4:junit4]   2> 2766 T66 oasc.AbstractZkTestCase.putConfig put /usr/home/hudson/hudson-slave/workspace/Lucene-Solr-Tests-4.x-java7/solr/build/solr-core/test-files/solr/collection1/conf/stopwords.txt to /configs/conf1/stopwords.txt
[junit4:junit4]   2> 2767 T66 oascc.SolrZkClient.makePath makePath: /configs/conf1/stopwords.txt
[junit4:junit4]   2> 2779 T66 oasc.AbstractZkTestCase.putConfig put /usr/home/hudson/hudson-slave/workspace/Lucene-Solr-Tests-4.x-java7/solr/build/solr-core/test-files/solr/collection1/conf/protwords.txt to /configs/conf1/protwords.txt
[junit4:junit4]   2> 2781 T66 oascc.SolrZkClient.makePath makePath: /configs/conf1/protwords.txt
[junit4:junit4]   2> 2786 T66 oasc.AbstractZkTestCase.putConfig put /usr/home/hudson/hudson-slave/workspace/Lucene-Solr-Tests-4.x-java7/solr/build/solr-core/test-files/solr/collection1/conf/currency.xml to /configs/conf1/currency.xml
[junit4:junit4]   2> 2787 T66 oascc.SolrZkClient.makePath makePath: /configs/conf1/currency.xml
[junit4:junit4]   2> 2793 T66 oasc.AbstractZkTestCase.putConfig put /usr/home/hudson/hudson-slave/workspace/Lucene-Solr-Tests-4.x-java7/solr/build/solr-core/test-files/solr/collection1/conf/open-exchange-rates.json to /configs/conf1/open-exchange-rates.json
[junit4:junit4]   2> 2794 T66 oascc.SolrZkClient.makePath makePath: /configs/conf1/open-exchange-rates.json
[junit4:junit4]   2> 2799 T66 oasc.AbstractZkTestCase.putConfig put /usr/home/hudson/hudson-slave/workspace/Lucene-Solr-Tests-4.x-java7/solr/build/solr-core/test-files/solr/collection1/conf/mapping-ISOLatin1Accent.txt to /configs/conf1/mapping-ISOLatin1Accent.txt
[junit4:junit4]   2> 2801 T66 oascc.SolrZkClient.makePath makePath: /configs/conf1/mapping-ISOLatin1Accent.txt
[junit4:junit4]   2> 2806 T66 oasc.AbstractZkTestCase.putConfig put /usr/home/hudson/hudson-slave/workspace/Lucene-Solr-Tests-4.x-java7/solr/build/solr-core/test-files/solr/collection1/conf/old_synonyms.txt to /configs/conf1/old_synonyms.txt
[junit4:junit4]   2> 2807 T66 oascc.SolrZkClient.makePath makePath: /configs/conf1/old_synonyms.txt
[junit4:junit4]   2> 2812 T66 oasc.AbstractZkTestCase.putConfig put /usr/home/hudson/hudson-slave/workspace/Lucene-Solr-Tests-4.x-java7/solr/build/solr-core/test-files/solr/collection1/conf/synonyms.txt to /configs/conf1/synonyms.txt
[junit4:junit4]   2> 2813 T66 oascc.SolrZkClient.makePath makePath: /configs/conf1/synonyms.txt
[junit4:junit4]   2> 2818 T72 oazs.PrepRequestProcessor.pRequest Processed session termination for sessionid: 0x13ab32808390001
[junit4:junit4]   2> 2819 T75 oaz.ClientCnxn$EventThread.run EventThread shut down
[junit4:junit4]   2> 2820 T68 oazs.NIOServerCnxn.closeSock Closed socket connection for client /140.211.11.196:55008 which had sessionid 0x13ab32808390001
[junit4:junit4]   2> 2819 T66 oaz.ZooKeeper.close Session: 0x13ab32808390001 closed
[junit4:junit4]   2> 3532 T66 oejs.Server.doStart jetty-8.1.2.v20120308
[junit4:junit4]   2> 3932 T66 oejs.AbstractConnector.doStart Started SelectChannelConnector@0.0.0.0:57117
[junit4:junit4]   2> 3978 T66 oasc.SolrResourceLoader.locateSolrHome JNDI not configured for solr (NoInitialContextEx)
[junit4:junit4]   2> 3978 T66 oasc.SolrResourceLoader.locateSolrHome using system property solr.solr.home: /usr/home/hudson/hudson-slave/workspace/Lucene-Solr-Tests-4.x-java7/solr/build/solr-core/test-files/solr
[junit4:junit4]   2> 3979 T66 oasc.SolrResourceLoader.<init> new SolrResourceLoader for deduced Solr Home: '/usr/home/hudson/hudson-slave/workspace/Lucene-Solr-Tests-4.x-java7/solr/build/solr-core/test-files/solr/'
[junit4:junit4]   2> 4024 T66 oass.SolrDispatchFilter.init SolrDispatchFilter.init()
[junit4:junit4]   2> 4024 T66 oasc.SolrResourceLoader.locateSolrHome JNDI not configured for solr (NoInitialContextEx)
[junit4:junit4]   2> 4025 T66 oasc.SolrResourceLoader.locateSolrHome using system property solr.solr.home: /usr/home/hudson/hudson-slave/workspace/Lucene-Solr-Tests-4.x-java7/solr/build/solr-core/test-files/solr
[junit4:junit4]   2> 4025 T66 oasc.CoreContainer$Initializer.initialize looking for solr.xml: /usr/home/hudson/hudson-slave/workspace/Lucene-Solr-Tests-4.x-java7/solr/build/solr-core/test-files/solr/solr.xml
[junit4:junit4]   2> 4026 T66 oasc.CoreContainer.<init> New CoreContainer 32329002
[junit4:junit4]   2> 4026 T66 oasc.CoreContainer.load Loading CoreContainer using Solr Home: '/usr/home/hudson/hudson-slave/workspace/Lucene-Solr-Tests-4.x-java7/solr/build/solr-core/test-files/solr/'
[junit4:junit4]   2> 4027 T66 oasc.SolrResourceLoader.<init> new SolrResourceLoader for directory: '/usr/home/hudson/hudson-slave/workspace/Lucene-Solr-Tests-4.x-java7/solr/build/solr-core/test-files/solr/'
[junit4:junit4]   2> 4063 T66 oasc.CoreContainer.load Registering Log Listener
[junit4:junit4]   2> 4078 T66 oasc.CoreContainer.initZooKeeper Zookeeper client=127.0.0.1:53891/solr
[junit4:junit4]   2> 4108 T66 oaz.ZooKeeper.<init> Initiating client connection, connectString=127.0.0.1:53891/solr sessionTimeout=5000 watcher=org.apache.solr.common.cloud.ConnectionManager@38d5fa38
[junit4:junit4]   2> 4109 T86 oaz.ClientCnxn$SendThread.startConnect Opening socket connection to server /127.0.0.1:53891
[junit4:junit4]   2> 4109 T66 oascc.ConnectionManager.waitForConnected Waiting for client to connect to ZooKeeper
[junit4:junit4]   2> 4111 T86 oaz.ClientCnxn$SendThread.primeConnection Socket connection established to localhost/127.0.0.1:53891, initiating session
[junit4:junit4]   2> 4111 T68 oazs.NIOServerCnxn$Factory.run Accepted socket connection from /140.211.11.196:65070
[junit4:junit4]   2> 4112 T68 oazs.NIOServerCnxn.readConnectRequest Client attempting to establish new session at /140.211.11.196:65070
[junit4:junit4]   2> 4114 T70 oazs.NIOServerCnxn.finishSessionInit Established session 0x13ab32808390002 with negotiated timeout 5000 for client /140.211.11.196:65070
[junit4:junit4]   2> 4114 T86 oaz.ClientCnxn$SendThread.readConnectResult Session establishment complete on server localhost/127.0.0.1:53891, sessionid = 0x13ab32808390002, negotiated timeout = 5000
[junit4:junit4]   2> 4115 T87 oascc.ConnectionManager.process Watcher org.apache.solr.common.cloud.ConnectionManager@38d5fa38 name:ZooKeeperConnection Watcher:127.0.0.1:53891/solr got event WatchedEvent state:SyncConnected type:None path:null path:null type:None
[junit4:junit4]   2> 4115 T66 oascc.ConnectionManager.waitForConnected Client is connected to ZooKeeper
[junit4:junit4]   2> 4132 T72 oazs.PrepRequestProcessor.pRequest Got user-level KeeperException when processing sessionid:0x13ab32808390002 type:create cxid:0x2 zxid:0xfffffffffffffffe txntype:unknown reqpath:n/a Error Path:/solr/overseer Error:KeeperErrorCode = NodeExists for /solr/overseer
[junit4:junit4]   2> 4139 T66 oascc.SolrZkClient.makePath makePath: /live_nodes
[junit4:junit4]   2> 4142 T66 oasc.ZkController.createEphemeralLiveNode Register node as live in ZooKeeper:/live_nodes/127.0.0.1:57117_solr
[junit4:junit4]   2> 4146 T72 oazs.PrepRequestProcessor.pRequest Got user-level KeeperException when processing sessionid:0x13ab32808390002 type:delete cxid:0x7 zxid:0xfffffffffffffffe txntype:unknown reqpath:n/a Error Path:/solr/live_nodes/127.0.0.1:57117_solr Error:KeeperErrorCode = NoNode for /solr/live_nodes/127.0.0.1:57117_solr
[junit4:junit4]   2> 4147 T66 oascc.SolrZkClient.makePath makePath: /live_nodes/127.0.0.1:57117_solr
[junit4:junit4]   2> 4159 T66 oashc.HttpShardHandlerFactory.getParameter Setting socketTimeout to: 0
[junit4:junit4]   2> 4159 T66 oashc.HttpShardHandlerFactory.getParameter Setting urlScheme to: http://
[junit4:junit4]   2> 4160 T66 oashc.HttpShardHandlerFactory.getParameter Setting connTimeout to: 0
[junit4:junit4]   2> 4160 T66 oashc.HttpShardHandlerFactory.getParameter Setting maxConnectionsPerHost to: 20
[junit4:junit4]   2> 4161 T66 oashc.HttpShardHandlerFactory.getParameter Setting corePoolSize to: 0
[junit4:junit4]   2> 4161 T66 oashc.HttpShardHandlerFactory.getParameter Setting maximumPoolSize to: 2147483647
[junit4:junit4]   2> 4161 T66 oashc.HttpShardHandlerFactory.getParameter Setting maxThreadIdleTime to: 5
[junit4:junit4]   2> 4162 T66 oashc.HttpShardHandlerFactory.getParameter Setting sizeOfQueue to: -1
[junit4:junit4]   2> 4162 T66 oashc.HttpShardHandlerFactory.getParameter Setting fairnessPolicy to: false
[junit4:junit4]   2> 4163 T66 oascsi.HttpClientUtil.createClient Creating new http client, config:maxConnectionsPerHost=20&maxConnections=10000&socketTimeout=0&connTimeout=0&retry=false
[junit4:junit4]   2> 4181 T66 oascc.SolrZkClient.makePath makePath: /overseer_elect/election
[junit4:junit4]   2> 4225 T72 oazs.PrepRequestProcessor.pRequest Got user-level KeeperException when processing sessionid:0x13ab32808390002 type:delete cxid:0x15 zxid:0xfffffffffffffffe txntype:unknown reqpath:n/a Error Path:/solr/overseer_elect/leader Error:KeeperErrorCode = NoNode for /solr/overseer_elect/leader
[junit4:junit4]   2> 4234 T66 oascc.SolrZkClient.makePath makePath: /overseer_elect/leader
[junit4:junit4]   2> 4238 T66 oasc.Overseer.start Overseer (id=88580127205163010-127.0.0.1:57117_solr-n_0000000000) starting
[junit4:junit4]   2> 4239 T72 oazs.PrepRequestProcessor.pRequest Got user-level KeeperException when processing sessionid:0x13ab32808390002 type:create cxid:0x1a zxid:0xfffffffffffffffe txntype:unknown reqpath:n/a Error Path:/solr/overseer Error:KeeperErrorCode = NodeExists for /solr/overseer
[junit4:junit4]   2> 4258 T72 oazs.PrepRequestProcessor.pRequest Got user-level KeeperException when processing sessionid:0x13ab32808390002 type:create cxid:0x1b zxid:0xfffffffffffffffe txntype:unknown reqpath:n/a Error Path:/solr/overseer Error:KeeperErrorCode = NodeExists for /solr/overseer
[junit4:junit4]   2> 4260 T72 oazs.PrepRequestProcessor.pRequest Got user-level KeeperException when processing sessionid:0x13ab32808390002 type:create cxid:0x1c zxid:0xfffffffffffffffe txntype:unknown reqpath:n/a Error Path:/solr/overseer Error:KeeperErrorCode = NodeExists for /solr/overseer
[junit4:junit4]   2> 4271 T72 oazs.PrepRequestProcessor.pRequest Got user-level KeeperException when processing sessionid:0x13ab32808390002 type:create cxid:0x1d zxid:0xfffffffffffffffe txntype:unknown reqpath:n/a Error Path:/solr/overseer Error:KeeperErrorCode = NodeExists for /solr/overseer
[junit4:junit4]   2> 4274 T89 oasc.OverseerCollectionProcessor.run Process current queue of collection messages
[junit4:junit4]   2> 4275 T66 oascc.SolrZkClient.makePath makePath: /clusterstate.json
[junit4:junit4]   2> 4278 T66 oascc.ZkStateReader.createClusterStateWatchersAndUpdate Updating cluster state from ZooKeeper... 
[junit4:junit4]   2> 4310 T88 oasc.Overseer$ClusterStateUpdater.run Starting to work on the main queue
[junit4:junit4]   2> 4340 T66 oasc.CoreContainer.create Creating SolrCore 'collection1' using instanceDir: /usr/home/hudson/hudson-slave/workspace/Lucene-Solr-Tests-4.x-java7/solr/build/solr-core/test-files/solr/collection1
[junit4:junit4]   2> 4341 T66 oasc.ZkController.createCollectionZkNode Check for collection zkNode:control_collection
[junit4:junit4]   2> 4343 T66 oasc.ZkController.createCollectionZkNode Collection zkNode exists
[junit4:junit4]   2> 4343 T66 oasc.ZkController.readConfigName Load collection config from:/collections/control_collection
[junit4:junit4]   2> 4346 T66 oasc.SolrResourceLoader.<init> new SolrResourceLoader for directory: '/usr/home/hudson/hudson-slave/workspace/Lucene-Solr-Tests-4.x-java7/solr/build/solr-core/test-files/solr/collection1/'
[junit4:junit4]   2> 4347 T66 oasc.SolrResourceLoader.replaceClassLoader Adding 'file:/usr/home/hudson/hudson-slave/workspace/Lucene-Solr-Tests-4.x-java7/solr/build/solr-core/test-files/solr/collection1/lib/README' to classloader
[junit4:junit4]   2> 4349 T66 oasc.SolrResourceLoader.replaceClassLoader Adding 'file:/usr/home/hudson/hudson-slave/workspace/Lucene-Solr-Tests-4.x-java7/solr/build/solr-core/test-files/solr/collection1/lib/classes/' to classloader
[junit4:junit4]   2> 4457 T66 oasc.SolrConfig.<init> Using Lucene MatchVersion: LUCENE_41
[junit4:junit4]   2> 4547 T66 oasc.SolrConfig.<init> Loaded SolrConfig: solrconfig.xml
[junit4:junit4]   2> 4649 T66 oass.IndexSchema.readSchema Reading Solr Schema
[junit4:junit4]   2> 4667 T66 oass.IndexSchema.readSchema Schema name=test
[junit4:junit4]   2> 5406 T66 oass.OpenExchangeRatesOrgProvider.init Initialized with rates=open-exchange-rates.json, refreshInterval=1440.
[junit4:junit4]   2> 5422 T66 oass.IndexSchema.readSchema default search field in schema is text
[junit4:junit4]   2> 5426 T66 oass.IndexSchema.readSchema unique key field: id
[junit4:junit4]   2> 5456 T66 oass.FileExchangeRateProvider.reload Reloading exchange rates from file currency.xml
[junit4:junit4]   2> 5463 T66 oass.FileExchangeRateProvider.reload Reloading exchange rates from file currency.xml
[junit4:junit4]   2> 5469 T66 oass.OpenExchangeRatesOrgProvider.reload Reloading exchange rates from open-exchange-rates.json
[junit4:junit4]   2> 5472 T66 oass.OpenExchangeRatesOrgProvider.reload Reloading exchange rates from open-exchange-rates.json
[junit4:junit4]   2> 5475 T66 oasc.SolrCore.<init> [collection1] Opening new SolrCore at /usr/home/hudson/hudson-slave/workspace/Lucene-Solr-Tests-4.x-java7/solr/build/solr-core/test-files/solr/collection1/, dataDir=./org.apache.solr.cloud.BasicDistributedZkTest-1351625475635/control/data/
[junit4:junit4]   2> 5475 T66 oasc.JmxMonitoredMap.<init> JMX monitoring is enabled. Adding Solr mbeans to JMX Server: com.sun.jmx.mbeanserver.JmxMBeanServer@1e05c314
[junit4:junit4]   2> 5514 T66 oasc.SolrCore.getNewIndexDir New index directory detected: old=null new=./org.apache.solr.cloud.BasicDistributedZkTest-1351625475635/control/data/index/
[junit4:junit4]   2> 5515 T66 oasc.SolrCore.initIndex WARNING [collection1] Solr index directory './org.apache.solr.cloud.BasicDistributedZkTest-1351625475635/control/data/index' doesn't exist. Creating new index...
[junit4:junit4]   2> 5517 T66 oasc.CachingDirectoryFactory.get return new directory for /usr/home/hudson/hudson-slave/workspace/Lucene-Solr-Tests-4.x-java7/solr/build/solr-core/test/J0/./org.apache.solr.cloud.BasicDistributedZkTest-1351625475635/control/data/index forceNew:false
[junit4:junit4]   2> 5543 T66 oasc.SolrDeletionPolicy.onCommit SolrDeletionPolicy.onCommit: commits:num=1
[junit4:junit4]   2> 		commit{dir=NRTCachingDirectory(org.apache.lucene.store.NIOFSDirectory@/usr/home/hudson/hudson-slave/workspace/Lucene-Solr-Tests-4.x-java7/solr/build/solr-core/test/J0/org.apache.solr.cloud.BasicDistributedZkTest-1351625475635/control/data/index lockFactory=org.apache.lucene.store.NativeFSLockFactory@47df4cd0; maxCacheMB=48.0 maxMergeSizeMB=4.0),segFN=segments_1,generation=1,filenames=[segments_1]
[junit4:junit4]   2> 5544 T66 oasc.SolrDeletionPolicy.updateCommits newest commit = 1
[junit4:junit4]   2> 5545 T66 oasc.SolrCore.initWriters created xml: solr.XMLResponseWriter
[junit4:junit4]   2> 5548 T66 oasup.UpdateRequestProcessorChain.init inserting DistributedUpdateProcessorFactory into updateRequestProcessorChain "dedupe"
[junit4:junit4]   2> 5549 T66 oasup.UpdateRequestProcessorChain.init inserting DistributedUpdateProcessorFactory into updateRequestProcessorChain "dedupe-allfields"
[junit4:junit4]   2> 5549 T66 oasup.UpdateRequestProcessorChain.init inserting DistributedUpdateProcessorFactory into updateRequestProcessorChain "stored_sig"
[junit4:junit4]   2> 5550 T66 oasup.UpdateRequestProcessorChain.init inserting DistributedUpdateProcessorFactory into updateRequestProcessorChain "uniq-fields"
[junit4:junit4]   2> 5551 T66 oasup.UpdateRequestProcessorChain.init inserting DistributedUpdateProcessorFactory into updateRequestProcessorChain "distrib-dup-test-chain-implicit"
[junit4:junit4]   2> 5552 T66 oasc.RequestHandlers.initHandlersFromConfig adding lazy requestHandler: solr.ReplicationHandler
[junit4:junit4]   2> 5552 T66 oasc.RequestHandlers.initHandlersFromConfig created /replication: solr.ReplicationHandler
[junit4:junit4]   2> 5553 T66 oasc.RequestHandlers.initHandlersFromConfig created standard: solr.StandardRequestHandler
[junit4:junit4]   2> 5554 T66 oasc.RequestHandlers.initHandlersFromConfig created /get: solr.RealTimeGetHandler
[junit4:junit4]   2> 5555 T66 oasc.RequestHandlers.initHandlersFromConfig created dismax: solr.SearchHandler
[junit4:junit4]   2> 5556 T66 oasc.RequestHandlers.initHandlersFromConfig created mock: org.apache.solr.core.MockQuerySenderListenerReqHandler
[junit4:junit4]   2> 5557 T66 oasc.RequestHandlers.initHandlersFromConfig created /admin/: org.apache.solr.handler.admin.AdminHandlers
[junit4:junit4]   2> 5557 T66 oasc.RequestHandlers.initHandlersFromConfig created defaults: solr.StandardRequestHandler
[junit4:junit4]   2> 5558 T66 oasc.RequestHandlers.initHandlersFromConfig adding lazy requestHandler: solr.StandardRequestHandler
[junit4:junit4]   2> 5559 T66 oasc.RequestHandlers.initHandlersFromConfig created lazy: solr.StandardRequestHandler
[junit4:junit4]   2> 5560 T66 oasc.RequestHandlers.initHandlersFromConfig created /update: solr.UpdateRequestHandler
[junit4:junit4]   2> 5560 T66 oasc.RequestHandlers.initHandlersFromConfig created /terms: org.apache.solr.handler.component.SearchHandler
[junit4:junit4]   2> 5561 T66 oasc.RequestHandlers.initHandlersFromConfig created spellCheckCompRH: org.apache.solr.handler.component.SearchHandler
[junit4:junit4]   2> 5562 T66 oasc.RequestHandlers.initHandlersFromConfig created spellCheckCompRH_Direct: org.apache.solr.handler.component.SearchHandler
[junit4:junit4]   2> 5563 T66 oasc.RequestHandlers.initHandlersFromConfig created spellCheckWithWordbreak: org.apache.solr.handler.component.SearchHandler
[junit4:junit4]   2> 5564 T66 oasc.RequestHandlers.initHandlersFromConfig created spellCheckWithWordbreak_Direct: org.apache.solr.handler.component.SearchHandler
[junit4:junit4]   2> 5565 T66 oasc.RequestHandlers.initHandlersFromConfig created spellCheckCompRH1: org.apache.solr.handler.component.SearchHandler
[junit4:junit4]   2> 5565 T66 oasc.RequestHandlers.initHandlersFromConfig created tvrh: org.apache.solr.handler.component.SearchHandler
[junit4:junit4]   2> 5566 T66 oasc.RequestHandlers.initHandlersFromConfig created /mlt: solr.MoreLikeThisHandler
[junit4:junit4]   2> 5567 T66 oasc.RequestHandlers.initHandlersFromConfig created /debug/dump: solr.DumpRequestHandler
[junit4:junit4]   2> 5582 T66 oashl.XMLLoader.init xsltCacheLifetimeSeconds=60
[junit4:junit4]   2> 5588 T66 oasc.SolrCore.initDeprecatedSupport WARNING solrconfig.xml uses deprecated <admin/gettableFiles>, Please update your config to use the ShowFileRequestHandler.
[junit4:junit4]   2> 5590 T66 oasc.SolrCore.initDeprecatedSupport WARNING adding ShowFileRequestHandler with hidden files: [SCHEMA.XML, OLD_SYNONYMS.TXT, STOPWORDS.TXT, PROTWORDS.TXT, OPEN-EXCHANGE-RATES.JSON, SYNONYMS.TXT, CURRENCY.XML, MAPPING-ISOLATIN1ACCENT.TXT]
[junit4:junit4]   2> 5595 T66 oass.SolrIndexSearcher.<init> Opening Searcher@bce81f5 main
[junit4:junit4]   2> 5606 T66 oasu.CommitTracker.<init> Hard AutoCommit: disabled
[junit4:junit4]   2> 5606 T66 oasu.CommitTracker.<init> Soft AutoCommit: disabled
[junit4:junit4]   2> 5607 T66 oashc.SpellCheckComponent.inform Initializing spell checkers
[junit4:junit4]   2> 5626 T66 oass.DirectSolrSpellChecker.init init: {name=direct,classname=DirectSolrSpellChecker,field=lowerfilt,minQueryLength=3}
[junit4:junit4]   2> 5694 T94 oasc.SolrCore.registerSearcher [collection1] Registered new searcher Searcher@bce81f5 main{StandardDirectoryReader(segments_1:1)}
[junit4:junit4]   2> 5700 T66 oasc.ZkController.publish numShards not found on descriptor - reading it from system property
[junit4:junit4]   2> 5702 T72 oazs.PrepRequestProcessor.pRequest Got user-level KeeperException when processing sessionid:0x13ab32808390002 type:create cxid:0x56 zxid:0xfffffffffffffffe txntype:unknown reqpath:n/a Error Path:/solr/overseer/queue Error:KeeperErrorCode = NoNode for /solr/overseer/queue
[junit4:junit4]   2> 5716 T66 oasc.CoreContainer.register registering core: collection1
[junit4:junit4]   2> 5716 T66 oasc.ZkController.register Register shard - core:collection1 address:http://127.0.0.1:57117/solr shardId:control_shard
[junit4:junit4]   2> 5732 T66 oascsi.HttpClientUtil.createClient Creating new http client, config:maxConnections=10000&maxConnectionsPerHost=20&connTimeout=30000&socketTimeout=30000&retry=false
[junit4:junit4]   2> 5751 T66 oascc.SolrZkClient.makePath makePath: /collections/control_collection/leader_elect/control_shard/election
[junit4:junit4]   2> 5774 T72 oazs.PrepRequestProcessor.pRequest Got user-level KeeperException when processing sessionid:0x13ab32808390002 type:delete cxid:0x65 zxid:0xfffffffffffffffe txntype:unknown reqpath:n/a Error Path:/solr/collections/control_collection/leaders Error:KeeperErrorCode = NoNode for /solr/collections/control_collection/leaders
[junit4:junit4]   2> 5776 T66 oasc.ShardLeaderElectionContext.runLeaderProcess Running the leader process.
[junit4:junit4]   2> 5777 T72 oazs.PrepRequestProcessor.pRequest Got user-level KeeperException when processing sessionid:0x13ab32808390002 type:create cxid:0x66 zxid:0xfffffffffffffffe txntype:unknown reqpath:n/a Error Path:/solr/overseer Error:KeeperErrorCode = NodeExists for /solr/overseer
[junit4:junit4]   2> 5821 T88 oascc.ZkStateReader.updateClusterState Updating cloud state from ZooKeeper... 
[junit4:junit4]   2> 5823 T88 oasc.Overseer$ClusterStateUpdater.updateState Update state numShards=null message={
[junit4:junit4]   2> 	  "operation":"state",
[junit4:junit4]   2> 	  "numShards":null,
[junit4:junit4]   2> 	  "shard":"control_shard",
[junit4:junit4]   2> 	  "roles":null,
[junit4:junit4]   2> 	  "state":"down",
[junit4:junit4]   2> 	  "core":"collection1",
[junit4:junit4]   2> 	  "collection":"control_collection",
[junit4:junit4]   2> 	  "node_name":"127.0.0.1:57117_solr",
[junit4:junit4]   2> 	  "base_url":"http://127.0.0.1:57117/solr"}
[junit4:junit4]   2> 5842 T72 oazs.PrepRequestProcessor.pRequest Got user-level KeeperException when processing sessionid:0x13ab32808390002 type:create cxid:0x6d zxid:0xfffffffffffffffe txntype:unknown reqpath:n/a Error Path:/solr/overseer/queue-work Error:KeeperErrorCode = NoNode for /solr/overseer/queue-work
[junit4:junit4]   2> 5862 T87 oascc.ZkStateReader$2.process A cluster state change has occurred - updating... (1)
[junit4:junit4]   2> 6288 T66 oasc.ShardLeaderElectionContext.waitForReplicasToComeUp Enough replicas found to continue.
[junit4:junit4]   2> 6289 T66 oasc.ShardLeaderElectionContext.runLeaderProcess I may be the new leader - try and sync
[junit4:junit4]   2> 6289 T66 oasc.SyncStrategy.sync Sync replicas to http://127.0.0.1:57117/solr/collection1/
[junit4:junit4]   2> 6290 T66 oasc.SyncStrategy.syncReplicas Sync Success - now sync replicas to me
[junit4:junit4]   2> 6291 T66 oasc.SyncStrategy.syncToMe http://127.0.0.1:57117/solr/collection1/ has no replicas
[junit4:junit4]   2> 6291 T66 oasc.ShardLeaderElectionContext.runLeaderProcess I am the new leader: http://127.0.0.1:57117/solr/collection1/
[junit4:junit4]   2> 6292 T66 oascc.SolrZkClient.makePath makePath: /collections/control_collection/leaders/control_shard
[junit4:junit4]   2> 6300 T72 oazs.PrepRequestProcessor.pRequest Got user-level KeeperException when processing sessionid:0x13ab32808390002 type:create cxid:0x8b zxid:0xfffffffffffffffe txntype:unknown reqpath:n/a Error Path:/solr/overseer Error:KeeperErrorCode = NodeExists for /solr/overseer
[junit4:junit4]   2> 6371 T88 oascc.ZkStateReader.updateClusterState Updating cloud state from ZooKeeper... 
[junit4:junit4]   2> 6386 T87 oascc.ZkStateReader$2.process A cluster state change has occurred - updating... (1)
[junit4:junit4]   2> 6413 T66 oasc.ZkController.register We are http://127.0.0.1:57117/solr/collection1/ and leader is http://127.0.0.1:57117/solr/collection1/
[junit4:junit4]   2> 6418 T66 oasc.ZkController.register No LogReplay needed for core=collection1 baseURL=http://127.0.0.1:57117/solr
[junit4:junit4]   2> 6418 T66 oasc.ZkController.checkRecovery I am the leader, no recovery necessary
[junit4:junit4]   2> 6419 T66 oasc.ZkController.publish numShards not found on descriptor - reading it from system property
[junit4:junit4]   2> 6422 T66 oascc.ZkStateReader.updateClusterState Updating cloud state from ZooKeeper... 
[junit4:junit4]   2> 6424 T66 oass.SolrDispatchFilter.init user.dir=/usr/home/hudson/hudson-slave/workspace/Lucene-Solr-Tests-4.x-java7/solr/build/solr-core/test/J0
[junit4:junit4]   2> 6424 T66 oass.SolrDispatchFilter.init SolrDispatchFilter.init() done
[junit4:junit4]   2> 6504 T66 oascsi.HttpClientUtil.createClient Creating new http client, config:maxConnections=128&maxConnectionsPerHost=32&followRedirects=false
[junit4:junit4]   2> 6715 T66 oejs.Server.doStart jetty-8.1.2.v20120308
[junit4:junit4]   2> 6719 T66 oejs.AbstractConnector.doStart Started SelectChannelConnector@0.0.0.0:28028
[junit4:junit4]   2> 6720 T66 oasc.SolrResourceLoader.locateSolrHome JNDI not configured for solr (NoInitialContextEx)
[junit4:junit4]   2> 6721 T66 oasc.SolrResourceLoader.locateSolrHome using system property solr.solr.home: /usr/home/hudson/hudson-slave/workspace/Lucene-Solr-Tests-4.x-java7/solr/build/solr-core/test/J0/./solrtest-jetty1-1351625482159
[junit4:junit4]   2> 6721 T66 oasc.SolrResourceLoader.<init> new SolrResourceLoader for deduced Solr Home: '/usr/home/hudson/hudson-slave/workspace/Lucene-Solr-Tests-4.x-java7/solr/build/solr-core/test/J0/./solrtest-jetty1-1351625482159/'
[junit4:junit4]   2> 6777 T66 oass.SolrDispatchFilter.init SolrDispatchFilter.init()
[junit4:junit4]   2> 6778 T66 oasc.SolrResourceLoader.locateSolrHome JNDI not configured for solr (NoInitialContextEx)
[junit4:junit4]   2> 6778 T66 oasc.SolrResourceLoader.locateSolrHome using system property solr.solr.home: /usr/home/hudson/hudson-slave/workspace/Lucene-Solr-Tests-4.x-java7/solr/build/solr-core/test/J0/./solrtest-jetty1-1351625482159
[junit4:junit4]   2> 6779 T66 oasc.CoreContainer$Initializer.initialize looking for solr.xml: /usr/home/hudson/hudson-slave/workspace/Lucene-Solr-Tests-4.x-java7/solr/build/solr-core/test/J0/./solrtest-jetty1-1351625482159/solr.xml
[junit4:junit4]   2> 6780 T66 oasc.CoreContainer.<init> New CoreContainer 1022744530
[junit4:junit4]   2> 6781 T66 oasc.CoreContainer.load Loading CoreContainer using Solr Home: '/usr/home/hudson/hudson-slave/workspace/Lucene-Solr-Tests-4.x-java7/solr/build/solr-core/test/J0/./solrtest-jetty1-1351625482159/'
[junit4:junit4]   2> 6781 T66 oasc.SolrResourceLoader.<init> new SolrResourceLoader for directory: '/usr/home/hudson/hudson-slave/workspace/Lucene-Solr-Tests-4.x-java7/solr/build/solr-core/test/J0/./solrtest-jetty1-1351625482159/'
[junit4:junit4]   2> 6818 T66 oasc.CoreContainer.load Registering Log Listener
[junit4:junit4]   2> 6840 T66 oasc.CoreContainer.initZooKeeper Zookeeper client=127.0.0.1:53891/solr
[junit4:junit4]   2> 6841 T66 oaz.ZooKeeper.<init> Initiating client connection, connectString=127.0.0.1:53891/solr sessionTimeout=5000 watcher=org.apache.solr.common.cloud.ConnectionManager@23016445
[junit4:junit4]   2> 6842 T104 oaz.ClientCnxn$SendThread.startConnect Opening socket connection to server /127.0.0.1:53891
[junit4:junit4]   2> 6842 T66 oascc.ConnectionManager.waitForConnected Waiting for client to connect to ZooKeeper
[junit4:junit4]   2> 6844 T104 oaz.ClientCnxn$SendThread.primeConnection Socket connection established to localhost/127.0.0.1:53891, initiating session
[junit4:junit4]   2> 6844 T68 oazs.NIOServerCnxn$Factory.run Accepted socket connection from /140.211.11.196:20470
[junit4:junit4]   2> 6845 T68 oazs.NIOServerCnxn.readConnectRequest Client attempting to establish new session at /140.211.11.196:20470
[junit4:junit4]   2> 6852 T70 oazs.NIOServerCnxn.finishSessionInit Established session 0x13ab32808390003 with negotiated timeout 5000 for client /140.211.11.196:20470
[junit4:junit4]   2> 6852 T104 oaz.ClientCnxn$SendThread.readConnectResult Session establishment complete on server localhost/127.0.0.1:53891, sessionid = 0x13ab32808390003, negotiated timeout = 5000
[junit4:junit4]   2> 6853 T105 oascc.ConnectionManager.process Watcher org.apache.solr.common.cloud.ConnectionManager@23016445 name:ZooKeeperConnection Watcher:127.0.0.1:53891/solr got event WatchedEvent state:SyncConnected type:None path:null path:null type:None
[junit4:junit4]   2> 6853 T66 oascc.ConnectionManager.waitForConnected Client is connected to ZooKeeper
[junit4:junit4]   2> 6855 T72 oazs.PrepRequestProcessor.pRequest Got user-level KeeperException when processing sessionid:0x13ab32808390003 type:create cxid:0x1 zxid:0xfffffffffffffffe txntype:unknown reqpath:n/a Error Path:/solr/overseer Error:KeeperErrorCode = NodeExists for /solr/overseer
[junit4:junit4]   2> 6881 T72 oazs.PrepRequestProcessor.pRequest Got user-level KeeperException when processing sessionid:0x13ab32808390003 type:create cxid:0x2 zxid:0xfffffffffffffffe txntype:unknown reqpath:n/a Error Path:/solr/overseer Error:KeeperErrorCode = NodeExists for /solr/overseer
[junit4:junit4]   2> 6883 T66 oasc.ZkController.createEphemeralLiveNode Register node as live in ZooKeeper:/live_nodes/127.0.0.1:28028_solr
[junit4:junit4]   2> 6884 T72 oazs.PrepRequestProcessor.pRequest Got user-level KeeperException when processing sessionid:0x13ab32808390003 type:delete cxid:0x4 zxid:0xfffffffffffffffe txntype:unknown reqpath:n/a Error Path:/solr/live_nodes/127.0.0.1:28028_solr Error:KeeperErrorCode = NoNode for /solr/live_nodes/127.0.0.1:28028_solr
[junit4:junit4]   2> 6978 T66 oascc.SolrZkClient.makePath makePath: /live_nodes/127.0.0.1:28028_solr
[junit4:junit4]   2> 6980 T88 oascc.ZkStateReader.updateClusterState Updating cloud state from ZooKeeper... 
[junit4:junit4]   2> 7014 T88 oasc.Overseer$ClusterStateUpdater.updateState Update state numShards=null message={
[junit4:junit4]   2> 	  "operation":"state",
[junit4:junit4]   2> 	  "numShards":null,
[junit4:junit4]   2> 	  "shard":"control_shard",
[junit4:junit4]   2> 	  "roles":null,
[junit4:junit4]   2> 	  "state":"active",
[junit4:junit4]   2> 	  "core":"collection1",
[junit4:junit4]   2> 	  "collection":"control_collection",
[junit4:junit4]   2> 	  "node_name":"127.0.0.1:57117_solr",
[junit4:junit4]   2> 	  "base_url":"http://127.0.0.1:57117/solr"}
[junit4:junit4]   2> 7014 T66 oashc.HttpShardHandlerFactory.getParameter Setting socketTimeout to: 0
[junit4:junit4]   2> 7015 T66 oashc.HttpShardHandlerFactory.getParameter Setting urlScheme to: http://
[junit4:junit4]   2> 7016 T66 oashc.HttpShardHandlerFactory.getParameter Setting connTimeout to: 0
[junit4:junit4]   2> 7016 T66 oashc.HttpShardHandlerFactory.getParameter Setting maxConnectionsPerHost to: 20
[junit4:junit4]   2> 7017 T66 oashc.HttpShardHandlerFactory.getParameter Setting corePoolSize to: 0
[junit4:junit4]   2> 7018 T66 oashc.HttpShardHandlerFactory.getParameter Setting maximumPoolSize to: 2147483647
[junit4:junit4]   2> 7018 T66 oashc.HttpShardHandlerFactory.getParameter Setting maxThreadIdleTime to: 5
[junit4:junit4]   2> 7019 T66 oashc.HttpShardHandlerFactory.getParameter Setting sizeOfQueue to: -1
[junit4:junit4]   2> 7019 T66 oashc.HttpShardHandlerFactory.getParameter Setting fairnessPolicy to: false
[junit4:junit4]   2> 7020 T66 oascsi.HttpClientUtil.createClient Creating new http client, config:maxConnectionsPerHost=20&maxConnections=10000&socketTimeout=0&connTimeout=0&retry=false
[junit4:junit4]   2> 7076 T66 oascc.ZkStateReader.createClusterStateWatchersAndUpdate Updating cluster state from ZooKeeper... 
[junit4:junit4]   2> 7085 T87 oascc.ZkStateReader$3.process Updating live nodes... (2)
[junit4:junit4]   2> 7086 T87 oascc.ZkStateReader$2.process A cluster state change has occurred - updating... (2)
[junit4:junit4]   2> 7092 T66 oasc.CoreContainer.create Creating SolrCore 'collection1' using instanceDir: /usr/home/hudson/hudson-slave/workspace/Lucene-Solr-Tests-4.x-java7/solr/build/solr-core/test/J0/./solrtest-jetty1-1351625482159/collection1
[junit4:junit4]   2> 7093 T66 oasc.ZkController.createCollectionZkNode Check for collection zkNode:collection1
[junit4:junit4]   2> 7094 T66 oasc.ZkController.createCollectionZkNode Collection zkNode exists
[junit4:junit4]   2> 7095 T66 oasc.ZkController.readConfigName Load collection config from:/collections/collection1
[junit4:junit4]   2> 7097 T66 oasc.SolrResourceLoader.<init> new SolrResourceLoader for directory: '/usr/home/hudson/hudson-slave/workspace/Lucene-Solr-Tests-4.x-java7/solr/build/solr-core/test/J0/./solrtest-jetty1-1351625482159/collection1/'
[junit4:junit4]   2> 7098 T66 oasc.SolrResourceLoader.replaceClassLoader Adding 'file:/usr/home/hudson/hudson-slave/workspace/Lucene-Solr-Tests-4.x-java7/solr/build/solr-core/test/J0/solrtest-jetty1-1351625482159/collection1/lib/classes/' to classloader
[junit4:junit4]   2> 7099 T66 oasc.SolrResourceLoader.replaceClassLoader Adding 'file:/usr/home/hudson/hudson-slave/workspace/Lucene-Solr-Tests-4.x-java7/solr/build/solr-core/test/J0/solrtest-jetty1-1351625482159/collection1/lib/README' to classloader
[junit4:junit4]   2> 7171 T66 oasc.SolrConfig.<init> Using Lucene MatchVersion: LUCENE_41
[junit4:junit4]   2> 7264 T66 oasc.SolrConfig.<init> Loaded SolrConfig: solrconfig.xml
[junit4:junit4]   2> 7365 T66 oass.IndexSchema.readSchema Reading Solr Schema
[junit4:junit4]   2> 7376 T66 oass.IndexSchema.readSchema Schema name=test
[junit4:junit4]   2> 8114 T66 oass.OpenExchangeRatesOrgProvider.init Initialized with rates=open-exchange-rates.json, refreshInterval=1440.
[junit4:junit4]   2> 8131 T66 oass.IndexSchema.readSchema default search field in schema is text
[junit4:junit4]   2> 8135 T66 oass.IndexSchema.readSchema unique key field: id
[junit4:junit4]   2> 8166 T66 oass.FileExchangeRateProvider.reload Reloading exchange rates from file currency.xml
[junit4:junit4]   2> 8192 T66 oass.FileExchangeRateProvider.reload Reloading exchange rates from file currency.xml
[junit4:junit4]   2> 8198 T66 oass.OpenExchangeRatesOrgProvider.reload Reloading exchange rates from open-exchange-rates.json
[junit4:junit4]   2> 8201 T66 oass.OpenExchangeRatesOrgProvider.reload Reloading exchange rates from open-exchange-rates.json
[junit4:junit4]   2> 8204 T66 oasc.SolrCore.<init> [collection1] Opening new SolrCore at /usr/home/hudson/hudson-slave/workspace/Lucene-Solr-Tests-4.x-java7/solr/build/solr-core/test/J0/./solrtest-jetty1-1351625482159/collection1/, dataDir=./org.apache.solr.cloud.BasicDistributedZkTest-1351625475635/jetty1/
[junit4:junit4]   2> 8205 T66 oasc.JmxMonitoredMap.<init> JMX monitoring is enabled. Adding Solr mbeans to JMX Server: com.sun.jmx.mbeanserver.JmxMBeanServer@1e05c314
[junit4:junit4]   2> 8206 T66 oasc.SolrCore.getNewIndexDir New index directory detected: old=null new=./org.apache.solr.cloud.BasicDistributedZkTest-1351625475635/jetty1/index/
[junit4:junit4]   2> 8207 T66 oasc.SolrCore.initIndex WARNING [collection1] Solr index directory './org.apache.solr.cloud.BasicDistributedZkTest-1351625475635/jetty1/index' doesn't exist. Creating new index...
[junit4:junit4]   2> 8209 T66 oasc.CachingDirectoryFactory.get return new directory for /usr/home/hudson/hudson-slave/workspace/Lucene-Solr-Tests-4.x-java7/solr/build/solr-core/test/J0/./org.apache.solr.cloud.BasicDistributedZkTest-1351625475635/jetty1/index forceNew:false
[junit4:junit4]   2> 8220 T66 oasc.SolrDeletionPolicy.onCommit SolrDeletionPolicy.onCommit: commits:num=1
[junit4:junit4]   2> 		commit{dir=NRTCachingDirectory(org.apache.lucene.store.NIOFSDirectory@/usr/home/hudson/hudson-slave/workspace/Lucene-Solr-Tests-4.x-java7/solr/build/solr-core/test/J0/org.apache.solr.cloud.BasicDistributedZkTest-1351625475635/jetty1/index lockFactory=org.apache.lucene.store.NativeFSLockFactory@71fde2e9; maxCacheMB=48.0 maxMergeSizeMB=4.0),segFN=segments_1,generation=1,filenames=[segments_1]
[junit4:junit4]   2> 8221 T66 oasc.SolrDeletionPolicy.updateCommits newest commit = 1
[junit4:junit4]   2> 8222 T66 oasc.SolrCore.initWriters created xml: solr.XMLResponseWriter
[junit4:junit4]   2> 8225 T66 oasup.UpdateRequestProcessorChain.init inserting DistributedUpdateProcessorFactory into updateRequestProcessorChain "dedupe"
[junit4:junit4]   2> 8226 T66 oasup.UpdateRequestProcessorChain.init inserting DistributedUpdateProcessorFactory into updateRequestProcessorChain "dedupe-allfields"
[junit4:junit4]   2> 8227 T66 oasup.UpdateRequestProcessorChain.init inserting DistributedUpdateProcessorFactory into updateRequestProcessorChain "stored_sig"
[junit4:junit4]   2> 8228 T66 oasup.UpdateRequestProcessorChain.init inserting DistributedUpdateProcessorFactory into updateRequestProcessorChain "uniq-fields"
[junit4:junit4]   2> 8229 T66 oasup.UpdateRequestProcessorChain.init inserting DistributedUpdateProcessorFactory into updateRequestProcessorChain "distrib-dup-test-chain-implicit"
[junit4:junit4]   2> 8229 T66 oasc.RequestHandlers.initHandlersFromConfig adding lazy requestHandler: solr.ReplicationHandler
[junit4:junit4]   2> 8230 T66 oasc.RequestHandlers.initHandlersFromConfig created /replication: solr.ReplicationHandler
[junit4:junit4]   2> 8231 T66 oasc.RequestHandlers.initHandlersFromConfig created standard: solr.StandardRequestHandler
[junit4:junit4]   2> 8232 T66 oasc.RequestHandlers.initHandlersFromConfig created /get: solr.RealTimeGetHandler
[junit4:junit4]   2> 8233 T66 oasc.RequestHandlers.initHandlersFromConfig created dismax: solr.SearchHandler
[junit4:junit4]   2> 8234 T66 oasc.RequestHandlers.initHandlersFromConfig created mock: org.apache.solr.core.MockQuerySenderListenerReqHandler
[junit4:junit4]   2> 8235 T66 oasc.RequestHandlers.initHandlersFromConfig created /admin/: org.apache.solr.handler.admin.AdminHandlers
[junit4:junit4]   2> 8236 T66 oasc.RequestHandlers.initHandlersFromConfig created defaults: solr.StandardRequestHandler
[junit4:junit4]   2> 8237 T66 oasc.RequestHandlers.initHandlersFromConfig adding lazy requestHandler: solr.StandardRequestHandler
[junit4:junit4]   2> 8237 T66 oasc.RequestHandlers.initHandlersFromConfig created lazy: solr.StandardRequestHandler
[junit4:junit4]   2> 8238 T66 oasc.RequestHandlers.initHandlersFromConfig created /update: solr.UpdateRequestHandler
[junit4:junit4]   2> 8239 T66 oasc.RequestHandlers.initHandlersFromConfig created /terms: org.apache.solr.handler.component.SearchHandler
[junit4:junit4]   2> 8240 T66 oasc.RequestHandlers.initHandlersFromConfig created spellCheckCompRH: org.apache.solr.handler.component.SearchHandler
[junit4:junit4]   2> 8241 T66 oasc.RequestHandlers.initHandlersFromConfig created spellCheckCompRH_Direct: org.apache.solr.handler.component.SearchHandler
[junit4:junit4]   2> 8242 T66 oasc.RequestHandlers.initHandlersFromConfig created spellCheckWithWordbreak: org.apache.solr.handler.component.SearchHandler
[junit4:junit4]   2> 8243 T66 oasc.RequestHandlers.initHandlersFromConfig created spellCheckWithWordbreak_Direct: org.apache.solr.handler.component.SearchHandler
[junit4:junit4]   2> 8244 T66 oasc.RequestHandlers.initHandlersFromConfig created spellCheckCompRH1: org.apache.solr.handler.component.SearchHandler
[junit4:junit4]   2> 8245 T66 oasc.RequestHandlers.initHandlersFromConfig created tvrh: org.apache.solr.handler.component.SearchHandler
[junit4:junit4]   2> 8246 T66 oasc.RequestHandlers.initHandlersFromConfig created /mlt: solr.MoreLikeThisHandler
[junit4:junit4]   2> 8247 T66 oasc.RequestHandlers.initHandlersFromConfig created /debug/dump: solr.DumpRequestHandler
[junit4:junit4]   2> 8264 T66 oashl.XMLLoader.init xsltCacheLifetimeSeconds=60
[junit4:junit4]   2> 8271 T66 oasc.SolrCore.initDeprecatedSupport WARNING solrconfig.xml uses deprecated <admin/gettableFiles>, Please update your config to use the ShowFileRequestHandler.
[junit4:junit4]   2> 8273 T66 oasc.SolrCore.initDeprecatedSupport WARNING adding ShowFileRequestHandler with hidden files: [SCHEMA.XML, OLD_SYNONYMS.TXT, STOPWORDS.TXT, PROTWORDS.TXT, OPEN-EXCHANGE-RATES.JSON, SYNONYMS.TXT, CURRENCY.XML, MAPPING-ISOLATIN1ACCENT.TXT]
[junit4:junit4]   2> 8278 T66 oass.SolrIndexSearcher.<init> Opening Searcher@335c592 main
[junit4:junit4]   2> 8280 T66 oasu.CommitTracker.<init> Hard AutoCommit: disabled
[junit4:junit4]   2> 8280 T66 oasu.CommitTracker.<init> Soft AutoCommit: disabled
[junit4:junit4]   2> 8281 T66 oashc.SpellCheckComponent.inform Initializing spell checkers
[junit4:junit4]   2> 8317 T66 oass.DirectSolrSpellChecker.init init: {name=direct,classname=DirectSolrSpellChecker,field=lowerfilt,minQueryLength=3}
[junit4:junit4]   2> 8402 T110 oasc.SolrCore.registerSearcher [collection1] Registered new searcher Searcher@335c592 main{StandardDirectoryReader(segments_1:1)}
[junit4:junit4]   2> 8409 T66 oasc.ZkController.publish numShards not found on descriptor - reading it from system property
[junit4:junit4]   2> 8594 T88 oascc.ZkStateReader.updateClusterState Updating cloud state from ZooKeeper... 
[junit4:junit4]   2> 8596 T88 oasc.Overseer$ClusterStateUpdater.updateState Update state numShards=2 message={
[junit4:junit4]   2> 	  "operation":"state",
[junit4:junit4]   2> 	  "numShards":"2",
[junit4:junit4]   2> 	  "shard":null,
[junit4:junit4]   2> 	  "roles":null,
[junit4:junit4]   2> 	  "state":"down",
[junit4:junit4]   2> 	  "core":"collection1",
[junit4:junit4]   2> 	  "collection":"collection1",
[junit4:junit4]   2> 	  "node_name":"127.0.0.1:28028_solr",
[junit4:junit4]   2> 	  "base_url":"http://127.0.0.1:28028/solr"}
[junit4:junit4]   2> 8596 T88 oasc.Overseer$ClusterStateUpdater.createCollection Create collection collection1 with numShards 2
[junit4:junit4]   2> 8618 T87 oascc.ZkStateReader$2.process A cluster state change has occurred - updating... (2)
[junit4:junit4]   2> 8619 T105 oascc.ZkStateReader$2.process A cluster state change has occurred - updating... (2)
[junit4:junit4]   2> 8913 T66 oasc.CoreContainer.register registering core: collection1
[junit4:junit4]   2> 8913 T66 oasc.ZkController.register Register shard - core:collection1 address:http://127.0.0.1:28028/solr shardId:shard1
[junit4:junit4]   2> 8915 T66 oascc.SolrZkClient.makePath makePath: /collections/collection1/leader_elect/shard1/election
[junit4:junit4]   2> 8938 T72 oazs.PrepRequestProcessor.pRequest Got user-level KeeperException when processing sessionid:0x13ab32808390003 type:delete cxid:0x42 zxid:0xfffffffffffffffe txntype:unknown reqpath:n/a Error Path:/solr/collections/collection1/leaders Error:KeeperErrorCode = NoNode for /solr/collections/collection1/leaders
[junit4:junit4]   2> 8945 T66 oasc.ShardLeaderElectionContext.runLeaderProcess Running the leader process.
[junit4:junit4]   2> 8946 T72 oazs.PrepRequestProcessor.pRequest Got user-level KeeperException when processing sessionid:0x13ab32808390003 type:create cxid:0x43 zxid:0xfffffffffffffffe txntype:unknown reqpath:n/a Error Path:/solr/overseer Error:KeeperErrorCode = NodeExists for /solr/overseer
[junit4:junit4]   2> 8949 T66 oasc.ShardLeaderElectionContext.waitForReplicasToComeUp Enough replicas found to continue.
[junit4:junit4]   2> 8949 T66 oasc.ShardLeaderElectionContext.runLeaderProcess I may be the new leader - try and sync
[junit4:junit4]   2> 8950 T66 oasc.SyncStrategy.sync Sync replicas to http://127.0.0.1:28028/solr/collection1/
[junit4:junit4]   2> 8950 T66 oasc.SyncStrategy.syncReplicas Sync Success - now sync replicas to me
[junit4:junit4]   2> 8951 T66 oasc.SyncStrategy.syncToMe http://127.0.0.1:28028/solr/collection1/ has no replicas
[junit4:junit4]   2> 8952 T66 oasc.ShardLeaderElectionContext.runLeaderProcess I am the new leader: http://127.0.0.1:28028/solr/collection1/
[junit4:junit4]   2> 8952 T66 oascc.SolrZkClient.makePath makePath: /collections/collection1/leaders/shard1
[junit4:junit4]   2> 8959 T72 oazs.PrepRequestProcessor.pRequest Got user-level KeeperException when processing sessionid:0x13ab32808390003 type:create cxid:0x4d zxid:0xfffffffffffffffe txntype:unknown reqpath:n/a Error Path:/solr/overseer Error:KeeperErrorCode = NodeExists for /solr/overseer
[junit4:junit4]   2> 9125 T88 oascc.ZkStateReader.updateClusterState Updating cloud state from ZooKeeper... 
[junit4:junit4]   2> 9146 T87 oascc.ZkStateReader$2.process A cluster state change has occurred - updating... (2)
[junit4:junit4]   2> 9146 T105 oascc.ZkStateReader$2.process A cluster state change has occurred - updating... (2)
[junit4:junit4]   2> 9172 T66 oasc.ZkController.register We are http://127.0.0.1:28028/solr/collection1/ and leader is http://127.0.0.1:28028/solr/collection1/
[junit4:junit4]   2> 9172 T66 oasc.ZkController.register No LogReplay needed for core=collection1 baseURL=http://127.0.0.1:28028/solr
[junit4:junit4]   2> 9173 T66 oasc.ZkController.checkRecovery I am the leader, no recovery necessary
[junit4:junit4]   2> 9173 T66 oasc.ZkController.publish numShards not found on descriptor - reading it from system property
[junit4:junit4]   2> 9176 T66 oascc.ZkStateReader.updateClusterState Updating cloud state from ZooKeeper... 
[junit4:junit4]   2> 9178 T66 oass.SolrDispatchFilter.init user.dir=/usr/home/hudson/hudson-slave/workspace/Lucene-Solr-Tests-4.x-java7/solr/build/solr-core/test/J0
[junit4:junit4]   2> 9178 T66 oass.SolrDispatchFilter.init SolrDispatchFilter.init() done
[junit4:junit4]   2> 9179 T66 oascsi.HttpClientUtil.createClient Creating new http client, config:maxConnections=128&maxConnectionsPerHost=32&followRedirects=false
[junit4:junit4]   2> 9385 T66 oejs.Server.doStart jetty-8.1.2.v20120308
[junit4:junit4]   2> 9388 T66 oejs.AbstractConnector.doStart Started SelectChannelConnector@0.0.0.0:22644
[junit4:junit4]   2> 9389 T66 oasc.SolrResourceLoader.locateSolrHome JNDI not configured for solr (NoInitialContextEx)
[junit4:junit4]   2> 9390 T66 oasc.SolrResourceLoader.locateSolrHome using system property solr.solr.home: /usr/home/hudson/hudson-slave/workspace/Lucene-Solr-Tests-4.x-java7/solr/build/solr-core/test/J0/./solrtest-jetty2-1351625484827
[junit4:junit4]   2> 9390 T66 oasc.SolrResourceLoader.<init> new SolrResourceLoader for deduced Solr Home: '/usr/home/hudson/hudson-slave/workspace/Lucene-Solr-Tests-4.x-java7/solr/build/solr-core/test/J0/./solrtest-jetty2-1351625484827/'
[junit4:junit4]   2> 9440 T66 oass.SolrDispatchFilter.init SolrDispatchFilter.init()
[junit4:junit4]   2> 9441 T66 oasc.SolrResourceLoader.locateSolrHome JNDI not configured for solr (NoInitialContextEx)
[junit4:junit4]   2> 9441 T66 oasc.SolrResourceLoader.locateSolrHome using system property solr.solr.home: /usr/home/hudson/hudson-slave/workspace/Lucene-Solr-Tests-4.x-java7/solr/build/solr-core/test/J0/./solrtest-jetty2-1351625484827
[junit4:junit4]   2> 9442 T66 oasc.CoreContainer$Initializer.initialize looking for solr.xml: /usr/home/hudson/hudson-slave/workspace/Lucene-Solr-Tests-4.x-java7/solr/build/solr-core/test/J0/./solrtest-jetty2-1351625484827/solr.xml
[junit4:junit4]   2> 9442 T66 oasc.CoreContainer.<init> New CoreContainer 1604749403
[junit4:junit4]   2> 9443 T66 oasc.CoreContainer.load Loading CoreContainer using Solr Home: '/usr/home/hudson/hudson-slave/workspace/Lucene-Solr-Tests-4.x-java7/solr/build/solr-core/test/J0/./solrtest-jetty2-1351625484827/'
[junit4:junit4]   2> 9444 T66 oasc.SolrResourceLoader.<init> new SolrResourceLoader for directory: '/usr/home/hudson/hudson-slave/workspace/Lucene-Solr-Tests-4.x-java7/solr/build/solr-core/test/J0/./solrtest-jetty2-1351625484827/'
[junit4:junit4]   2> 9480 T66 oasc.CoreContainer.load Registering Log Listener
[junit4:junit4]   2> 9499 T66 oasc.CoreContainer.initZooKeeper Zookeeper client=127.0.0.1:53891/solr
[junit4:junit4]   2> 9500 T66 oaz.ZooKeeper.<init> Initiating client connection, connectString=127.0.0.1:53891/solr sessionTimeout=5000 watcher=org.apache.solr.common.cloud.ConnectionManager@304e3a2
[junit4:junit4]   2> 9501 T120 oaz.ClientCnxn$SendThread.startConnect Opening socket connection to server /127.0.0.1:53891
[junit4:junit4]   2> 9501 T66 oascc.ConnectionManager.waitForConnected Waiting for client to connect to ZooKeeper
[junit4:junit4]   2> 9503 T120 oaz.ClientCnxn$SendThread.primeConnection Socket connection established to localhost/127.0.0.1:53891, initiating session
[junit4:junit4]   2> 9503 T68 oazs.NIOServerCnxn$Factory.run Accepted socket connection from /140.211.11.196:41224
[junit4:junit4]   2> 9504 T68 oazs.NIOServerCnxn.readConnectRequest Client attempting to establish new session at /140.211.11.196:41224
[junit4:junit4]   2> 9511 T70 oazs.NIOServerCnxn.finishSessionInit Established session 0x13ab32808390004 with negotiated timeout 5000 for client /140.211.11.196:41224
[junit4:junit4]   2> 9511 T120 oaz.ClientCnxn$SendThread.readConnectResult Session establishment complete on server localhost/127.0.0.1:53891, sessionid = 0x13ab32808390004, negotiated timeout = 5000
[junit4:junit4]   2> 9512 T121 oascc.ConnectionManager.process Watcher org.apache.solr.common.cloud.ConnectionManager@304e3a2 name:ZooKeeperConnection Watcher:127.0.0.1:53891/solr got event WatchedEvent state:SyncConnected type:None path:null path:null type:None
[junit4:junit4]   2> 9513 T66 oascc.ConnectionManager.waitForConnected Client is connected to ZooKeeper
[junit4:junit4]   2> 9514 T72 oazs.PrepRequestProcessor.pRequest Got user-level KeeperException when processing sessionid:0x13ab32808390004 type:create cxid:0x1 zxid:0xfffffffffffffffe txntype:unknown reqpath:n/a Error Path:/solr/overseer Error:KeeperErrorCode = NodeExists for /solr/overseer
[junit4:junit4]   2> 9526 T72 oazs.PrepRequestProcessor.pRequest Got user-level KeeperException when processing sessionid:0x13ab32808390004 type:create cxid:0x2 zxid:0xfffffffffffffffe txntype:unknown reqpath:n/a Error Path:/solr/overseer Error:KeeperErrorCode = NodeExists for /solr/overseer
[junit4:junit4]   2> 9528 T66 oasc.ZkController.createEphemeralLiveNode Register node as live in ZooKeeper:/live_nodes/127.0.0.1:22644_solr
[junit4:junit4]   2> 9529 T72 oazs.PrepRequestProcessor.pRequest Got user-level KeeperException when processing sessionid:0x13ab32808390004 type:delete cxid:0x4 zxid:0xfffffffffffffffe txntype:unknown reqpath:n/a Error Path:/solr/live_nodes/127.0.0.1:22644_solr Error:KeeperErrorCode = NoNode for /solr/live_nodes/127.0.0.1:22644_solr
[junit4:junit4]   2> 9530 T66 oascc.SolrZkClient.makePath makePath: /live_nodes/127.0.0.1:22644_solr
[junit4:junit4]   2> 9539 T87 oascc.ZkStateReader$3.process Updating live nodes... (3)
[junit4:junit4]   2> 9539 T105 oascc.ZkStateReader$3.process Updating live nodes... (3)
[junit4:junit4]   2> 9540 T66 oashc.HttpShardHandlerFactory.getParameter Setting socketTimeout to: 0
[junit4:junit4]   2> 9540 T66 oashc.HttpShardHandlerFactory.getParameter Setting urlScheme to: http://
[junit4:junit4]   2> 9541 T66 oashc.HttpShardHandlerFactory.getParameter Setting connTimeout to: 0
[junit4:junit4]   2> 9542 T66 oashc.HttpShardHandlerFactory.getParameter Setting maxConnectionsPerHost to: 20
[junit4:junit4]   2> 9542 T66 oashc.HttpShardHandlerFactory.getParameter Setting corePoolSize to: 0
[junit4:junit4]   2> 9543 T66 oashc.HttpShardHandlerFactory.getParameter Setting maximumPoolSize to: 2147483647
[junit4:junit4]   2> 9543 T66 oashc.HttpShardHandlerFactory.getParameter Setting maxThreadIdleTime to: 5
[junit4:junit4]   2> 9544 T66 oashc.HttpShardHandlerFactory.getParameter Setting sizeOfQueue to: -1
[junit4:junit4]   2> 9545 T66 oashc.HttpShardHandlerFactory.getParameter Setting fairnessPolicy to: false
[junit4:junit4]   2> 9545 T66 oascsi.HttpClientUtil.createClient Creating new http client, config:maxConnectionsPerHost=20&maxConnections=10000&socketTimeout=0&connTimeout=0&retry=false
[junit4:junit4]   2> 9570 T66 oascc.ZkStateReader.createClusterStateWatchersAndUpdate Updating cluster state from ZooKeeper... 
[junit4:junit4]   2> 9584 T66 oasc.CoreContainer.create Creating SolrCore 'collection1' using instanceDir: /usr/home/hudson/hudson-slave/workspace/Lucene-Solr-Tests-4.x-java7/solr/build/solr-core/test/J0/./solrtest-jetty2-1351625484827/collection1
[junit4:junit4]   2> 9585 T66 oasc.ZkController.createCollectionZkNode Check for collection zkNode:collection1
[junit4:junit4]   2> 9587 T66 oasc.ZkController.createCollectionZkNode Collection zkNode exists
[junit4:junit4]   2> 9587 T66 oasc.ZkController.readConfigName Load collection config from:/collections/collection1
[junit4:junit4]   2> 9589 T66 oasc.SolrResourceLoader.<init> new SolrResourceLoader for directory: '/usr/home/hudson/hudson-slave/workspace/Lucene-Solr-Tests-4.x-java7/solr/build/solr-core/test/J0/./solrtest-jetty2-1351625484827/collection1/'
[junit4:junit4]   2> 9591 T66 oasc.SolrResourceLoader.replaceClassLoader Adding 'file:/usr/home/hudson/hudson-slave/workspace/Lucene-Solr-Tests-4.x-java7/solr/build/solr-core/test/J0/solrtest-jetty2-1351625484827/collection1/lib/classes/' to classloader
[junit4:junit4]   2> 9592 T66 oasc.SolrResourceLoader.replaceClassLoader Adding 'file:/usr/home/hudson/hudson-slave/workspace/Lucene-Solr-Tests-4.x-java7/solr/build/solr-core/test/J0/solrtest-jetty2-1351625484827/collection1/lib/README' to classloader
[junit4:junit4]   2> 9651 T66 oasc.SolrConfig.<init> Using Lucene MatchVersion: LUCENE_41
[junit4:junit4]   2> 9664 T88 oascc.ZkStateReader.updateClusterState Updating cloud state from ZooKeeper... 
[junit4:junit4]   2> 9665 T88 oasc.Overseer$ClusterStateUpdater.updateState Update state numShards=2 message={
[junit4:junit4]   2> 	  "operation":"state",
[junit4:junit4]   2> 	  "numShards":"2",
[junit4:junit4]   2> 	  "shard":"shard1",
[junit4:junit4]   2> 	  "roles":null,
[junit4:junit4]   2> 	  "state":"active",
[junit4:junit4]   2> 	  "core":"collection1",
[junit4:junit4]   2> 	  "collection":"collection1",
[junit4:junit4]   2> 	  "node_name":"127.0.0.1:28028_solr",
[junit4:junit4]   2> 	  "base_url":"http://127.0.0.1:28028/solr"}
[junit4:junit4]   2> 9699 T121 oascc.ZkStateReader$2.process A cluster state change has occurred - updating... (3)
[junit4:junit4]   2> 9699 T105 oascc.ZkStateReader$2.process A cluster state change has occurred - updating... (3)
[junit4:junit4]   2> 9699 T87 oascc.ZkStateReader$2.process A cluster state change has occurred - updating... (3)
[junit4:junit4]   2> 9732 T66 oasc.SolrConfig.<init> Loaded SolrConfig: solrconfig.xml
[junit4:junit4]   2> 9834 T66 oass.IndexSchema.readSchema Reading Solr Schema
[junit4:junit4]   2> 9851 T66 oass.IndexSchema.readSchema Schema name=test
[junit4:junit4]   2> 10721 T66 oass.OpenExchangeRatesOrgProvider.init Initialized with rates=open-exchange-rates.json, refreshInterval=1440.
[junit4:junit4]   2> 10744 T66 oass.IndexSchema.readSchema default search field in schema is text
[junit4:junit4]   2> 10751 T66 oass.IndexSchema.readSchema unique key field: id
[junit4:junit4]   2> 10795 T66 oass.FileExchangeRateProvider.reload Reloading exchange rates from file currency.xml
[junit4:junit4]   2> 10802 T66 oass.FileExchangeRateProvider.reload Reloading exchange rates from file currency.xml
[junit4:junit4]   2> 10810 T66 oass.OpenExchangeRatesOrgProvider.reload Reloading exchange rates from open-exchange-rates.json
[junit4:junit4]   2> 10814 T66 oass.OpenExchangeRatesOrgProvider.reload Reloading exchange rates from open-exchange-rates.json
[junit4:junit4]   2> 10818 T66 oasc.SolrCore.<init> [collection1] Opening new SolrCore at /usr/home/hudson/hudson-slave/workspace/Lucene-Solr-Tests-4.x-java7/solr/build/solr-core/test/J0/./solrtest-jetty2-1351625484827/collection1/, dataDir=./org.apache.solr.cloud.BasicDistributedZkTest-1351625475635/jetty2/
[junit4:junit4]   2> 10818 T66 oasc.JmxMonitoredMap.<init> JMX monitoring is enabled. Adding Solr mbeans to JMX Server: com.sun.jmx.mbeanserver.JmxMBeanServer@1e05c314
[junit4:junit4]   2> 10821 T66 oasc.SolrCore.getNewIndexDir New index directory detected: old=null new=./org.apache.solr.cloud.BasicDistributedZkTest-1351625475635/jetty2/index/
[junit4:junit4]   2> 10822 T66 oasc.SolrCore.initIndex WARNING [collection1] Solr index directory './org.apache.solr.cloud.BasicDistributedZkTest-1351625475635/jetty2/index' doesn't exist. Creating new index...
[junit4:junit4]   2> 10824 T66 oasc.CachingDirectoryFactory.get return new directory for /usr/home/hudson/hudson-slave/workspace/Lucene-Solr-Tests-4.x-java7/solr/build/solr-core/test/J0/./org.apache.solr.cloud.BasicDistributedZkTest-1351625475635/jetty2/index forceNew:false
[junit4:junit4]   2> 10835 T66 oasc.SolrDeletionPolicy.onCommit SolrDeletionPolicy.onCommit: commits:num=1
[junit4:junit4]   2> 		commit{dir=NRTCachingDirectory(org.apache.lucene.store.NIOFSDirectory@/usr/home/hudson/hudson-slave/workspace/Lucene-Solr-Tests-4.x-java7/solr/build/solr-core/test/J0/org.apache.solr.cloud.BasicDistributedZkTest-1351625475635/jetty2/index lockFactory=org.apache.lucene.store.NativeFSLockFactory@236afc22; maxCacheMB=48.0 maxMergeSizeMB=4.0),segFN=segments_1,generation=1,filenames=[segments_1]
[junit4:junit4]   2> 10836 T66 oasc.SolrDeletionPolicy.updateCommits newest commit = 1
[junit4:junit4]   2> 10837 T66 oasc.SolrCore.initWriters created xml: solr.XMLResponseWriter
[junit4:junit4]   2> 10841 T66 oasup.UpdateRequestProcessorChain.init inserting DistributedUpdateProcessorFactory into updateRequestProcessorChain "dedupe"
[junit4:junit4]   2> 10842 T66 oasup.UpdateRequestProcessorChain.init inserting DistributedUpdateProcessorFactory into updateRequestProcessorChain "dedupe-allfields"
[junit4:junit4]   2> 10843 T66 oasup.UpdateRequestProcessorChain.init inserting DistributedUpdateProcessorFactory into updateRequestProcessorChain "stored_sig"
[junit4:junit4]   2> 10843 T66 oasup.UpdateRequestProcessorChain.init inserting DistributedUpdateProcessorFactory into updateRequestProcessorChain "uniq-fields"
[junit4:junit4]   2> 10844 T66 oasup.UpdateRequestProcessorChain.init inserting DistributedUpdateProcessorFactory into updateRequestProcessorChain "distrib-dup-test-chain-implicit"
[junit4:junit4]   2> 10845 T66 oasc.RequestHandlers.initHandlersFromConfig adding lazy requestHandler: solr.ReplicationHandler
[junit4:junit4]   2> 10846 T66 oasc.RequestHandlers.initHandlersFromConfig created /replication: solr.ReplicationHandler
[junit4:junit4]   2> 10847 T66 oasc.RequestHandlers.initHandlersFromConfig created standard: solr.StandardRequestHandler
[junit4:junit4]   2> 10848 T66 oasc.RequestHandlers.initHandlersFromConfig created /get: solr.RealTimeGetHandler
[junit4:junit4]   2> 10850 T66 oasc.RequestHandlers.initHandlersFromConfig created dismax: solr.SearchHandler
[junit4:junit4]   2> 10852 T66 oasc.RequestHandlers.initHandlersFromConfig created mock: org.apache.solr.core.MockQuerySenderListenerReqHandler
[junit4:junit4]   2> 10853 T66 oasc.RequestHandlers.initHandlersFromConfig created /admin/: org.apache.solr.handler.admin.AdminHandlers
[junit4:junit4]   2> 10854 T66 oasc.RequestHandlers.initHandlersFromConfig created defaults: solr.StandardRequestHandler
[junit4:junit4]   2> 10855 T66 oasc.RequestHandlers.initHandlersFromConfig adding lazy requestHandler: solr.StandardRequestHandler
[junit4:junit4]   2> 10856 T66 oasc.RequestHandlers.initHandlersFromConfig created lazy: solr.StandardRequestHandler
[junit4:junit4]   2> 10858 T66 oasc.RequestHandlers.initHandlersFromConfig created /update: solr.UpdateRequestHandler
[junit4:junit4]   2> 10859 T66 oasc.RequestHandlers.initHandlersFromConfig created /terms: org.apache.solr.handler.component.SearchHandler
[junit4:junit4]   2> 10860 T66 oasc.RequestHandlers.initHandlersFromConfig created spellCheckCompRH: org.apache.solr.handler.component.SearchHandler
[junit4:junit4]   2> 10861 T66 oasc.RequestHandlers.initHandlersFromConfig created spellCheckCompRH_Direct: org.apache.solr.handler.component.SearchHandler
[junit4:junit4]   2> 10862 T66 oasc.RequestHandlers.initHandlersFromConfig created spellCheckWithWordbreak: org.apache.solr.handler.component.SearchHandler
[junit4:junit4]   2> 10864 T66 oasc.RequestHandlers.initHandlersFromConfig created spellCheckWithWordbreak_Direct: org.apache.solr.handler.component.SearchHandler
[junit4:junit4]   2> 10865 T66 oasc.RequestHandlers.initHandlersFromConfig created spellCheckCompRH1: org.apache.solr.handler.component.SearchHandler
[junit4:junit4]   2> 10866 T66 oasc.RequestHandlers.initHandlersFromConfig created tvrh: org.apache.solr.handler.component.SearchHandler
[junit4:junit4]   2> 10867 T66 oasc.RequestHandlers.initHandlersFromConfig created /mlt: solr.MoreLikeThisHandler
[junit4:junit4]   2> 10868 T66 oasc.RequestHandlers.initHandlersFromConfig created /debug/dump: solr.DumpRequestHandler
[junit4:junit4]   2> 10885 T66 oashl.XMLLoader.init xsltCacheLifetimeSeconds=60
[junit4:junit4]   2> 10893 T66 oasc.SolrCore.initDeprecatedSupport WARNING solrconfig.xml uses deprecated <admin/gettableFiles>, Please update your config to use the ShowFileRequestHandler.
[junit4:junit4]   2> 10895 T66 oasc.SolrCore.initDeprecatedSupport WARNING adding ShowFileRequestHandler with hidden files: [SCHEMA.XML, OLD_SYNONYMS.TXT, STOPWORDS.TXT, PROTWORDS.TXT, OPEN-EXCHANGE-RATES.JSON, SYNONYMS.TXT, CURRENCY.XML, MAPPING-ISOLATIN1ACCENT.TXT]
[junit4:junit4]   2> 10900 T66 oass.SolrIndexSearcher.<init> Opening Searcher@20feb133 main
[junit4:junit4]   2> 10902 T66 oasu.CommitTracker.<init> Hard AutoCommit: disabled
[junit4:junit4]   2> 10903 T66 oasu.CommitTracker.<init> Soft AutoCommit: disabled
[junit4:junit4]   2> 10904 T66 oashc.SpellCheckComponent.inform Initializing spell checkers
[junit4:junit4]   2> 10927 T66 oass.DirectSolrSpellChecker.init init: {name=direct,classname=DirectSolrSpellChecker,field=lowerfilt,minQueryLength=3}
[junit4:junit4]   2> 11002 T126 oasc.SolrCore.registerSearcher [collection1] Registered new searcher Searcher@20feb133 main{StandardDirectoryReader(segments_1:1)}
[junit4:junit4]   2> 11011 T66 oasc.ZkController.publish numShards not found on descriptor - reading it from system property
[junit4:junit4]   2> 11220 T88 oascc.ZkStateReader.updateClusterState Updating cloud state from ZooKeeper... 
[junit4:junit4]   2> 11221 T88 oasc.Overseer$ClusterStateUpdater.updateState Update state numShards=2 message={
[junit4:junit4]   2> 	  "operation":"state",
[junit4:junit4]   2> 	  "numShards":"2",
[junit4:junit4]   2> 	  "shard":null,
[junit4:junit4]   2> 	  "roles":null,
[junit4:junit4]   2> 	  "state":"down",
[junit4:junit4]   2> 	  "core":"collection1",
[junit4:junit4]   2> 	  "collection":"collection1",
[junit4:junit4]   2> 	  "node_name":"127.0.0.1:22644_solr",
[junit4:junit4]   2> 	  "base_url":"http://127.0.0.1:22644/solr"}
[junit4:junit4]   2> 11236 T87 oascc.ZkStateReader$2.process A cluster state change has occurred - updating... (3)
[junit4:junit4]   2> 11236 T121 oascc.ZkStateReader$2.process A cluster state change has occurred - updating... (3)
[junit4:junit4]   2> 11236 T105 oascc.ZkStateReader$2.process A cluster state change has occurred - updating... (3)
[junit4:junit4]   2> 11516 T66 oasc.CoreContainer.register registering core: collection1
[junit4:junit4]   2> 11517 T66 oasc.ZkController.register Register shard - core:collection1 address:http://127.0.0.1:22644/solr shardId:shard2
[junit4:junit4]   2> 11519 T66 oascc.SolrZkClient.makePath makePath: /collections/collection1/leader_elect/shard2/election
[junit4:junit4]   2> 11537 T72 oazs.PrepRequestProcessor.pRequest Got user-level KeeperException when processing sessionid:0x13ab32808390004 type:delete cxid:0x42 zxid:0xfffffffffffffffe txntype:unknown reqpath:n/a Error Path:/solr/collections/collection1/leaders/shard2 Error:KeeperErrorCode = NoNode for /solr/collections/collection1/leaders/shard2
[junit4:junit4]   2> 11539 T66 oasc.ShardLeaderElectionContext.runLeaderProcess Running the leader process.
[junit4:junit4]   2> 11540 T72 oazs.PrepRequestProcessor.pRequest Got user-level KeeperException when processing sessionid:0x13ab32808390004 type:create cxid:0x43 zxid:0xfffffffffffffffe txntype:unknown reqpath:n/a Error Path:/solr/overseer Error:KeeperErrorCode = NodeExists for /solr/overseer
[junit4:junit4]   2> 11552 T66 oasc.ShardLeaderElectionContext.waitForReplicasToComeUp Enough replicas found to continue.
[junit4:junit4]   2> 11554 T66 oasc.ShardLeaderElectionContext.runLeaderProcess I may be the new leader - try and sync
[junit4:junit4]   2> 11554 T66 oasc.SyncStrategy.sync Sync replicas to http://127.0.0.1:22644/solr/collection1/
[junit4:junit4]   2> 11555 T66 oasc.SyncStrategy.syncReplicas Sync Success - now sync replicas to me
[junit4:junit4]   2> 11556 T66 oasc.SyncStrategy.syncToMe http://127.0.0.1:22644/solr/collection1/ has no replicas
[junit4:junit4]   2> 11556 T66 oasc.ShardLeaderElectionContext.runLeaderProcess I am the new leader: http://127.0.0.1:22644/solr/collection1/
[junit4:junit4]   2> 11557 T66 oascc.SolrZkClient.makePath makePath: /collections/collection1/leaders/shard2
[junit4:junit4]   2> 11565 T72 oazs.PrepRequestProcessor.pRequest Got user-level KeeperException when processing sessionid:0x13ab32808390004 type:create cxid:0x4c zxid:0xfffffffffffffffe txntype:unknown reqpath:n/a Error Path:/solr/overseer Error:KeeperErrorCode = NodeExists for /solr/overseer
[junit4:junit4]   2> 11744 T88 oascc.ZkStateReader.updateClusterState Updating cloud state from ZooKeeper... 
[junit4:junit4]   2> 11764 T87 oascc.ZkStateReader$2.process A cluster state change has occurred - updating... (3)
[junit4:junit4]   2> 11765 T121 oascc.ZkStateReader$2.process A cluster state change has occurred - updating... (3)
[junit4:junit4]   2> 11764 T105 oascc.ZkStateReader$2.process A cluster state change has occurred - updating... (3)
[junit4:junit4]   2> 11780 T66 oasc.ZkController.register We are http://127.0.0.1:22644/solr/collection1/ and leader is http://127.0.0.1:22644/solr/collection1/
[junit4:junit4]   2> 11781 T66 oasc.ZkController.register No LogReplay needed for core=collection1 baseURL=http://127.0.0.1:22644/solr
[junit4:junit4]   2> 11784 T66 oasc.ZkController.checkRecovery I am the leader, no recovery necessary
[junit4:junit4]   2> 11784 T66 oasc.ZkController.publish numShards not found on descriptor - reading it from system property
[junit4:junit4]   2> 11789 T66 oascc.ZkStateReader.updateClusterState Updating cloud state from ZooKeeper... 
[junit4:junit4]   2> 11791 T66 oass.SolrDispatchFilter.init user.dir=/usr/home/hudson/hudson-slave/workspace/Lucene-Solr-Tests-4.x-java7/solr/build/solr-core/test/J0
[junit4:junit4]   2> 11792 T66 oass.SolrDispatchFilter.init SolrDispatchFilter.init() done
[junit4:junit4]   2> 11793 T66 oascsi.HttpClientUtil.createClient Creating new http client, config:maxConnections=128&maxConnectionsPerHost=32&followRedirects=false
[junit4:junit4]   2> 12080 T66 oejs.Server.doStart jetty-8.1.2.v20120308
[junit4:junit4]   2> 12084 T66 oejs.AbstractConnector.doStart Started SelectChannelConnector@0.0.0.0:51712
[junit4:junit4]   2> 12085 T66 oasc.SolrResourceLoader.locateSolrHome JNDI not configured for solr (NoInitialContextEx)
[junit4:junit4]   2> 12086 T66 oasc.SolrResourceLoader.locateSolrHome using system property solr.solr.home: /usr/home/hudson/hudson-slave/workspace/Lucene-Solr-Tests-4.x-java7/solr/build/solr-core/test/J0/./solrtest-jetty3-1351625487445
[junit4:junit4]   2> 12087 T66 oasc.SolrResourceLoader.<init> new SolrResourceLoader for deduced Solr Home: '/usr/home/hudson/hudson-slave/workspace/Lucene-Solr-Tests-4.x-java7/solr/build/solr-core/test/J0/./solrtest-jetty3-1351625487445/'
[junit4:junit4]   2> 12139 T66 oass.SolrDispatchFilter.init SolrDispatchFilter.init()
[junit4:junit4]   2> 12140 T66 oasc.SolrResourceLoader.locateSolrHome JNDI not configured for solr (NoInitialContextEx)
[junit4:junit4]   2> 12140 T66 oasc.SolrResourceLoader.locateSolrHome using system property solr.solr.home: /usr/home/hudson/hudson-slave/workspace/Lucene-Solr-Tests-4.x-java7/solr/build/solr-core/test/J0/./solrtest-jetty3-1351625487445
[junit4:junit4]   2> 12141 T66 oasc.CoreContainer$Initializer.initialize looking for solr.xml: /usr/home/hudson/hudson-slave/workspace/Lucene-Solr-Tests-4.x-java7/solr/build/solr-core/test/J0/./solrtest-jetty3-1351625487445/solr.xml
[junit4:junit4]   2> 12141 T66 oasc.CoreContainer.<init> New CoreContainer 1017023675
[junit4:junit4]   2> 12142 T66 oasc.CoreContainer.load Loading CoreContainer using Solr Home: '/usr/home/hudson/hudson-slave/workspace/Lucene-Solr-Tests-4.x-java7/solr/build/solr-core/test/J0/./solrtest-jetty3-1351625487445/'
[junit4:junit4]   2> 12143 T66 oasc.SolrResourceLoader.<init> new SolrResourceLoader for directory: '/usr/home/hudson/hudson-slave/workspace/Lucene-Solr-Tests-4.x-java7/solr/build/solr-core/test/J0/./solrtest-jetty3-1351625487445/'
[junit4:junit4]   2> 12194 T66 oasc.CoreContainer.load Registering Log Listener
[junit4:junit4]   2> 12212 T66 oasc.CoreContainer.initZooKeeper Zookeeper client=127.0.0.1:53891/solr
[junit4:junit4]   2> 12213 T66 oaz.ZooKeeper.<init> Initiating client connection, connectString=127.0.0.1:53891/solr sessionTimeout=5000 watcher=org.apache.solr.common.cloud.ConnectionManager@231062a2
[junit4:junit4]   2> 12214 T136 oaz.ClientCnxn$SendThread.startConnect Opening socket connection to server /127.0.0.1:53891
[junit4:junit4]   2> 12214 T66 oascc.ConnectionManager.waitForConnected Waiting for client to connect to ZooKeeper
[junit4:junit4]   2> 12216 T136 oaz.ClientCnxn$SendThread.primeConnection Socket connection established to localhost/127.0.0.1:53891, initiating session
[junit4:junit4]   2> 12216 T68 oazs.NIOServerCnxn$Factory.run Accepted socket connection from /140.211.11.196:51713
[junit4:junit4]   2> 12217 T68 oazs.NIOServerCnxn.readConnectRequest Client attempting to establish new session at /140.211.11.196:51713
[junit4:junit4]   2> 12253 T70 oazs.NIOServerCnxn.finishSessionInit Established session 0x13ab32808390005 with negotiated timeout 5000 for client /140.211.11.196:51713
[junit4:junit4]   2> 12253 T136 oaz.ClientCnxn$SendThread.readConnectResult Session establishment complete on server localhost/127.0.0.1:53891, sessionid = 0x13ab32808390005, negotiated timeout = 5000
[junit4:junit4]   2> 12254 T137 oascc.ConnectionManager.process Watcher org.apache.solr.common.cloud.ConnectionManager@231062a2 name:ZooKeeperConnection Watcher:127.0.0.1:53891/solr got event WatchedEvent state:SyncConnected type:None path:null path:null type:None
[junit4:junit4]   2> 12254 T66 oascc.ConnectionManager.waitForConnected Client is connected to ZooKeeper
[junit4:junit4]   2> 12255 T72 oazs.PrepRequestProcessor.pRequest Got user-level KeeperException when processing sessionid:0x13ab32808390005 type:create cxid:0x1 zxid:0xfffffffffffffffe txntype:unknown reqpath:n/a Error Path:/solr/overseer Error:KeeperErrorCode = NodeExists for /solr/overseer
[junit4:junit4]   2> 12315 T72 oazs.PrepRequestProcessor.pRequest Got user-level KeeperException when processing sessionid:0x13ab32808390005 type:create cxid:0x2 zxid:0xfffffffffffffffe txntype:unknown reqpath:n/a Error Path:/solr/overseer Error:KeeperErrorCode = NodeExists for /solr/overseer
[junit4:junit4]   2> 12318 T66 oasc.ZkController.createEphemeralLiveNode Register node as live in ZooKeeper:/live_nodes/127.0.0.1:51712_solr
[junit4:junit4]   2> 12318 T88 oascc.ZkStateReader.updateClusterState Updating cloud state from ZooKeeper... 
[junit4:junit4]   2> 12320 T72 oazs.PrepRequestProcessor.pRequest Got user-level KeeperException when processing sessionid:0x13ab32808390005 type:delete cxid:0x4 zxid:0xfffffffffffffffe txntype:unknown reqpath:n/a Error Path:/solr/live_nodes/127.0.0.1:51712_solr Error:KeeperErrorCode = NoNode for /solr/live_nodes/127.0.0.1:51712_solr
[junit4:junit4]   2> 12365 T66 oascc.SolrZkClient.makePath makePath: /live_nodes/127.0.0.1:51712_solr
[junit4:junit4]   2> 12365 T88 oasc.Overseer$ClusterStateUpdater.updateState Update state numShards=2 message={
[junit4:junit4]   2> 	  "operation":"state",
[junit4:junit4]   2> 	  "numShards":"2",
[junit4:junit4]   2> 	  "shard":"shard2",
[junit4:junit4]   2> 	  "roles":null,
[junit4:junit4]   2> 	  "state":"active",
[junit4:junit4]   2> 	  "core":"collection1",
[junit4:junit4]   2> 	  "collection":"collection1",
[junit4:junit4]   2> 	  "node_name":"127.0.0.1:22644_solr",
[junit4:junit4]   2> 	  "base_url":"http://127.0.0.1:22644/solr"}
[junit4:junit4]   2> 12500 T121 oascc.ZkStateReader$3.process Updating live nodes... (4)
[junit4:junit4]   2> 12500 T105 oascc.ZkStateReader$3.process Updating live nodes... (4)
[junit4:junit4]   2> 12502 T66 oashc.HttpShardHandlerFactory.getParameter Setting socketTimeout to: 0
[junit4:junit4]   2> 12502 T66 oashc.HttpShardHandlerFactory.getParameter Setting urlScheme to: http://
[junit4:junit4]   2> 12503 T66 oashc.HttpShardHandlerFactory.getParameter Setting connTimeout to: 0
[junit4:junit4]   2> 12503 T66 oashc.HttpShardHandlerFactory.getParameter Setting maxConnectionsPerHost to: 20
[junit4:junit4]   2> 12504 T66 oashc.HttpShardHandlerFactory.getParameter Setting corePoolSize to: 0
[junit4:junit4]   2> 12505 T66 oashc.HttpShardHandlerFactory.getParameter Setting maximumPoolSize to: 2147483647
[junit4:junit4]   2> 12505 T66 oashc.HttpShardHandlerFactory.getParameter Setting maxThreadIdleTime to: 5
[junit4:junit4]   2> 12506 T66 oashc.HttpShardHandlerFactory.getParameter Setting sizeOfQueue to: -1
[junit4:junit4]   2> 12506 T66 oashc.HttpShardHandlerFactory.getParameter Setting fairnessPolicy to: false
[junit4:junit4]   2> 12507 T66 oascsi.HttpClientUtil.createClient Creating new http client, config:maxConnectionsPerHost=20&maxConnections=10000&socketTimeout=0&connTimeout=0&retry=false
[junit4:junit4]   2> 12537 T105 oascc.ZkStateReader$2.process A cluster state change has occurred - updating... (4)
[junit4:junit4]   2> 12537 T121 oascc.ZkStateReader$2.process A cluster state change has occurred - updating... (4)
[junit4:junit4]   2> 12552 T66 oascc.ZkStateReader.createClusterStateWatchersAndUpdate Updating cluster state from ZooKeeper... 
[junit4:junit4]   2> 12552 T87 oascc.ZkStateReader$3.process Updating live nodes... (4)
[junit4:junit4]   2> 12553 T87 oascc.ZkStateReader$2.process A cluster state change has occurred - updating... (4)
[junit4:junit4]   2> 12561 T66 oasc.CoreContainer.create Creating SolrCore 'collection1' using instanceDir: /usr/home/hudson/hudson-slave/workspace/Lucene-Solr-Tests-4.x-java7/solr/build/solr-core/test/J0/./solrtest-jetty3-1351625487445/collection1
[junit4:junit4]   2> 12561 T66 oasc.ZkController.createCollectionZkNode Check for collection zkNode:collection1
[junit4:junit4]   2> 12563 T66 oasc.ZkController.createCollectionZkNode Collection zkNode exists
[junit4:junit4]   2> 12563 T66 oasc.ZkController.readConfigName Load collection config from:/collections/collection1
[junit4:junit4]   2> 12566 T66 oasc.SolrResourceLoader.<init> new SolrResourceLoader for directory: '/usr/home/hudson/hudson-slave/workspace/Lucene-Solr-Tests-4.x-java7/solr/build/solr-core/test/J0/./solrtest-jetty3-1351625487445/collection1/'
[junit4:junit4]   2> 12568 T66 oasc.SolrResourceLoader.replaceClassLoader Adding 'file:/usr/home/hudson/hudson-slave/workspace/Lucene-Solr-Tests-4.x-java7/solr/build/solr-core/test/J0/solrtest-jetty3-1351625487445/collection1/lib/README' to classloader
[junit4:junit4]   2> 12569 T66 oasc.SolrResourceLoader.replaceClassLoader Adding 'file:/usr/home/hudson/hudson-slave/workspace/Lucene-Solr-Tests-4.x-java7/solr/build/solr-core/test/J0/solrtest-jetty3-1351625487445/collection1/lib/classes/' to classloader
[junit4:junit4]   2> 12633 T66 oasc.SolrConfig.<init> Using Lucene MatchVersion: LUCENE_41
[junit4:junit4]   2> 12722 T66 oasc.SolrConfig.<init> Loaded SolrConfig: solrconfig.xml
[junit4:junit4]   2> 12824 T66 oass.IndexSchema.readSchema Reading Solr Schema
[junit4:junit4]   2> 12834 T66 oass.IndexSchema.readSchema Schema name=test
[junit4:junit4]   2> 13551 T66 oass.OpenExchangeRatesOrgProvider.init Initialized with rates=open-exchange-rates.json, refreshInterval=1440.
[junit4:junit4]   2> 13565 T66 oass.IndexSchema.readSchema default search field in schema is text
[junit4:junit4]   2> 13569 T66 oass.IndexSchema.readSchema unique key field: id
[junit4:junit4]   2> 13595 T66 oass.FileExchangeRateProvider.reload Reloading exchange rates from file currency.xml
[junit4:junit4]   2> 13600 T66 oass.FileExchangeRateProvider.reload Reloading exchange rates from file currency.xml
[junit4:junit4]   2> 13605 T66 oass.OpenExchangeRatesOrgProvider.reload Reloading exchange rates from open-exchange-rates.json
[junit4:junit4]   2> 13608 T66 oass.OpenExchangeRatesOrgProvider.reload Reloading exchange rates from open-exchange-rates.json
[junit4:junit4]   2> 13610 T66 oasc.SolrCore.<init> [collection1] Opening new SolrCore at /usr/home/hudson/hudson-slave/workspace/Lucene-Solr-Tests-4.x-java7/solr/build/solr-core/test/J0/./solrtest-jetty3-1351625487445/collection1/, dataDir=./org.apache.solr.cloud.BasicDistributedZkTest-1351625475635/jetty3/
[junit4:junit4]   2> 13611 T66 oasc.JmxMonitoredMap.<init> JMX monitoring is enabled. Adding Solr mbeans to JMX Server: com.sun.jmx.mbeanserver.JmxMBeanServer@1e05c314
[junit4:junit4]   2> 13612 T66 oasc.SolrCore.getNewIndexDir New index directory detected: old=null new=./org.apache.solr.cloud.BasicDistributedZkTest-1351625475635/jetty3/index/
[junit4:junit4]   2> 13613 T66 oasc.SolrCore.initIndex WARNING [collection1] Solr index directory './org.apache.solr.cloud.BasicDistributedZkTest-1351625475635/jetty3/index' doesn't exist. Creating new index...
[junit4:junit4]   2> 13614 T66 oasc.CachingDirectoryFactory.get return new directory for /usr/home/hudson/hudson-slave/workspace/Lucene-Solr-Tests-4.x-java7/solr/build/solr-core/test/J0/./org.apache.solr.cloud.BasicDistributedZkTest-1351625475635/jetty3/index forceNew:false
[junit4:junit4]   2> 13634 T66 oasc.SolrDeletionPolicy.onCommit SolrDeletionPolicy.onCommit: commits:num=1
[junit4:junit4]   2> 		commit{dir=NRTCachingDirectory(org.apache.lucene.store.NIOFSDirectory@/usr/home/hudson/hudson-slave/workspace/Lucene-Solr-Tests-4.x-java7/solr/build/solr-core/test/J0/org.apache.solr.cloud.BasicDistributedZkTest-1351625475635/jetty3/index lockFactory=org.apache.lucene.store.NativeFSLockFactory@14746ad; maxCacheMB=48.0 maxMergeSizeMB=4.0),segFN=segments_1,generation=1,filenames=[segments_1]
[junit4:junit4]   2> 13634 T66 oasc.SolrDeletionPolicy.updateCommits newest commit = 1
[junit4:junit4]   2> 13635 T66 oasc.SolrCore.initWriters created xml: solr.XMLResponseWriter
[junit4:junit4]   2> 13643 T66 oasup.UpdateRequestProcessorChain.init inserting DistributedUpdateProcessorFactory into updateRequestProcessorChain "dedupe"
[junit4:junit4]   2> 13644 T66 oasup.UpdateRequestProcessorChain.init inserting DistributedUpdateProcessorFactory into updateRequestProcessorChain "dedupe-allfields"
[junit4:junit4]   2> 13644 T66 oasup.UpdateRequestProcessorChain.init inserting DistributedUpdateProcessorFactory into updateRequestProcessorChain "stored_sig"
[junit4:junit4]   2> 13645 T66 oasup.UpdateRequestProcessorChain.init inserting DistributedUpdateProcessorFactory into updateRequestProcessorChain "uniq-fields"
[junit4:junit4]   2> 13645 T66 oasup.UpdateRequestProcessorChain.init inserting DistributedUpdateProcessorFactory into updateRequestProcessorChain "distrib-dup-test-chain-implicit"
[junit4:junit4]   2> 13646 T66 oasc.RequestHandlers.initHandlersFromConfig adding lazy requestHandler: solr.ReplicationHandler
[junit4:junit4]   2> 13646 T66 oasc.RequestHandlers.initHandlersFromConfig created /replication: solr.ReplicationHandler
[junit4:junit4]   2> 13647 T66 oasc.RequestHandlers.initHandlersFromConfig created standard: solr.StandardRequestHandler
[junit4:junit4]   2> 13648 T66 oasc.RequestHandlers.initHandlersFromConfig created /get: solr.RealTimeGetHandler
[junit4:junit4]   2> 13648 T66 oasc.RequestHandlers.initHandlersFromConfig created dismax: solr.SearchHandler
[junit4:junit4]   2> 13649 T66 oasc.RequestHandlers.initHandlersFromConfig created mock: org.apache.solr.core.MockQuerySenderListenerReqHandler
[junit4:junit4]   2> 13650 T66 oasc.RequestHandlers.initHandlersFromConfig created /admin/: org.apache.solr.handler.admin.AdminHandlers
[junit4:junit4]   2> 13650 T66 oasc.RequestHandlers.initHandlersFromConfig created defaults: solr.StandardRequestHandler
[junit4:junit4]   2> 13651 T66 oasc.RequestHandlers.initHandlersFromConfig adding lazy requestHandler: solr.StandardRequestHandler
[junit4:junit4]   2> 13651 T66 oasc.RequestHandlers.initHandlersFromConfig created lazy: solr.StandardRequestHandler
[junit4:junit4]   2> 13652 T66 oasc.RequestHandlers.initHandlersFromConfig created /update: solr.UpdateRequestHandler
[junit4:junit4]   2> 13652 T66 oasc.RequestHandlers.initHandlersFromConfig created /terms: org.apache.solr.handler.component.SearchHandler
[junit4:junit4]   2> 13653 T66 oasc.RequestHandlers.initHandlersFromConfig created spellCheckCompRH: org.apache.solr.handler.component.SearchHandler
[junit4:junit4]   2> 13654 T66 oasc.RequestHandlers.initHandlersFromConfig created spellCheckCompRH_Direct: org.apache.solr.handler.component.SearchHandler
[junit4:junit4]   2> 13654 T66 oasc.RequestHandlers.initHandlersFromConfig created spellCheckWithWordbreak: org.apache.solr.handler.component.SearchHandler
[junit4:junit4]   2> 13655 T66 oasc.RequestHandlers.initHandlersFromConfig created spellCheckWithWordbreak_Direct: org.apache.solr.handler.component.SearchHandler
[junit4:junit4]   2> 13655 T66 oasc.RequestHandlers.initHandlersFromConfig created spellCheckCompRH1: org.apache.solr.handler.component.SearchHandler
[junit4:junit4]   2> 13656 T66 oasc.RequestHandlers.initHandlersFromConfig created tvrh: org.apache.solr.handler.component.SearchHandler
[junit4:junit4]   2> 13657 T66 oasc.RequestHandlers.initHandlersFromConfig created /mlt: solr.MoreLikeThisHandler
[junit4:junit4]   2> 13657 T66 oasc.RequestHandlers.initHandlersFromConfig created /debug/dump: solr.DumpRequestHandler
[junit4:junit4]   2> 13669 T66 oashl.XMLLoader.init xsltCacheLifetimeSeconds=60
[junit4:junit4]   2> 13673 T66 oasc.SolrCore.initDeprecatedSupport WARNING solrconfig.xml uses deprecated <admin/gettableFiles>, Please update your config to use the ShowFileRequestHandler.
[junit4:junit4]   2> 13675 T66 oasc.SolrCore.initDeprecatedSupport WARNING adding ShowFileRequestHandler with hidden files: [SCHEMA.XML, OLD_SYNONYMS.TXT, STOPWORDS.TXT, PROTWORDS.TXT, OPEN-EXCHANGE-RATES.JSON, SYNONYMS.TXT, CURRENCY.XML, MAPPING-ISOLATIN1ACCENT.TXT]
[junit4:junit4]   2> 13679 T66 oass.SolrIndexSearcher.<init> Opening Searcher@56ee36 main
[junit4:junit4]   2> 13680 T66 oasu.CommitTracker.<init> Hard AutoCommit: disabled
[junit4:junit4]   2> 13681 T66 oasu.CommitTracker.<init> Soft AutoCommit: disabled
[junit4:junit4]   2> 13690 T66 oashc.SpellCheckComponent.inform Initializing spell checkers
[junit4:junit4]   2> 13703 T66 oass.DirectSolrSpellChecker.init init: {name=direct,classname=DirectSolrSpellChecker,field=lowerfilt,minQueryLength=3}
[junit4:junit4]   2> 13778 T142 oasc.SolrCore.registerSearcher [collection1] Registered new searcher Searcher@56ee36 main{StandardDirectoryReader(segments_1:1)}
[junit4:junit4]   2> 13783 T66 oasc.ZkController.publish numShards not found on descriptor - reading it from system property
[junit4:junit4]   2> 14060 T88 oascc.ZkStateReader.updateClusterState Updating cloud state from ZooKeeper... 
[junit4:junit4]   2> 14062 T88 oasc.Overseer$ClusterStateUpdater.updateState Update state numShards=2 message={
[junit4:junit4]   2> 	  "operation":"state",
[junit4:junit4]   2> 	  "numShards":"2",
[junit4:junit4]   2> 	  "shard":null,
[junit4:junit4]   2> 	  "roles":null,
[junit4:junit4]   2> 	  "state":"down",
[junit4:junit4]   2> 	  "core":"collection1",
[junit4:junit4]   2> 	  "collection":"collection1",
[junit4:junit4]   2> 	  "node_name":"127.0.0.1:51712_solr",
[junit4:junit4]   2> 	  "base_url":"http://127.0.0.1:51712/solr"}
[junit4:junit4]   2> 14068 T87 oascc.ZkStateReader$2.process A cluster state change has occurred - updating... (4)
[junit4:junit4]   2> 14068 T121 oascc.ZkStateReader$2.process A cluster state change has occurred - updating... (4)
[junit4:junit4]   2> 14068 T137 oascc.ZkStateReader$2.process A cluster state change has occurred - updating... (4)
[junit4:junit4]   2> 14068 T105 oascc.ZkStateReader$2.process A cluster state change has occurred - updating... (4)
[junit4:junit4]   2> 14286 T66 oasc.CoreContainer.register registering core: collection1
[junit4:junit4]   2> 14286 T66 oasc.ZkController.register Register shard - core:collection1 address:http://127.0.0.1:51712/solr shardId:shard1
[junit4:junit4]   2> 14291 T66 oasc.ZkController.register We are http://127.0.0.1:51712/solr/collection1/ and leader is http://127.0.0.1:28028/solr/collection1/
[junit4:junit4]   2> 14291 T66 oasc.ZkController.register No LogReplay needed for core=collection1 baseURL=http://127.0.0.1:51712/solr
[junit4:junit4]   2> 14291 T66 oasc.ZkController.checkRecovery Core needs to recover:collection1
[junit4:junit4]   2> 14292 T66 oasu.DefaultSolrCoreState.doRecovery Running recovery - first canceling any ongoing recovery
[junit4:junit4]   2> ASYNC  NEW_CORE C5 name=collection1 org.apache.solr.core.SolrCore@164f868d url=http://127.0.0.1:51712/solr/collection1 node=127.0.0.1:51712_solr
[junit4:junit4]   2> 14298 T143 C5 P51712 oasc.RecoveryStrategy.run Starting recovery process.  core=collection1 recoveringAfterStartup=true
[junit4:junit4]   2> 14299 T66 oascc.ZkStateReader.updateClusterState Updating cloud state from ZooKeeper... 
[junit4:junit4]   2> 14299 T143 C5 P51712 oasc.RecoveryStrategy.doRecovery ###### startupVersions=[]
[junit4:junit4]   2> 14299 T143 C5 P51712 oasc.ZkController.publish numShards not found on descriptor - reading it from system property
[junit4:junit4]   2> 14300 T66 oass.SolrDispatchFilter.init user.dir=/usr/home/hudson/hudson-slave/workspace/Lucene-Solr-Tests-4.x-java7/solr/build/solr-core/test/J0
[junit4:junit4]   2> 14301 T66 oass.SolrDispatchFilter.init SolrDispatchFilter.init() done
[junit4:junit4]   2> 14301 T66 oascsi.HttpClientUtil.createClient Creating new http client, config:maxConnections=128&maxConnectionsPerHost=32&followRedirects=false
[junit4:junit4]   2> 14302 T143 C5 P51712 oasc.RecoveryStrategy.doRecovery Attempting to PeerSync from http://127.0.0.1:28028/solr/collection1/ core=collection1 - recoveringAfterStartup=true
[junit4:junit4]   2> 14315 T143 C5 P51712 oascsi.HttpClientUtil.createClient Creating new http client, config:maxConnectionsPerHost=20&maxConnections=10000&connTimeout=30000&socketTimeout=30000&retry=false
[junit4:junit4]   2> 14341 T143 C5 P51712 oasu.PeerSync.sync PeerSync: core=collection1 url=http://127.0.0.1:51712/solr START replicas=[http://127.0.0.1:28028/solr/collection1/] nUpdates=100
[junit4:junit4]   2> 14355 T143 C5 P51712 oasu.PeerSync.sync WARNING no frame of reference to tell of we've missed updates
[junit4:junit4]   2> 14356 T143 C5 P51712 oasc.RecoveryStrategy.doRecovery PeerSync Recovery was not successful - trying replication. core=collection1
[junit4:junit4]   2> 14356 T143 C5 P51712 oasc.RecoveryStrategy.doRecovery Starting Replication Recovery. core=collection1
[junit4:junit4]   2> 14357 T143 C5 P51712 oascsi.HttpClientUtil.createClient Creating new http client, config:maxConnections=128&maxConnectionsPerHost=32&followRedirects=false
[junit4:junit4]   2> 14534 T66 oejs.Server.doStart jetty-8.1.2.v20120308
[junit4:junit4]   2> 14538 T66 oejs.AbstractConnector.doStart Started SelectChannelConnector@0.0.0.0:51719
[junit4:junit4]   2> 14539 T66 oasc.SolrResourceLoader.locateSolrHome JNDI not configured for solr (NoInitialContextEx)
[junit4:junit4]   2> 14539 T66 oasc.SolrResourceLoader.locateSolrHome using system property solr.solr.home: /usr/home/hudson/hudson-slave/workspace/Lucene-Solr-Tests-4.x-java7/solr/build/solr-core/test/J0/./solrtest-jetty4-1351625489950
[junit4:junit4]   2> 14540 T66 oasc.SolrResourceLoader.<init> new SolrResourceLoader for deduced Solr Home: '/usr/home/hudson/hudson-slave/workspace/Lucene-Solr-Tests-4.x-java7/solr/build/solr-core/test/J0/./solrtest-jetty4-1351625489950/'
[junit4:junit4]   2> 14577 T88 oascc.ZkStateReader.updateClusterState Updating cloud state from ZooKeeper... 
[junit4:junit4]   2> 14578 T88 oasc.Overseer$ClusterStateUpdater.updateState Update state numShards=2 m

[...truncated too long message...]

.accept(SelectChannelConnector.java:104)
[junit4:junit4]    >         at org.eclipse.jetty.server.AbstractConnector$Acceptor.run(AbstractConnector.java:933)
[junit4:junit4]    >         at org.eclipse.jetty.util.thread.QueuedThreadPool.runJob(QueuedThreadPool.java:599)
[junit4:junit4]    >         at org.eclipse.jetty.util.thread.QueuedThreadPool$3.run(QueuedThreadPool.java:534)
[junit4:junit4]    >         at java.lang.Thread.run(Thread.java:722)
[junit4:junit4]    >    3) Thread[id=135, name=qtp462026823-135 Acceptor3 SelectChannelConnector@0.0.0.0:51712, state=RUNNABLE, group=TGRP-BasicDistributedZkTest]
[junit4:junit4]    >         at sun.nio.ch.ServerSocketChannelImpl.accept0(Native Method)
[junit4:junit4]    >         at sun.nio.ch.ServerSocketChannelImpl.accept(ServerSocketChannelImpl.java:226)
[junit4:junit4]    >         at org.eclipse.jetty.server.nio.SelectChannelConnector.accept(SelectChannelConnector.java:104)
[junit4:junit4]    >         at org.eclipse.jetty.server.AbstractConnector$Acceptor.run(AbstractConnector.java:933)
[junit4:junit4]    >         at org.eclipse.jetty.util.thread.QueuedThreadPool.runJob(QueuedThreadPool.java:599)
[junit4:junit4]    >         at org.eclipse.jetty.util.thread.QueuedThreadPool$3.run(QueuedThreadPool.java:534)
[junit4:junit4]    >         at java.lang.Thread.run(Thread.java:722)
[junit4:junit4]    >    4) Thread[id=151, name=qtp1633289861-151 Acceptor1 SelectChannelConnector@0.0.0.0:51719, state=BLOCKED, group=TGRP-BasicDistributedZkTest]
[junit4:junit4]    >         at sun.nio.ch.ServerSocketChannelImpl.accept(ServerSocketChannelImpl.java:210)
[junit4:junit4]    >         at org.eclipse.jetty.server.nio.SelectChannelConnector.accept(SelectChannelConnector.java:104)
[junit4:junit4]    >         at org.eclipse.jetty.server.AbstractConnector$Acceptor.run(AbstractConnector.java:933)
[junit4:junit4]    >         at org.eclipse.jetty.util.thread.QueuedThreadPool.runJob(QueuedThreadPool.java:599)
[junit4:junit4]    >         at org.eclipse.jetty.util.thread.QueuedThreadPool$3.run(QueuedThreadPool.java:534)
[junit4:junit4]    >         at java.lang.Thread.run(Thread.java:722)
[junit4:junit4]    >    5) Thread[id=83, name=qtp1642399029-83 Acceptor1 SelectChannelConnector@0.0.0.0:57117, state=BLOCKED, group=TGRP-BasicDistributedZkTest]
[junit4:junit4]    >         at sun.nio.ch.ServerSocketChannelImpl.accept(ServerSocketChannelImpl.java:210)
[junit4:junit4]    >         at org.eclipse.jetty.server.nio.SelectChannelConnector.accept(SelectChannelConnector.java:104)
[junit4:junit4]    >         at org.eclipse.jetty.server.AbstractConnector$Acceptor.run(AbstractConnector.java:933)
[junit4:junit4]    >         at org.eclipse.jetty.util.thread.QueuedThreadPool.runJob(QueuedThreadPool.java:599)
[junit4:junit4]    >         at org.eclipse.jetty.util.thread.QueuedThreadPool$3.run(QueuedThreadPool.java:534)
[junit4:junit4]    >         at java.lang.Thread.run(Thread.java:722)
[junit4:junit4]    >    6) Thread[id=132, name=qtp462026823-132 Acceptor0 SelectChannelConnector@0.0.0.0:51712, state=BLOCKED, group=TGRP-BasicDistributedZkTest]
[junit4:junit4]    >         at sun.nio.ch.ServerSocketChannelImpl.accept(ServerSocketChannelImpl.java:210)
[junit4:junit4]    >         at org.eclipse.jetty.server.nio.SelectChannelConnector.accept(SelectChannelConnector.java:104)
[junit4:junit4]    >         at org.eclipse.jetty.server.AbstractConnector$Acceptor.run(AbstractConnector.java:933)
[junit4:junit4]    >         at org.eclipse.jetty.util.thread.QueuedThreadPool.runJob(QueuedThreadPool.java:599)
[junit4:junit4]    >         at org.eclipse.jetty.util.thread.QueuedThreadPool$3.run(QueuedThreadPool.java:534)
[junit4:junit4]    >         at java.lang.Thread.run(Thread.java:722)
[junit4:junit4]    >    7) Thread[id=85, name=qtp1642399029-85 Acceptor3 SelectChannelConnector@0.0.0.0:57117, state=BLOCKED, group=TGRP-BasicDistributedZkTest]
[junit4:junit4]    >         at sun.nio.ch.ServerSocketChannelImpl.accept(ServerSocketChannelImpl.java:210)
[junit4:junit4]    >         at org.eclipse.jetty.server.nio.SelectChannelConnector.accept(SelectChannelConnector.java:104)
[junit4:junit4]    >         at org.eclipse.jetty.server.AbstractConnector$Acceptor.run(AbstractConnector.java:933)
[junit4:junit4]    >         at org.eclipse.jetty.util.thread.QueuedThreadPool.runJob(QueuedThreadPool.java:599)
[junit4:junit4]    >         at org.eclipse.jetty.util.thread.QueuedThreadPool$3.run(QueuedThreadPool.java:534)
[junit4:junit4]    >         at java.lang.Thread.run(Thread.java:722)
[junit4:junit4]    >    8) Thread[id=153, name=qtp1633289861-153 Acceptor3 SelectChannelConnector@0.0.0.0:51719, state=BLOCKED, group=TGRP-BasicDistributedZkTest]
[junit4:junit4]    >         at sun.nio.ch.ServerSocketChannelImpl.accept(ServerSocketChannelImpl.java:210)
[junit4:junit4]    >         at org.eclipse.jetty.server.nio.SelectChannelConnector.accept(SelectChannelConnector.java:104)
[junit4:junit4]    >         at org.eclipse.jetty.server.AbstractConnector$Acceptor.run(AbstractConnector.java:933)
[junit4:junit4]    >         at org.eclipse.jetty.util.thread.QueuedThreadPool.runJob(QueuedThreadPool.java:599)
[junit4:junit4]    >         at org.eclipse.jetty.util.thread.QueuedThreadPool$3.run(QueuedThreadPool.java:534)
[junit4:junit4]    >         at java.lang.Thread.run(Thread.java:722)
[junit4:junit4]    >    9) Thread[id=152, name=qtp1633289861-152 Acceptor2 SelectChannelConnector@0.0.0.0:51719, state=BLOCKED, group=TGRP-BasicDistributedZkTest]
[junit4:junit4]    >         at sun.nio.ch.ServerSocketChannelImpl.accept(ServerSocketChannelImpl.java:210)
[junit4:junit4]    >         at org.eclipse.jetty.server.nio.SelectChannelConnector.accept(SelectChannelConnector.java:104)
[junit4:junit4]    >         at org.eclipse.jetty.server.AbstractConnector$Acceptor.run(AbstractConnector.java:933)
[junit4:junit4]    >         at org.eclipse.jetty.util.thread.QueuedThreadPool.runJob(QueuedThreadPool.java:599)
[junit4:junit4]    >         at org.eclipse.jetty.util.thread.QueuedThreadPool$3.run(QueuedThreadPool.java:534)
[junit4:junit4]    >         at java.lang.Thread.run(Thread.java:722)
[junit4:junit4]    >   10) Thread[id=134, name=qtp462026823-134 Acceptor2 SelectChannelConnector@0.0.0.0:51712, state=BLOCKED, group=TGRP-BasicDistributedZkTest]
[junit4:junit4]    >         at sun.nio.ch.ServerSocketChannelImpl.accept(ServerSocketChannelImpl.java:210)
[junit4:junit4]    >         at org.eclipse.jetty.server.nio.SelectChannelConnector.accept(SelectChannelConnector.java:104)
[junit4:junit4]    >         at org.eclipse.jetty.server.AbstractConnector$Acceptor.run(AbstractConnector.java:933)
[junit4:junit4]    >         at org.eclipse.jetty.util.thread.QueuedThreadPool.runJob(QueuedThreadPool.java:599)
[junit4:junit4]    >         at org.eclipse.jetty.util.thread.QueuedThreadPool$3.run(QueuedThreadPool.java:534)
[junit4:junit4]    >         at java.lang.Thread.run(Thread.java:722)
[junit4:junit4]    >   11) Thread[id=150, name=qtp1633289861-150 Acceptor0 SelectChannelConnector@0.0.0.0:51719, state=RUNNABLE, group=TGRP-BasicDistributedZkTest]
[junit4:junit4]    >         at sun.nio.ch.ServerSocketChannelImpl.accept0(Native Method)
[junit4:junit4]    >         at sun.nio.ch.ServerSocketChannelImpl.accept(ServerSocketChannelImpl.java:226)
[junit4:junit4]    >         at org.eclipse.jetty.server.nio.SelectChannelConnector.accept(SelectChannelConnector.java:104)
[junit4:junit4]    >         at org.eclipse.jetty.server.AbstractConnector$Acceptor.run(AbstractConnector.java:933)
[junit4:junit4]    >         at org.eclipse.jetty.util.thread.QueuedThreadPool.runJob(QueuedThreadPool.java:599)
[junit4:junit4]    >         at org.eclipse.jetty.util.thread.QueuedThreadPool$3.run(QueuedThreadPool.java:534)
[junit4:junit4]    >         at java.lang.Thread.run(Thread.java:722)
[junit4:junit4]    >   12) Thread[id=82, name=qtp1642399029-82 Acceptor0 SelectChannelConnector@0.0.0.0:57117, state=BLOCKED, group=TGRP-BasicDistributedZkTest]
[junit4:junit4]    >         at sun.nio.ch.ServerSocketChannelImpl.accept(ServerSocketChannelImpl.java:210)
[junit4:junit4]    >         at org.eclipse.jetty.server.nio.SelectChannelConnector.accept(SelectChannelConnector.java:104)
[junit4:junit4]    >         at org.eclipse.jetty.server.AbstractConnector$Acceptor.run(AbstractConnector.java:933)
[junit4:junit4]    >         at org.eclipse.jetty.util.thread.QueuedThreadPool.runJob(QueuedThreadPool.java:599)
[junit4:junit4]    >         at org.eclipse.jetty.util.thread.QueuedThreadPool$3.run(QueuedThreadPool.java:534)
[junit4:junit4]    >         at java.lang.Thread.run(Thread.java:722)
[junit4:junit4]    > 	at __randomizedtesting.SeedInfo.seed([64D3BA166035617A]:0)
[junit4:junit4] Completed on J0 in 294.38s, 1 test, 2 errors <<< FAILURES!

[...truncated 146 lines...]
BUILD FAILED
/usr/home/hudson/hudson-slave/workspace/Lucene-Solr-Tests-4.x-java7/build.xml:335: The following error occurred while executing this line:
/usr/home/hudson/hudson-slave/workspace/Lucene-Solr-Tests-4.x-java7/build.xml:39: The following error occurred while executing this line:
/usr/home/hudson/hudson-slave/workspace/Lucene-Solr-Tests-4.x-java7/solr/build.xml:178: The following error occurred while executing this line:
/usr/home/hudson/hudson-slave/workspace/Lucene-Solr-Tests-4.x-java7/lucene/module-build.xml:61: The following error occurred while executing this line:
/usr/home/hudson/hudson-slave/workspace/Lucene-Solr-Tests-4.x-java7/lucene/common-build.xml:1159: The following error occurred while executing this line:
/usr/home/hudson/hudson-slave/workspace/Lucene-Solr-Tests-4.x-java7/lucene/common-build.xml:827: There were test failures: 233 suites, 965 tests, 4 suite-level errors, 790 ignored (2 assumptions)

Total time: 24 minutes 5 seconds
Build step 'Invoke Ant' marked build as failure
Archiving artifacts
Recording test results
Email was triggered for: Failure
Sending email for trigger: Failure



Mime
View raw message