lucene-dev mailing list archives

Site index · List index
Message view « Date » · « Thread »
Top « Date » · « Thread »
From Policeman Jenkins Server <jenk...@sd-datasolutions.de>
Subject [JENKINS] Lucene-Solr-4.x-Linux (32bit/jdk1.7.0_07) - Build # 1555 - Failure!
Date Fri, 05 Oct 2012 16:54:15 GMT
Build: http://jenkins.sd-datasolutions.de/job/Lucene-Solr-4.x-Linux/1555/
Java: 32bit/jdk1.7.0_07 -client -XX:+UseParallelGC

1 tests failed.
REGRESSION:  org.apache.lucene.queries.function.TestDocValuesFieldSources.test

Error Message:
codec=Lucene3x does not support docValues: from docValuesFormat().docsConsumer(...) returned
null; field=id

Stack Trace:
java.lang.IllegalStateException: codec=Lucene3x does not support docValues: from docValuesFormat().docsConsumer(...)
returned null; field=id
	at __randomizedtesting.SeedInfo.seed([D04DEF927E66B7EF:5819D048D09ADA17]:0)
	at org.apache.lucene.index.DocFieldProcessor.docValuesConsumer(DocFieldProcessor.java:362)
	at org.apache.lucene.index.DocFieldProcessor.processDocument(DocFieldProcessor.java:275)
	at org.apache.lucene.index.DocumentsWriterPerThread.updateDocument(DocumentsWriterPerThread.java:244)
	at org.apache.lucene.index.DocumentsWriter.updateDocument(DocumentsWriter.java:373)
	at org.apache.lucene.index.IndexWriter.updateDocument(IndexWriter.java:1445)
	at org.apache.lucene.index.IndexWriter.addDocument(IndexWriter.java:1124)
	at org.apache.lucene.index.RandomIndexWriter.addDocument(RandomIndexWriter.java:201)
	at org.apache.lucene.index.RandomIndexWriter.addDocument(RandomIndexWriter.java:160)
	at org.apache.lucene.queries.function.TestDocValuesFieldSources.test(TestDocValuesFieldSources.java:152)
	at org.apache.lucene.queries.function.TestDocValuesFieldSources.test(TestDocValuesFieldSources.java:279)
	at sun.reflect.NativeMethodAccessorImpl.invoke0(Native Method)
	at sun.reflect.NativeMethodAccessorImpl.invoke(NativeMethodAccessorImpl.java:57)
	at sun.reflect.DelegatingMethodAccessorImpl.invoke(DelegatingMethodAccessorImpl.java:43)
	at java.lang.reflect.Method.invoke(Method.java:601)
	at com.carrotsearch.randomizedtesting.RandomizedRunner.invoke(RandomizedRunner.java:1559)
	at com.carrotsearch.randomizedtesting.RandomizedRunner.access$600(RandomizedRunner.java:79)
	at com.carrotsearch.randomizedtesting.RandomizedRunner$6.evaluate(RandomizedRunner.java:737)
	at com.carrotsearch.randomizedtesting.RandomizedRunner$7.evaluate(RandomizedRunner.java:773)
	at com.carrotsearch.randomizedtesting.RandomizedRunner$8.evaluate(RandomizedRunner.java:787)
	at org.apache.lucene.util.TestRuleSetupTeardownChained$1.evaluate(TestRuleSetupTeardownChained.java:50)
	at org.apache.lucene.util.TestRuleFieldCacheSanity$1.evaluate(TestRuleFieldCacheSanity.java:51)
	at org.apache.lucene.util.AbstractBeforeAfterRule$1.evaluate(AbstractBeforeAfterRule.java:45)
	at com.carrotsearch.randomizedtesting.rules.SystemPropertiesInvariantRule$1.evaluate(SystemPropertiesInvariantRule.java:55)
	at org.apache.lucene.util.TestRuleThreadAndTestName$1.evaluate(TestRuleThreadAndTestName.java:48)
	at org.apache.lucene.util.TestRuleIgnoreAfterMaxFailures$1.evaluate(TestRuleIgnoreAfterMaxFailures.java:70)
	at org.apache.lucene.util.TestRuleMarkFailure$1.evaluate(TestRuleMarkFailure.java:48)
	at com.carrotsearch.randomizedtesting.rules.StatementAdapter.evaluate(StatementAdapter.java:36)
	at com.carrotsearch.randomizedtesting.ThreadLeakControl$StatementRunner.run(ThreadLeakControl.java:358)
	at com.carrotsearch.randomizedtesting.ThreadLeakControl.forkTimeoutingTask(ThreadLeakControl.java:782)
	at com.carrotsearch.randomizedtesting.ThreadLeakControl$3.evaluate(ThreadLeakControl.java:442)
	at com.carrotsearch.randomizedtesting.RandomizedRunner.runSingleTest(RandomizedRunner.java:746)
	at com.carrotsearch.randomizedtesting.RandomizedRunner$3.evaluate(RandomizedRunner.java:648)
	at com.carrotsearch.randomizedtesting.RandomizedRunner$4.evaluate(RandomizedRunner.java:682)
	at com.carrotsearch.randomizedtesting.RandomizedRunner$5.evaluate(RandomizedRunner.java:693)
	at org.apache.lucene.util.AbstractBeforeAfterRule$1.evaluate(AbstractBeforeAfterRule.java:45)
	at org.apache.lucene.util.TestRuleStoreClassName$1.evaluate(TestRuleStoreClassName.java:42)
	at com.carrotsearch.randomizedtesting.rules.SystemPropertiesInvariantRule$1.evaluate(SystemPropertiesInvariantRule.java:55)
	at com.carrotsearch.randomizedtesting.rules.NoShadowingOrOverridesOnMethodsRule$1.evaluate(NoShadowingOrOverridesOnMethodsRule.java:39)
	at com.carrotsearch.randomizedtesting.rules.NoShadowingOrOverridesOnMethodsRule$1.evaluate(NoShadowingOrOverridesOnMethodsRule.java:39)
	at com.carrotsearch.randomizedtesting.rules.StatementAdapter.evaluate(StatementAdapter.java:36)
	at org.apache.lucene.util.TestRuleAssertionsRequired$1.evaluate(TestRuleAssertionsRequired.java:43)
	at org.apache.lucene.util.TestRuleMarkFailure$1.evaluate(TestRuleMarkFailure.java:48)
	at org.apache.lucene.util.TestRuleIgnoreAfterMaxFailures$1.evaluate(TestRuleIgnoreAfterMaxFailures.java:70)
	at org.apache.lucene.util.TestRuleIgnoreTestSuites$1.evaluate(TestRuleIgnoreTestSuites.java:55)
	at com.carrotsearch.randomizedtesting.rules.StatementAdapter.evaluate(StatementAdapter.java:36)
	at com.carrotsearch.randomizedtesting.ThreadLeakControl$StatementRunner.run(ThreadLeakControl.java:358)
	at java.lang.Thread.run(Thread.java:722)




Build Log:
[...truncated 7183 lines...]
[junit4:junit4] Suite: org.apache.lucene.queries.function.TestDocValuesFieldSources
[junit4:junit4]   2> NOTE: reproduce with: ant test  -Dtestcase=TestDocValuesFieldSources
-Dtests.method=test -Dtests.seed=D04DEF927E66B7EF -Dtests.multiplier=3 -Dtests.slow=true -Dtests.locale=ar_LY
-Dtests.timezone=America/St_Lucia -Dtests.file.encoding=ISO-8859-1
[junit4:junit4] ERROR   0.04s J0 | TestDocValuesFieldSources.test <<<
[junit4:junit4]    > Throwable #1: java.lang.IllegalStateException: codec=Lucene3x does
not support docValues: from docValuesFormat().docsConsumer(...) returned null; field=id
[junit4:junit4]    > 	at __randomizedtesting.SeedInfo.seed([D04DEF927E66B7EF:5819D048D09ADA17]:0)
[junit4:junit4]    > 	at org.apache.lucene.index.DocFieldProcessor.docValuesConsumer(DocFieldProcessor.java:362)
[junit4:junit4]    > 	at org.apache.lucene.index.DocFieldProcessor.processDocument(DocFieldProcessor.java:275)
[junit4:junit4]    > 	at org.apache.lucene.index.DocumentsWriterPerThread.updateDocument(DocumentsWriterPerThread.java:244)
[junit4:junit4]    > 	at org.apache.lucene.index.DocumentsWriter.updateDocument(DocumentsWriter.java:373)
[junit4:junit4]    > 	at org.apache.lucene.index.IndexWriter.updateDocument(IndexWriter.java:1445)
[junit4:junit4]    > 	at org.apache.lucene.index.IndexWriter.addDocument(IndexWriter.java:1124)
[junit4:junit4]    > 	at org.apache.lucene.index.RandomIndexWriter.addDocument(RandomIndexWriter.java:201)
[junit4:junit4]    > 	at org.apache.lucene.index.RandomIndexWriter.addDocument(RandomIndexWriter.java:160)
[junit4:junit4]    > 	at org.apache.lucene.queries.function.TestDocValuesFieldSources.test(TestDocValuesFieldSources.java:152)
[junit4:junit4]    > 	at org.apache.lucene.queries.function.TestDocValuesFieldSources.test(TestDocValuesFieldSources.java:279)
[junit4:junit4]    > 	at sun.reflect.NativeMethodAccessorImpl.invoke0(Native Method)
[junit4:junit4]    > 	at sun.reflect.NativeMethodAccessorImpl.invoke(NativeMethodAccessorImpl.java:57)
[junit4:junit4]    > 	at sun.reflect.DelegatingMethodAccessorImpl.invoke(DelegatingMethodAccessorImpl.java:43)
[junit4:junit4]    > 	at java.lang.reflect.Method.invoke(Method.java:601)
[junit4:junit4]    > 	at com.carrotsearch.randomizedtesting.RandomizedRunner.invoke(RandomizedRunner.java:1559)
[junit4:junit4]    > 	at com.carrotsearch.randomizedtesting.RandomizedRunner.access$600(RandomizedRunner.java:79)
[junit4:junit4]    > 	at com.carrotsearch.randomizedtesting.RandomizedRunner$6.evaluate(RandomizedRunner.java:737)
[junit4:junit4]    > 	at com.carrotsearch.randomizedtesting.RandomizedRunner$7.evaluate(RandomizedRunner.java:773)
[junit4:junit4]    > 	at com.carrotsearch.randomizedtesting.RandomizedRunner$8.evaluate(RandomizedRunner.java:787)
[junit4:junit4]    > 	at org.apache.lucene.util.TestRuleSetupTeardownChained$1.evaluate(TestRuleSetupTeardownChained.java:50)
[junit4:junit4]    > 	at org.apache.lucene.util.TestRuleFieldCacheSanity$1.evaluate(TestRuleFieldCacheSanity.java:51)
[junit4:junit4]    > 	at org.apache.lucene.util.AbstractBeforeAfterRule$1.evaluate(AbstractBeforeAfterRule.java:45)
[junit4:junit4]    > 	at com.carrotsearch.randomizedtesting.rules.SystemPropertiesInvariantRule$1.evaluate(SystemPropertiesInvariantRule.java:55)
[junit4:junit4]    > 	at org.apache.lucene.util.TestRuleThreadAndTestName$1.evaluate(TestRuleThreadAndTestName.java:48)
[junit4:junit4]    > 	at org.apache.lucene.util.TestRuleIgnoreAfterMaxFailures$1.evaluate(TestRuleIgnoreAfterMaxFailures.java:70)
[junit4:junit4]    > 	at org.apache.lucene.util.TestRuleMarkFailure$1.evaluate(TestRuleMarkFailure.java:48)
[junit4:junit4]    > 	at com.carrotsearch.randomizedtesting.rules.StatementAdapter.evaluate(StatementAdapter.java:36)
[junit4:junit4]    > 	at com.carrotsearch.randomizedtesting.ThreadLeakControl$StatementRunner.run(ThreadLeakControl.java:358)
[junit4:junit4]    > 	at com.carrotsearch.randomizedtesting.ThreadLeakControl.forkTimeoutingTask(ThreadLeakControl.java:782)
[junit4:junit4]    > 	at com.carrotsearch.randomizedtesting.ThreadLeakControl$3.evaluate(ThreadLeakControl.java:442)
[junit4:junit4]    > 	at com.carrotsearch.randomizedtesting.RandomizedRunner.runSingleTest(RandomizedRunner.java:746)
[junit4:junit4]    > 	at com.carrotsearch.randomizedtesting.RandomizedRunner$3.evaluate(RandomizedRunner.java:648)
[junit4:junit4]    > 	at com.carrotsearch.randomizedtesting.RandomizedRunner$4.evaluate(RandomizedRunner.java:682)
[junit4:junit4]    > 	at com.carrotsearch.randomizedtesting.RandomizedRunner$5.evaluate(RandomizedRunner.java:693)
[junit4:junit4]    > 	at org.apache.lucene.util.AbstractBeforeAfterRule$1.evaluate(AbstractBeforeAfterRule.java:45)
[junit4:junit4]    > 	at org.apache.lucene.util.TestRuleStoreClassName$1.evaluate(TestRuleStoreClassName.java:42)
[junit4:junit4]    > 	at com.carrotsearch.randomizedtesting.rules.SystemPropertiesInvariantRule$1.evaluate(SystemPropertiesInvariantRule.java:55)
[junit4:junit4]    > 	at com.carrotsearch.randomizedtesting.rules.NoShadowingOrOverridesOnMethodsRule$1.evaluate(NoShadowingOrOverridesOnMethodsRule.java:39)
[junit4:junit4]    > 	at com.carrotsearch.randomizedtesting.rules.NoShadowingOrOverridesOnMethodsRule$1.evaluate(NoShadowingOrOverridesOnMethodsRule.java:39)
[junit4:junit4]    > 	at com.carrotsearch.randomizedtesting.rules.StatementAdapter.evaluate(StatementAdapter.java:36)
[junit4:junit4]    > 	at org.apache.lucene.util.TestRuleAssertionsRequired$1.evaluate(TestRuleAssertionsRequired.java:43)
[junit4:junit4]    > 	at org.apache.lucene.util.TestRuleMarkFailure$1.evaluate(TestRuleMarkFailure.java:48)
[junit4:junit4]    > 	at org.apache.lucene.util.TestRuleIgnoreAfterMaxFailures$1.evaluate(TestRuleIgnoreAfterMaxFailures.java:70)
[junit4:junit4]    > 	at org.apache.lucene.util.TestRuleIgnoreTestSuites$1.evaluate(TestRuleIgnoreTestSuites.java:55)
[junit4:junit4]    > 	at com.carrotsearch.randomizedtesting.rules.StatementAdapter.evaluate(StatementAdapter.java:36)
[junit4:junit4]    > 	at com.carrotsearch.randomizedtesting.ThreadLeakControl$StatementRunner.run(ThreadLeakControl.java:358)
[junit4:junit4]    > 	at java.lang.Thread.run(Thread.java:722)
[junit4:junit4]   2> NOTE: test params are: codec=Lucene3x, sim=RandomSimilarityProvider(queryNorm=false,coord=yes):
{}, locale=ar_LY, timezone=America/St_Lucia
[junit4:junit4]   2> NOTE: Linux 3.2.0-31-generic i386/Oracle Corporation 1.7.0_07 (32-bit)/cpus=8,threads=1,free=33411448,total=47316992
[junit4:junit4]   2> NOTE: All tests run in this JVM: [TestValueSources, BoostingQueryTest,
TestDocValuesFieldSources]
[junit4:junit4] Completed on J0 in 0.05s, 1 test, 1 error <<< FAILURES!

[...truncated 28 lines...]
BUILD FAILED
/mnt/ssd/jenkins/workspace/Lucene-Solr-4.x-Linux/build.xml:38: The following error occurred
while executing this line:
/mnt/ssd/jenkins/workspace/Lucene-Solr-4.x-Linux/lucene/build.xml:507: The following error
occurred while executing this line:
/mnt/ssd/jenkins/workspace/Lucene-Solr-4.x-Linux/lucene/common-build.xml:1641: The following
error occurred while executing this line:
/mnt/ssd/jenkins/workspace/Lucene-Solr-4.x-Linux/lucene/module-build.xml:61: The following
error occurred while executing this line:
/mnt/ssd/jenkins/workspace/Lucene-Solr-4.x-Linux/lucene/common-build.xml:1143: The following
error occurred while executing this line:
/mnt/ssd/jenkins/workspace/Lucene-Solr-4.x-Linux/lucene/common-build.xml:816: There were test
failures: 11 suites, 76 tests, 1 error

Total time: 13 minutes 15 seconds
Build step 'Invoke Ant' marked build as failure
Recording test results
Description set: Java: 32bit/jdk1.7.0_07 -client -XX:+UseParallelGC
Email was triggered for: Failure
Sending email for trigger: Failure



Mime
View raw message