lucene-dev mailing list archives

Site index · List index
Message view « Date » · « Thread »
Top « Date » · « Thread »
From Policeman Jenkins Server <jenk...@sd-datasolutions.de>
Subject [JENKINS] Lucene-Solr-trunk-Windows (32bit/jdk1.6.0_35) - Build # 1361 - Still Failing!
Date Tue, 30 Oct 2012 01:30:12 GMT
Build: http://jenkins.sd-datasolutions.de/job/Lucene-Solr-trunk-Windows/1361/
Java: 32bit/jdk1.6.0_35 -client -XX:+UseParallelGC

2 tests failed.
FAILED:  junit.framework.TestSuite.org.apache.solr.client.solrj.embedded.TestEmbeddedSolrServer

Error Message:
2 threads leaked from SUITE scope at org.apache.solr.client.solrj.embedded.TestEmbeddedSolrServer:     1) Thread[id=16, name=metrics-meter-tick-thread-1, state=TIMED_WAITING, group=TGRP-TestEmbeddedSolrServer]         at sun.misc.Unsafe.park(Native Method)         at java.util.concurrent.locks.LockSupport.parkNanos(LockSupport.java:196)         at java.util.concurrent.locks.AbstractQueuedSynchronizer$ConditionObject.awaitNanos(AbstractQueuedSynchronizer.java:2025)         at java.util.concurrent.DelayQueue.take(DelayQueue.java:164)         at java.util.concurrent.ScheduledThreadPoolExecutor$DelayedWorkQueue.take(ScheduledThreadPoolExecutor.java:609)         at java.util.concurrent.ScheduledThreadPoolExecutor$DelayedWorkQueue.take(ScheduledThreadPoolExecutor.java:602)         at java.util.concurrent.ThreadPoolExecutor.getTask(ThreadPoolExecutor.java:947)         at java.util.concurrent.ThreadPoolExecutor$Worker.run(ThreadPoolExecutor.java:907)         at java.lang.Thread.run(Thread.java:662)    2) Thread[id=17, name=metrics-meter-tick-thread-2, state=TIMED_WAITING, group=TGRP-TestEmbeddedSolrServer]         at sun.misc.Unsafe.park(Native Method)         at java.util.concurrent.locks.LockSupport.parkNanos(LockSupport.java:196)         at java.util.concurrent.locks.AbstractQueuedSynchronizer$ConditionObject.awaitNanos(AbstractQueuedSynchronizer.java:2025)         at java.util.concurrent.DelayQueue.take(DelayQueue.java:164)         at java.util.concurrent.ScheduledThreadPoolExecutor$DelayedWorkQueue.take(ScheduledThreadPoolExecutor.java:609)         at java.util.concurrent.ScheduledThreadPoolExecutor$DelayedWorkQueue.take(ScheduledThreadPoolExecutor.java:602)         at java.util.concurrent.ThreadPoolExecutor.getTask(ThreadPoolExecutor.java:947)         at java.util.concurrent.ThreadPoolExecutor$Worker.run(ThreadPoolExecutor.java:907)         at java.lang.Thread.run(Thread.java:662)

Stack Trace:
com.carrotsearch.randomizedtesting.ThreadLeakError: 2 threads leaked from SUITE scope at org.apache.solr.client.solrj.embedded.TestEmbeddedSolrServer: 
   1) Thread[id=16, name=metrics-meter-tick-thread-1, state=TIMED_WAITING, group=TGRP-TestEmbeddedSolrServer]
        at sun.misc.Unsafe.park(Native Method)
        at java.util.concurrent.locks.LockSupport.parkNanos(LockSupport.java:196)
        at java.util.concurrent.locks.AbstractQueuedSynchronizer$ConditionObject.awaitNanos(AbstractQueuedSynchronizer.java:2025)
        at java.util.concurrent.DelayQueue.take(DelayQueue.java:164)
        at java.util.concurrent.ScheduledThreadPoolExecutor$DelayedWorkQueue.take(ScheduledThreadPoolExecutor.java:609)
        at java.util.concurrent.ScheduledThreadPoolExecutor$DelayedWorkQueue.take(ScheduledThreadPoolExecutor.java:602)
        at java.util.concurrent.ThreadPoolExecutor.getTask(ThreadPoolExecutor.java:947)
        at java.util.concurrent.ThreadPoolExecutor$Worker.run(ThreadPoolExecutor.java:907)
        at java.lang.Thread.run(Thread.java:662)
   2) Thread[id=17, name=metrics-meter-tick-thread-2, state=TIMED_WAITING, group=TGRP-TestEmbeddedSolrServer]
        at sun.misc.Unsafe.park(Native Method)
        at java.util.concurrent.locks.LockSupport.parkNanos(LockSupport.java:196)
        at java.util.concurrent.locks.AbstractQueuedSynchronizer$ConditionObject.awaitNanos(AbstractQueuedSynchronizer.java:2025)
        at java.util.concurrent.DelayQueue.take(DelayQueue.java:164)
        at java.util.concurrent.ScheduledThreadPoolExecutor$DelayedWorkQueue.take(ScheduledThreadPoolExecutor.java:609)
        at java.util.concurrent.ScheduledThreadPoolExecutor$DelayedWorkQueue.take(ScheduledThreadPoolExecutor.java:602)
        at java.util.concurrent.ThreadPoolExecutor.getTask(ThreadPoolExecutor.java:947)
        at java.util.concurrent.ThreadPoolExecutor$Worker.run(ThreadPoolExecutor.java:907)
        at java.lang.Thread.run(Thread.java:662)
	at __randomizedtesting.SeedInfo.seed([FB06F72CB0F8CC03]:0)


FAILED:  junit.framework.TestSuite.org.apache.solr.client.solrj.embedded.TestEmbeddedSolrServer

Error Message:
There are still zombie threads that couldn't be terminated:    1) Thread[id=16, name=metrics-meter-tick-thread-1, state=TIMED_WAITING, group=TGRP-TestEmbeddedSolrServer]         at sun.misc.Unsafe.park(Native Method)         at java.util.concurrent.locks.LockSupport.parkNanos(LockSupport.java:196)         at java.util.concurrent.locks.AbstractQueuedSynchronizer$ConditionObject.awaitNanos(AbstractQueuedSynchronizer.java:2025)         at java.util.concurrent.DelayQueue.take(DelayQueue.java:164)         at java.util.concurrent.ScheduledThreadPoolExecutor$DelayedWorkQueue.take(ScheduledThreadPoolExecutor.java:609)         at java.util.concurrent.ScheduledThreadPoolExecutor$DelayedWorkQueue.take(ScheduledThreadPoolExecutor.java:602)         at java.util.concurrent.ThreadPoolExecutor.getTask(ThreadPoolExecutor.java:947)         at java.util.concurrent.ThreadPoolExecutor$Worker.run(ThreadPoolExecutor.java:907)         at java.lang.Thread.run(Thread.java:662)    2) Thread[id=17, name=metrics-meter-tick-thread-2, state=TIMED_WAITING, group=TGRP-TestEmbeddedSolrServer]         at sun.misc.Unsafe.park(Native Method)         at java.util.concurrent.locks.LockSupport.parkNanos(LockSupport.java:196)         at java.util.concurrent.locks.AbstractQueuedSynchronizer$ConditionObject.awaitNanos(AbstractQueuedSynchronizer.java:2025)         at java.util.concurrent.DelayQueue.take(DelayQueue.java:164)         at java.util.concurrent.ScheduledThreadPoolExecutor$DelayedWorkQueue.take(ScheduledThreadPoolExecutor.java:609)         at java.util.concurrent.ScheduledThreadPoolExecutor$DelayedWorkQueue.take(ScheduledThreadPoolExecutor.java:602)         at java.util.concurrent.ThreadPoolExecutor.getTask(ThreadPoolExecutor.java:947)         at java.util.concurrent.ThreadPoolExecutor$Worker.run(ThreadPoolExecutor.java:907)         at java.lang.Thread.run(Thread.java:662)

Stack Trace:
com.carrotsearch.randomizedtesting.ThreadLeakError: There are still zombie threads that couldn't be terminated:
   1) Thread[id=16, name=metrics-meter-tick-thread-1, state=TIMED_WAITING, group=TGRP-TestEmbeddedSolrServer]
        at sun.misc.Unsafe.park(Native Method)
        at java.util.concurrent.locks.LockSupport.parkNanos(LockSupport.java:196)
        at java.util.concurrent.locks.AbstractQueuedSynchronizer$ConditionObject.awaitNanos(AbstractQueuedSynchronizer.java:2025)
        at java.util.concurrent.DelayQueue.take(DelayQueue.java:164)
        at java.util.concurrent.ScheduledThreadPoolExecutor$DelayedWorkQueue.take(ScheduledThreadPoolExecutor.java:609)
        at java.util.concurrent.ScheduledThreadPoolExecutor$DelayedWorkQueue.take(ScheduledThreadPoolExecutor.java:602)
        at java.util.concurrent.ThreadPoolExecutor.getTask(ThreadPoolExecutor.java:947)
        at java.util.concurrent.ThreadPoolExecutor$Worker.run(ThreadPoolExecutor.java:907)
        at java.lang.Thread.run(Thread.java:662)
   2) Thread[id=17, name=metrics-meter-tick-thread-2, state=TIMED_WAITING, group=TGRP-TestEmbeddedSolrServer]
        at sun.misc.Unsafe.park(Native Method)
        at java.util.concurrent.locks.LockSupport.parkNanos(LockSupport.java:196)
        at java.util.concurrent.locks.AbstractQueuedSynchronizer$ConditionObject.awaitNanos(AbstractQueuedSynchronizer.java:2025)
        at java.util.concurrent.DelayQueue.take(DelayQueue.java:164)
        at java.util.concurrent.ScheduledThreadPoolExecutor$DelayedWorkQueue.take(ScheduledThreadPoolExecutor.java:609)
        at java.util.concurrent.ScheduledThreadPoolExecutor$DelayedWorkQueue.take(ScheduledThreadPoolExecutor.java:602)
        at java.util.concurrent.ThreadPoolExecutor.getTask(ThreadPoolExecutor.java:947)
        at java.util.concurrent.ThreadPoolExecutor$Worker.run(ThreadPoolExecutor.java:907)
        at java.lang.Thread.run(Thread.java:662)
	at __randomizedtesting.SeedInfo.seed([FB06F72CB0F8CC03]:0)




Build Log:
[...truncated 8766 lines...]
[junit4:junit4] Suite: org.apache.solr.client.solrj.embedded.TestEmbeddedSolrServer
[junit4:junit4]   2> 704 T14 oasc.CoreContainer.<init> New CoreContainer 11068806
[junit4:junit4]   2> 713 T14 oasc.CoreContainer.load Loading CoreContainer using Solr Home: 'C:\Users\JenkinsSlave\workspace\Lucene-Solr-trunk-Windows\solr\solrj\src\test-files\solrj\solr\shared'
[junit4:junit4]   2> 769 T14 oasc.SolrResourceLoader.<init> new SolrResourceLoader for directory: 'C:\Users\JenkinsSlave\workspace\Lucene-Solr-trunk-Windows\solr\solrj\src\test-files\solrj\solr\shared\'
[junit4:junit4]   2> 1293 T14 oasc.CoreContainer.load Registering Log Listener
[junit4:junit4]   2> 1520 T14 oasc.CoreContainer.create Creating SolrCore 'collection1' using instanceDir: C:\Users\JenkinsSlave\workspace\Lucene-Solr-trunk-Windows\solr\solrj\src\test-files\solrj\solr\shared\.
[junit4:junit4]   2> 1521 T14 oasc.SolrResourceLoader.<init> new SolrResourceLoader for directory: 'C:\Users\JenkinsSlave\workspace\Lucene-Solr-trunk-Windows\solr\solrj\src\test-files\solrj\solr\shared\.\'
[junit4:junit4]   2> 1629 T14 oasc.SolrConfig.<init> Using Lucene MatchVersion: LUCENE_50
[junit4:junit4]   2> 1925 T14 oasc.SolrConfig.<init> Loaded SolrConfig: solrconfig.xml
[junit4:junit4]   2> 1962 T14 oass.IndexSchema.readSchema Reading Solr Schema
[junit4:junit4]   2> 1975 T14 oass.IndexSchema.readSchema Schema name=example core 
[junit4:junit4]   2> 2181 T14 oass.IndexSchema.readSchema default search field in schema is name
[junit4:junit4]   2> 2187 T14 oass.IndexSchema.readSchema query parser default operator is OR
[junit4:junit4]   2> 2190 T14 oass.IndexSchema.readSchema unique key field: id
[junit4:junit4]   2> 2414 T14 oasc.SolrCore.<init> [collection1] Opening new SolrCore at C:\Users\JenkinsSlave\workspace\Lucene-Solr-trunk-Windows\solr\solrj\src\test-files\solrj\solr\shared\.\, dataDir=C:\Users\JenkinsSlave\workspace\Lucene-Solr-trunk-Windows\solr\build\solr-solrj\test\J0\.\solrtest-TestEmbeddedSolrServer-1351560567631/data/-1.3\
[junit4:junit4]   2> 2416 T14 oasc.SolrCore.<init> JMX monitoring not detected for core: collection1
[junit4:junit4]   2> 2425 T14 oasc.SolrCore.initDirectoryFactory org.apache.solr.core.MockDirectoryFactory
[junit4:junit4]   2> 2522 T14 oasc.CachingDirectoryFactory.injectLockFactory WARNING No lockType configured for MockDirWrapper(org.apache.lucene.store.RAMDirectory@1e88b35 lockFactory=org.apache.lucene.store.SingleInstanceLockFactory@b655a) assuming 'simple'
[junit4:junit4]   2> 2526 T14 oasc.CachingDirectoryFactory.get return new directory for C:\Users\JenkinsSlave\workspace\Lucene-Solr-trunk-Windows\solr\build\solr-solrj\test\J0\.\solrtest-TestEmbeddedSolrServer-1351560567631\data\-1.3 forceNew:false
[junit4:junit4]   2> 2526 T14 oasc.CachingDirectoryFactory.close Releasing directory:C:\Users\JenkinsSlave\workspace\Lucene-Solr-trunk-Windows\solr\build\solr-solrj\test\J0\.\solrtest-TestEmbeddedSolrServer-1351560567631\data\-1.3
[junit4:junit4]   2> 2527 T14 oasc.SolrCore.getNewIndexDir New index directory detected: old=null new=C:\Users\JenkinsSlave\workspace\Lucene-Solr-trunk-Windows\solr\build\solr-solrj\test\J0\.\solrtest-TestEmbeddedSolrServer-1351560567631/data/-1.3\index/
[junit4:junit4]   2> 2528 T14 oasc.SolrCore.initIndex WARNING [collection1] Solr index directory 'C:\Users\JenkinsSlave\workspace\Lucene-Solr-trunk-Windows\solr\build\solr-solrj\test\J0\.\solrtest-TestEmbeddedSolrServer-1351560567631\data\-1.3\index' doesn't exist. Creating new index...
[junit4:junit4]   2> 2547 T14 oasc.CachingDirectoryFactory.get return new directory for C:\Users\JenkinsSlave\workspace\Lucene-Solr-trunk-Windows\solr\build\solr-solrj\test\J0\.\solrtest-TestEmbeddedSolrServer-1351560567631\data\-1.3\index forceNew:false
[junit4:junit4]   2> 2855 T14 oasc.SolrDeletionPolicy.onCommit SolrDeletionPolicy.onCommit: commits:num=1
[junit4:junit4]   2> 		commit{dir=MockDirWrapper(org.apache.lucene.store.RAMDirectory@1ab5dae lockFactory=org.apache.lucene.store.NativeFSLockFactory@19480b8),segFN=segments_1,generation=1,filenames=[segments_1]
[junit4:junit4]   2> 2856 T14 oasc.SolrDeletionPolicy.updateCommits newest commit = 1[segments_1]
[junit4:junit4]   2> 2858 T14 oasc.CachingDirectoryFactory.close Releasing directory:C:\Users\JenkinsSlave\workspace\Lucene-Solr-trunk-Windows\solr\build\solr-solrj\test\J0\.\solrtest-TestEmbeddedSolrServer-1351560567631\data\-1.3\index
[junit4:junit4]   2> 3561 T14 oasc.RequestHandlers.initHandlersFromConfig created standard: solr.StandardRequestHandler
[junit4:junit4]   2> 3597 T14 oasc.RequestHandlers.initHandlersFromConfig created /update: solr.UpdateRequestHandler
[junit4:junit4]   2> 3601 T14 oasc.RequestHandlers.initHandlersFromConfig created /admin/: org.apache.solr.handler.admin.AdminHandlers
[junit4:junit4]   2> 3632 T14 oashl.XMLLoader.init xsltCacheLifetimeSeconds=60
[junit4:junit4]   2> 3660 T14 oasc.CachingDirectoryFactory.close Releasing directory:C:\Users\JenkinsSlave\workspace\Lucene-Solr-trunk-Windows\solr\build\solr-solrj\test\J0\.\solrtest-TestEmbeddedSolrServer-1351560567631\data\-1.3
[junit4:junit4]   2> 3715 T14 oass.SolrIndexSearcher.<init> Opening Searcher@30c963 main
[junit4:junit4]   2> 3804 T14 oasu.CommitTracker.<init> Hard AutoCommit: disabled
[junit4:junit4]   2> 3804 T14 oasu.CommitTracker.<init> Soft AutoCommit: disabled
[junit4:junit4]   2> 3906 T14 oashc.HttpShardHandlerFactory.getParameter Setting socketTimeout to: 0
[junit4:junit4]   2> 3908 T14 oashc.HttpShardHandlerFactory.getParameter Setting urlScheme to: http://
[junit4:junit4]   2> 3908 T14 oashc.HttpShardHandlerFactory.getParameter Setting connTimeout to: 0
[junit4:junit4]   2> 3909 T14 oashc.HttpShardHandlerFactory.getParameter Setting maxConnectionsPerHost to: 20
[junit4:junit4]   2> 3909 T14 oashc.HttpShardHandlerFactory.getParameter Setting corePoolSize to: 0
[junit4:junit4]   2> 3909 T14 oashc.HttpShardHandlerFactory.getParameter Setting maximumPoolSize to: 2147483647
[junit4:junit4]   2> 3910 T14 oashc.HttpShardHandlerFactory.getParameter Setting maxThreadIdleTime to: 5
[junit4:junit4]   2> 3910 T14 oashc.HttpShardHandlerFactory.getParameter Setting sizeOfQueue to: -1
[junit4:junit4]   2> 3911 T14 oashc.HttpShardHandlerFactory.getParameter Setting fairnessPolicy to: false
[junit4:junit4]   2> 3911 T14 oascsi.HttpClientUtil.createClient Creating new http client, config:maxConnectionsPerHost=20&maxConnections=10000&socketTimeout=0&connTimeout=0&retry=false
[junit4:junit4]   2> 3997 T14 oasc.CoreContainer.register registering core: collection1
[junit4:junit4]   2> 3997 T18 oasc.SolrCore.registerSearcher [collection1] Registered new searcher Searcher@30c963 main{StandardDirectoryReader(segments_1:1)}
[junit4:junit4]   2> 4002 T14 oasc.CoreContainer.create Creating SolrCore 'core0' using instanceDir: C:\Users\JenkinsSlave\workspace\Lucene-Solr-trunk-Windows\solr\solrj\src\test-files\solrj\solr\shared\.
[junit4:junit4]   2> 4003 T14 oasc.SolrResourceLoader.<init> new SolrResourceLoader for directory: 'C:\Users\JenkinsSlave\workspace\Lucene-Solr-trunk-Windows\solr\solrj\src\test-files\solrj\solr\shared\.\'
[junit4:junit4]   2> 4063 T14 oasc.SolrConfig.<init> Using Lucene MatchVersion: LUCENE_50
[junit4:junit4]   2> 4135 T14 oasc.SolrConfig.<init> Loaded SolrConfig: solrconfig.xml
[junit4:junit4]   2> 4138 T14 oass.IndexSchema.readSchema Reading Solr Schema
[junit4:junit4]   2> 4146 T14 oass.IndexSchema.readSchema Schema name=example core EN
[junit4:junit4]   2> 4196 T14 oass.IndexSchema.readSchema default search field in schema is name
[junit4:junit4]   2> 4197 T14 oass.IndexSchema.readSchema query parser default operator is OR
[junit4:junit4]   2> 4201 T14 oass.IndexSchema.readSchema unique key field: id
[junit4:junit4]   2> 4204 T14 oasc.SolrCore.<init> [core0] Opening new SolrCore at C:\Users\JenkinsSlave\workspace\Lucene-Solr-trunk-Windows\solr\solrj\src\test-files\solrj\solr\shared\.\, dataDir=C:\Users\JenkinsSlave\workspace\Lucene-Solr-trunk-Windows\solr\build\solr-solrj\test\J0\.\solrtest-TestEmbeddedSolrServer-1351560567631/data/EN-3.5\
[junit4:junit4]   2> 4205 T14 oasc.SolrCore.<init> JMX monitoring not detected for core: core0
[junit4:junit4]   2> 4205 T14 oasc.SolrCore.initDirectoryFactory org.apache.solr.core.MockDirectoryFactory
[junit4:junit4]   2> 4207 T14 oasc.CachingDirectoryFactory.injectLockFactory WARNING No lockType configured for MockDirWrapper(org.apache.lucene.store.RAMDirectory@1e94001 lockFactory=org.apache.lucene.store.SingleInstanceLockFactory@6937f9) assuming 'simple'
[junit4:junit4]   2> 4207 T14 oasc.CachingDirectoryFactory.get return new directory for C:\Users\JenkinsSlave\workspace\Lucene-Solr-trunk-Windows\solr\build\solr-solrj\test\J0\.\solrtest-TestEmbeddedSolrServer-1351560567631\data\EN-3.5 forceNew:false
[junit4:junit4]   2> 4208 T14 oasc.CachingDirectoryFactory.close Releasing directory:C:\Users\JenkinsSlave\workspace\Lucene-Solr-trunk-Windows\solr\build\solr-solrj\test\J0\.\solrtest-TestEmbeddedSolrServer-1351560567631\data\EN-3.5
[junit4:junit4]   2> 4208 T14 oasc.SolrCore.getNewIndexDir New index directory detected: old=null new=C:\Users\JenkinsSlave\workspace\Lucene-Solr-trunk-Windows\solr\build\solr-solrj\test\J0\.\solrtest-TestEmbeddedSolrServer-1351560567631/data/EN-3.5\index/
[junit4:junit4]   2> 4209 T14 oasc.SolrCore.initIndex WARNING [core0] Solr index directory 'C:\Users\JenkinsSlave\workspace\Lucene-Solr-trunk-Windows\solr\build\solr-solrj\test\J0\.\solrtest-TestEmbeddedSolrServer-1351560567631\data\EN-3.5\index' doesn't exist. Creating new index...
[junit4:junit4]   2> 4211 T14 oasc.CachingDirectoryFactory.get return new directory for C:\Users\JenkinsSlave\workspace\Lucene-Solr-trunk-Windows\solr\build\solr-solrj\test\J0\.\solrtest-TestEmbeddedSolrServer-1351560567631\data\EN-3.5\index forceNew:false
[junit4:junit4]   2> 4215 T14 oasc.SolrDeletionPolicy.onCommit SolrDeletionPolicy.onCommit: commits:num=1
[junit4:junit4]   2> 		commit{dir=MockDirWrapper(org.apache.lucene.store.RAMDirectory@8d0b0f lockFactory=org.apache.lucene.store.NativeFSLockFactory@1f18cbe),segFN=segments_1,generation=1,filenames=[segments_1]
[junit4:junit4]   2> 4216 T14 oasc.SolrDeletionPolicy.updateCommits newest commit = 1[segments_1]
[junit4:junit4]   2> 4216 T14 oasc.CachingDirectoryFactory.close Releasing directory:C:\Users\JenkinsSlave\workspace\Lucene-Solr-trunk-Windows\solr\build\solr-solrj\test\J0\.\solrtest-TestEmbeddedSolrServer-1351560567631\data\EN-3.5\index
[junit4:junit4]   2> 4217 T14 oasc.RequestHandlers.initHandlersFromConfig created standard: solr.StandardRequestHandler
[junit4:junit4]   2> 4219 T14 oasc.RequestHandlers.initHandlersFromConfig created /update: solr.UpdateRequestHandler
[junit4:junit4]   2> 4219 T14 oasc.RequestHandlers.initHandlersFromConfig created /admin/: org.apache.solr.handler.admin.AdminHandlers
[junit4:junit4]   2> 4226 T14 oashl.XMLLoader.init xsltCacheLifetimeSeconds=60
[junit4:junit4]   2> 4232 T14 oasc.CachingDirectoryFactory.close Releasing directory:C:\Users\JenkinsSlave\workspace\Lucene-Solr-trunk-Windows\solr\build\solr-solrj\test\J0\.\solrtest-TestEmbeddedSolrServer-1351560567631\data\EN-3.5
[junit4:junit4]   2> 4238 T14 oass.SolrIndexSearcher.<init> Opening Searcher@16b98c3 main
[junit4:junit4]   2> 4238 T14 oasu.CommitTracker.<init> Hard AutoCommit: disabled
[junit4:junit4]   2> 4239 T14 oasu.CommitTracker.<init> Soft AutoCommit: disabled
[junit4:junit4]   2> 4249 T19 oasc.SolrCore.registerSearcher [core0] Registered new searcher Searcher@16b98c3 main{StandardDirectoryReader(segments_1:1)}
[junit4:junit4]   2> 4249 T14 oasc.CoreContainer.register registering core: core0
[junit4:junit4]   2> 4251 T14 oasc.CoreContainer.create Creating SolrCore 'core1' using instanceDir: C:\Users\JenkinsSlave\workspace\Lucene-Solr-trunk-Windows\solr\solrj\src\test-files\solrj\solr\shared\.
[junit4:junit4]   2> 4252 T14 oasc.SolrResourceLoader.<init> new SolrResourceLoader for directory: 'C:\Users\JenkinsSlave\workspace\Lucene-Solr-trunk-Windows\solr\solrj\src\test-files\solrj\solr\shared\.\'
[junit4:junit4]   2> 4312 T14 oasc.SolrConfig.<init> Using Lucene MatchVersion: LUCENE_50
[junit4:junit4]   2> 4384 T14 oasc.SolrConfig.<init> Loaded SolrConfig: solrconfig.xml
[junit4:junit4]   2> 4385 T14 oass.IndexSchema.readSchema Reading Solr Schema
[junit4:junit4]   2> 4394 T14 oass.IndexSchema.readSchema Schema name=example core FR
[junit4:junit4]   2> 4448 T14 oass.IndexSchema.readSchema default search field in schema is name
[junit4:junit4]   2> 4451 T14 oass.IndexSchema.readSchema query parser default operator is OR
[junit4:junit4]   2> 4453 T14 oass.IndexSchema.readSchema unique key field: id
[junit4:junit4]   2> 4456 T14 oasc.SolrCore.<init> [core1] Opening new SolrCore at C:\Users\JenkinsSlave\workspace\Lucene-Solr-trunk-Windows\solr\solrj\src\test-files\solrj\solr\shared\.\, dataDir=C:\Users\JenkinsSlave\workspace\Lucene-Solr-trunk-Windows\solr\build\solr-solrj\test\J0\.\solrtest-TestEmbeddedSolrServer-1351560567631/data/FR-2.4\
[junit4:junit4]   2> 4456 T14 oasc.SolrCore.<init> JMX monitoring not detected for core: core1
[junit4:junit4]   2> 4456 T14 oasc.SolrCore.initDirectoryFactory org.apache.solr.core.MockDirectoryFactory
[junit4:junit4]   2> 4459 T14 oasc.CachingDirectoryFactory.injectLockFactory WARNING No lockType configured for MockDirWrapper(NRTCachingDirectory(org.apache.lucene.store.RAMDirectory@157bf4c lockFactory=org.apache.lucene.store.SingleInstanceLockFactory@1d056de; maxCacheMB=0.71484375 maxMergeSizeMB=0.66015625)) assuming 'simple'
[junit4:junit4]   2> 4459 T14 oasc.CachingDirectoryFactory.get return new directory for C:\Users\JenkinsSlave\workspace\Lucene-Solr-trunk-Windows\solr\build\solr-solrj\test\J0\.\solrtest-TestEmbeddedSolrServer-1351560567631\data\FR-2.4 forceNew:false
[junit4:junit4]   2> 4460 T14 oasc.CachingDirectoryFactory.close Releasing directory:C:\Users\JenkinsSlave\workspace\Lucene-Solr-trunk-Windows\solr\build\solr-solrj\test\J0\.\solrtest-TestEmbeddedSolrServer-1351560567631\data\FR-2.4
[junit4:junit4]   2> 4461 T14 oasc.SolrCore.getNewIndexDir New index directory detected: old=null new=C:\Users\JenkinsSlave\workspace\Lucene-Solr-trunk-Windows\solr\build\solr-solrj\test\J0\.\solrtest-TestEmbeddedSolrServer-1351560567631/data/FR-2.4\index/
[junit4:junit4]   2> 4465 T14 oasc.SolrCore.initIndex WARNING [core1] Solr index directory 'C:\Users\JenkinsSlave\workspace\Lucene-Solr-trunk-Windows\solr\build\solr-solrj\test\J0\.\solrtest-TestEmbeddedSolrServer-1351560567631\data\FR-2.4\index' doesn't exist. Creating new index...
[junit4:junit4]   2> 4466 T14 oasc.CachingDirectoryFactory.get return new directory for C:\Users\JenkinsSlave\workspace\Lucene-Solr-trunk-Windows\solr\build\solr-solrj\test\J0\.\solrtest-TestEmbeddedSolrServer-1351560567631\data\FR-2.4\index forceNew:false
[junit4:junit4]   2> 4472 T14 oasc.SolrDeletionPolicy.onCommit SolrDeletionPolicy.onCommit: commits:num=1
[junit4:junit4]   2> 		commit{dir=MockDirWrapper(org.apache.lucene.store.RAMDirectory@39ea58 lockFactory=org.apache.lucene.store.NativeFSLockFactory@e33af5),segFN=segments_1,generation=1,filenames=[segments_1]
[junit4:junit4]   2> 4472 T14 oasc.SolrDeletionPolicy.updateCommits newest commit = 1[segments_1]
[junit4:junit4]   2> 4473 T14 oasc.CachingDirectoryFactory.close Releasing directory:C:\Users\JenkinsSlave\workspace\Lucene-Solr-trunk-Windows\solr\build\solr-solrj\test\J0\.\solrtest-TestEmbeddedSolrServer-1351560567631\data\FR-2.4\index
[junit4:junit4]   2> 4477 T14 oasc.RequestHandlers.initHandlersFromConfig created standard: solr.StandardRequestHandler
[junit4:junit4]   2> 4478 T14 oasc.RequestHandlers.initHandlersFromConfig created /update: solr.UpdateRequestHandler
[junit4:junit4]   2> 4478 T14 oasc.RequestHandlers.initHandlersFromConfig created /admin/: org.apache.solr.handler.admin.AdminHandlers
[junit4:junit4]   2> 4484 T14 oashl.XMLLoader.init xsltCacheLifetimeSeconds=60
[junit4:junit4]   2> 4492 T14 oasc.CachingDirectoryFactory.close Releasing directory:C:\Users\JenkinsSlave\workspace\Lucene-Solr-trunk-Windows\solr\build\solr-solrj\test\J0\.\solrtest-TestEmbeddedSolrServer-1351560567631\data\FR-2.4
[junit4:junit4]   2> 4492 T14 oass.SolrIndexSearcher.<init> Opening Searcher@a30fd main
[junit4:junit4]   2> 4493 T14 oasu.CommitTracker.<init> Hard AutoCommit: disabled
[junit4:junit4]   2> 4493 T14 oasu.CommitTracker.<init> Soft AutoCommit: disabled
[junit4:junit4]   2> 4504 T14 oasc.CoreContainer.register registering core: core1
[junit4:junit4]   2> 4506 T20 oasc.SolrCore.registerSearcher [core1] Registered new searcher Searcher@a30fd main{StandardDirectoryReader(segments_1:1)}
[junit4:junit4]   2> 4568 T14 oasc.CoreContainer.shutdown Shutting down CoreContainer instance=11068806
[junit4:junit4]   2> 4569 T14 oasc.SolrCore.close [collection1]  CLOSING SolrCore org.apache.solr.core.SolrCore@18706f6
[junit4:junit4]   2> 4569 T14 oasu.DirectUpdateHandler2.close closing DirectUpdateHandler2{commits=0,autocommits=0,soft autocommits=0,optimizes=0,rollbacks=0,expungeDeletes=0,docsPending=0,adds=0,deletesById=0,deletesByQuery=0,errors=0,cumulative_adds=0,cumulative_deletesById=0,cumulative_deletesByQuery=0,cumulative_errors=0}
[junit4:junit4]   2> 4570 T14 oasc.SolrCore.decrefSolrCoreState Closing SolrCoreState
[junit4:junit4]   2> 4570 T14 oasu.DefaultSolrCoreState.closeIndexWriter SolrCoreState ref count has reached 0 - closing IndexWriter
[junit4:junit4]   2> 4571 T14 oasu.DefaultSolrCoreState.closeIndexWriter closing IndexWriter with IndexWriterCloser
[junit4:junit4]   2> 4580 T14 oasc.SolrCore.closeSearcher [collection1] Closing main searcher on request.
[junit4:junit4]   2> 4581 T14 oasc.CachingDirectoryFactory.close Releasing directory:C:\Users\JenkinsSlave\workspace\Lucene-Solr-trunk-Windows\solr\build\solr-solrj\test\J0\.\solrtest-TestEmbeddedSolrServer-1351560567631\data\-1.3\index
[junit4:junit4]   2> 4581 T14 oasc.SolrCore.close [core0]  CLOSING SolrCore org.apache.solr.core.SolrCore@566633
[junit4:junit4]   2> 4581 T14 oasu.DirectUpdateHandler2.close closing DirectUpdateHandler2{commits=0,autocommits=0,soft autocommits=0,optimizes=0,rollbacks=0,expungeDeletes=0,docsPending=0,adds=0,deletesById=0,deletesByQuery=0,errors=0,cumulative_adds=0,cumulative_deletesById=0,cumulative_deletesByQuery=0,cumulative_errors=0}
[junit4:junit4]   2> 4582 T14 oasc.SolrCore.decrefSolrCoreState Closing SolrCoreState
[junit4:junit4]   2> 4582 T14 oasu.DefaultSolrCoreState.closeIndexWriter SolrCoreState ref count has reached 0 - closing IndexWriter
[junit4:junit4]   2> 4583 T14 oasu.DefaultSolrCoreState.closeIndexWriter closing IndexWriter with IndexWriterCloser
[junit4:junit4]   2> 4584 T14 oasc.SolrCore.closeSearcher [core0] Closing main searcher on request.
[junit4:junit4]   2> 4584 T14 oasc.CachingDirectoryFactory.close Releasing directory:C:\Users\JenkinsSlave\workspace\Lucene-Solr-trunk-Windows\solr\build\solr-solrj\test\J0\.\solrtest-TestEmbeddedSolrServer-1351560567631\data\EN-3.5\index
[junit4:junit4]   2> 4584 T14 oasc.SolrCore.close [core1]  CLOSING SolrCore org.apache.solr.core.SolrCore@e8c7db
[junit4:junit4]   2> 4585 T14 oasu.DirectUpdateHandler2.close closing DirectUpdateHandler2{commits=0,autocommits=0,soft autocommits=0,optimizes=0,rollbacks=0,expungeDeletes=0,docsPending=0,adds=0,deletesById=0,deletesByQuery=0,errors=0,cumulative_adds=0,cumulative_deletesById=0,cumulative_deletesByQuery=0,cumulative_errors=0}
[junit4:junit4]   2> 4585 T14 oasc.SolrCore.decrefSolrCoreState Closing SolrCoreState
[junit4:junit4]   2> 4585 T14 oasu.DefaultSolrCoreState.closeIndexWriter SolrCoreState ref count has reached 0 - closing IndexWriter
[junit4:junit4]   2> 4585 T14 oasu.DefaultSolrCoreState.closeIndexWriter closing IndexWriter with IndexWriterCloser
[junit4:junit4]   2> 4587 T14 oasc.SolrCore.closeSearcher [core1] Closing main searcher on request.
[junit4:junit4]   2> 4587 T14 oasc.CachingDirectoryFactory.close Releasing directory:C:\Users\JenkinsSlave\workspace\Lucene-Solr-trunk-Windows\solr\build\solr-solrj\test\J0\.\solrtest-TestEmbeddedSolrServer-1351560567631\data\FR-2.4\index
[junit4:junit4]   2> 4590 T14 oasc.CoreContainer.shutdown Shutting down CoreContainer instance=11068806
[junit4:junit4]   2> 4609 T14 oasc.CoreContainer.<init> New CoreContainer 29330645
[junit4:junit4]   2> 4611 T14 oasc.CoreContainer.load Loading CoreContainer using Solr Home: 'C:\Users\JenkinsSlave\workspace\Lucene-Solr-trunk-Windows\solr\solrj\src\test-files\solrj\solr\shared'
[junit4:junit4]   2> 4613 T14 oasc.SolrResourceLoader.<init> new SolrResourceLoader for directory: 'C:\Users\JenkinsSlave\workspace\Lucene-Solr-trunk-Windows\solr\solrj\src\test-files\solrj\solr\shared\'
[junit4:junit4]   2> 4653 T14 oasc.CoreContainer.load Registering Log Listener
[junit4:junit4]   2> 4680 T14 oasc.CoreContainer.create Creating SolrCore 'collection1' using instanceDir: C:\Users\JenkinsSlave\workspace\Lucene-Solr-trunk-Windows\solr\solrj\src\test-files\solrj\solr\shared\.
[junit4:junit4]   2> 4681 T14 oasc.SolrResourceLoader.<init> new SolrResourceLoader for directory: 'C:\Users\JenkinsSlave\workspace\Lucene-Solr-trunk-Windows\solr\solrj\src\test-files\solrj\solr\shared\.\'
[junit4:junit4]   2> 4730 T14 oasc.SolrConfig.<init> Using Lucene MatchVersion: LUCENE_50
[junit4:junit4]   2> 4820 T14 oasc.SolrConfig.<init> Loaded SolrConfig: solrconfig.xml
[junit4:junit4]   2> 4821 T14 oass.IndexSchema.readSchema Reading Solr Schema
[junit4:junit4]   2> 4827 T14 oass.IndexSchema.readSchema Schema name=example core 
[junit4:junit4]   2> 4879 T14 oass.IndexSchema.readSchema default search field in schema is name
[junit4:junit4]   2> 4881 T14 oass.IndexSchema.readSchema query parser default operator is OR
[junit4:junit4]   2> 4883 T14 oass.IndexSchema.readSchema unique key field: id
[junit4:junit4]   2> 4886 T14 oasc.SolrCore.<init> [collection1] Opening new SolrCore at C:\Users\JenkinsSlave\workspace\Lucene-Solr-trunk-Windows\solr\solrj\src\test-files\solrj\solr\shared\.\, dataDir=C:\Users\JenkinsSlave\workspace\Lucene-Solr-trunk-Windows\solr\build\solr-solrj\test\J0\.\solrtest-TestEmbeddedSolrServer-1351560571597/data/-1.3\
[junit4:junit4]   2> 4886 T14 oasc.SolrCore.<init> JMX monitoring not detected for core: collection1
[junit4:junit4]   2> 4887 T14 oasc.SolrCore.initDirectoryFactory org.apache.solr.core.MockDirectoryFactory
[junit4:junit4]   2> 4887 T14 oasc.CachingDirectoryFactory.injectLockFactory WARNING No lockType configured for MockDirWrapper(org.apache.lucene.store.RAMDirectory@17e60a1 lockFactory=org.apache.lucene.store.SingleInstanceLockFactory@1f9f0f2) assuming 'simple'
[junit4:junit4]   2> 4887 T14 oasc.CachingDirectoryFactory.get return new directory for C:\Users\JenkinsSlave\workspace\Lucene-Solr-trunk-Windows\solr\build\solr-solrj\test\J0\.\solrtest-TestEmbeddedSolrServer-1351560571597\data\-1.3 forceNew:false
[junit4:junit4]   2> 4888 T14 oasc.CachingDirectoryFactory.close Releasing directory:C:\Users\JenkinsSlave\workspace\Lucene-Solr-trunk-Windows\solr\build\solr-solrj\test\J0\.\solrtest-TestEmbeddedSolrServer-1351560571597\data\-1.3
[junit4:junit4]   2> 4888 T14 oasc.SolrCore.getNewIndexDir New index directory detected: old=null new=C:\Users\JenkinsSlave\workspace\Lucene-Solr-trunk-Windows\solr\build\solr-solrj\test\J0\.\solrtest-TestEmbeddedSolrServer-1351560571597/data/-1.3\index/
[junit4:junit4]   2> 4890 T14 oasc.SolrCore.initIndex WARNING [collection1] Solr index directory 'C:\Users\JenkinsSlave\workspace\Lucene-Solr-trunk-Windows\solr\build\solr-solrj\test\J0\.\solrtest-TestEmbeddedSolrServer-1351560571597\data\-1.3\index' doesn't exist. Creating new index...
[junit4:junit4]   2> 4890 T14 oasc.CachingDirectoryFactory.get return new directory for C:\Users\JenkinsSlave\workspace\Lucene-Solr-trunk-Windows\solr\build\solr-solrj\test\J0\.\solrtest-TestEmbeddedSolrServer-1351560571597\data\-1.3\index forceNew:false
[junit4:junit4]   2> 4894 T14 oasc.SolrDeletionPolicy.onCommit SolrDeletionPolicy.onCommit: commits:num=1
[junit4:junit4]   2> 		commit{dir=MockDirWrapper(org.apache.lucene.store.RAMDirectory@148c02f lockFactory=org.apache.lucene.store.NativeFSLockFactory@1bef5e8),segFN=segments_1,generation=1,filenames=[segments_1]
[junit4:junit4]   2> 4896 T14 oasc.SolrDeletionPolicy.updateCommits newest commit = 1[segments_1]
[junit4:junit4]   2> 4896 T14 oasc.CachingDirectoryFactory.close Releasing directory:C:\Users\JenkinsSlave\workspace\Lucene-Solr-trunk-Windows\solr\build\solr-solrj\test\J0\.\solrtest-TestEmbeddedSolrServer-1351560571597\data\-1.3\index
[junit4:junit4]   2> 4898 T14 oasc.RequestHandlers.initHandlersFromConfig created standard: solr.StandardRequestHandler
[junit4:junit4]   2> 4899 T14 oasc.RequestHandlers.initHandlersFromConfig created /update: solr.UpdateRequestHandler
[junit4:junit4]   2> 4899 T14 oasc.RequestHandlers.initHandlersFromConfig created /admin/: org.apache.solr.handler.admin.AdminHandlers
[junit4:junit4]   2> 4908 T14 oashl.XMLLoader.init xsltCacheLifetimeSeconds=60
[junit4:junit4]   2> 4918 T14 oasc.CachingDirectoryFactory.close Releasing directory:C:\Users\JenkinsSlave\workspace\Lucene-Solr-trunk-Windows\solr\build\solr-solrj\test\J0\.\solrtest-TestEmbeddedSolrServer-1351560571597\data\-1.3
[junit4:junit4]   2> 4918 T14 oass.SolrIndexSearcher.<init> Opening Searcher@c378f6 main
[junit4:junit4]   2> 4919 T14 oasu.CommitTracker.<init> Hard AutoCommit: disabled
[junit4:junit4]   2> 4919 T14 oasu.CommitTracker.<init> Soft AutoCommit: disabled
[junit4:junit4]   2> 4920 T14 oashc.HttpShardHandlerFactory.getParameter Setting socketTimeout to: 0
[junit4:junit4]   2> 4920 T14 oashc.HttpShardHandlerFactory.getParameter Setting urlScheme to: http://
[junit4:junit4]   2> 4920 T14 oashc.HttpShardHandlerFactory.getParameter Setting connTimeout to: 0
[junit4:junit4]   2> 4921 T14 oashc.HttpShardHandlerFactory.getParameter Setting maxConnectionsPerHost to: 20
[junit4:junit4]   2> 4921 T14 oashc.HttpShardHandlerFactory.getParameter Setting corePoolSize to: 0
[junit4:junit4]   2> 4921 T14 oashc.HttpShardHandlerFactory.getParameter Setting maximumPoolSize to: 2147483647
[junit4:junit4]   2> 4922 T14 oashc.HttpShardHandlerFactory.getParameter Setting maxThreadIdleTime to: 5
[junit4:junit4]   2> 4922 T14 oashc.HttpShardHandlerFactory.getParameter Setting sizeOfQueue to: -1
[junit4:junit4]   2> 4923 T14 oashc.HttpShardHandlerFactory.getParameter Setting fairnessPolicy to: false
[junit4:junit4]   2> 4923 T14 oascsi.HttpClientUtil.createClient Creating new http client, config:maxConnectionsPerHost=20&maxConnections=10000&socketTimeout=0&connTimeout=0&retry=false
[junit4:junit4]   2> 4943 T21 oasc.SolrCore.registerSearcher [collection1] Registered new searcher Searcher@c378f6 main{StandardDirectoryReader(segments_1:1)}
[junit4:junit4]   2> 4943 T14 oasc.CoreContainer.register registering core: collection1
[junit4:junit4]   2> 4945 T14 oasc.CoreContainer.create Creating SolrCore 'core0' using instanceDir: C:\Users\JenkinsSlave\workspace\Lucene-Solr-trunk-Windows\solr\solrj\src\test-files\solrj\solr\shared\.
[junit4:junit4]   2> 4946 T14 oasc.SolrResourceLoader.<init> new SolrResourceLoader for directory: 'C:\Users\JenkinsSlave\workspace\Lucene-Solr-trunk-Windows\solr\solrj\src\test-files\solrj\solr\shared\.\'
[junit4:junit4]   2> 5007 T14 oasc.SolrConfig.<init> Using Lucene MatchVersion: LUCENE_50
[junit4:junit4]   2> 5075 T14 oasc.SolrConfig.<init> Loaded SolrConfig: solrconfig.xml
[junit4:junit4]   2> 5075 T14 oass.IndexSchema.readSchema Reading Solr Schema
[junit4:junit4]   2> 5082 T14 oass.IndexSchema.readSchema Schema name=example core EN
[junit4:junit4]   2> 5132 T14 oass.IndexSchema.readSchema default search field in schema is name
[junit4:junit4]   2> 5135 T14 oass.IndexSchema.readSchema query parser default operator is OR
[junit4:junit4]   2> 5137 T14 oass.IndexSchema.readSchema unique key field: id
[junit4:junit4]   2> 5140 T14 oasc.SolrCore.<init> [core0] Opening new SolrCore at C:\Users\JenkinsSlave\workspace\Lucene-Solr-trunk-Windows\solr\solrj\src\test-files\solrj\solr\shared\.\, dataDir=C:\Users\JenkinsSlave\workspace\Lucene-Solr-trunk-Windows\solr\build\solr-solrj\test\J0\.\solrtest-TestEmbeddedSolrServer-1351560571597/data/EN-3.5\
[junit4:junit4]   2> 5140 T14 oasc.SolrCore.<init> JMX monitoring not detected for core: core0
[junit4:junit4]   2> 5140 T14 oasc.SolrCore.initDirectoryFactory org.apache.solr.core.MockDirectoryFactory
[junit4:junit4]   2> 5142 T14 oasc.CachingDirectoryFactory.injectLockFactory WARNING No lockType configured for MockDirWrapper(org.apache.lucene.store.RAMDirectory@144752d lockFactory=org.apache.lucene.store.SingleInstanceLockFactory@168e429) assuming 'simple'
[junit4:junit4]   2> 5142 T14 oasc.CachingDirectoryFactory.get return new directory for C:\Users\JenkinsSlave\workspace\Lucene-Solr-trunk-Windows\solr\build\solr-solrj\test\J0\.\solrtest-TestEmbeddedSolrServer-1351560571597\data\EN-3.5 forceNew:false
[junit4:junit4]   2> 5142 T14 oasc.CachingDirectoryFactory.close Releasing directory:C:\Users\JenkinsSlave\workspace\Lucene-Solr-trunk-Windows\solr\build\solr-solrj\test\J0\.\solrtest-TestEmbeddedSolrServer-1351560571597\data\EN-3.5
[junit4:junit4]   2> 5144 T14 oasc.SolrCore.getNewIndexDir New index directory detected: old=null new=C:\Users\JenkinsSlave\workspace\Lucene-Solr-trunk-Windows\solr\build\solr-solrj\test\J0\.\solrtest-TestEmbeddedSolrServer-1351560571597/data/EN-3.5\index/
[junit4:junit4]   2> 5146 T14 oasc.SolrCore.initIndex WARNING [core0] Solr index directory 'C:\Users\JenkinsSlave\workspace\Lucene-Solr-trunk-Windows\solr\build\solr-solrj\test\J0\.\solrtest-TestEmbeddedSolrServer-1351560571597\data\EN-3.5\index' doesn't exist. Creating new index...
[junit4:junit4]   2> 5146 T14 oasc.CachingDirectoryFactory.get return new directory for C:\Users\JenkinsSlave\workspace\Lucene-Solr-trunk-Windows\solr\build\solr-solrj\test\J0\.\solrtest-TestEmbeddedSolrServer-1351560571597\data\EN-3.5\index forceNew:false
[junit4:junit4]   2> 5152 T14 oasc.SolrDeletionPolicy.onCommit SolrDeletionPolicy.onCommit: commits:num=1
[junit4:junit4]   2> 		commit{dir=MockDirWrapper(org.apache.lucene.store.RAMDirectory@1a01e8a lockFactory=org.apache.lucene.store.NativeFSLockFactory@1398cac),segFN=segments_1,generation=1,filenames=[segments_1]
[junit4:junit4]   2> 5153 T14 oasc.SolrDeletionPolicy.updateCommits newest commit = 1[segments_1]
[junit4:junit4]   2> 5156 T14 oasc.CachingDirectoryFactory.close Releasing directory:C:\Users\JenkinsSlave\workspace\Lucene-Solr-trunk-Windows\solr\build\solr-solrj\test\J0\.\solrtest-TestEmbeddedSolrServer-1351560571597\data\EN-3.5\index
[junit4:junit4]   2> 5157 T14 oasc.RequestHandlers.initHandlersFromConfig created standard: solr.StandardRequestHandler
[junit4:junit4]   2> 5158 T14 oasc.RequestHandlers.initHandlersFromConfig created /update: solr.UpdateRequestHandler
[junit4:junit4]   2> 5158 T14 oasc.RequestHandlers.initHandlersFromConfig created /admin/: org.apache.solr.handler.admin.AdminHandlers
[junit4:junit4]   2> 5163 T14 oashl.XMLLoader.init xsltCacheLifetimeSeconds=60
[junit4:junit4]   2> 5174 T14 oasc.CachingDirectoryFactory.close Releasing directory:C:\Users\JenkinsSlave\workspace\Lucene-Solr-trunk-Windows\solr\build\solr-solrj\test\J0\.\solrtest-TestEmbeddedSolrServer-1351560571597\data\EN-3.5
[junit4:junit4]   2> 5174 T14 oass.SolrIndexSearcher.<init> Opening Searcher@541b02 main
[junit4:junit4]   2> 5175 T14 oasu.CommitTracker.<init> Hard AutoCommit: disabled
[junit4:junit4]   2> 5175 T14 oasu.CommitTracker.<init> Soft AutoCommit: disabled
[junit4:junit4]   2> 5188 T14 oasc.CoreContainer.register registering core: core0
[junit4:junit4]   2> 5193 T14 oasc.CoreContainer.create Creating SolrCore 'core1' using instanceDir: C:\Users\JenkinsSlave\workspace\Lucene-Solr-trunk-Windows\solr\solrj\src\test-files\solrj\solr\shared\.
[junit4:junit4]   2> 5193 T22 oasc.SolrCore.registerSearcher [core0] Registered new searcher Searcher@541b02 main{StandardDirectoryReader(segments_1:1)}
[junit4:junit4]   2> 5194 T14 oasc.SolrResourceLoader.<init> new SolrResourceLoader for directory: 'C:\Users\JenkinsSlave\workspace\Lucene-Solr-trunk-Windows\solr\solrj\src\test-files\solrj\solr\shared\.\'
[junit4:junit4]   2> 5263 T14 oasc.SolrConfig.<init> Using Lucene MatchVersion: LUCENE_50
[junit4:junit4]   2> 5342 T14 oasc.SolrConfig.<init> Loaded SolrConfig: solrconfig.xml
[junit4:junit4]   2> 5343 T14 oass.IndexSchema.readSchema Reading Solr Schema
[junit4:junit4]   2> 5354 T14 oass.IndexSchema.readSchema Schema name=example core FR
[junit4:junit4]   2> 5416 T14 oass.IndexSchema.readSchema default search field in schema is name
[junit4:junit4]   2> 5419 T14 oass.IndexSchema.readSchema query parser default operator is OR
[junit4:junit4]   2> 5421 T14 oass.IndexSchema.readSchema unique key field: id
[junit4:junit4]   2> 5426 T14 oasc.SolrCore.<init> [core1] Opening new SolrCore at C:\Users\JenkinsSlave\workspace\Lucene-Solr-trunk-Windows\solr\solrj\src\test-files\solrj\solr\shared\.\, dataDir=C:\Users\JenkinsSlave\workspace\Lucene-Solr-trunk-Windows\solr\build\solr-solrj\test\J0\.\solrtest-TestEmbeddedSolrServer-1351560571597/data/FR-2.4\
[junit4:junit4]   2> 5426 T14 oasc.SolrCore.<init> JMX monitoring not detected for core: core1
[junit4:junit4]   2> 5427 T14 oasc.SolrCore.initDirectoryFactory org.apache.solr.core.MockDirectoryFactory
[junit4:junit4]   2> 5428 T14 oasc.CachingDirectoryFactory.injectLockFactory WARNING No lockType configured for MockDirWrapper(org.apache.lucene.store.RAMDirectory@1a51312 lockFactory=org.apache.lucene.store.SingleInstanceLockFactory@8730b8) assuming 'simple'
[junit4:junit4]   2> 5428 T14 oasc.CachingDirectoryFactory.get return new directory for C:\Users\JenkinsSlave\workspace\Lucene-Solr-trunk-Windows\solr\build\solr-solrj\test\J0\.\solrtest-TestEmbeddedSolrServer-1351560571597\data\FR-2.4 forceNew:false
[junit4:junit4]   2> 5428 T14 oasc.CachingDirectoryFactory.close Releasing directory:C:\Users\JenkinsSlave\workspace\Lucene-Solr-trunk-Windows\solr\build\solr-solrj\test\J0\.\solrtest-TestEmbeddedSolrServer-1351560571597\data\FR-2.4
[junit4:junit4]   2> 5429 T14 oasc.SolrCore.getNewIndexDir New index directory detected: old=null new=C:\Users\JenkinsSlave\workspace\Lucene-Solr-trunk-Windows\solr\build\solr-solrj\test\J0\.\solrtest-TestEmbeddedSolrServer-1351560571597/data/FR-2.4\index/
[junit4:junit4]   2> 5430 T14 oasc.SolrCore.initIndex WARNING [core1] Solr index directory 'C:\Users\JenkinsSlave\workspace\Lucene-Solr-trunk-Windows\solr\build\solr-solrj\test\J0\.\solrtest-TestEmbeddedSolrServer-1351560571597\data\FR-2.4\index' doesn't exist. Creating new index...
[junit4:junit4]   2> 5436 T14 oasc.CachingDirectoryFactory.get return new directory for C:\Users\JenkinsSlave\workspace\Lucene-Solr-trunk-Windows\solr\build\solr-solrj\test\J0\.\solrtest-TestEmbeddedSolrServer-1351560571597\data\FR-2.4\index forceNew:false
[junit4:junit4]   2> 5441 T14 oasc.SolrDeletionPolicy.onCommit SolrDeletionPolicy.onCommit: commits:num=1
[junit4:junit4]   2> 		commit{dir=MockDirWrapper(org.apache.lucene.store.RAMDirectory@d1918a lockFactory=org.apache.lucene.store.NativeFSLockFactory@16db492),segFN=segments_1,generation=1,filenames=[segments_1]
[junit4:junit4]   2> 5441 T14 oasc.SolrDeletionPolicy.updateCommits newest commit = 1[segments_1]
[junit4:junit4]   2> 5442 T14 oasc.CachingDirectoryFactory.close Releasing directory:C:\Users\JenkinsSlave\workspace\Lucene-Solr-trunk-Windows\solr\build\solr-solrj\test\J0\.\solrtest-TestEmbeddedSolrServer-1351560571597\data\FR-2.4\index
[junit4:junit4]   2> 5444 T14 oasc.RequestHandlers.initHandlersFromConfig created standard: solr.StandardRequestHandler
[junit4:junit4]   2> 5447 T14 oasc.RequestHandlers.initHandlersFromConfig created /update: solr.UpdateRequestHandler
[junit4:junit4]   2> 5448 T14 oasc.RequestHandlers.initHandlersFromConfig created /admin/: org.apache.solr.handler.admin.AdminHandlers
[junit4:junit4]   2> 5457 T14 oashl.XMLLoader.init xsltCacheLifetimeSeconds=60
[junit4:junit4]   2> 5463 T14 oasc.CachingDirectoryFactory.close Releasing directory:C:\Users\JenkinsSlave\workspace\Lucene-Solr-trunk-Windows\solr\build\solr-solrj\test\J0\.\solrtest-TestEmbeddedSolrServer-1351560571597\data\FR-2.4
[junit4:junit4]   2> 5464 T14 oass.SolrIndexSearcher.<init> Opening Searcher@945b95 main
[junit4:junit4]   2> 5465 T14 oasu.CommitTracker.<init> Hard AutoCommit: disabled
[junit4:junit4]   2> 5465 T14 oasu.CommitTracker.<init> Soft AutoCommit: disabled
[junit4:junit4]   2> 5476 T23 oasc.SolrCore.registerSearcher [core1] Registered new searcher Searcher@945b95 main{StandardDirectoryReader(segments_1:1)}
[junit4:junit4]   2> 5476 T14 oasc.CoreContainer.register registering core: core1
[junit4:junit4]   2> 5477 T14 oasc.CoreContainer.shutdown Shutting down CoreContainer instance=29330645
[junit4:junit4]   2> 5477 T14 oasc.SolrCore.close [collection1]  CLOSING SolrCore org.apache.solr.core.SolrCore@14d659d
[junit4:junit4]   2> 5477 T14 oasu.DirectUpdateHandler2.close closing DirectUpdateHandler2{commits=0,autocommits=0,soft autocommits=0,optimizes=0,rollbacks=0,expungeDeletes=0,docsPending=0,adds=0,deletesById=0,deletesByQuery=0,errors=0,cumulative_adds=0,cumulative_deletesById=0,cumulative_deletesByQuery=0,cumulative_errors=0}
[junit4:junit4]   2> 5478 T14 oasc.SolrCore.decrefSolrCoreState Closing SolrCoreState
[junit4:junit4]   2> 5478 T14 oasu.DefaultSolrCoreState.closeIndexWriter SolrCoreState ref count has reached 0 - closing IndexWriter
[junit4:junit4]   2> 5478 T14 oasu.DefaultSolrCoreState.closeIndexWriter closing IndexWriter with IndexWriterCloser
[junit4:junit4]   2> 5479 T14 oasc.SolrCore.closeSearcher [collection1] Closing main searcher on request.
[junit4:junit4]   2> 5479 T14 oasc.CachingDirectoryFactory.close Releasing directory:C:\Users\JenkinsSlave\workspace\Lucene-Solr-trunk-Windows\solr\build\solr-solrj\test\J0\.\solrtest-TestEmbeddedSolrServer-1351560571597\data\-1.3\index
[junit4:junit4]   2> 5480 T14 oasc.SolrCore.close [core0]  CLOSING SolrCore org.apache.solr.core.SolrCore@13a8eb1
[junit4:junit4]   2> 5481 T14 oasu.DirectUpdateHandler2.close closing DirectUpdateHandler2{commits=0,autocommits=0,soft autocommits=0,optimizes=0,rollbacks=0,expungeDeletes=0,docsPending=0,adds=0,deletesById=0,deletesByQuery=0,errors=0,cumulative_adds=0,cumulative_deletesById=0,cumulative_deletesByQuery=0,cumulative_errors=0}
[junit4:junit4]   2> 5481 T14 oasc.SolrCore.decrefSolrCoreState Closing SolrCoreState
[junit4:junit4]   2> 5481 T14 oasu.DefaultSolrCoreState.closeIndexWriter SolrCoreState ref count has reached 0 - closing IndexWriter
[junit4:junit4]   2> 5482 T14 oasu.DefaultSolrCoreState.closeIndexWriter closing IndexWriter with IndexWriterCloser
[junit4:junit4]   2> 5482 T14 oasc.SolrCore.closeSearcher [core0] Closing main searcher on request.
[junit4:junit4]   2> 5484 T14 oasc.CachingDirectoryFactory.close Releasing directory:C:\Users\JenkinsSlave\workspace\Lucene-Solr-trunk-Windows\solr\build\solr-solrj\test\J0\.\solrtest-TestEmbeddedSolrServer-1351560571597\data\EN-3.5\index
[junit4:junit4]   2> 5484 T14 oasc.SolrCore.close [core1]  CLOSING SolrCore org.apache.solr.core.SolrCore@1b38cdc
[junit4:junit4]   2> 5485 T14 oasu.DirectUpdateHandler2.close closing DirectUpdateHandler2{commits=0,autocommits=0,soft autocommits=0,optimizes=0,rollbacks=0,expungeDeletes=0,docsPending=0,adds=0,deletesById=0,deletesByQuery=0,errors=0,cumulative_adds=0,cumulative_deletesById=0,cumulative_deletesByQuery=0,cumulative_errors=0}
[junit4:junit4]   2> 5485 T14 oasc.SolrCore.decrefSolrCoreState Closing SolrCoreState
[junit4:junit4]   2> 5485 T14 oasu.DefaultSolrCoreState.closeIndexWriter SolrCoreState ref count has reached 0 - closing IndexWriter
[junit4:junit4]   2> 5486 T14 oasu.DefaultSolrCoreState.closeIndexWriter closing IndexWriter with IndexWriterCloser
[junit4:junit4]   2> 5487 T14 oasc.SolrCore.closeSearcher [core1] Closing main searcher on request.
[junit4:junit4]   2> 5487 T14 oasc.CachingDirectoryFactory.close Releasing directory:C:\Users\JenkinsSlave\workspace\Lucene-Solr-trunk-Windows\solr\build\solr-solrj\test\J0\.\solrtest-TestEmbeddedSolrServer-1351560571597\data\FR-2.4\index
[junit4:junit4]   2> 5509 T13 ccr.ThreadLeakControl.checkThreadLeaks WARNING Will linger awaiting termination of 2 leaked thread(s).
[junit4:junit4]   2> 25795 T13 ccr.ThreadLeakControl.checkThreadLeaks SEVERE 2 threads leaked from SUITE scope at org.apache.solr.client.solrj.embedded.TestEmbeddedSolrServer: 
[junit4:junit4]   2> 	   1) Thread[id=16, name=metrics-meter-tick-thread-1, state=TIMED_WAITING, group=TGRP-TestEmbeddedSolrServer]
[junit4:junit4]   2> 	        at sun.misc.Unsafe.park(Native Method)
[junit4:junit4]   2> 	        at java.util.concurrent.locks.LockSupport.parkNanos(LockSupport.java:196)
[junit4:junit4]   2> 	        at java.util.concurrent.locks.AbstractQueuedSynchronizer$ConditionObject.awaitNanos(AbstractQueuedSynchronizer.java:2025)
[junit4:junit4]   2> 	        at java.util.concurrent.DelayQueue.take(DelayQueue.java:164)
[junit4:junit4]   2> 	        at java.util.concurrent.ScheduledThreadPoolExecutor$DelayedWorkQueue.take(ScheduledThreadPoolExecutor.java:609)
[junit4:junit4]   2> 	        at java.util.concurrent.ScheduledThreadPoolExecutor$DelayedWorkQueue.take(ScheduledThreadPoolExecutor.java:602)
[junit4:junit4]   2> 	        at java.util.concurrent.ThreadPoolExecutor.getTask(ThreadPoolExecutor.java:947)
[junit4:junit4]   2> 	        at java.util.concurrent.ThreadPoolExecutor$Worker.run(ThreadPoolExecutor.java:907)
[junit4:junit4]   2> 	        at java.lang.Thread.run(Thread.java:662)
[junit4:junit4]   2> 	   2) Thread[id=17, name=metrics-meter-tick-thread-2, state=TIMED_WAITING, group=TGRP-TestEmbeddedSolrServer]
[junit4:junit4]   2> 	        at sun.misc.Unsafe.park(Native Method)
[junit4:junit4]   2> 	        at java.util.concurrent.locks.LockSupport.parkNanos(LockSupport.java:196)
[junit4:junit4]   2> 	        at java.util.concurrent.locks.AbstractQueuedSynchronizer$ConditionObject.awaitNanos(AbstractQueuedSynchronizer.java:2025)
[junit4:junit4]   2> 	        at java.util.concurrent.DelayQueue.take(DelayQueue.java:164)
[junit4:junit4]   2> 	        at java.util.concurrent.ScheduledThreadPoolExecutor$DelayedWorkQueue.take(ScheduledThreadPoolExecutor.java:609)
[junit4:junit4]   2> 	        at java.util.concurrent.ScheduledThreadPoolExecutor$DelayedWorkQueue.take(ScheduledThreadPoolExecutor.java:602)
[junit4:junit4]   2> 	        at java.util.concurrent.ThreadPoolExecutor.getTask(ThreadPoolExecutor.java:947)
[junit4:junit4]   2> 	        at java.util.concurrent.ThreadPoolExecutor$Worker.run(ThreadPoolExecutor.java:907)
[junit4:junit4]   2> 	        at java.lang.Thread.run(Thread.java:662)
[junit4:junit4]   2> 25796 T13 ccr.ThreadLeakControl.tryToInterruptAll Starting to interrupt leaked threads:
[junit4:junit4]   2> 	   1) Thread[id=16, name=metrics-meter-tick-thread-1, state=TIMED_WAITING, group=TGRP-TestEmbeddedSolrServer]
[junit4:junit4]   2> 	   2) Thread[id=17, name=metrics-meter-tick-thread-2, state=TIMED_WAITING, group=TGRP-TestEmbeddedSolrServer]
[junit4:junit4]   2> 29863 T13 ccr.ThreadLeakControl.tryToInterruptAll SEVERE There are still zombie threads that couldn't be terminated:
[junit4:junit4]   2> 	   1) Thread[id=16, name=metrics-meter-tick-thread-1, state=TIMED_WAITING, group=TGRP-TestEmbeddedSolrServer]
[junit4:junit4]   2> 	        at sun.misc.Unsafe.park(Native Method)
[junit4:junit4]   2> 	        at java.util.concurrent.locks.LockSupport.parkNanos(LockSupport.java:196)
[junit4:junit4]   2> 	        at java.util.concurrent.locks.AbstractQueuedSynchronizer$ConditionObject.awaitNanos(AbstractQueuedSynchronizer.java:2025)
[junit4:junit4]   2> 	        at java.util.concurrent.DelayQueue.take(DelayQueue.java:164)
[junit4:junit4]   2> 	        at java.util.concurrent.ScheduledThreadPoolExecutor$DelayedWorkQueue.take(ScheduledThreadPoolExecutor.java:609)
[junit4:junit4]   2> 	        at java.util.concurrent.ScheduledThreadPoolExecutor$DelayedWorkQueue.take(ScheduledThreadPoolExecutor.java:602)
[junit4:junit4]   2> 	        at java.util.concurrent.ThreadPoolExecutor.getTask(ThreadPoolExecutor.java:947)
[junit4:junit4]   2> 	        at java.util.concurrent.ThreadPoolExecutor$Worker.run(ThreadPoolExecutor.java:907)
[junit4:junit4]   2> 	        at java.lang.Thread.run(Thread.java:662)
[junit4:junit4]   2> 	   2) Thread[id=17, name=metrics-meter-tick-thread-2, state=TIMED_WAITING, group=TGRP-TestEmbeddedSolrServer]
[junit4:junit4]   2> 	        at sun.misc.Unsafe.park(Native Method)
[junit4:junit4]   2> 	        at java.util.concurrent.locks.LockSupport.parkNanos(LockSupport.java:196)
[junit4:junit4]   2> 	        at java.util.concurrent.locks.AbstractQueuedSynchronizer$ConditionObject.awaitNanos(AbstractQueuedSynchronizer.java:2025)
[junit4:junit4]   2> 	        at java.util.concurrent.DelayQueue.take(DelayQueue.java:164)
[junit4:junit4]   2> 	        at java.util.concurrent.ScheduledThreadPoolExecutor$DelayedWorkQueue.take(ScheduledThreadPoolExecutor.java:609)
[junit4:junit4]   2> 	        at java.util.concurrent.ScheduledThreadPoolExecutor$DelayedWorkQueue.take(ScheduledThreadPoolExecutor.java:602)
[junit4:junit4]   2> 	        at java.util.concurrent.ThreadPoolExecutor.getTask(ThreadPoolExecutor.java:947)
[junit4:junit4]   2> 	        at java.util.concurrent.ThreadPoolExecutor$Worker.run(ThreadPoolExecutor.java:907)
[junit4:junit4]   2> 	        at java.lang.Thread.run(Thread.java:662)
[junit4:junit4]   2> NOTE: test params are: codec=Asserting, sim=RandomSimilarityProvider(queryNorm=true,coord=crazy): {}, locale=el_GR, timezone=Pacific/Noumea
[junit4:junit4]   2> NOTE: Windows 7 6.1 x86/Sun Microsystems Inc. 1.6.0_35 (32-bit)/cpus=2,threads=3,free=12629888,total=92995584
[junit4:junit4]   2> NOTE: All tests run in this JVM: [TestDocumentObjectBinder, TestJavaBinCodec, TestEmbeddedSolrServer]
[junit4:junit4]   2> NOTE: reproduce with: ant test  -Dtestcase=TestEmbeddedSolrServer -Dtests.seed=FB06F72CB0F8CC03 -Dtests.slow=true -Dtests.locale=el_GR -Dtests.timezone=Pacific/Noumea -Dtests.file.encoding=UTF-8
[junit4:junit4] ERROR   0.00s | TestEmbeddedSolrServer (suite) <<<
[junit4:junit4]    > Throwable #1: com.carrotsearch.randomizedtesting.ThreadLeakError: 2 threads leaked from SUITE scope at org.apache.solr.client.solrj.embedded.TestEmbeddedSolrServer: 
[junit4:junit4]    >    1) Thread[id=16, name=metrics-meter-tick-thread-1, state=TIMED_WAITING, group=TGRP-TestEmbeddedSolrServer]
[junit4:junit4]    >         at sun.misc.Unsafe.park(Native Method)
[junit4:junit4]    >         at java.util.concurrent.locks.LockSupport.parkNanos(LockSupport.java:196)
[junit4:junit4]    >         at java.util.concurrent.locks.AbstractQueuedSynchronizer$ConditionObject.awaitNanos(AbstractQueuedSynchronizer.java:2025)
[junit4:junit4]    >         at java.util.concurrent.DelayQueue.take(DelayQueue.java:164)
[junit4:junit4]    >         at java.util.concurrent.ScheduledThreadPoolExecutor$DelayedWorkQueue.take(ScheduledThreadPoolExecutor.java:609)
[junit4:junit4]    >         at java.util.concurrent.ScheduledThreadPoolExecutor$DelayedWorkQueue.take(ScheduledThreadPoolExecutor.java:602)
[junit4:junit4]    >         at java.util.concurrent.ThreadPoolExecutor.getTask(ThreadPoolExecutor.java:947)
[junit4:junit4]    >         at java.util.concurrent.ThreadPoolExecutor$Worker.run(ThreadPoolExecutor.java:907)
[junit4:junit4]    >         at java.lang.Thread.run(Thread.java:662)
[junit4:junit4]    >    2) Thread[id=17, name=metrics-meter-tick-thread-2, state=TIMED_WAITING, group=TGRP-TestEmbeddedSolrServer]
[junit4:junit4]    >         at sun.misc.Unsafe.park(Native Method)
[junit4:junit4]    >         at java.util.concurrent.locks.LockSupport.parkNanos(LockSupport.java:196)
[junit4:junit4]    >         at java.util.concurrent.locks.AbstractQueuedSynchronizer$ConditionObject.awaitNanos(AbstractQueuedSynchronizer.java:2025)
[junit4:junit4]    >         at java.util.concurrent.DelayQueue.take(DelayQueue.java:164)
[junit4:junit4]    >         at java.util.concurrent.ScheduledThreadPoolExecutor$DelayedWorkQueue.take(ScheduledThreadPoolExecutor.java:609)
[junit4:junit4]    >         at java.util.concurrent.ScheduledThreadPoolExecutor$DelayedWorkQueue.take(ScheduledThreadPoolExecutor.java:602)
[junit4:junit4]    >         at java.util.concurrent.ThreadPoolExecutor.getTask(ThreadPoolExecutor.java:947)
[junit4:junit4]    >         at java.util.concurrent.ThreadPoolExecutor$Worker.run(ThreadPoolExecutor.java:907)
[junit4:junit4]    >         at java.lang.Thread.run(Thread.java:662)
[junit4:junit4]    > 	at __randomizedtesting.SeedInfo.seed([FB06F72CB0F8CC03]:0)
[junit4:junit4]    > Throwable #2: com.carrotsearch.randomizedtesting.ThreadLeakError: There are still zombie threads that couldn't be terminated:
[junit4:junit4]    >    1) Thread[id=16, name=metrics-meter-tick-thread-1, state=TIMED_WAITING, group=TGRP-TestEmbeddedSolrServer]
[junit4:junit4]    >         at sun.misc.Unsafe.park(Native Method)
[junit4:junit4]    >         at java.util.concurrent.locks.LockSupport.parkNanos(LockSupport.java:196)
[junit4:junit4]    >         at java.util.concurrent.locks.AbstractQueuedSynchronizer$ConditionObject.awaitNanos(AbstractQueuedSynchronizer.java:2025)
[junit4:junit4]    >         at java.util.concurrent.DelayQueue.take(DelayQueue.java:164)
[junit4:junit4]    >         at java.util.concurrent.ScheduledThreadPoolExecutor$DelayedWorkQueue.take(ScheduledThreadPoolExecutor.java:609)
[junit4:junit4]    >         at java.util.concurrent.ScheduledThreadPoolExecutor$DelayedWorkQueue.take(ScheduledThreadPoolExecutor.java:602)
[junit4:junit4]    >         at java.util.concurrent.ThreadPoolExecutor.getTask(ThreadPoolExecutor.java:947)
[junit4:junit4]    >         at java.util.concurrent.ThreadPoolExecutor$Worker.run(ThreadPoolExecutor.java:907)
[junit4:junit4]    >         at java.lang.Thread.run(Thread.java:662)
[junit4:junit4]    >    2) Thread[id=17, name=metrics-meter-tick-thread-2, state=TIMED_WAITING, group=TGRP-TestEmbeddedSolrServer]
[junit4:junit4]    >         at sun.misc.Unsafe.park(Native Method)
[junit4:junit4]    >         at java.util.concurrent.locks.LockSupport.parkNanos(LockSupport.java:196)
[junit4:junit4]    >         at java.util.concurrent.locks.AbstractQueuedSynchronizer$ConditionObject.awaitNanos(AbstractQueuedSynchronizer.java:2025)
[junit4:junit4]    >         at java.util.concurrent.DelayQueue.take(DelayQueue.java:164)
[junit4:junit4]    >         at java.util.concurrent.ScheduledThreadPoolExecutor$DelayedWorkQueue.take(ScheduledThreadPoolExecutor.java:609)
[junit4:junit4]    >         at java.util.concurrent.ScheduledThreadPoolExecutor$DelayedWorkQueue.take(ScheduledThreadPoolExecutor.java:602)
[junit4:junit4]    >         at java.util.concurrent.ThreadPoolExecutor.getTask(ThreadPoolExecutor.java:947)
[junit4:junit4]    >         at java.util.concurrent.ThreadPoolExecutor$Worker.run(ThreadPoolExecutor.java:907)
[junit4:junit4]    >         at java.lang.Thread.run(Thread.java:662)
[junit4:junit4]    > 	at __randomizedtesting.SeedInfo.seed([FB06F72CB0F8CC03]:0)
[junit4:junit4] Completed in 29.52s, 2 tests, 2 errors <<< FAILURES!

[...truncated 126 lines...]
BUILD FAILED
C:\Users\JenkinsSlave\workspace\Lucene-Solr-trunk-Windows\build.xml:335: The following error occurred while executing this line:
C:\Users\JenkinsSlave\workspace\Lucene-Solr-trunk-Windows\build.xml:39: The following error occurred while executing this line:
C:\Users\JenkinsSlave\workspace\Lucene-Solr-trunk-Windows\solr\build.xml:185: The following error occurred while executing this line:
C:\Users\JenkinsSlave\workspace\Lucene-Solr-trunk-Windows\lucene\module-build.xml:61: The following error occurred while executing this line:
C:\Users\JenkinsSlave\workspace\Lucene-Solr-trunk-Windows\lucene\common-build.xml:1159: The following error occurred while executing this line:
C:\Users\JenkinsSlave\workspace\Lucene-Solr-trunk-Windows\lucene\common-build.xml:827: There were test failures: 43 suites, 239 tests, 2 suite-level errors, 228 ignored

Total time: 39 minutes 17 seconds
Build step 'Invoke Ant' marked build as failure
Archiving artifacts
Recording test results
Description set: Java: 32bit/jdk1.6.0_35 -client -XX:+UseParallelGC
Email was triggered for: Failure
Sending email for trigger: Failure



Mime
View raw message