lucene-dev mailing list archives

Site index · List index
Message view « Date » · « Thread »
Top « Date » · « Thread »
From Apache Jenkins Server <jenk...@builds.apache.org>
Subject [JENKINS] Lucene-Solr-Tests-trunk-java7 - Build # 3302 - Still Failing
Date Sun, 14 Oct 2012 09:18:09 GMT
Build: https://builds.apache.org/job/Lucene-Solr-Tests-trunk-java7/3302/

1 tests failed.
REGRESSION:  org.apache.solr.cloud.BasicDistributedZkTest.testDistribSearch

Error Message:
some core start times did not change on reload

Stack Trace:
java.lang.AssertionError: some core start times did not change on reload
	at __randomizedtesting.SeedInfo.seed([AF621453B73C4E01:2E849A4BC0632E3D]:0)
	at org.junit.Assert.fail(Assert.java:93)
	at org.junit.Assert.assertTrue(Assert.java:43)
	at org.apache.solr.cloud.BasicDistributedZkTest.testCollectionsAPI(BasicDistributedZkTest.java:443)
	at org.apache.solr.cloud.BasicDistributedZkTest.doTest(BasicDistributedZkTest.java:332)
	at org.apache.solr.BaseDistributedSearchTestCase.testDistribSearch(BaseDistributedSearchTestCase.java:695)
	at sun.reflect.NativeMethodAccessorImpl.invoke0(Native Method)
	at sun.reflect.NativeMethodAccessorImpl.invoke(NativeMethodAccessorImpl.java:57)
	at sun.reflect.DelegatingMethodAccessorImpl.invoke(DelegatingMethodAccessorImpl.java:43)
	at java.lang.reflect.Method.invoke(Method.java:601)
	at com.carrotsearch.randomizedtesting.RandomizedRunner.invoke(RandomizedRunner.java:1559)
	at com.carrotsearch.randomizedtesting.RandomizedRunner.access$600(RandomizedRunner.java:79)
	at com.carrotsearch.randomizedtesting.RandomizedRunner$6.evaluate(RandomizedRunner.java:737)
	at com.carrotsearch.randomizedtesting.RandomizedRunner$7.evaluate(RandomizedRunner.java:773)
	at com.carrotsearch.randomizedtesting.RandomizedRunner$8.evaluate(RandomizedRunner.java:787)
	at com.carrotsearch.randomizedtesting.rules.SystemPropertiesRestoreRule$1.evaluate(SystemPropertiesRestoreRule.java:53)
	at org.apache.lucene.util.TestRuleSetupTeardownChained$1.evaluate(TestRuleSetupTeardownChained.java:50)
	at org.apache.lucene.util.TestRuleFieldCacheSanity$1.evaluate(TestRuleFieldCacheSanity.java:51)
	at org.apache.lucene.util.AbstractBeforeAfterRule$1.evaluate(AbstractBeforeAfterRule.java:45)
	at com.carrotsearch.randomizedtesting.rules.SystemPropertiesInvariantRule$1.evaluate(SystemPropertiesInvariantRule.java:55)
	at org.apache.lucene.util.TestRuleThreadAndTestName$1.evaluate(TestRuleThreadAndTestName.java:48)
	at org.apache.lucene.util.TestRuleIgnoreAfterMaxFailures$1.evaluate(TestRuleIgnoreAfterMaxFailures.java:70)
	at org.apache.lucene.util.TestRuleMarkFailure$1.evaluate(TestRuleMarkFailure.java:48)
	at com.carrotsearch.randomizedtesting.rules.StatementAdapter.evaluate(StatementAdapter.java:36)
	at com.carrotsearch.randomizedtesting.ThreadLeakControl$StatementRunner.run(ThreadLeakControl.java:358)
	at com.carrotsearch.randomizedtesting.ThreadLeakControl.forkTimeoutingTask(ThreadLeakControl.java:782)
	at com.carrotsearch.randomizedtesting.ThreadLeakControl$3.evaluate(ThreadLeakControl.java:442)
	at com.carrotsearch.randomizedtesting.RandomizedRunner.runSingleTest(RandomizedRunner.java:746)
	at com.carrotsearch.randomizedtesting.RandomizedRunner$3.evaluate(RandomizedRunner.java:648)
	at com.carrotsearch.randomizedtesting.RandomizedRunner$4.evaluate(RandomizedRunner.java:682)
	at com.carrotsearch.randomizedtesting.RandomizedRunner$5.evaluate(RandomizedRunner.java:693)
	at com.carrotsearch.randomizedtesting.rules.StatementAdapter.evaluate(StatementAdapter.java:36)
	at com.carrotsearch.randomizedtesting.rules.SystemPropertiesRestoreRule$1.evaluate(SystemPropertiesRestoreRule.java:53)
	at org.apache.lucene.util.AbstractBeforeAfterRule$1.evaluate(AbstractBeforeAfterRule.java:45)
	at org.apache.lucene.util.TestRuleStoreClassName$1.evaluate(TestRuleStoreClassName.java:42)
	at com.carrotsearch.randomizedtesting.rules.SystemPropertiesInvariantRule$1.evaluate(SystemPropertiesInvariantRule.java:55)
	at com.carrotsearch.randomizedtesting.rules.NoShadowingOrOverridesOnMethodsRule$1.evaluate(NoShadowingOrOverridesOnMethodsRule.java:39)
	at com.carrotsearch.randomizedtesting.rules.NoShadowingOrOverridesOnMethodsRule$1.evaluate(NoShadowingOrOverridesOnMethodsRule.java:39)
	at com.carrotsearch.randomizedtesting.rules.StatementAdapter.evaluate(StatementAdapter.java:36)
	at org.apache.lucene.util.TestRuleAssertionsRequired$1.evaluate(TestRuleAssertionsRequired.java:43)
	at org.apache.lucene.util.TestRuleMarkFailure$1.evaluate(TestRuleMarkFailure.java:48)
	at org.apache.lucene.util.TestRuleIgnoreAfterMaxFailures$1.evaluate(TestRuleIgnoreAfterMaxFailures.java:70)
	at org.apache.lucene.util.TestRuleIgnoreTestSuites$1.evaluate(TestRuleIgnoreTestSuites.java:55)
	at com.carrotsearch.randomizedtesting.rules.StatementAdapter.evaluate(StatementAdapter.java:36)
	at com.carrotsearch.randomizedtesting.ThreadLeakControl$StatementRunner.run(ThreadLeakControl.java:358)
	at java.lang.Thread.run(Thread.java:722)




Build Log:
[...truncated 9015 lines...]
[junit4:junit4] Suite: org.apache.solr.cloud.BasicDistributedZkTest
[junit4:junit4]   2> 4 T1138 oas.SolrTestCaseJ4.setUp ###Starting testDistribSearch
[junit4:junit4]   2> Creating dataDir: /usr/home/hudson/hudson-slave/workspace/Lucene-Solr-Tests-trunk-java7/solr/build/solr-core/test/J0/./solrtest-BasicDistributedZkTest-1350205756807
[junit4:junit4]   2> 5 T1138 oasc.ZkTestServer.run STARTING ZK TEST SERVER
[junit4:junit4]   2> 7 T1139 oazs.ZooKeeperServer.setTickTime tickTime set to 1000
[junit4:junit4]   2> 8 T1139 oazs.NIOServerCnxn$Factory.<init> binding to port 0.0.0.0/0.0.0.0:0
[junit4:junit4]   2> 8 T1139 oazsp.FileTxnSnapLog.save Snapshotting: 0
[junit4:junit4]   2> 106 T1138 oasc.ZkTestServer.run start zk server on port:63159
[junit4:junit4]   2> 106 T1138 oaz.ZooKeeper.<init> Initiating client connection, connectString=127.0.0.1:63159 sessionTimeout=10000 watcher=org.apache.solr.common.cloud.ConnectionManager@6109a733
[junit4:junit4]   2> 107 T1144 oaz.ClientCnxn$SendThread.startConnect Opening socket connection to server /127.0.0.1:63159
[junit4:junit4]   2> 107 T1138 oascc.ConnectionManager.waitForConnected Waiting for client to connect to ZooKeeper
[junit4:junit4]   2> 108 T1144 oaz.ClientCnxn$SendThread.primeConnection Socket connection established to localhost/127.0.0.1:63159, initiating session
[junit4:junit4]   2> 108 T1140 oazs.NIOServerCnxn$Factory.run Accepted socket connection from /140.211.11.196:63160
[junit4:junit4]   2> 109 T1140 oazs.NIOServerCnxn.readConnectRequest Client attempting to establish new session at /140.211.11.196:63160
[junit4:junit4]   2> 109 T1142 oazsp.FileTxnLog.append Creating new log file: log.1
[junit4:junit4]   2> 112 T1142 oazs.NIOServerCnxn.finishSessionInit Established session 0x13a5e88d58c0000 with negotiated timeout 10000 for client /140.211.11.196:63160
[junit4:junit4]   2> 112 T1144 oaz.ClientCnxn$SendThread.readConnectResult Session establishment complete on server localhost/127.0.0.1:63159, sessionid = 0x13a5e88d58c0000, negotiated timeout = 10000
[junit4:junit4]   2> 112 T1145 oascc.ConnectionManager.process Watcher org.apache.solr.common.cloud.ConnectionManager@6109a733 name:ZooKeeperConnection Watcher:127.0.0.1:63159 got event WatchedEvent state:SyncConnected type:None path:null path:null type:None
[junit4:junit4]   2> 113 T1138 oascc.ConnectionManager.waitForConnected Client is connected to ZooKeeper
[junit4:junit4]   2> 113 T1138 oascc.SolrZkClient.makePath makePath: /solr
[junit4:junit4]   2> 116 T1143 oazs.PrepRequestProcessor.pRequest Processed session termination for sessionid: 0x13a5e88d58c0000
[junit4:junit4]   2> 127 T1145 oaz.ClientCnxn$EventThread.run EventThread shut down
[junit4:junit4]   2> 127 T1138 oaz.ZooKeeper.close Session: 0x13a5e88d58c0000 closed
[junit4:junit4]   2> 128 T1140 oazs.NIOServerCnxn.closeSock Closed socket connection for client /140.211.11.196:63160 which had sessionid 0x13a5e88d58c0000
[junit4:junit4]   2> 128 T1138 oaz.ZooKeeper.<init> Initiating client connection, connectString=127.0.0.1:63159/solr sessionTimeout=10000 watcher=org.apache.solr.common.cloud.ConnectionManager@98a6d40
[junit4:junit4]   2> 129 T1146 oaz.ClientCnxn$SendThread.startConnect Opening socket connection to server /127.0.0.1:63159
[junit4:junit4]   2> 129 T1138 oascc.ConnectionManager.waitForConnected Waiting for client to connect to ZooKeeper
[junit4:junit4]   2> 129 T1146 oaz.ClientCnxn$SendThread.primeConnection Socket connection established to localhost/127.0.0.1:63159, initiating session
[junit4:junit4]   2> 130 T1140 oazs.NIOServerCnxn$Factory.run Accepted socket connection from /140.211.11.196:63161
[junit4:junit4]   2> 130 T1140 oazs.NIOServerCnxn.readConnectRequest Client attempting to establish new session at /140.211.11.196:63161
[junit4:junit4]   2> 131 T1142 oazs.NIOServerCnxn.finishSessionInit Established session 0x13a5e88d58c0001 with negotiated timeout 10000 for client /140.211.11.196:63161
[junit4:junit4]   2> 131 T1146 oaz.ClientCnxn$SendThread.readConnectResult Session establishment complete on server localhost/127.0.0.1:63159, sessionid = 0x13a5e88d58c0001, negotiated timeout = 10000
[junit4:junit4]   2> 131 T1147 oascc.ConnectionManager.process Watcher org.apache.solr.common.cloud.ConnectionManager@98a6d40 name:ZooKeeperConnection Watcher:127.0.0.1:63159/solr got event WatchedEvent state:SyncConnected type:None path:null path:null type:None
[junit4:junit4]   2> 132 T1138 oascc.ConnectionManager.waitForConnected Client is connected to ZooKeeper
[junit4:junit4]   2> 132 T1138 oascc.SolrZkClient.makePath makePath: /collections/collection1
[junit4:junit4]   2> 142 T1138 oascc.SolrZkClient.makePath makePath: /collections/collection1/shards
[junit4:junit4]   2> 145 T1138 oascc.SolrZkClient.makePath makePath: /collections/control_collection
[junit4:junit4]   2> 147 T1138 oascc.SolrZkClient.makePath makePath: /collections/control_collection/shards
[junit4:junit4]   2> 156 T1138 oasc.AbstractZkTestCase.putConfig put /usr/home/hudson/hudson-slave/workspace/Lucene-Solr-Tests-trunk-java7/solr/build/solr-core/test-files/solr/collection1/conf/solrconfig.xml to /configs/conf1/solrconfig.xml
[junit4:junit4]   2> 156 T1138 oascc.SolrZkClient.makePath makePath: /configs/conf1/solrconfig.xml
[junit4:junit4]   2> 170 T1138 oasc.AbstractZkTestCase.putConfig put /usr/home/hudson/hudson-slave/workspace/Lucene-Solr-Tests-trunk-java7/solr/build/solr-core/test-files/solr/collection1/conf/schema.xml to /configs/conf1/schema.xml
[junit4:junit4]   2> 170 T1138 oascc.SolrZkClient.makePath makePath: /configs/conf1/schema.xml
[junit4:junit4]   2> 275 T1138 oasc.AbstractZkTestCase.putConfig put /usr/home/hudson/hudson-slave/workspace/Lucene-Solr-Tests-trunk-java7/solr/build/solr-core/test-files/solr/collection1/conf/solrconfig.xml to /configs/conf1/solrconfig.xml
[junit4:junit4]   2> 276 T1138 oascc.SolrZkClient.makePath makePath: /configs/conf1/solrconfig.xml
[junit4:junit4]   2> 290 T1138 oasc.AbstractZkTestCase.putConfig put /usr/home/hudson/hudson-slave/workspace/Lucene-Solr-Tests-trunk-java7/solr/build/solr-core/test-files/solr/collection1/conf/stopwords.txt to /configs/conf1/stopwords.txt
[junit4:junit4]   2> 291 T1138 oascc.SolrZkClient.makePath makePath: /configs/conf1/stopwords.txt
[junit4:junit4]   2> 301 T1138 oasc.AbstractZkTestCase.putConfig put /usr/home/hudson/hudson-slave/workspace/Lucene-Solr-Tests-trunk-java7/solr/build/solr-core/test-files/solr/collection1/conf/protwords.txt to /configs/conf1/protwords.txt
[junit4:junit4]   2> 302 T1138 oascc.SolrZkClient.makePath makePath: /configs/conf1/protwords.txt
[junit4:junit4]   2> 308 T1138 oasc.AbstractZkTestCase.putConfig put /usr/home/hudson/hudson-slave/workspace/Lucene-Solr-Tests-trunk-java7/solr/build/solr-core/test-files/solr/collection1/conf/currency.xml to /configs/conf1/currency.xml
[junit4:junit4]   2> 308 T1138 oascc.SolrZkClient.makePath makePath: /configs/conf1/currency.xml
[junit4:junit4]   2> 312 T1138 oasc.AbstractZkTestCase.putConfig put /usr/home/hudson/hudson-slave/workspace/Lucene-Solr-Tests-trunk-java7/solr/build/solr-core/test-files/solr/collection1/conf/open-exchange-rates.json to /configs/conf1/open-exchange-rates.json
[junit4:junit4]   2> 312 T1138 oascc.SolrZkClient.makePath makePath: /configs/conf1/open-exchange-rates.json
[junit4:junit4]   2> 315 T1138 oasc.AbstractZkTestCase.putConfig put /usr/home/hudson/hudson-slave/workspace/Lucene-Solr-Tests-trunk-java7/solr/build/solr-core/test-files/solr/collection1/conf/mapping-ISOLatin1Accent.txt to /configs/conf1/mapping-ISOLatin1Accent.txt
[junit4:junit4]   2> 317 T1138 oascc.SolrZkClient.makePath makePath: /configs/conf1/mapping-ISOLatin1Accent.txt
[junit4:junit4]   2> 320 T1138 oasc.AbstractZkTestCase.putConfig put /usr/home/hudson/hudson-slave/workspace/Lucene-Solr-Tests-trunk-java7/solr/build/solr-core/test-files/solr/collection1/conf/old_synonyms.txt to /configs/conf1/old_synonyms.txt
[junit4:junit4]   2> 321 T1138 oascc.SolrZkClient.makePath makePath: /configs/conf1/old_synonyms.txt
[junit4:junit4]   2> 324 T1138 oasc.AbstractZkTestCase.putConfig put /usr/home/hudson/hudson-slave/workspace/Lucene-Solr-Tests-trunk-java7/solr/build/solr-core/test-files/solr/collection1/conf/synonyms.txt to /configs/conf1/synonyms.txt
[junit4:junit4]   2> 324 T1138 oascc.SolrZkClient.makePath makePath: /configs/conf1/synonyms.txt
[junit4:junit4]   2> 327 T1143 oazs.PrepRequestProcessor.pRequest Processed session termination for sessionid: 0x13a5e88d58c0001
[junit4:junit4]   2> 334 T1147 oaz.ClientCnxn$EventThread.run EventThread shut down
[junit4:junit4]   2> 334 T1138 oaz.ZooKeeper.close Session: 0x13a5e88d58c0001 closed
[junit4:junit4]   2> 335 T1140 oazs.NIOServerCnxn.closeSock Closed socket connection for client /140.211.11.196:63161 which had sessionid 0x13a5e88d58c0001
[junit4:junit4]   2> 492 T1138 oejs.Server.doStart jetty-8.1.2.v20120308
[junit4:junit4]   2> 497 T1138 oejs.AbstractConnector.doStart Started SocketConnector@0.0.0.0:63165
[junit4:junit4]   2> 497 T1138 oasc.SolrResourceLoader.locateSolrHome JNDI not configured for solr (NoInitialContextEx)
[junit4:junit4]   2> 498 T1138 oasc.SolrResourceLoader.locateSolrHome using system property solr.solr.home: /usr/home/hudson/hudson-slave/workspace/Lucene-Solr-Tests-trunk-java7/solr/build/solr-core/test/J0/./org.apache.solr.cloud.BasicDistributedZkTest-controljetty-1350205757139
[junit4:junit4]   2> 498 T1138 oasc.SolrResourceLoader.<init> new SolrResourceLoader for deduced Solr Home: '/usr/home/hudson/hudson-slave/workspace/Lucene-Solr-Tests-trunk-java7/solr/build/solr-core/test/J0/./org.apache.solr.cloud.BasicDistributedZkTest-controljetty-1350205757139/'
[junit4:junit4]   2> 540 T1138 oass.SolrDispatchFilter.init SolrDispatchFilter.init()
[junit4:junit4]   2> 540 T1138 oasc.SolrResourceLoader.locateSolrHome JNDI not configured for solr (NoInitialContextEx)
[junit4:junit4]   2> 541 T1138 oasc.SolrResourceLoader.locateSolrHome using system property solr.solr.home: /usr/home/hudson/hudson-slave/workspace/Lucene-Solr-Tests-trunk-java7/solr/build/solr-core/test/J0/./org.apache.solr.cloud.BasicDistributedZkTest-controljetty-1350205757139
[junit4:junit4]   2> 541 T1138 oasc.CoreContainer$Initializer.initialize looking for solr.xml: /usr/home/hudson/hudson-slave/workspace/Lucene-Solr-Tests-trunk-java7/solr/build/solr-core/test/J0/./org.apache.solr.cloud.BasicDistributedZkTest-controljetty-1350205757139/solr.xml
[junit4:junit4]   2> 542 T1138 oasc.CoreContainer.<init> New CoreContainer 1783904393
[junit4:junit4]   2> 542 T1138 oasc.CoreContainer.load Loading CoreContainer using Solr Home: '/usr/home/hudson/hudson-slave/workspace/Lucene-Solr-Tests-trunk-java7/solr/build/solr-core/test/J0/./org.apache.solr.cloud.BasicDistributedZkTest-controljetty-1350205757139/'
[junit4:junit4]   2> 543 T1138 oasc.SolrResourceLoader.<init> new SolrResourceLoader for directory: '/usr/home/hudson/hudson-slave/workspace/Lucene-Solr-Tests-trunk-java7/solr/build/solr-core/test/J0/./org.apache.solr.cloud.BasicDistributedZkTest-controljetty-1350205757139/'
[junit4:junit4]   2> 577 T1138 oasc.CoreContainer.load Registering Log Listener
[junit4:junit4]   2> 593 T1138 oasc.CoreContainer.initZooKeeper Zookeeper client=127.0.0.1:63159/solr
[junit4:junit4]   2> 595 T1138 oaz.ZooKeeper.<init> Initiating client connection, connectString=127.0.0.1:63159/solr sessionTimeout=5000 watcher=org.apache.solr.common.cloud.ConnectionManager@4eac6aed
[junit4:junit4]   2> 596 T1157 oaz.ClientCnxn$SendThread.startConnect Opening socket connection to server /127.0.0.1:63159
[junit4:junit4]   2> 596 T1138 oascc.ConnectionManager.waitForConnected Waiting for client to connect to ZooKeeper
[junit4:junit4]   2> 597 T1157 oaz.ClientCnxn$SendThread.primeConnection Socket connection established to localhost/127.0.0.1:63159, initiating session
[junit4:junit4]   2> 597 T1140 oazs.NIOServerCnxn$Factory.run Accepted socket connection from /140.211.11.196:63167
[junit4:junit4]   2> 598 T1140 oazs.NIOServerCnxn.readConnectRequest Client attempting to establish new session at /140.211.11.196:63167
[junit4:junit4]   2> 600 T1142 oazs.NIOServerCnxn.finishSessionInit Established session 0x13a5e88d58c0002 with negotiated timeout 5000 for client /140.211.11.196:63167
[junit4:junit4]   2> 600 T1157 oaz.ClientCnxn$SendThread.readConnectResult Session establishment complete on server localhost/127.0.0.1:63159, sessionid = 0x13a5e88d58c0002, negotiated timeout = 5000
[junit4:junit4]   2> 600 T1158 oascc.ConnectionManager.process Watcher org.apache.solr.common.cloud.ConnectionManager@4eac6aed name:ZooKeeperConnection Watcher:127.0.0.1:63159/solr got event WatchedEvent state:SyncConnected type:None path:null path:null type:None
[junit4:junit4]   2> 600 T1138 oascc.ConnectionManager.waitForConnected Client is connected to ZooKeeper
[junit4:junit4]   2> 602 T1143 oazs.PrepRequestProcessor.pRequest Got user-level KeeperException when processing sessionid:0x13a5e88d58c0002 type:create cxid:0x2 zxid:0xfffffffffffffffe txntype:unknown reqpath:n/a Error Path:/solr/overseer Error:KeeperErrorCode = NodeExists for /solr/overseer
[junit4:junit4]   2> 610 T1138 oascc.SolrZkClient.makePath makePath: /live_nodes
[junit4:junit4]   2> 612 T1138 oasc.ZkController.createEphemeralLiveNode Register node as live in ZooKeeper:/live_nodes/127.0.0.1:63165_solr
[junit4:junit4]   2> 613 T1143 oazs.PrepRequestProcessor.pRequest Got user-level KeeperException when processing sessionid:0x13a5e88d58c0002 type:delete cxid:0x7 zxid:0xfffffffffffffffe txntype:unknown reqpath:n/a Error Path:/solr/live_nodes/127.0.0.1:63165_solr Error:KeeperErrorCode = NoNode for /solr/live_nodes/127.0.0.1:63165_solr
[junit4:junit4]   2> 614 T1138 oascc.SolrZkClient.makePath makePath: /live_nodes/127.0.0.1:63165_solr
[junit4:junit4]   2> 622 T1138 oashc.HttpShardHandlerFactory.getParameter Setting socketTimeout to: 0
[junit4:junit4]   2> 623 T1138 oashc.HttpShardHandlerFactory.getParameter Setting urlScheme to: http://
[junit4:junit4]   2> 623 T1138 oashc.HttpShardHandlerFactory.getParameter Setting connTimeout to: 0
[junit4:junit4]   2> 624 T1138 oashc.HttpShardHandlerFactory.getParameter Setting maxConnectionsPerHost to: 20
[junit4:junit4]   2> 624 T1138 oashc.HttpShardHandlerFactory.getParameter Setting corePoolSize to: 0
[junit4:junit4]   2> 625 T1138 oashc.HttpShardHandlerFactory.getParameter Setting maximumPoolSize to: 2147483647
[junit4:junit4]   2> 625 T1138 oashc.HttpShardHandlerFactory.getParameter Setting maxThreadIdleTime to: 5
[junit4:junit4]   2> 626 T1138 oashc.HttpShardHandlerFactory.getParameter Setting sizeOfQueue to: -1
[junit4:junit4]   2> 626 T1138 oashc.HttpShardHandlerFactory.getParameter Setting fairnessPolicy to: false
[junit4:junit4]   2> 627 T1138 oascsi.HttpClientUtil.createClient Creating new http client, config:maxConnectionsPerHost=20&maxConnections=10000&socketTimeout=0&connTimeout=0&retry=false
[junit4:junit4]   2> 643 T1138 oascc.SolrZkClient.makePath makePath: /overseer_elect/election
[junit4:junit4]   2> 656 T1143 oazs.PrepRequestProcessor.pRequest Got user-level KeeperException when processing sessionid:0x13a5e88d58c0002 type:delete cxid:0x15 zxid:0xfffffffffffffffe txntype:unknown reqpath:n/a Error Path:/solr/overseer_elect/leader Error:KeeperErrorCode = NoNode for /solr/overseer_elect/leader
[junit4:junit4]   2> 657 T1138 oascc.SolrZkClient.makePath makePath: /overseer_elect/leader
[junit4:junit4]   2> 660 T1138 oasc.Overseer.start Overseer (id=88487084478431234-127.0.0.1:63165_solr-n_0000000000) starting
[junit4:junit4]   2> 661 T1143 oazs.PrepRequestProcessor.pRequest Got user-level KeeperException when processing sessionid:0x13a5e88d58c0002 type:create cxid:0x1a zxid:0xfffffffffffffffe txntype:unknown reqpath:n/a Error Path:/solr/overseer Error:KeeperErrorCode = NodeExists for /solr/overseer
[junit4:junit4]   2> 662 T1143 oazs.PrepRequestProcessor.pRequest Got user-level KeeperException when processing sessionid:0x13a5e88d58c0002 type:create cxid:0x1b zxid:0xfffffffffffffffe txntype:unknown reqpath:n/a Error Path:/solr/overseer Error:KeeperErrorCode = NodeExists for /solr/overseer
[junit4:junit4]   2> 672 T1143 oazs.PrepRequestProcessor.pRequest Got user-level KeeperException when processing sessionid:0x13a5e88d58c0002 type:create cxid:0x1c zxid:0xfffffffffffffffe txntype:unknown reqpath:n/a Error Path:/solr/overseer Error:KeeperErrorCode = NodeExists for /solr/overseer
[junit4:junit4]   2> 673 T1143 oazs.PrepRequestProcessor.pRequest Got user-level KeeperException when processing sessionid:0x13a5e88d58c0002 type:create cxid:0x1d zxid:0xfffffffffffffffe txntype:unknown reqpath:n/a Error Path:/solr/overseer Error:KeeperErrorCode = NodeExists for /solr/overseer
[junit4:junit4]   2> 675 T1160 oasc.OverseerCollectionProcessor.run Process current queue of collection creations
[junit4:junit4]   2> 675 T1138 oascc.SolrZkClient.makePath makePath: /clusterstate.json
[junit4:junit4]   2> 685 T1138 oascc.ZkStateReader.createClusterStateWatchersAndUpdate Updating cluster state from ZooKeeper... 
[junit4:junit4]   2> 687 T1159 oasc.Overseer$ClusterStateUpdater.run Starting to work on the main queue
[junit4:junit4]   2> 692 T1138 oasc.CoreContainer.create Creating SolrCore 'collection1' using instanceDir: /usr/home/hudson/hudson-slave/workspace/Lucene-Solr-Tests-trunk-java7/solr/build/solr-core/test/J0/./org.apache.solr.cloud.BasicDistributedZkTest-controljetty-1350205757139/collection1
[junit4:junit4]   2> 693 T1138 oasc.ZkController.createCollectionZkNode Check for collection zkNode:control_collection
[junit4:junit4]   2> 694 T1138 oasc.ZkController.createCollectionZkNode Collection zkNode exists
[junit4:junit4]   2> 694 T1138 oasc.ZkController.readConfigName Load collection config from:/collections/control_collection
[junit4:junit4]   2> 696 T1138 oasc.SolrResourceLoader.<init> new SolrResourceLoader for directory: '/usr/home/hudson/hudson-slave/workspace/Lucene-Solr-Tests-trunk-java7/solr/build/solr-core/test/J0/./org.apache.solr.cloud.BasicDistributedZkTest-controljetty-1350205757139/collection1/'
[junit4:junit4]   2> 697 T1138 oasc.SolrResourceLoader.replaceClassLoader Adding 'file:/usr/home/hudson/hudson-slave/workspace/Lucene-Solr-Tests-trunk-java7/solr/build/solr-core/test/J0/org.apache.solr.cloud.BasicDistributedZkTest-controljetty-1350205757139/collection1/lib/README' to classloader
[junit4:junit4]   2> 698 T1138 oasc.SolrResourceLoader.replaceClassLoader Adding 'file:/usr/home/hudson/hudson-slave/workspace/Lucene-Solr-Tests-trunk-java7/solr/build/solr-core/test/J0/org.apache.solr.cloud.BasicDistributedZkTest-controljetty-1350205757139/collection1/lib/classes/' to classloader
[junit4:junit4]   2> 750 T1138 oasc.SolrConfig.<init> Using Lucene MatchVersion: LUCENE_50
[junit4:junit4]   2> 821 T1138 oasc.SolrConfig.<init> Loaded SolrConfig: solrconfig.xml
[junit4:junit4]   2> 922 T1138 oass.IndexSchema.readSchema Reading Solr Schema
[junit4:junit4]   2> 927 T1138 oass.IndexSchema.readSchema Schema name=test
[junit4:junit4]   2> 1457 T1138 oass.OpenExchangeRatesOrgProvider.init Initialized with rates=open-exchange-rates.json, refreshInterval=1440.
[junit4:junit4]   2> 1468 T1138 oass.IndexSchema.readSchema default search field in schema is text
[junit4:junit4]   2> 1472 T1138 oass.IndexSchema.readSchema unique key field: id
[junit4:junit4]   2> 1488 T1138 oass.FileExchangeRateProvider.reload Reloading exchange rates from file currency.xml
[junit4:junit4]   2> 1493 T1138 oass.FileExchangeRateProvider.reload Reloading exchange rates from file currency.xml
[junit4:junit4]   2> 1498 T1138 oass.OpenExchangeRatesOrgProvider.reload Reloading exchange rates from open-exchange-rates.json
[junit4:junit4]   2> 1500 T1138 oass.OpenExchangeRatesOrgProvider.reload Reloading exchange rates from open-exchange-rates.json
[junit4:junit4]   2> 1501 T1138 oasc.SolrCore.<init> [collection1] Opening new SolrCore at /usr/home/hudson/hudson-slave/workspace/Lucene-Solr-Tests-trunk-java7/solr/build/solr-core/test/J0/./org.apache.solr.cloud.BasicDistributedZkTest-controljetty-1350205757139/collection1/, dataDir=./org.apache.solr.cloud.BasicDistributedZkTest-1350205756807/control/data/
[junit4:junit4]   2> 1502 T1138 oasc.JmxMonitoredMap.<init> JMX monitoring is enabled. Adding Solr mbeans to JMX Server: com.sun.jmx.mbeanserver.JmxMBeanServer@4001e1d5
[junit4:junit4]   2> 1504 T1138 oasc.SolrCore.getNewIndexDir New index directory detected: old=null new=./org.apache.solr.cloud.BasicDistributedZkTest-1350205756807/control/data/index/
[junit4:junit4]   2> 1505 T1138 oasc.SolrCore.initIndex WARNING [collection1] Solr index directory './org.apache.solr.cloud.BasicDistributedZkTest-1350205756807/control/data/index' doesn't exist. Creating new index...
[junit4:junit4]   2> 1506 T1138 oasc.CachingDirectoryFactory.get return new directory for /usr/home/hudson/hudson-slave/workspace/Lucene-Solr-Tests-trunk-java7/solr/build/solr-core/test/J0/./org.apache.solr.cloud.BasicDistributedZkTest-1350205756807/control/data/index forceNew:false
[junit4:junit4]   2> 1517 T1138 oasc.SolrDeletionPolicy.onCommit SolrDeletionPolicy.onCommit: commits:num=1
[junit4:junit4]   2> 		commit{dir=NRTCachingDirectory(org.apache.lucene.store.NIOFSDirectory@/usr/home/hudson/hudson-slave/workspace/Lucene-Solr-Tests-trunk-java7/solr/build/solr-core/test/J0/org.apache.solr.cloud.BasicDistributedZkTest-1350205756807/control/data/index lockFactory=org.apache.lucene.store.NativeFSLockFactory@7d17b2c3; maxCacheMB=48.0 maxMergeSizeMB=4.0),segFN=segments_1,generation=1,filenames=[segments_1]
[junit4:junit4]   2> 1518 T1138 oasc.SolrDeletionPolicy.updateCommits newest commit = 1
[junit4:junit4]   2> 1519 T1138 oasc.SolrCore.initWriters created xml: solr.XMLResponseWriter
[junit4:junit4]   2> 1522 T1138 oasup.UpdateRequestProcessorChain.init inserting DistributedUpdateProcessorFactory into updateRequestProcessorChain "dedupe"
[junit4:junit4]   2> 1522 T1138 oasup.UpdateRequestProcessorChain.init inserting DistributedUpdateProcessorFactory into updateRequestProcessorChain "dedupe-allfields"
[junit4:junit4]   2> 1523 T1138 oasup.UpdateRequestProcessorChain.init inserting DistributedUpdateProcessorFactory into updateRequestProcessorChain "stored_sig"
[junit4:junit4]   2> 1523 T1138 oasup.UpdateRequestProcessorChain.init inserting DistributedUpdateProcessorFactory into updateRequestProcessorChain "uniq-fields"
[junit4:junit4]   2> 1524 T1138 oasup.UpdateRequestProcessorChain.init inserting DistributedUpdateProcessorFactory into updateRequestProcessorChain "distrib-dup-test-chain-implicit"
[junit4:junit4]   2> 1525 T1138 oasc.RequestHandlers.initHandlersFromConfig adding lazy requestHandler: solr.ReplicationHandler
[junit4:junit4]   2> 1526 T1138 oasc.RequestHandlers.initHandlersFromConfig created /replication: solr.ReplicationHandler
[junit4:junit4]   2> 1526 T1138 oasc.RequestHandlers.initHandlersFromConfig created standard: solr.StandardRequestHandler
[junit4:junit4]   2> 1527 T1138 oasc.RequestHandlers.initHandlersFromConfig created /get: solr.RealTimeGetHandler
[junit4:junit4]   2> 1528 T1138 oasc.RequestHandlers.initHandlersFromConfig created dismax: solr.SearchHandler
[junit4:junit4]   2> 1528 T1138 oasc.RequestHandlers.initHandlersFromConfig created mock: org.apache.solr.core.MockQuerySenderListenerReqHandler
[junit4:junit4]   2> 1529 T1138 oasc.RequestHandlers.initHandlersFromConfig created /admin/: org.apache.solr.handler.admin.AdminHandlers
[junit4:junit4]   2> 1530 T1138 oasc.RequestHandlers.initHandlersFromConfig created defaults: solr.StandardRequestHandler
[junit4:junit4]   2> 1530 T1138 oasc.RequestHandlers.initHandlersFromConfig adding lazy requestHandler: solr.StandardRequestHandler
[junit4:junit4]   2> 1531 T1138 oasc.RequestHandlers.initHandlersFromConfig created lazy: solr.StandardRequestHandler
[junit4:junit4]   2> 1531 T1138 oasc.RequestHandlers.initHandlersFromConfig created /update: solr.UpdateRequestHandler
[junit4:junit4]   2> 1532 T1138 oasc.RequestHandlers.initHandlersFromConfig created /terms: org.apache.solr.handler.component.SearchHandler
[junit4:junit4]   2> 1533 T1138 oasc.RequestHandlers.initHandlersFromConfig created spellCheckCompRH: org.apache.solr.handler.component.SearchHandler
[junit4:junit4]   2> 1533 T1138 oasc.RequestHandlers.initHandlersFromConfig created spellCheckCompRH_Direct: org.apache.solr.handler.component.SearchHandler
[junit4:junit4]   2> 1534 T1138 oasc.RequestHandlers.initHandlersFromConfig created spellCheckWithWordbreak: org.apache.solr.handler.component.SearchHandler
[junit4:junit4]   2> 1535 T1138 oasc.RequestHandlers.initHandlersFromConfig created spellCheckWithWordbreak_Direct: org.apache.solr.handler.component.SearchHandler
[junit4:junit4]   2> 1535 T1138 oasc.RequestHandlers.initHandlersFromConfig created spellCheckCompRH1: org.apache.solr.handler.component.SearchHandler
[junit4:junit4]   2> 1536 T1138 oasc.RequestHandlers.initHandlersFromConfig created tvrh: org.apache.solr.handler.component.SearchHandler
[junit4:junit4]   2> 1537 T1138 oasc.RequestHandlers.initHandlersFromConfig created /mlt: solr.MoreLikeThisHandler
[junit4:junit4]   2> 1538 T1138 oasc.RequestHandlers.initHandlersFromConfig created /debug/dump: solr.DumpRequestHandler
[junit4:junit4]   2> 1550 T1138 oashl.XMLLoader.init xsltCacheLifetimeSeconds=60
[junit4:junit4]   2> 1555 T1138 oasc.SolrCore.initDeprecatedSupport WARNING solrconfig.xml uses deprecated <admin/gettableFiles>, Please update your config to use the ShowFileRequestHandler.
[junit4:junit4]   2> 1557 T1138 oasc.SolrCore.initDeprecatedSupport WARNING adding ShowFileRequestHandler with hidden files: [SCHEMA.XML, OLD_SYNONYMS.TXT, STOPWORDS.TXT, PROTWORDS.TXT, OPEN-EXCHANGE-RATES.JSON, SYNONYMS.TXT, CURRENCY.XML, MAPPING-ISOLATIN1ACCENT.TXT]
[junit4:junit4]   2> 1561 T1138 oass.SolrIndexSearcher.<init> Opening Searcher@ea7fbeb main
[junit4:junit4]   2> 1562 T1138 oasu.CommitTracker.<init> Hard AutoCommit: disabled
[junit4:junit4]   2> 1563 T1138 oasu.CommitTracker.<init> Soft AutoCommit: disabled
[junit4:junit4]   2> 1564 T1138 oashc.SpellCheckComponent.inform Initializing spell checkers
[junit4:junit4]   2> 1572 T1138 oass.DirectSolrSpellChecker.init init: {name=direct,classname=DirectSolrSpellChecker,field=lowerfilt,minQueryLength=3}
[junit4:junit4]   2> 1633 T1161 oasc.SolrCore.registerSearcher [collection1] Registered new searcher Searcher@ea7fbeb main{StandardDirectoryReader(segments_1:1)}
[junit4:junit4]   2> 1638 T1143 oazs.PrepRequestProcessor.pRequest Got user-level KeeperException when processing sessionid:0x13a5e88d58c0002 type:create cxid:0x53 zxid:0xfffffffffffffffe txntype:unknown reqpath:n/a Error Path:/solr/overseer/queue Error:KeeperErrorCode = NoNode for /solr/overseer/queue
[junit4:junit4]   2> 1643 T1138 oasc.CoreContainer.register registering core: collection1
[junit4:junit4]   2> 1643 T1138 oasc.ZkController.register Register shard - core:collection1 address:http://127.0.0.1:63165/solr shardId:control_shard
[junit4:junit4]   2> 1644 T1138 oascc.SolrZkClient.makePath makePath: /collections/control_collection/leader_elect/control_shard/election
[junit4:junit4]   2> 1652 T1143 oazs.PrepRequestProcessor.pRequest Got user-level KeeperException when processing sessionid:0x13a5e88d58c0002 type:delete cxid:0x62 zxid:0xfffffffffffffffe txntype:unknown reqpath:n/a Error Path:/solr/collections/control_collection/leaders Error:KeeperErrorCode = NoNode for /solr/collections/control_collection/leaders
[junit4:junit4]   2> 1653 T1138 oasc.ShardLeaderElectionContext.runLeaderProcess Running the leader process.
[junit4:junit4]   2> 1654 T1143 oazs.PrepRequestProcessor.pRequest Got user-level KeeperException when processing sessionid:0x13a5e88d58c0002 type:create cxid:0x63 zxid:0xfffffffffffffffe txntype:unknown reqpath:n/a Error Path:/solr/overseer Error:KeeperErrorCode = NodeExists for /solr/overseer
[junit4:junit4]   2> 1693 T1159 oascc.ZkStateReader.updateClusterState Updating cloud state from ZooKeeper... 
[junit4:junit4]   2> 1694 T1143 oazs.PrepRequestProcessor.pRequest Got user-level KeeperException when processing sessionid:0x13a5e88d58c0002 type:create cxid:0x6a zxid:0xfffffffffffffffe txntype:unknown reqpath:n/a Error Path:/solr/overseer/queue-work Error:KeeperErrorCode = NoNode for /solr/overseer/queue-work
[junit4:junit4]   2> 1702 T1158 oascc.ZkStateReader$2.process A cluster state change has occurred - updating...
[junit4:junit4]   2> 2157 T1138 oasc.ShardLeaderElectionContext.waitForReplicasToComeUp Enough replicas found to continue.
[junit4:junit4]   2> 2158 T1138 oasc.ShardLeaderElectionContext.runLeaderProcess I may be the new leader - try and sync
[junit4:junit4]   2> 2159 T1138 oasc.SyncStrategy.sync Sync replicas to http://127.0.0.1:63165/solr/collection1/
[junit4:junit4]   2> 2159 T1138 oasc.SyncStrategy.syncReplicas Sync Success - now sync replicas to me
[junit4:junit4]   2> 2160 T1138 oasc.SyncStrategy.syncToMe http://127.0.0.1:63165/solr/collection1/ has no replicas
[junit4:junit4]   2> 2160 T1138 oasc.ShardLeaderElectionContext.runLeaderProcess I am the new leader: http://127.0.0.1:63165/solr/collection1/
[junit4:junit4]   2> 2161 T1138 oascc.SolrZkClient.makePath makePath: /collections/control_collection/leaders/control_shard
[junit4:junit4]   2> 2169 T1143 oazs.PrepRequestProcessor.pRequest Got user-level KeeperException when processing sessionid:0x13a5e88d58c0002 type:create cxid:0x88 zxid:0xfffffffffffffffe txntype:unknown reqpath:n/a Error Path:/solr/overseer Error:KeeperErrorCode = NodeExists for /solr/overseer
[junit4:junit4]   2> 2207 T1159 oascc.ZkStateReader.updateClusterState Updating cloud state from ZooKeeper... 
[junit4:junit4]   2> 2220 T1158 oascc.ZkStateReader$2.process A cluster state change has occurred - updating...
[junit4:junit4]   2> 2232 T1138 oasc.ZkController.register We are http://127.0.0.1:63165/solr/collection1/ and leader is http://127.0.0.1:63165/solr/collection1/
[junit4:junit4]   2> 2232 T1138 oasc.ZkController.register No LogReplay needed for core=collection1 baseURL=http://127.0.0.1:63165/solr
[junit4:junit4]   2> 2233 T1138 oasc.ZkController.checkRecovery I am the leader, no recovery necessary
[junit4:junit4]   2> 2235 T1138 oascc.ZkStateReader.updateClusterState Updating cloud state from ZooKeeper... 
[junit4:junit4]   2> 2235 T1138 oass.SolrDispatchFilter.init user.dir=/usr/home/hudson/hudson-slave/workspace/Lucene-Solr-Tests-trunk-java7/solr/build/solr-core/test/J0
[junit4:junit4]   2> 2236 T1138 oass.SolrDispatchFilter.init SolrDispatchFilter.init() done
[junit4:junit4]   2> 2237 T1138 oascsi.HttpClientUtil.createClient Creating new http client, config:maxConnections=128&maxConnectionsPerHost=32&followRedirects=false
[junit4:junit4]   2> 2413 T1138 oejs.Server.doStart jetty-8.1.2.v20120308
[junit4:junit4]   2> 2416 T1138 oejs.AbstractConnector.doStart Started SocketConnector@0.0.0.0:63170
[junit4:junit4]   2> 2417 T1138 oasc.SolrResourceLoader.locateSolrHome JNDI not configured for solr (NoInitialContextEx)
[junit4:junit4]   2> 2417 T1138 oasc.SolrResourceLoader.locateSolrHome using system property solr.solr.home: /usr/home/hudson/hudson-slave/workspace/Lucene-Solr-Tests-trunk-java7/solr/build/solr-core/test/J0/./org.apache.solr.cloud.BasicDistributedZkTest-jetty1-1350205759055
[junit4:junit4]   2> 2418 T1138 oasc.SolrResourceLoader.<init> new SolrResourceLoader for deduced Solr Home: '/usr/home/hudson/hudson-slave/workspace/Lucene-Solr-Tests-trunk-java7/solr/build/solr-core/test/J0/./org.apache.solr.cloud.BasicDistributedZkTest-jetty1-1350205759055/'
[junit4:junit4]   2> 2460 T1138 oass.SolrDispatchFilter.init SolrDispatchFilter.init()
[junit4:junit4]   2> 2460 T1138 oasc.SolrResourceLoader.locateSolrHome JNDI not configured for solr (NoInitialContextEx)
[junit4:junit4]   2> 2461 T1138 oasc.SolrResourceLoader.locateSolrHome using system property solr.solr.home: /usr/home/hudson/hudson-slave/workspace/Lucene-Solr-Tests-trunk-java7/solr/build/solr-core/test/J0/./org.apache.solr.cloud.BasicDistributedZkTest-jetty1-1350205759055
[junit4:junit4]   2> 2461 T1138 oasc.CoreContainer$Initializer.initialize looking for solr.xml: /usr/home/hudson/hudson-slave/workspace/Lucene-Solr-Tests-trunk-java7/solr/build/solr-core/test/J0/./org.apache.solr.cloud.BasicDistributedZkTest-jetty1-1350205759055/solr.xml
[junit4:junit4]   2> 2462 T1138 oasc.CoreContainer.<init> New CoreContainer 319733706
[junit4:junit4]   2> 2462 T1138 oasc.CoreContainer.load Loading CoreContainer using Solr Home: '/usr/home/hudson/hudson-slave/workspace/Lucene-Solr-Tests-trunk-java7/solr/build/solr-core/test/J0/./org.apache.solr.cloud.BasicDistributedZkTest-jetty1-1350205759055/'
[junit4:junit4]   2> 2463 T1138 oasc.SolrResourceLoader.<init> new SolrResourceLoader for directory: '/usr/home/hudson/hudson-slave/workspace/Lucene-Solr-Tests-trunk-java7/solr/build/solr-core/test/J0/./org.apache.solr.cloud.BasicDistributedZkTest-jetty1-1350205759055/'
[junit4:junit4]   2> 2496 T1138 oasc.CoreContainer.load Registering Log Listener
[junit4:junit4]   2> 2512 T1138 oasc.CoreContainer.initZooKeeper Zookeeper client=127.0.0.1:63159/solr
[junit4:junit4]   2> 2513 T1138 oaz.ZooKeeper.<init> Initiating client connection, connectString=127.0.0.1:63159/solr sessionTimeout=5000 watcher=org.apache.solr.common.cloud.ConnectionManager@7125dd43
[junit4:junit4]   2> 2514 T1171 oaz.ClientCnxn$SendThread.startConnect Opening socket connection to server /127.0.0.1:63159
[junit4:junit4]   2> 2514 T1138 oascc.ConnectionManager.waitForConnected Waiting for client to connect to ZooKeeper
[junit4:junit4]   2> 2516 T1171 oaz.ClientCnxn$SendThread.primeConnection Socket connection established to localhost/127.0.0.1:63159, initiating session
[junit4:junit4]   2> 2516 T1140 oazs.NIOServerCnxn$Factory.run Accepted socket connection from /140.211.11.196:63171
[junit4:junit4]   2> 2516 T1140 oazs.NIOServerCnxn.readConnectRequest Client attempting to establish new session at /140.211.11.196:63171
[junit4:junit4]   2> 2518 T1142 oazs.NIOServerCnxn.finishSessionInit Established session 0x13a5e88d58c0003 with negotiated timeout 5000 for client /140.211.11.196:63171
[junit4:junit4]   2> 2518 T1171 oaz.ClientCnxn$SendThread.readConnectResult Session establishment complete on server localhost/127.0.0.1:63159, sessionid = 0x13a5e88d58c0003, negotiated timeout = 5000
[junit4:junit4]   2> 2519 T1172 oascc.ConnectionManager.process Watcher org.apache.solr.common.cloud.ConnectionManager@7125dd43 name:ZooKeeperConnection Watcher:127.0.0.1:63159/solr got event WatchedEvent state:SyncConnected type:None path:null path:null type:None
[junit4:junit4]   2> 2519 T1138 oascc.ConnectionManager.waitForConnected Client is connected to ZooKeeper
[junit4:junit4]   2> 2520 T1143 oazs.PrepRequestProcessor.pRequest Got user-level KeeperException when processing sessionid:0x13a5e88d58c0003 type:create cxid:0x1 zxid:0xfffffffffffffffe txntype:unknown reqpath:n/a Error Path:/solr/overseer Error:KeeperErrorCode = NodeExists for /solr/overseer
[junit4:junit4]   2> 2521 T1143 oazs.PrepRequestProcessor.pRequest Got user-level KeeperException when processing sessionid:0x13a5e88d58c0003 type:create cxid:0x2 zxid:0xfffffffffffffffe txntype:unknown reqpath:n/a Error Path:/solr/overseer Error:KeeperErrorCode = NodeExists for /solr/overseer
[junit4:junit4]   2> 2529 T1138 oasc.ZkController.createEphemeralLiveNode Register node as live in ZooKeeper:/live_nodes/127.0.0.1:63170_solr
[junit4:junit4]   2> 2529 T1143 oazs.PrepRequestProcessor.pRequest Got user-level KeeperException when processing sessionid:0x13a5e88d58c0003 type:delete cxid:0x4 zxid:0xfffffffffffffffe txntype:unknown reqpath:n/a Error Path:/solr/live_nodes/127.0.0.1:63170_solr Error:KeeperErrorCode = NoNode for /solr/live_nodes/127.0.0.1:63170_solr
[junit4:junit4]   2> 2530 T1138 oascc.SolrZkClient.makePath makePath: /live_nodes/127.0.0.1:63170_solr
[junit4:junit4]   2> 2533 T1158 oascc.ZkStateReader$3.process Updating live nodes
[junit4:junit4]   2> 2534 T1138 oashc.HttpShardHandlerFactory.getParameter Setting socketTimeout to: 0
[junit4:junit4]   2> 2535 T1138 oashc.HttpShardHandlerFactory.getParameter Setting urlScheme to: http://
[junit4:junit4]   2> 2535 T1138 oashc.HttpShardHandlerFactory.getParameter Setting connTimeout to: 0
[junit4:junit4]   2> 2536 T1138 oashc.HttpShardHandlerFactory.getParameter Setting maxConnectionsPerHost to: 20
[junit4:junit4]   2> 2536 T1138 oashc.HttpShardHandlerFactory.getParameter Setting corePoolSize to: 0
[junit4:junit4]   2> 2537 T1138 oashc.HttpShardHandlerFactory.getParameter Setting maximumPoolSize to: 2147483647
[junit4:junit4]   2> 2537 T1138 oashc.HttpShardHandlerFactory.getParameter Setting maxThreadIdleTime to: 5
[junit4:junit4]   2> 2538 T1138 oashc.HttpShardHandlerFactory.getParameter Setting sizeOfQueue to: -1
[junit4:junit4]   2> 2538 T1138 oashc.HttpShardHandlerFactory.getParameter Setting fairnessPolicy to: false
[junit4:junit4]   2> 2539 T1138 oascsi.HttpClientUtil.createClient Creating new http client, config:maxConnectionsPerHost=20&maxConnections=10000&socketTimeout=0&connTimeout=0&retry=false
[junit4:junit4]   2> 2556 T1138 oascc.ZkStateReader.createClusterStateWatchersAndUpdate Updating cluster state from ZooKeeper... 
[junit4:junit4]   2> 2563 T1138 oasc.CoreContainer.create Creating SolrCore 'collection1' using instanceDir: /usr/home/hudson/hudson-slave/workspace/Lucene-Solr-Tests-trunk-java7/solr/build/solr-core/test/J0/./org.apache.solr.cloud.BasicDistributedZkTest-jetty1-1350205759055/collection1
[junit4:junit4]   2> 2563 T1138 oasc.ZkController.createCollectionZkNode Check for collection zkNode:collection1
[junit4:junit4]   2> 2564 T1138 oasc.ZkController.createCollectionZkNode Collection zkNode exists
[junit4:junit4]   2> 2565 T1138 oasc.ZkController.readConfigName Load collection config from:/collections/collection1
[junit4:junit4]   2> 2566 T1138 oasc.SolrResourceLoader.<init> new SolrResourceLoader for directory: '/usr/home/hudson/hudson-slave/workspace/Lucene-Solr-Tests-trunk-java7/solr/build/solr-core/test/J0/./org.apache.solr.cloud.BasicDistributedZkTest-jetty1-1350205759055/collection1/'
[junit4:junit4]   2> 2568 T1138 oasc.SolrResourceLoader.replaceClassLoader Adding 'file:/usr/home/hudson/hudson-slave/workspace/Lucene-Solr-Tests-trunk-java7/solr/build/solr-core/test/J0/org.apache.solr.cloud.BasicDistributedZkTest-jetty1-1350205759055/collection1/lib/README' to classloader
[junit4:junit4]   2> 2569 T1138 oasc.SolrResourceLoader.replaceClassLoader Adding 'file:/usr/home/hudson/hudson-slave/workspace/Lucene-Solr-Tests-trunk-java7/solr/build/solr-core/test/J0/org.apache.solr.cloud.BasicDistributedZkTest-jetty1-1350205759055/collection1/lib/classes/' to classloader
[junit4:junit4]   2> 2621 T1138 oasc.SolrConfig.<init> Using Lucene MatchVersion: LUCENE_50
[junit4:junit4]   2> 2692 T1138 oasc.SolrConfig.<init> Loaded SolrConfig: solrconfig.xml
[junit4:junit4]   2> 2724 T1159 oascc.ZkStateReader.updateClusterState Updating cloud state from ZooKeeper... 
[junit4:junit4]   2> 2737 T1158 oascc.ZkStateReader$2.process A cluster state change has occurred - updating...
[junit4:junit4]   2> 2793 T1172 oascc.ZkStateReader$2.process A cluster state change has occurred - updating...
[junit4:junit4]   2> 2793 T1138 oass.IndexSchema.readSchema Reading Solr Schema
[junit4:junit4]   2> 2799 T1138 oass.IndexSchema.readSchema Schema name=test
[junit4:junit4]   2> 3434 T1138 oass.OpenExchangeRatesOrgProvider.init Initialized with rates=open-exchange-rates.json, refreshInterval=1440.
[junit4:junit4]   2> 3446 T1138 oass.IndexSchema.readSchema default search field in schema is text
[junit4:junit4]   2> 3450 T1138 oass.IndexSchema.readSchema unique key field: id
[junit4:junit4]   2> 3466 T1138 oass.FileExchangeRateProvider.reload Reloading exchange rates from file currency.xml
[junit4:junit4]   2> 3471 T1138 oass.FileExchangeRateProvider.reload Reloading exchange rates from file currency.xml
[junit4:junit4]   2> 3477 T1138 oass.OpenExchangeRatesOrgProvider.reload Reloading exchange rates from open-exchange-rates.json
[junit4:junit4]   2> 3479 T1138 oass.OpenExchangeRatesOrgProvider.reload Reloading exchange rates from open-exchange-rates.json
[junit4:junit4]   2> 3481 T1138 oasc.SolrCore.<init> [collection1] Opening new SolrCore at /usr/home/hudson/hudson-slave/workspace/Lucene-Solr-Tests-trunk-java7/solr/build/solr-core/test/J0/./org.apache.solr.cloud.BasicDistributedZkTest-jetty1-1350205759055/collection1/, dataDir=./org.apache.solr.cloud.BasicDistributedZkTest-1350205756807/jetty1/
[junit4:junit4]   2> 3481 T1138 oasc.JmxMonitoredMap.<init> JMX monitoring is enabled. Adding Solr mbeans to JMX Server: com.sun.jmx.mbeanserver.JmxMBeanServer@4001e1d5
[junit4:junit4]   2> 3483 T1138 oasc.SolrCore.getNewIndexDir New index directory detected: old=null new=./org.apache.solr.cloud.BasicDistributedZkTest-1350205756807/jetty1/index/
[junit4:junit4]   2> 3484 T1138 oasc.SolrCore.initIndex WARNING [collection1] Solr index directory './org.apache.solr.cloud.BasicDistributedZkTest-1350205756807/jetty1/index' doesn't exist. Creating new index...
[junit4:junit4]   2> 3485 T1138 oasc.CachingDirectoryFactory.get return new directory for /usr/home/hudson/hudson-slave/workspace/Lucene-Solr-Tests-trunk-java7/solr/build/solr-core/test/J0/./org.apache.solr.cloud.BasicDistributedZkTest-1350205756807/jetty1/index forceNew:false
[junit4:junit4]   2> 3491 T1138 oasc.SolrDeletionPolicy.onCommit SolrDeletionPolicy.onCommit: commits:num=1
[junit4:junit4]   2> 		commit{dir=NRTCachingDirectory(org.apache.lucene.store.NIOFSDirectory@/usr/home/hudson/hudson-slave/workspace/Lucene-Solr-Tests-trunk-java7/solr/build/solr-core/test/J0/org.apache.solr.cloud.BasicDistributedZkTest-1350205756807/jetty1/index lockFactory=org.apache.lucene.store.NativeFSLockFactory@51e9e252; maxCacheMB=48.0 maxMergeSizeMB=4.0),segFN=segments_1,generation=1,filenames=[segments_1]
[junit4:junit4]   2> 3492 T1138 oasc.SolrDeletionPolicy.updateCommits newest commit = 1
[junit4:junit4]   2> 3493 T1138 oasc.SolrCore.initWriters created xml: solr.XMLResponseWriter
[junit4:junit4]   2> 3496 T1138 oasup.UpdateRequestProcessorChain.init inserting DistributedUpdateProcessorFactory into updateRequestProcessorChain "dedupe"
[junit4:junit4]   2> 3496 T1138 oasup.UpdateRequestProcessorChain.init inserting DistributedUpdateProcessorFactory into updateRequestProcessorChain "dedupe-allfields"
[junit4:junit4]   2> 3497 T1138 oasup.UpdateRequestProcessorChain.init inserting DistributedUpdateProcessorFactory into updateRequestProcessorChain "stored_sig"
[junit4:junit4]   2> 3498 T1138 oasup.UpdateRequestProcessorChain.init inserting DistributedUpdateProcessorFactory into updateRequestProcessorChain "uniq-fields"
[junit4:junit4]   2> 3499 T1138 oasup.UpdateRequestProcessorChain.init inserting DistributedUpdateProcessorFactory into updateRequestProcessorChain "distrib-dup-test-chain-implicit"
[junit4:junit4]   2> 3499 T1138 oasc.RequestHandlers.initHandlersFromConfig adding lazy requestHandler: solr.ReplicationHandler
[junit4:junit4]   2> 3500 T1138 oasc.RequestHandlers.initHandlersFromConfig created /replication: solr.ReplicationHandler
[junit4:junit4]   2> 3501 T1138 oasc.RequestHandlers.initHandlersFromConfig created standard: solr.StandardRequestHandler
[junit4:junit4]   2> 3501 T1138 oasc.RequestHandlers.initHandlersFromConfig created /get: solr.RealTimeGetHandler
[junit4:junit4]   2> 3502 T1138 oasc.RequestHandlers.initHandlersFromConfig created dismax: solr.SearchHandler
[junit4:junit4]   2> 3503 T1138 oasc.RequestHandlers.initHandlersFromConfig created mock: org.apache.solr.core.MockQuerySenderListenerReqHandler
[junit4:junit4]   2> 3504 T1138 oasc.RequestHandlers.initHandlersFromConfig created /admin/: org.apache.solr.handler.admin.AdminHandlers
[junit4:junit4]   2> 3504 T1138 oasc.RequestHandlers.initHandlersFromConfig created defaults: solr.StandardRequestHandler
[junit4:junit4]   2> 3505 T1138 oasc.RequestHandlers.initHandlersFromConfig adding lazy requestHandler: solr.StandardRequestHandler
[junit4:junit4]   2> 3506 T1138 oasc.RequestHandlers.initHandlersFromConfig created lazy: solr.StandardRequestHandler
[junit4:junit4]   2> 3506 T1138 oasc.RequestHandlers.initHandlersFromConfig created /update: solr.UpdateRequestHandler
[junit4:junit4]   2> 3507 T1138 oasc.RequestHandlers.initHandlersFromConfig created /terms: org.apache.solr.handler.component.SearchHandler
[junit4:junit4]   2> 3508 T1138 oasc.RequestHandlers.initHandlersFromConfig created spellCheckCompRH: org.apache.solr.handler.component.SearchHandler
[junit4:junit4]   2> 3509 T1138 oasc.RequestHandlers.initHandlersFromConfig created spellCheckCompRH_Direct: org.apache.solr.handler.component.SearchHandler
[junit4:junit4]   2> 3509 T1138 oasc.RequestHandlers.initHandlersFromConfig created spellCheckWithWordbreak: org.apache.solr.handler.component.SearchHandler
[junit4:junit4]   2> 3510 T1138 oasc.RequestHandlers.initHandlersFromConfig created spellCheckWithWordbreak_Direct: org.apache.solr.handler.component.SearchHandler
[junit4:junit4]   2> 3511 T1138 oasc.RequestHandlers.initHandlersFromConfig created spellCheckCompRH1: org.apache.solr.handler.component.SearchHandler
[junit4:junit4]   2> 3512 T1138 oasc.RequestHandlers.initHandlersFromConfig created tvrh: org.apache.solr.handler.component.SearchHandler
[junit4:junit4]   2> 3512 T1138 oasc.RequestHandlers.initHandlersFromConfig created /mlt: solr.MoreLikeThisHandler
[junit4:junit4]   2> 3513 T1138 oasc.RequestHandlers.initHandlersFromConfig created /debug/dump: solr.DumpRequestHandler
[junit4:junit4]   2> 3527 T1138 oashl.XMLLoader.init xsltCacheLifetimeSeconds=60
[junit4:junit4]   2> 3532 T1138 oasc.SolrCore.initDeprecatedSupport WARNING solrconfig.xml uses deprecated <admin/gettableFiles>, Please update your config to use the ShowFileRequestHandler.
[junit4:junit4]   2> 3533 T1138 oasc.SolrCore.initDeprecatedSupport WARNING adding ShowFileRequestHandler with hidden files: [SCHEMA.XML, OLD_SYNONYMS.TXT, STOPWORDS.TXT, PROTWORDS.TXT, OPEN-EXCHANGE-RATES.JSON, SYNONYMS.TXT, CURRENCY.XML, MAPPING-ISOLATIN1ACCENT.TXT]
[junit4:junit4]   2> 3537 T1138 oass.SolrIndexSearcher.<init> Opening Searcher@7eafe721 main
[junit4:junit4]   2> 3539 T1138 oasu.CommitTracker.<init> Hard AutoCommit: disabled
[junit4:junit4]   2> 3539 T1138 oasu.CommitTracker.<init> Soft AutoCommit: disabled
[junit4:junit4]   2> 3540 T1138 oashc.SpellCheckComponent.inform Initializing spell checkers
[junit4:junit4]   2> 3557 T1138 oass.DirectSolrSpellChecker.init init: {name=direct,classname=DirectSolrSpellChecker,field=lowerfilt,minQueryLength=3}
[junit4:junit4]   2> 3610 T1173 oasc.SolrCore.registerSearcher [collection1] Registered new searcher Searcher@7eafe721 main{StandardDirectoryReader(segments_1:1)}
[junit4:junit4]   2> 3743 T1159 oascc.ZkStateReader.updateClusterState Updating cloud state from ZooKeeper... 
[junit4:junit4]   2> 3756 T1158 oascc.ZkStateReader$2.process A cluster state change has occurred - updating...
[junit4:junit4]   2> 3757 T1172 oascc.ZkStateReader$2.process A cluster state change has occurred - updating...
[junit4:junit4]   2> 4118 T1138 oasc.CoreContainer.register registering core: collection1
[junit4:junit4]   2> 4118 T1138 oasc.ZkController.register Register shard - core:collection1 address:http://127.0.0.1:63170/solr shardId:shard1
[junit4:junit4]   2> 4120 T1138 oascc.SolrZkClient.makePath makePath: /collections/collection1/leader_elect/shard1/election
[junit4:junit4]   2> 4136 T1143 oazs.PrepRequestProcessor.pRequest Got user-level KeeperException when processing sessionid:0x13a5e88d58c0003 type:delete cxid:0x43 zxid:0xfffffffffffffffe txntype:unknown reqpath:n/a Error Path:/solr/collections/collection1/leaders Error:KeeperErrorCode = NoNode for /solr/collections/collection1/leaders
[junit4:junit4]   2> 4138 T1138 oasc.ShardLeaderElectionContext.runLeaderProcess Running the leader process.
[junit4:junit4]   2> 4139 T1143 oazs.PrepRequestProcessor.pRequest Got user-level KeeperException when processing sessionid:0x13a5e88d58c0003 type:create cxid:0x44 zxid:0xfffffffffffffffe txntype:unknown reqpath:n/a Error Path:/solr/overseer Error:KeeperErrorCode = NodeExists for /solr/overseer
[junit4:junit4]   2> 4148 T1138 oasc.ShardLeaderElectionContext.waitForReplicasToComeUp Enough replicas found to continue.
[junit4:junit4]   2> 4149 T1138 oasc.ShardLeaderElectionContext.runLeaderProcess I may be the new leader - try and sync
[junit4:junit4]   2> 4149 T1138 oasc.SyncStrategy.sync Sync replicas to http://127.0.0.1:63170/solr/collection1/
[junit4:junit4]   2> 4150 T1138 oasc.SyncStrategy.syncReplicas Sync Success - now sync replicas to me
[junit4:junit4]   2> 4150 T1138 oasc.SyncStrategy.syncToMe http://127.0.0.1:63170/solr/collection1/ has no replicas
[junit4:junit4]   2> 4151 T1138 oasc.ShardLeaderElectionContext.runLeaderProcess I am the new leader: http://127.0.0.1:63170/solr/collection1/
[junit4:junit4]   2> 4151 T1138 oascc.SolrZkClient.makePath makePath: /collections/collection1/leaders/shard1
[junit4:junit4]   2> 4156 T1143 oazs.PrepRequestProcessor.pRequest Got user-level KeeperException when processing sessionid:0x13a5e88d58c0003 type:create cxid:0x4e zxid:0xfffffffffffffffe txntype:unknown reqpath:n/a Error Path:/solr/overseer Error:KeeperErrorCode = NodeExists for /solr/overseer
[junit4:junit4]   2> 4262 T1159 oascc.ZkStateReader.updateClusterState Updating cloud state from ZooKeeper... 
[junit4:junit4]   2> 4279 T1158 oascc.ZkStateReader$2.process A cluster state change has occurred - updating...
[junit4:junit4]   2> 4279 T1172 oascc.ZkStateReader$2.process A cluster state change has occurred - updating...
[junit4:junit4]   2> 4319 T1138 oasc.ZkController.register We are http://127.0.0.1:63170/solr/collection1/ and leader is http://127.0.0.1:63170/solr/collection1/
[junit4:junit4]   2> 4319 T1138 oasc.ZkController.register No LogReplay needed for core=collection1 baseURL=http://127.0.0.1:63170/solr
[junit4:junit4]   2> 4320 T1138 oasc.ZkController.checkRecovery I am the leader, no recovery necessary
[junit4:junit4]   2> 4323 T1138 oascc.ZkStateReader.updateClusterState Updating cloud state from ZooKeeper... 
[junit4:junit4]   2> 4324 T1138 oass.SolrDispatchFilter.init user.dir=/usr/home/hudson/hudson-slave/workspace/Lucene-Solr-Tests-trunk-java7/solr/build/solr-core/test/J0
[junit4:junit4]   2> 4324 T1138 oass.SolrDispatchFilter.init SolrDispatchFilter.init() done
[junit4:junit4]   2> 4325 T1138 oascsi.HttpClientUtil.createClient Creating new http client, config:maxConnections=128&maxConnectionsPerHost=32&followRedirects=false
[junit4:junit4]   2> 4504 T1138 oejs.Server.doStart jetty-8.1.2.v20120308
[junit4:junit4]   2> 4508 T1138 oejs.AbstractConnector.doStart Started SocketConnector@0.0.0.0:63179
[junit4:junit4]   2> 4508 T1138 oasc.SolrResourceLoader.locateSolrHome JNDI not configured for solr (NoInitialContextEx)
[junit4:junit4]   2> 4509 T1138 oasc.SolrResourceLoader.locateSolrHome using system property solr.solr.home: /usr/home/hudson/hudson-slave/workspace/Lucene-Solr-Tests-trunk-java7/solr/build/solr-core/test/J0/./org.apache.solr.cloud.BasicDistributedZkTest-jetty2-1350205761143
[junit4:junit4]   2> 4509 T1138 oasc.SolrResourceLoader.<init> new SolrResourceLoader for deduced Solr Home: '/usr/home/hudson/hudson-slave/workspace/Lucene-Solr-Tests-trunk-java7/solr/build/solr-core/test/J0/./org.apache.solr.cloud.BasicDistributedZkTest-jetty2-1350205761143/'
[junit4:junit4]   2> 4553 T1138 oass.SolrDispatchFilter.init SolrDispatchFilter.init()
[junit4:junit4]   2> 4554 T1138 oasc.SolrResourceLoader.locateSolrHome JNDI not configured for solr (NoInitialContextEx)
[junit4:junit4]   2> 4555 T1138 oasc.SolrResourceLoader.locateSolrHome using system property solr.solr.home: /usr/home/hudson/hudson-slave/workspace/Lucene-Solr-Tests-trunk-java7/solr/build/solr-core/test/J0/./org.apache.solr.cloud.BasicDistributedZkTest-jetty2-1350205761143
[junit4:junit4]   2> 4555 T1138 oasc.CoreContainer$Initializer.initialize looking for solr.xml: /usr/home/hudson/hudson-slave/workspace/Lucene-Solr-Tests-trunk-java7/solr/build/solr-core/test/J0/./org.apache.solr.cloud.BasicDistributedZkTest-jetty2-1350205761143/solr.xml
[junit4:junit4]   2> 4556 T1138 oasc.CoreContainer.<init> New CoreContainer 1712186458
[junit4:junit4]   2> 4556 T1138 oasc.CoreContainer.load Loading CoreContainer using Solr Home: '/usr/home/hudson/hudson-slave/workspace/Lucene-Solr-Tests-trunk-java7/solr/build/solr-core/test/J0/./org.apache.solr.cloud.BasicDistributedZkTest-jetty2-1350205761143/'
[junit4:junit4]   2> 4557 T1138 oasc.SolrResourceLoader.<init> new SolrResourceLoader for directory: '/usr/home/hudson/hudson-slave/workspace/Lucene-Solr-Tests-trunk-java7/solr/build/solr-core/test/J0/./org.apache.solr.cloud.BasicDistributedZkTest-jetty2-1350205761143/'
[junit4:junit4]   2> 4589 T1138 oasc.CoreContainer.load Registering Log Listener
[junit4:junit4]   2> 4605 T1138 oasc.CoreContainer.initZooKeeper Zookeeper client=127.0.0.1:63159/solr
[junit4:junit4]   2> 4606 T1138 oaz.ZooKeeper.<init> Initiating client connection, connectString=127.0.0.1:63159/solr sessionTimeout=5000 watcher=org.apache.solr.common.cloud.ConnectionManager@6a0a8ecf
[junit4:junit4]   2> 4607 T1183 oaz.ClientCnxn$SendThread.startConnect Opening socket connection to server /127.0.0.1:63159
[junit4:junit4]   2> 4607 T1138 oascc.ConnectionManager.waitForConnected Waiting for client to connect to ZooKeeper
[junit4:junit4]   2> 4608 T1183 oaz.ClientCnxn$SendThread.primeConnection Socket connection established to localhost/127.0.0.1:63159, initiating session
[junit4:junit4]   2> 4609 T1140 oazs.NIOServerCnxn$Factory.run Accepted socket connection from /140.211.11.196:63180
[junit4:junit4]   2> 4609 T1140 oazs.NIOServerCnxn.readConnectRequest Client attempting to establish new session at /140.211.11.196:63180
[junit4:junit4]   2> 4611 T1142 oazs.NIOServerCnxn.finishSessionInit Established session 0x13a5e88d58c0004 with negotiated timeout 5000 for client /140.211.11.196:63180
[junit4:junit4]   2> 4611 T1183 oaz.ClientCnxn$SendThread.readConnectResult Session establishment complete on server localhost/127.0.0.1:63159, sessionid = 0x13a5e88d58c0004, negotiated timeout = 5000
[junit4:junit4]   2> 4612 T1184 oascc.ConnectionManager.process Watcher org.apache.solr.common.cloud.ConnectionManager@6a0a8ecf name:ZooKeeperConnection Watcher:127.0.0.1:63159/solr got event WatchedEvent state:SyncConnected type:None path:null path:null type:None
[junit4:junit4]   2> 4612 T1138 oascc.ConnectionManager.waitForConnected Client is connected to ZooKeeper
[junit4:junit4]   2> 4613 T1143 oazs.PrepRequestProcessor.pRequest Got user-level KeeperException when processing sessionid:0x13a5e88d58c0004 type:create cxid:0x1 zxid:0xfffffffffffffffe txntype:unknown reqpath:n/a Error Path:/solr/overseer Error:KeeperErrorCode = NodeExists for /solr/overseer
[junit4:junit4]   2> 4615 T1143 oazs.PrepRequestProcessor.pRequest Got user-level KeeperException when processing sessionid:0x13a5e88d58c0004 type:create cxid:0x2 zxid:0xfffffffffffffffe txntype:unknown reqpath:n/a Error Path:/solr/overseer Error:KeeperErrorCode = NodeExists for /solr/overseer
[junit4:junit4]   2> 4623 T1138 oasc.ZkController.createEphemeralLiveNode Register node as live in ZooKeeper:/live_nodes/127.0.0.1:63179_solr
[junit4:junit4]   2> 4623 T1143 oazs.PrepRequestProcessor.pRequest Got user-level KeeperException when processing sessionid:0x13a5e88d58c0004 type:delete cxid:0x4 zxid:0xfffffffffffffffe txntype:unknown reqpath:n/a Error Path:/solr/live_nodes/127.0.0.1:63179_solr Error:KeeperErrorCode = NoNode for /solr/live_nodes/127.0.0.1:63179_solr
[junit4:junit4]   2> 4624 T1138 oascc.SolrZkClient.makePath makePath: /live_nodes/127.0.0.1:63179_solr
[junit4:junit4]   2> 4627 T1158 oascc.ZkStateReader$3.process Updating live nodes
[junit4:junit4]   2> 4627 T1172 oascc.ZkStateReader$3.process Updating live nodes
[junit4:junit4]   2> 4628 T1138 oashc.HttpShardHandlerFactory.getParameter Setting socketTimeout to: 0
[junit4:junit4]   2> 4628 T1138 oashc.HttpShardHandlerFactory.getParameter Setting urlScheme to: http://
[junit4:junit4]   2> 4629 T1138 oashc.HttpShardHandlerFactory.getParameter Setting connTimeout to: 0
[junit4:junit4]   2> 4629 T1138 oashc.HttpShardHandlerFactory.getParameter Setting maxConnectionsPerHost to: 20
[junit4:junit4]   2> 4630 T1138 oashc.HttpShardHandlerFactory.getParameter Setting corePoolSize to: 0
[junit4:junit4]   2> 4630 T1138 oashc.HttpShardHandlerFactory.getParameter Setting maximumPoolSize to: 2147483647
[junit4:junit4]   2> 4631 T1138 oashc.HttpShardHandlerFactory.getParameter Setting maxThreadIdleTime to: 5
[junit4:junit4]   2> 4631 T1138 oashc.HttpShardHandlerFactory.getParameter Setting sizeOfQueue to: -1
[junit4:junit4]   2> 4632 T1138 oashc.HttpShardHandlerFactory.getParameter Setting fairnessPolicy to: false
[junit4:junit4]   2> 4632 T1138 oascsi.HttpClientUtil.createClient Creating new http client, config:maxConnectionsPerHost=20&maxConnections=10000&socketTimeout=0&connTimeout=0&retry=false
[junit4:junit4]   2> 4650 T1138 oascc.ZkStateReader.createClusterStateWatchersAndUpdate Updating cluster state from ZooKeeper... 
[junit4:junit4]   2> 4657 T1138 oasc.CoreContainer.create Creating SolrCore 'collection1' using instanceDir: /usr/home/hudson/hudson-slave/workspace/Lucene-Solr-Tests-trunk-java7/solr/build/solr-core/test/J0/./org.apache.solr.cloud.BasicDistributedZkTest-jetty2-1350205761143/collection1
[junit4:junit4]   2> 4658 T1138 oasc.ZkController.createCollectionZkNode Check for collection zkNode:collection1
[junit4:junit4]   2> 4659 T1138 oasc.ZkController.createCollectionZkNode Collection zkNode exists
[junit4:junit4]   2> 4659 T1138 oasc.ZkController.readConfigName Load collection config from:/collections/collection1
[junit4:junit4]   2> 4661 T1138 oasc.SolrResourceLoader.<init> new SolrResourceLoader for directory: '/usr/home/hudson/hudson-slave/workspace/Lucene-Solr-Tests-trunk-java7/solr/build/solr-core/test/J0/./org.apache.solr.cloud.BasicDistributedZkTest-jetty2-1350205761143/collection1/'
[junit4:junit4]   2> 4662 T1138 oasc.SolrResourceLoader.replaceClassLoader Adding 'file:/usr/home/hudson/hudson-slave/workspace/Lucene-Solr-Tests-trunk-java7/solr/build/solr-core/test/J0/org.apache.solr.cloud.BasicDistributedZkTest-jetty2-1350205761143/collection1/lib/classes/' to classloader
[junit4:junit4]   2> 4663 T1138 oasc.SolrResourceLoader.replaceClassLoader Adding 'file:/usr/home/hudson/hudson-slave/workspace/Lucene-Solr-Tests-trunk-java7/solr/build/solr-core/test/J0/org.apache.solr.cloud.BasicDistributedZkTest-jetty2-1350205761143/collection1/lib/README' to classloader
[junit4:junit4]   2> 4717 T1138 oasc.SolrConfig.<init> Using Lucene MatchVersion: LUCENE_50
[junit4:junit4]   2> 4785 T1159 oascc.ZkStateReader.updateClusterState Updating cloud state from ZooKeeper... 
[junit4:junit4]   2> 4790 T1138 oasc.SolrConfig.<init> Loaded SolrConfig: solrconfig.xml
[junit4:junit4]   2> 4799 T1158 oascc.ZkStateReader$2.process A cluster state change has occurred - updating...
[junit4:junit4]   2> 4799 T1184 oascc.ZkStateReader$2.process A cluster state change has occurred - updating...
[junit4:junit4]   2> 4799 T1172 oascc.ZkStateReader$2.process A cluster state change has occurred - updating...
[junit4:junit4]   2> 4800 T1138 oass.IndexSchema.readSchema Reading Solr Schema
[junit4:junit4]   2> 4815 T1138 oass.IndexSchema.readSchema Schema name=test
[junit4:junit4]   2> 5293 T1138 oass.OpenExchangeRatesOrgProvider.init Initialized with rates=open-exchange-rates.json, refreshInterval=1440.
[junit4:junit4]   2> 5302 T1138 oass.IndexSchema.readSchema default search field in schema is text
[junit4:junit4]   2> 5305 T1138 oass.IndexSchema.readSchema unique key field: id
[junit4:junit4]   2> 5316 T1138 oass.FileExchangeRateProvider.reload Reloading exchange rates from file currency.xml
[junit4:junit4]   2> 5320 T1138 oass.FileExchangeRateProvider.reload Reloading exchange rates from file currency.xml
[junit4:junit4]   2> 5324 T1138 oass.OpenExchangeRatesOrgProvider.reload Reloading exchange rates from open-exchange-rates.json
[junit4:junit4]   2> 5325 T1138 oass.OpenExchangeRatesOrgProvider.reload Reloading exchange rates from open-exchange-rates.json
[junit4:junit4]   2> 5326 T1138 oasc.SolrCore.<init> [collection1] Opening new SolrCore at /usr/home/hudson/hudson-slave/workspace/Lucene-Solr-Tests-trunk-java7/solr/build/solr-core/test/J0/./org.apache.solr.cloud.BasicDistributedZkTest-jetty2-1350205761143/collection1/, dataDir=./org.apache.solr.cloud.BasicDistributedZkTest-1350205756807/jetty2/
[junit4:junit4]   2> 5326 T1138 oasc.JmxMonitoredMap.<init> JMX monitoring is enabled. Adding Solr mbeans to JMX Server: com.sun.jmx.mbeanserver.JmxMBeanServer@4001e1d5
[junit4:junit4]   2> 5327 T1138 oasc.SolrCore.getNewIndexDir New index directory detected: old=null new=./org.apache.solr.cloud.BasicDistributedZkTest-1350205756807/jetty2/index/
[junit4:junit4]   2> 5328 T1138 oasc.SolrCore.initIndex WARNING [collection1] Solr index directory './org.apache.solr.cloud.BasicDistributedZkTest-1350205756807/jetty2/index' doesn't exist. Creating new index...
[junit4:junit4]   2> 5329 T1138 oasc.CachingDirectoryFactory.get return new directory for /usr/home/hudson/hudson-slave/workspace/Lucene-Solr-Tests-trunk-java7/solr/build/solr-core/test/J0/./org.apache.solr.cloud.BasicDistributedZkTest-1350205756807/jetty2/index forceNew:false
[junit4:junit4]   2> 5365 T1138 oasc.SolrDeletionPolicy.onCommit SolrDeletionPolicy.onCommit: commits:num=1
[junit4:junit4]   2> 		commit{dir=NRTCachingDirectory(org.apache.lucene.store.NIOFSDirectory@/usr/home/hudson/hudson-slave/workspace/Lucene-Solr-Tests-trunk-java7/solr/build/solr-core/test/J0/org.apache.solr.cloud.BasicDistributedZkTest-1350205756807/jetty2/index lockFactory=org.apache.lucene.store.NativeFSLockFactory@38ac7386; maxCacheMB=48.0 maxMergeSizeMB=4.0),segFN=segments_1,generation=1,filenames=[segments_1]
[junit4:junit4]   2> 5366 T1138 oasc.SolrDeletionPolicy.updateCommits newest commit = 1
[junit4:junit4]   2> 5367 T1138 oasc.SolrCore.initWriters created xml: solr.XMLResponseWriter
[junit4:junit4]   2> 5369 T1138 oasup.UpdateRequestProcessorChain.init inserting DistributedUpdateProcessorFactory into updateRequestProcessorChain "dedupe"
[junit4:junit4]   2> 5369 T1138 oasup.UpdateRequestProcessorChain.init inserting DistributedUpdateProcessorFactory into updateRequestProcessorChain "dedupe-allfields"
[junit4:junit4]   2> 5370 T1138 oasup.UpdateRequestProcessorChain.init inserting DistributedUpdateProcessorFactory into updateRequestProcessorChain "stored_sig"
[junit4:junit4]   2> 5370 T1138 oasup.UpdateRequestProcessorChain.init inserting DistributedUpdateProcessorFactory into updateRequestProcessorChain "uniq-fields"
[junit4:junit4]   2> 5371 T1138 oasup.UpdateRequestProcessorChain.init inserting DistributedUpdateProcessorFactory into updateRequestProcessorChain "distrib-dup-test-chain-implicit"
[junit4:junit4]   2> 5371 T1138 oasc.RequestHandlers.initHandlersFromConfig adding lazy requestHandler: solr.ReplicationHandler
[junit4:junit4]   2> 5372 T1138 oasc.RequestHandlers.initHandlersFromConfig created /replication: solr.ReplicationHandler
[junit4:junit4]   2> 5372 T1138 oasc.RequestHandlers.initHandlersFromConfig created standard: solr.StandardRequestHandler
[junit4:junit4]   2> 5373 T1138 oasc.RequestHandlers.initHandlersFromConfig created /get: solr.RealTimeGetHandler
[junit4:junit4]   2> 5373 T1138 oasc.RequestHandlers.initHandlersFromConfig created dismax: solr.SearchHandler
[junit4:junit4]   2> 5374 T1138 oasc.RequestHandlers.initHandlersFromConfig created mock: org.apache.solr.core.MockQuerySenderListenerReqHandler
[junit4:junit4]   2> 5374 T1138 oasc.RequestHandlers.initHandlersFromConfig created /admin/: org.apache.solr.handler.admin.AdminHandlers
[junit4:junit4]   2> 5375 T1138 oasc.RequestHandlers.initHandlersFromConfig created defaults: solr.StandardRequestHandler
[junit4:junit4]   2> 5375 T1138 oasc.RequestHandlers.initHandlersFromConfig adding lazy requestHandler: solr.StandardRequestHandler
[junit4:junit4]   2> 5376 T1138 oasc.RequestHandlers.initHandlersFromConfig created lazy: solr.StandardRequestHandler
[junit4:junit4]   2> 5376 T1138 oasc.RequestHandlers.initHandlersFromConfig created /update: solr.UpdateRequestHandler
[junit4:junit4]   2> 5377 T1138 oasc.RequestHandlers.initHandlersFromConfig created /terms: org.apache.solr.handler.component.SearchHandler
[junit4:junit4]   2> 5377 T1138 oasc.RequestHandlers.initHandlersFromConfig created spellCheckCompRH: org.apache.solr.handler.component.SearchHandler
[junit4:junit4]   2> 5378 T1138 oasc.RequestHandlers.initHandlersFromConfig created spellCheckCompRH_Direct: org.apache.solr.handler.component.SearchHandler
[junit4:junit4]   2> 5378 T1138 oasc.RequestHandlers.initHandlersFromConfig created spellCheckWithWordbreak: org.apache.solr.handler.component.SearchHandler
[junit4:junit4]   2> 5379 T1138 oasc.RequestHandlers.initHandlersFromConfig created spellCheckWithWordbreak_Direct: org.apache.solr.handler.component.SearchHandler
[junit4:junit4]   2> 5379 T1138 oasc.RequestHandlers.initHandlersFromConfig created spellCheckCompRH1: org.apache.solr.handler.component.SearchHandler
[junit4:junit4]   2> 5380 T1138 oasc.RequestHandlers.initHandlersFromConfig created tvrh: org.apache.solr.handler.component.SearchHandler
[junit4:junit4]   2> 5380 T1138 oasc.RequestHandlers.initHandlersFromConfig created /mlt: solr.MoreLikeThisHandler
[junit4:junit4]   2> 5381 T1138 oasc.RequestHandlers.initHandlersFromConfig created /debug/dump: solr.DumpRequestHandler
[junit4:junit4]   2> 5391 T1138 oashl.XMLLoader.init xsltCacheLifetimeSeconds=60
[junit4:junit4]   2> 5395 T1138 oasc.SolrCore.initDeprecatedSupport WARNING solrconfig.xml uses deprecated <admin/gettableFiles>, Please update your config to use the ShowFileRequestHandler.
[junit4:junit4]   2> 5396 T1138 oasc.SolrCore.initDeprecatedSupport WARNING adding ShowFileRequestHandler with hidden files: [SCHEMA.XML, OLD_SYNONYMS.TXT, STOPWORDS.TXT, PROTWORDS.TXT, OPEN-EXCHANGE-RATES.JSON, SYNONYMS.TXT, CURRENCY.XML, MAPPING-ISOLATIN1ACCENT.TXT]
[junit4:junit4]   2> 5400 T1138 oass.SolrIndexSearcher.<init> Opening Searcher@149adee3 main
[junit4:junit4]   2> 5401 T1138 oasu.CommitTracker.<init> Hard AutoCommit: disabled
[junit4:junit4]   2> 5401 T1138 oasu.CommitTracker.<init> Soft AutoCommit: disabled
[junit4:junit4]   2> 5402 T1138 oashc.SpellCheckComponent.inform Initializing spell checkers
[junit4:junit4]   2> 5408 T1138 oass.DirectSolrSpellChecker.init init: {name=direct,classname=DirectSolrSpellChecker,field=lowerfilt,minQueryLength=3}
[junit4:junit4]   2> 5454 T1185 oasc.SolrCore.registerSearcher [collection1] Registered new searcher Searcher@149adee3 main{StandardDirectoryReader(segments_1:1)}
[junit4:junit4]   2> 5806 T1159 oascc.ZkStateReader.updateClusterState Updating cloud state from ZooKeeper... 
[junit4:junit4]   2> 5810 T1172 oascc.ZkStateReader$2.process A cluster state change has occurred - updating...
[junit4:junit4]   2> 5810 T1158 oascc.ZkStateReader$2.process A cluster state change has occurred - updating...
[junit4:junit4]   2> 5810 T1184 oascc.ZkStateReader$2.process A cluster state change has occurred - updating...
[junit4:junit4]   2> 5961 T1138 oasc.CoreContainer.register registering core: collection1
[junit4:junit4]   2> 5962 T1138 oasc.ZkController.register Register shard - core:collection1 address:http://127.0.0.1:63179/solr shardId:shard2
[junit4:junit4]   2> 5963 T1138 oascc.SolrZkClient.makePath makePath: /collections/collection1/leader_elect/shard2/election
[junit4:junit4]   2> 6030 T1143 oazs.PrepRequestProcessor.pRequest Got user-level KeeperException when processing sessionid:0x13a5e88d58c0004 type:delete cxid:0x42 zxid:0xfffffffffffffffe txntype:unknown reqpath:n/a Error Path:/solr/collections/collection1/leaders/shard2 Error:KeeperErrorCode = NoNode for /solr/collections/collection1/leaders/shard2
[junit4:junit4]   2> 6058 T1138 oasc.ShardLeaderElectionContext.runLeaderProcess Running the leader process.
[junit4:junit4]   2> 6060 T1143 oazs.PrepRequestProcessor.pRequest Got user-level KeeperException when processing sessionid:0x13a5e88d58c0004 type:create cxid:0x43 zxid:0xfffffffffffffffe txntype:unknown reqpath:n/a Error Path:/solr/overseer Error:KeeperErrorCode = NodeExists for /solr/overseer
[junit4:junit4]   2> 6135 T1138 oasc.ShardLeaderElectionContext.waitForReplicasToComeUp Enough replicas found to continue.
[junit4:junit4]   2> 6136 T1138 oasc.ShardLeaderElectionContext.runLeaderProcess I may be the new leader - try and sync
[junit4:junit4]   2> 6136 T1138 oasc.SyncStrategy.sync Sync replicas to http://127.0.0.1:63179/solr/collection1/
[junit4:junit4]   2> 6137 T1138 oasc.SyncStrategy.syncReplicas Sync Success - now sync replicas to me
[junit4:junit4]   2> 6137 T1138 oasc.SyncStrategy.syncToMe http://127.0.0.1:63179/solr/collection1/ has no replicas
[junit4:junit4]   2> 6137 T1138 oasc.ShardLeaderElectionContext.runLeaderProcess I am the new leader: http://127.0.0.1:63179/solr/collection1/
[junit4:junit4]   2> 6138 T1138 oascc.SolrZkClient.makePath makePath: /collections/collection1/leaders/shard2
[junit4:junit4]   2> 6203 T1143 oazs.PrepRequestProcessor.pRequest Got user-level KeeperException when processing sessionid:0x13a5e88d58c0004 type:create cxid:0x4c zxid:0xfffffffffffffffe txntype:unknown reqpath:n/a Error Path:/solr/overseer Error:KeeperErrorCode = NodeExists for /solr/overseer
[junit4:junit4]   2> 6314 T1159 oascc.ZkStateReader.updateClusterState Updating cloud state from ZooKeeper... 
[junit4:junit4]   2> 6332 T1158 oascc.ZkStateReader$2.process A cluster state change has occurred - updating...
[junit4:junit4]   2> 6332 T1172 oascc.ZkStateReader$2.process A cluster state change has occurred - updating...
[junit4:junit4]   2> 6332 T1184 oascc.ZkStateReader$2.process A cluster state change has occurred - updating...
[junit4:junit4]   2> 6342 T1138 oasc.ZkController.register We are http://127.0.0.1:63179/solr/collection1/ and leader is http://127.0.0.1:63179/solr/collection1/
[junit4:junit4]   2> 6343 T1138 oasc.ZkController.register No LogReplay needed for core=collection1 baseURL=http://127.0.0.1:63179/solr
[junit4:junit4]   2> 6343 T1138 oasc.ZkController.checkRecovery I am the leader, no recovery necessary
[junit4:junit4]   2> 6345 T1138 oascc.ZkStateReader.updateClusterState Updating cloud state from ZooKeeper... 
[junit4:junit4]   2> 6346 T1138 oass.SolrDispatchFilter.init user.dir=/usr/home/hudson/hudson-slave/workspace/Lucene-Solr-Tests-trunk-java7/solr/build/solr-core/test/J0
[junit4:junit4]   2> 6346 T1138 oass.SolrDispatchFilter.init SolrDispatchFilter.init() done
[junit4:junit4]   2> 6346 T1138 oascsi.HttpClientUtil.createClient Creating new http client, config:maxConnections=128&maxConnectionsPerHost=32&followRedirects=false
[junit4:junit4]   2> 6463 T1138 oejs.Server.doStart jetty-8.1.2.v20120308
[junit4:junit4]   2> 6466 T1138 oejs.AbstractConnector.doStart Started SocketConnector@0.0.0.0:63181
[junit4:junit4]   2> 6466 T1138 oasc.SolrResourceLoader.locateSolrHome JNDI not configured for solr (NoInitialContextEx)
[junit4:junit4]   2> 6467 T1138 oasc.SolrResourceLoader.locateSolrHome using system property solr.solr.home: /usr/home/hudson/hudson-slave/workspace/Lucene-Solr-Tests-trunk-java7/solr/build/solr-core/test/J0/./org.apache.solr.cloud.BasicDistributedZkTest-jetty3-1350205763160
[junit4:junit4]   2> 6467 T1138 oasc.SolrResourceLoader.<init> new SolrResourceLoader for deduced Solr Home: '/usr/home/hudson/hudson-slave/workspace/Lucene-Solr-Tests-trunk-java7/solr/build/solr-core/test/J0/./org.apache.solr.cloud.BasicDistributedZkTest-jetty3-1350205763160/'
[junit4:junit4]   2> 6495 T1138 oass.SolrDispatchFilter.init SolrDispatchFilter.init()
[junit4:junit4]   2> 6496 T1138 oasc.SolrResourceLoader.locateSolrHome JNDI not configured for solr (NoInitialContextEx)
[junit4:junit4]   2> 6496 T1138 oasc.SolrResourceLoader.locateSolrHome using system property solr.solr.home: /usr/home/hudson/hudson-slave/workspace/Lucene-Solr-Tests-trunk-java7/solr/build/solr-core/test/J0/./org.apache.solr.cloud.BasicDistributedZkTest-jetty3-1350205763160
[junit4:junit4]   2> 6496 T1138 oasc.CoreContainer$Initializer.initialize looking for solr.xml: /usr/home/hudson/hudson-slave/workspace/Lucene-Solr-Tests-trunk-java7/solr/build/solr-core/test/J0/./org.apache.solr.cloud.BasicDistributedZkTest-jetty3-1350205763160/solr.xml
[junit4:junit4]   2> 6497 T1138 oasc.CoreContainer.<init> New CoreContainer 299057381
[junit4:junit4]   2> 6497 T1138 oasc.CoreContainer.load Loading CoreContainer using Solr Home: '/usr/home/hudson/hudson-slave/workspace/Lucene-Solr-Tests-trunk-java7/solr/build/solr-core/test/J0/./org.apache.solr.cloud.BasicDistributedZkTest-jetty3-1350205763160/'
[junit4:junit4]   2> 6498 T1138 oasc.SolrResourceLoader.<init> new SolrResourceLoader for directory: '/usr/home/hudson/hudson-slave/workspace/Lucene-Solr-Tests-trunk-java7/solr/build/solr-core/test/J0/./org.apache.solr.cloud.BasicDistributedZkTest-jetty3-1350205763160/'
[junit4:junit4]   2> 6520 T1138 oasc.CoreContainer.load Registering Log Listener
[junit4:junit4]   2> 6531 T1138 oasc.CoreContainer.initZooKeeper Zookeeper client=127.0.0.1:63159/solr
[junit4:junit4]   2> 6532 T1138 oaz.ZooKeeper.<init> Initiating client connection, connectString=127.0.0.1:63159/solr sessionTimeout=5000 watcher=org.apache.solr.common.cloud.ConnectionManager@445a5a83
[junit4:junit4]   2> 6533 T1195 oaz.ClientCnxn$SendThread.startConnect Opening socket connection to server /127.0.0.1:63159
[junit4:junit4]   2> 6533 T1138 oascc.ConnectionManager.waitForConnected Waiting for client to connect to ZooKeeper
[junit4:junit4]   2> 6534 T1195 oaz.ClientCnxn$SendThread.primeConnection Socket connection established to localhost/127.0.0.1:63159, initiating session
[junit4:junit4]   2> 6534 T1140 oazs.NIOServerCnxn$Factory.run Accepted socket connection from /140.211.11.196:63183
[junit4:junit4]   2> 6534 T1140 oazs.NIOServerCnxn.readConnectRequest Client attempting to establish new session at /140.211.11.196:63183
[junit4:junit4]   2> 6541 T1142 oazs.NIOServerCnxn.finishSessionInit Established session 0x13a5e88d58c0005 with negotiated timeout 5000 for client /140.211.11.196:63183
[junit4:junit4]   2> 6541 T1195 oaz.ClientCnxn$SendThread.readConnectResult Session establishment complete on server localhost/127.0.0.1:63159, sessionid = 0x13a5e88d58c0005, negotiated timeout = 5000
[junit4:junit4]   2> 6541 T1196 oascc.ConnectionManager.process Watcher org.apache.solr.common.cloud.ConnectionManager@445a5a83 name:ZooKeeperConnection Watcher:127.0.0.1:63159/solr got event WatchedEvent state:SyncConnected type:None path:null path:null type:None
[junit4:junit4]   2> 6541 T1138 oascc.ConnectionManager.waitForConnected Client is connected to ZooKeeper
[junit4:junit4]   2> 6542 T1143 oazs.PrepRequestProcessor.pRequest Got user-level KeeperException when processing sessionid:0x13a5e88d58c0005 type:create cxid:0x1 zxid:0xfffffffffffffffe txntype:unknown reqpath:n/a Error Path:/solr/overseer Error:KeeperErrorCode = NodeExists for /solr/overseer
[junit4:junit4]   2> 6577 T1143 oazs.PrepRequestProcessor.pRequest Got user-level KeeperException when processing sessionid:0x13a5e88d58c0005 type:create cxid:0x2 zxid:0xfffffffffffffffe txntype:unknown reqpath:n/a Error Path:/solr/overseer Error:KeeperErrorCode = NodeExists for /solr/overseer
[junit4:junit4]   2> 6578 T1138 oasc.ZkController.createEphemeralLiveNode Register node as live in ZooKeeper:/live_nodes/127.0.0.1:63181_solr
[junit4:junit4]   2> 6579 T1143 oazs.PrepRequestProcessor.pRequest Got user-level KeeperException when processing sessionid:0x13a5e88d58c0005 type:delete cxid:0x4 zxid:0xfffffffffffffffe txntype:unknown reqpath:n/a Error Path:/solr/live_nodes/127.0.0.1:63181_solr Error:KeeperErrorCode = NoNode for /solr/live_nodes/127.0.0.1:63181_solr
[junit4:junit4]   2> 6594 T1138 oascc.SolrZkClient.makePath makePath: /live_nodes/127.0.0.1:63181_solr
[junit4:junit4]   2> 6596 T1158 oascc.ZkStateReader$3.process Updating live nodes
[junit4:junit4]   2> 6596 T1172 oascc.ZkStateReader$3.process Updating live nodes
[junit4:junit4]   2> 6596 T1184 oascc.ZkStateReader$3.process Updating live nodes
[junit4:junit4]   2> 6597 T1138 oashc.HttpShardHandlerFactory.getParameter Setting socketTimeout to: 0
[junit4:junit4]   2> 6597 T1138 oashc.HttpShardHandlerFactory.getParameter Setting urlScheme to: http://
[junit4:junit4]   2> 6598 T1138 oashc.HttpShardHandlerFactory.getParameter Setting connTimeout to: 0
[junit4:junit4]   2> 6598 T1138 oashc.HttpShardHandlerFactory.getParameter Setting maxConnectionsPerHost to: 20
[junit4:junit4]   2> 6598 T1138 oashc.HttpShardHandlerFactory.getParameter Setting corePoolSize to: 0
[junit4:junit4]   2> 6599 T1138 oashc.HttpShardHandlerFactory.getParameter Setting maximumPoolSize to: 2147483647
[junit4:junit4]   2> 6599 T1138 oashc.HttpShardHandlerFactory.getParameter Setting maxThreadIdleTime to: 5
[junit4:junit4]   2> 6599 T1138 oashc.HttpShardHandlerFactory.getParameter Setting sizeOfQueue to: -1
[junit4:junit4]   2> 6600 T1138 oashc.HttpShardHandlerFactory.getParameter Setting fairnessPolicy to: false
[junit4:junit4]   2> 6600 T1138 oascsi.HttpClientUtil.createClient Creating new http client, config:maxConnectionsPerHost=20&maxConnections=10000&socketTimeout=0&connTimeout=0&retry=false
[junit4:junit4]   2> 6614 T1138 oascc.ZkStateReader.createClusterStateWatchersAndUpdate Updating cluster state from ZooKeeper... 
[junit4:junit4]   2> 6619 T1138 oasc.CoreContainer.create Creating SolrCore 'collection1' using instanceDir: /usr/home/hudson/hudson-slave/workspace/Lucene-Solr-Tests-trunk-java7/solr/build/solr-core/test/J0/./org.apache.solr.cloud.BasicDistributedZkTest-jetty3-1350205763160/collection1
[junit4:junit4]   2> 6619 T1138 oasc.ZkController.createCollectionZkNode Check for collection zkNode:collection1
[junit4:junit4]   2> 6620 T1138 oasc.ZkController.createCollectionZkNode Collection zkNode exists
[junit4:junit4]   2> 6620 T1138 oasc.ZkController.readConfigName Load collection config from:/collections/collection1
[junit4:junit4]   2> 6621 T1138 oasc.SolrResourceLoader.<init> new SolrResourceLoader for directory: '/usr/home/hudson/hudson-slave/workspace/Lucene-Solr-Tests-trunk-java7/solr/build/solr-core/test/J0/./org.apache.solr.cloud.BasicDistributedZkTest-jetty3-1350205763160/collection1/'
[junit4:junit4]   2> 6622 T1138 oasc.SolrResourceLoader.replaceClassLoader Adding 'file:/usr/home/hudson/hudson-slave/workspace/Lucene-Solr-Tests-trunk-java7/solr/build/solr-core/test/J0/org.apache.solr.cloud.BasicDistributedZkTest-jetty3-1350205763160/collection1/lib/classes/' to classloader
[junit4:junit4]   2> 6623 T1138 oasc.SolrResourceLoader.replaceClassLoader Adding 'file:/usr/home/hudson/hudson-slave/workspace/Lucene-Solr-Tests-trunk-java7/solr/build/solr-core/test/J0/org.apache.solr.cloud.BasicDistributedZkTest-jetty3-1350205763160/collection1/lib/README' to classloader
[junit4:junit4]   2> 6659 T1138 oasc.SolrConfig.<init> Using Lucene MatchVersion: LUCENE_50
[junit4:junit4]   2> 6727 T1138 oasc.SolrConfig.<init> Loaded SolrConfig: solrconfig.xml
[junit4:junit4]   2> 6829 T1138 oass.IndexSchema.readSchema Reading Solr Schema
[junit4:junit4]   2> 6839 T1138 oass.IndexSchema.readSchema Schema name=test
[junit4:junit4]   2> 6845 T1159 oascc.ZkStateReader.updateClusterState Updating cloud state from ZooKeeper... 
[junit4:junit4]   2> 6865 T1196 oascc.ZkStateReader$2.process A cluster state change has occurred - updating...
[junit4:junit4]   2> 6865 T1184 oascc.ZkStateReader$2.process A cluster state change has occurred - updating...
[junit4:junit4]   2> 6866 T1172 oascc.ZkStateReader$2.process A cluster state change has occurred - updating...
[junit4:junit4]   2> 6865 T1158 oascc.ZkStateReader$2.process A cluster state change has occurred - updating...
[junit4:junit4]   2> 7733 T1138 oass.OpenExchangeRatesOrgProvider.init Initialized with rates=open-exchange-rates.json, refreshInterval=1440.
[junit4:junit4]   2> 7753 T1138 oass.IndexSchema.readSchema default search field in schema is text
[junit4:junit4]   2> 7758 T1138 oass.IndexSchema.readSchema unique key field: id
[junit4:junit4]   2> 7770 T1138 oass.FileExchangeRateProvider.reload Reloading exchange rates from file currency.xml
[junit4:junit4]   2> 7775 T1138 oass.FileExchangeRateProvider.reload Reloading exchange rates from file currency.xml
[junit4:junit4]   2> 7778 T1138 oass.OpenExchangeRatesOrgProvider.reload Reloading exchange rates from open-exchange-rates.json
[junit4:junit4]   2> 7779 T1138 oass.OpenExchangeRatesOrgProvider.reload Reloading exchange rates from open-exchange-rates.json
[junit4:junit4]   2> 7780 T1138 oasc.SolrCore.<init> [collection1] Opening new SolrCore at /usr/home/hudson/hudson-slave/workspace/Lucene-Solr-Tests-trunk-java7/solr/build/solr-core/test/J0/./org.apache.solr.cloud.BasicDistributedZkTest-jetty3-1350205763160/collection1/, dataDir=./org.apache.solr.cloud.BasicDistributedZkTest-1350205756807/jetty3/
[junit4:junit4]   2> 7781 T1138 oasc.JmxMonitoredMap.<init> JMX monitoring is enabled. Adding Solr mbeans to JMX Server: com.sun.jmx.mbeanserver.JmxMBeanServer@4001e1d5
[junit4:junit4]   2> 7782 T1138 oasc.SolrCore.getNewIndexDir New index directory detected: old=null new=./org.apache.solr.cloud.BasicDistributedZkTest-1350205756807/jetty3/index/
[junit4:junit4]   2> 7782 T1138 oasc.SolrCore.initIndex WARNING [collection1] Solr index directory './org.apache.solr.cloud.BasicDistributedZkTest-1350205756807/jetty3/index' doesn't exist. Creating new index...
[junit4:junit4]   2> 7783 T1138 oasc.CachingDirectoryFactory.get return new directory for /usr/home/hudson/hudson-slave/workspace/Lucene-Solr-Tests-trunk-java7/solr/build/solr-core/test/J0/./org.apache.solr.cloud.BasicDistributedZkTest-1350205756807/jetty3/index forceNew:false
[junit4:junit4]   2> 7791 T1138 oasc.SolrDeletionPolicy.onCommit SolrDeletionPolicy.onCommit: commits:num=1
[junit4:junit4]   2> 		commit{dir=NRTCachingDirectory(org.apache.lucene.store.NIOFSDirectory@/usr/home/hudson/hudson-slave/workspace/Lucene-Solr-Tests-trunk-java7/solr/build/solr-core/test/J0/org.apache.solr.cloud.BasicDistributedZkTest-1350205756807/jetty3/index lockFactory=org.apache.lucene.store.NativeFSLockFactory@484aa1ec; maxCacheMB=48.0 maxMergeSizeMB=4.0),segFN=segments_1,generation=1,filenames=[segments_1]
[junit4:junit4]   2> 7791 T1138 oasc.SolrDeletionPolicy.updateCommits newest commit = 1
[junit4:junit4]   2> 7792 T1138 oasc.SolrCore.initWriters created xml: solr.XMLResponseWriter
[junit4:junit4]   2> 7813 T1138 oasup.UpdateRequestProcessorChain.init inserting DistributedUpdateProcessorFactory into updateRequestProcessorChain "dedupe"
[junit4:junit4]   2> 7814 T1138 oasup.UpdateRequestProcessorChain.init inserting DistributedUpdateProcessorFactory into updateRequestProcessorChain "dedupe-allfields"
[junit4:junit4]   2> 7814 T1138 oasup.UpdateRequestProcessorChain.init inserting DistributedUpdateProcessorFactory into updateRequestProcessorChain "stored_sig"
[junit4:junit4]   2> 7815 T1138 oasup.UpdateRequestProcessorChain.init inserting DistributedUpdateProcessorFactory into updateRequestProcessorChain "uniq-fields"
[junit4:junit4]   2> 7815 T1138 oasup.UpdateRequestProcessorChain.init inserting DistributedUpdateProcessorFactory into updateRequestProcessorChain "distrib-dup-test-chain-implicit"
[junit4:junit4]   2> 7816 T1138 oasc.RequestHandlers.initHandlersFromConfig adding lazy requestHandler: solr.ReplicationHandler
[junit4:junit4]   2> 7816 T1138 oasc.RequestHandlers.initHandlersFromConfig created /replication: solr.ReplicationHandler
[junit4:junit4]   2> 7817 T1138 oasc.RequestHandlers.initHandlersFromConfig created standard: solr.StandardRequestHandler
[junit4:junit4]   2> 7817 T1138 oasc.RequestHandlers.initHandlersFromConfig created /get: solr.RealTimeGetHandler
[junit4:junit4]   2> 7818 T1138 oasc.RequestHandlers.initHandlersFromConfig created dismax: solr.SearchHandler
[junit4:junit4]   2> 7818 T1138 oasc.RequestHandlers.initHandlersFromConfig created mock: org.apache.solr.core.MockQuerySenderListenerReqHandler
[junit4:junit4]   2> 7819 T1138 oasc.RequestHandlers.initHandlersFromConfig created /admin/: org.apache.solr.handler.admin.AdminHandlers
[junit4:junit4]   2> 7819 T1138 oasc.RequestHandlers.initHandlersFromConfig created defaults: solr.StandardRequestHandler
[junit4:junit4]   2> 7820 T1138 oasc.RequestHandlers.initHandlersFromConfig adding lazy requestHandler: solr.StandardRequestHandler
[junit4:junit4]   2> 7820 T1138 oasc.RequestHandlers.initHandlersFromConfig created lazy: solr.StandardRequestHandler
[junit4:junit4]   2> 7821 T1138 oasc.RequestHandlers.initHandlersFromConfig created /update: solr.UpdateRequestHandler
[junit4:junit4]   2> 7821 T1138 oasc.RequestHandlers.initHandlersFromConfig created /terms: org.apache.solr.handler.component.SearchHandler
[junit4:junit4]   2> 7822 T1138 oasc.RequestHandlers.initHandlersFromConfig created spellCheckCompRH: org.apache.solr.handler.component.SearchHandler
[junit4:junit4]   2> 7822 T1138 oasc.RequestHandlers.initHandlersFromConfig created spellCheckCompRH_Direct: org.apache.solr.handler.component.SearchHandler
[junit4:junit4]   2> 7823 T1138 oasc.RequestHandlers.initHandlersFromConfig created spellCheckWithWordbreak: org.apache.solr.handler.component.SearchHandler
[junit4:junit4]   2> 7825 T1138 oasc.RequestHandlers.initHandlersFromConfig created spellCheckWithWordbreak_Direct: org.apache.solr.handler.component.SearchHandler
[junit4:junit4]   2> 7825 T1138 oasc.RequestHandlers.initHandlersFromConfig created spellCheckCompRH1: org.apache.solr.handler.component.SearchHandler
[junit4:junit4]   2> 7826 T1138 oasc.RequestHandlers.initHandlersFromConfig created tvrh: org.apache.solr.handler.component.SearchHandler
[junit4:junit4]   2> 7827 T1138 oasc.RequestHandlers.initHandlersFromConfig created /mlt: solr.MoreLikeThisHandler
[junit4:junit4]   2> 7828 T1138 oasc.RequestHandlers.initHandlersFromConfig created /debug/dump: solr.DumpRequestHandler
[junit4:junit4]   2> 7838 T1138 oashl.XMLLoader.init xsltCacheLifetimeSeconds=60
[junit4:junit4]   2> 7842 T1138 oasc.SolrCore.initDeprecatedSupport WARNING solrconfig.xml uses deprecated <admin/gettableFiles>, Please update your config to use the ShowFileRequestHandler.
[junit4:junit4]   2> 7843 T1138 oasc.SolrCore.initDeprecatedSupport WARNING adding ShowFileRequestHandler with hidden files: [SCHEMA.XML, OLD_SYNONYMS.TXT, STOPWORDS.TXT, PROTWORDS.TXT, OPEN-EXCHANGE-RATES.JSON, SYNONYMS.TXT, CURRENCY.XML, MAPPING-ISOLATIN1ACCENT.TXT]
[junit4:junit4]   2> 7846 T1138 oass.SolrIndexSearcher.<init> Opening Searcher@7120ac3b main
[junit4:junit4]   2> 7847 T1138 oasu.CommitTracker.<init> Hard AutoCommit: disabled
[junit4:junit4]   2> 7848 T1138 oasu.CommitTracker.<init> Soft AutoCommit: disabled
[junit4:junit4]   2> 7848 T1138 oashc.SpellCheckComponent.inform Initializing spell checkers
[junit4:junit4]   2> 7854 T1138 oass.DirectSolrSpellChecker.init init: {name=direct,classname=DirectSolrSpellChecker,field=lowerfilt,minQueryLength=3}
[junit4:junit4]   2> 7897 T1197 oasc.SolrCore.registerSearcher [collection1] Registered new searcher Searcher@7120ac3b main{StandardDirectoryReader(segments_1:1)}
[junit4:junit4]   2> 8379 T1159 oascc.ZkStateReader.updateClusterState Updating cloud state from ZooKeeper... 
[junit4:junit4]   2> 8390 T1172 oascc.ZkStateReader$2.process A cluster state change has occurred - updating...
[junit4:junit4]   2> 8390 T1196 oascc.ZkStateReader$2.process A cluster state change has occurred - updating...
[junit4:junit4]   2> 8390 T1158 oascc.ZkStateReader$2.process A cluster state change has occurred - updating...
[junit4:junit4]   2> 8390 T1184 oascc.ZkStateReader$2.process A cluster state change has occurred - updating...
[junit4:junit4]   2> 8403 T1138 oasc.CoreContainer.register registering core: collection1
[junit4:junit4]   2> 8403 T1138 oasc.ZkController.register Register shard - core:collection1 address:http://127.0.0.1:63181/solr shardId:shard1
[junit4:junit4]   2> 8407 T1138 oasc.ZkController.register We are http://127.0.0.1:63181/solr/collection1/ and leader is http://127.0.0.1:63170/solr/collection1/
[junit4:junit4]   2> 8407 T1138 oasc.ZkController.register No LogReplay needed for core=collection1 baseURL=http://127.0.0.1:63181/solr
[junit4:junit4]   2> 8407 T1138 oasc.ZkController.checkRecovery Core needs to recover:collection1
[junit4:junit4]   2> 8408 T1138 oasu.DefaultSolrCoreState.doRecovery Running recovery - first canceling any ongoing recovery
[junit4:junit4]   2> ASYNC  NEW_CORE C53 name=collection1 org.apache.solr.core.SolrCore@5fba8383 url=http://127.0.0.1:63181/solr/collection1 node=127.0.0.1:63181_solr
[junit4:junit4]   2> 8409 T1198 C53 P63181 oasc.RecoveryStrategy.run Starting recovery process.  core=collection1 recoveringAfterStartup=true
[junit4:junit4]   2> 8409 T1138 oascc.ZkStateReader.updateClusterState Updating cloud state from ZooKeeper... 
[junit4:junit4]   2> 8434 T1198 C53 P63181 oasc.RecoveryStrategy.doRecovery ###### startupVersions=[]
[junit4:junit4]   2> 8435 T1138 oass.SolrDispatchFilter.init user.dir=/usr/home/hudson/hudson-slave/workspace/Lucene-Solr-Tests-trunk-java7/solr/build/solr-core/test/J0
[junit4:junit4]   2> 8435 T1138 oass.SolrDispatchFilter.init SolrDispatchFilter.init() done
[junit4:junit4]   2> 8435 T1198 C53 P63181 oasc.RecoveryStrategy.doRecovery Attempting to PeerSync from http://127.0.0.1:63170/solr/collection1/ core=collection1 - recoveringAfterStartup=true
[junit4:junit4]   2> 8435 T1138 oascsi.HttpClientUtil.createClient Creating new http client, config:maxConnections=128&maxConnectionsPerHost=32&followRedirects=false
[junit4:junit4]   2> 8436 T1198 C53 P63181 oasu.PeerSync.sync PeerSync: core=collection1 url=http://127.0.0.1:63181/solr START replicas=[http://127.0.0.1:63170/solr/collection1/] nUpdates=100
[junit4:junit4]   2> 8436 T1198 C53 P63181 oasu.PeerSync.sync WARNING no frame of reference to tell of we've missed updates
[junit4:junit4]   2> 8437 T1198 C53 P63181 oasc.RecoveryStrategy.doRecovery PeerSync Recovery was not successful - trying replication. core=collection1
[junit4:junit4]   2> 8437 T1198 C53 P63181 oasc.RecoveryStrategy.doRecovery Starting Replication Recovery. core=collection1
[junit4:junit4]   2> 8437 T1198 C53 P63181 oascsi.HttpClientUtil.createClient Creating new http client, config:maxConnections=128&maxConnectionsPerHost=32&followRedirects=false
[junit4:junit4]   2> ASYNC  NEW_CORE C54 name=collection1 org.apache.solr.core.SolrCore@6ec62c2e url=http://127.0.0.1:63170/solr/collection1 node=127.0.0.1:63170_solr
[junit4:junit4]   2> 8445 T1164 C54 P63170 REQ /get {distrib=false&qt=/get&wt=javabin&version=2&getVersions=100} status=0 QTime=0 
[junit4:junit4]   2> 8454 T1138 oaz.ZooKeeper.<init> Initiating client connection, connectString=127.0.0.1:63159/solr sessionTimeout=10000 watcher=org.apache.solr.common.cloud.ConnectionManager@72603e2
[junit4:junit4]   2> 8455 T1200 oaz.ClientCnxn$SendThread.startConnect Opening socket connection to server /127.0.0.1:63159
[junit4:junit4]   2> 8455 T1138 oascc.ConnectionManager.waitForConnected Waiting for client to connect to ZooKeeper
[junit4:junit4]   2> 8456 T1200 oaz.ClientCnxn$SendThread.primeConnection Socket connection established to localhost/127.0.0.1:63159, initiating session
[junit4:junit4]   2> 8456 T1140 oazs.NIOServerCnxn$Factory.run Accepted socket connection from /140.211.11.196:63193
[junit4:junit4]   2> 8456 T1140 oazs.NIOServerCnxn.readConnectRequest Client attempting to establish new session at /140.211.11.196:63193
[junit4:junit4]   2> 8457 T1142 oazs.NIOServerCnxn.finishSessionInit Established session 0x13a5e88d58c0006 with negotiated timeout 10000 for client /140.211.11.196:63193
[junit4:junit4]   2> 8457 T1200 oaz.ClientCnxn$SendThread.readConnectResult Session establishment complete on server localhost/127.0.0.1:63159, sessionid = 0x13a5e88d58c0006, negotiated timeout = 10000
[junit4:junit4]   2> 8458 T1201 oascc.ConnectionManager.process Watcher org.apache.solr.common.cloud.ConnectionManager@72603e2 name:ZooKeeperConnection Watcher:127.0.0.1:63159/solr got event WatchedEvent state:SyncConnected type:None path:null path:null type:None
[junit4:junit4]   2> 8458 T1138 oascc.ConnectionManager.waitForConnected Client is connected to ZooKeeper
[junit4:junit4]   2> 8459 T1138 oascc.ZkStateReader.createClusterStateWatchersAndUpdate Updating cluster state from ZooKeeper... 
[junit4:junit4]   2> 8460 T1138 oasc.ChaosMonkey.monkeyLog monkey: init - expire sessions:true cause connection loss:true
[junit4:junit4]   2> 8460 T1138 oascsi.HttpClientUtil.createClient Creating new http client, config:
[junit4:junit4]   2> 8473 T1138 oascc.ZkStateReader.updateClusterState Updating cloud state from ZooKeeper... 
[junit4:junit4]   2> 8475 T1138 oasc.AbstractDistribZkTestBase.waitForRecoveriesToFinish Wait for recoveries to finish - collection: collection1 failOnTimeout:true timeout (sec):1800
[junit4:junit4]   2> 8476 T1138 oascc.ZkStateReader.updateClusterState Updating cloud state from ZooKeeper... 
[junit4:junit4]   2> 8895 T1159 oascc.ZkStateReader.updateClusterState Updating cloud state from ZooKeeper... 
[junit4:junit4]   2> 8909 T1196 oascc.ZkStateReader$2.process A cluster state change has occurred - updating...
[junit4:junit4]   2> 8909 T1172 oascc.ZkStateReader$2.process A cluster state change has occurred - updating...
[junit4:junit4]   2> 8909 T1201 oascc.ZkStateReader$2.process A cluster state change has occurred - updating...
[junit4:junit4]   2> 8909 T1158 oascc.ZkStateReader$2.process A cluster state change has occurred - updating...
[junit4:junit4]   2> 8909 T1184 oascc.ZkStateReader$2.process A cluster state change has occurred - updating...
[junit4:junit4]   2> 9478 T1138 oascc.ZkStateReader.updateClusterState Updating cloud state from ZooKeeper... 
[junit4:junit4]   2> 10480 T1138 oascc.ZkStateReader.updateClusterState Updating cloud state from ZooKeeper... 
[junit4:junit4]   2>  C53_STATE=coll:collection1 core:collection1 props:{shard=shard1, roles=null, state=recovering, core=collection1, collection=collection1, node_name=127.0.0.1:63181_solr, base_url=http://127.0.0.1:63181/solr}
[junit4:junit4]   2> 11457 T1198 C53 P63181 oasc.RecoveryStrategy.doRecovery Begin buffering updates. core=collection1
[junit4:junit4]   2> 11457 T1198 C53 P63181 oasu.UpdateLog.bufferUpdates Starting to buffer updates. FSUpdateLog{state=ACTIVE, tlog=null}
[junit4:junit4]   2> 11457 T1198 C53 P63181 oasc.RecoveryStrategy.replicate Attempting to replicate from http://127.0.0.1:63170/solr/collection1/. core=collection1
[junit4:junit4]   2> 11457 T1198 C53 P63181 oascsi.HttpClientUtil.createClient Creating new http client, config:maxConnections=128&maxConnectionsPerHost=32&followRedirects=false
[junit4:junit4]   2> 11467 T1166 C54 P63170 oasu.DirectUpdateHandler2.commit start commit{flags=0,_version_=0,optimize=false,openSearcher=false,waitSearcher=true,expungeDeletes=false,softCommit=false}
[junit4:junit4]   2> 11472 T1166 C54 P63170 oasc.SolrDeletionPolicy.onInit SolrDeletionPolicy.onInit: commits:num=1
[junit4:junit4]   2> 		commit{dir=NRTCachingDirectory(org.apache.lucene.store.NIOFSDirectory@/usr/home/hudson/hudson-slave/workspace/Lucene-Solr-Tests-trunk-java7/solr/build/solr-core/test/J0/org.apache.solr.cloud.BasicDistributedZkTest-1350205756807/jetty1/index lockFactory=org.apache.lucene.store.NativeFSLockFactory@51e9e252; maxCacheMB=48.0 maxMergeSizeMB=4.0),segFN=segments_1,generation=1,filenames=[segments_1]
[junit4:junit4]   2> 11473 T1166 C54 P63170 oasc.SolrDeletionPolicy.updateCommits newest commit = 1
[junit4:junit4]   2> 11473 T1166 C54 P63170 oass.SolrIndexSearcher.<init> Opening Searcher@6f83b43d realtime
[junit4:junit4]   2> 11474 T1166 C54 P63170 oasu.DirectUpdateHandler2.commit end_commit_flush
[junit4:junit4]   2> 11474 T1166 C54 P63170 /update {waitSearcher=true&openSearcher=false&commit=true&commit_end_point=true&wt=javabin&softCommit=false&version=2} {commit=} 0 7
[junit4:junit4]   2> 11475 T1198 C53 P63181 oash.ReplicationHandler.inform Commits will be reserved for  10000
[junit4:junit4]   2> 11475 T1198 C53 P63181 oash.SnapPuller.<init>  No value set for 'pollInterval'. Timer Task not started.
[junit4:junit4]   2> 11477 T1167 C54 P63170 oash.ReplicationHandler.inform Commits will be reserved for  10000
[junit4:junit4]   2> 11478 T1167 C54 P63170 REQ /replication {command=indexversion&wt=javabin&qt=/replication&version=2} status=0 QTime=2 
[junit4:junit4]   2> 11481 T1198 C53 P63181 oasc.SolrDeletionPolicy.onInit SolrDeletionPolicy.onInit: commits:num=1
[junit4:junit4]   2> 		commit{dir=NRTCachingDirectory(org.apache.lucene.store.NIOFSDirectory@/usr/home/hudson/hudson-slave/workspace/Lucene-Solr-Tests-trunk-java7/solr/build/solr-core/test/J0/org.apache.solr.cloud.BasicDistributedZkTest-1350205756807/jetty3/index lockFactory=org.apache.lucene.store.NativeFSLockFactory@484aa1ec; maxCacheMB=48.0 maxMergeSizeMB=4.0),segFN=segments_1,generation=1,filenames=[segments_1]
[junit4:junit4]   2> 11482 T1198 C53 P63181 oasc.SolrDeletionPolicy.updateCommits newest commit = 1
[junit4:junit4]   2> 11482 T1198 C53 P63181 oasu.DirectUpdateHandler2.commit start commit{flags=0,_version_=0,optimize=false,openSearcher=true,waitSearcher=true,expungeDeletes=false,softCommit=false}
[junit4:junit4]   2> 11482 T1138 oascc.ZkStateReader.updateClusterState Updating cloud state from ZooKeeper... 
[junit4:junit4]   2> 11485 T1198 C53 P63181 oasc.SolrDeletionPolicy.onCommit SolrDeletionPolicy.onCommit: commits:num=2
[junit4:junit4]   2> 		commit{dir=NRTCachingDirectory(org.apache.lucene.store.NIOFSDirectory@/usr/home/hudson/hudson-slave/workspace/Lucene-Solr-Tests-trunk-java7/solr/build/solr-core/test/J0/org.apache.solr.cloud.BasicDistributedZkTest-1350205756807/jetty3/index lockFactory=org.apache.lucene.store.NativeFSLockFactory@484aa1ec; maxCacheMB=48.0 maxMergeSizeMB=4.0),segFN=segments_1,generation=1,filenames=[segments_1]
[junit4:junit4]   2> 		commit{dir=NRTCachingDirectory(org.apache.lucene.store.NIOFSDirectory@/usr/home/hudson/hudson-slave/workspace/Lucene-Solr-Tests-trunk-java7/solr/build/solr-core/test/J0/org.apache.solr.cloud.BasicDistributedZkTest-1350205756807/jetty3/index lockFactory=org.apache.lucene.store.NativeFSLockFactory@484aa1ec; maxCacheMB=48.0 maxMergeSizeMB=4.0),segFN=segments_2,generation=2,filenames=[segments_2]
[junit4:junit4]   2> 11485 T1198 C53 P63181 oasc.SolrDeletionPolicy.updateCommits newest commit = 2
[junit4:junit4]   2> 11488 T1198 C53 P63181 oass.SolrIndexSearcher.<init> Opening Searcher@53bd8068 main
[junit4:junit4]   2> 11488 T1198 C53 P63181 oasu.DirectUpdateHandler2.commit end_commit_flush
[junit4:junit4]   2> 11490 T1197 oasc.SolrCore.registerSearcher [collection1] Registered new searcher Searcher@53bd8068 main{StandardDirectoryReader(segments_2:2)}
[junit4:junit4]   2> 11490 T1198 C53 P63181 oasc.RecoveryStrategy.replay No replay needed. core=collection1
[junit4:junit4]   2> 11490 T1198 C53 P63181 oasc.RecoveryStrategy.doRecovery Replication Recovery was successful - registering as Active. core=collection1
[junit4:junit4]   2> 11492 T1198 C53 P63181 oasc.RecoveryStrategy.doRecovery Finished recovery process. core=collection1
[junit4:junit4]   2> 11928 T1159 oascc.ZkStateReader.updateClusterState Updating cloud state from ZooKeeper... 
[junit4:junit4]   2> 11934 T1196 oascc.ZkStateReader$2.process A cluster state change has occurred - updating...
[junit4:junit4]   2> 11934 T1184 oascc.ZkStateReader$2.process A cluster state change has occurred - updating...
[junit4:junit4]   2> 11934 T1201 oascc.ZkStateReader$2.process A cluster state change has occurred - updating...
[junit4:junit4]   2> 11934 T1172 oascc.ZkStateReader$2.process A cluster state change has occurred - updating...
[junit4:junit4]   2> 11934 T1158 oascc.ZkStateReader$2.process A cluster state change has occurred - updating...
[junit4:junit4]   2> 12484 T1138 oascc.ZkStateReader.updateClusterState Updating cloud state from ZooKeeper... 
[junit4:junit4]   2> ASYNC  NEW_CORE C55 name=collection1 org.apache.solr.core.SolrCore@463962ed url=http://127.0.0.1:63165/solr/collection1 node=127.0.0.1:63165_solr
[junit4:junit4]   2> 12496 T1150 C55 P63165 oasc.SolrDeletionPolicy.onInit SolrDeletionPolicy.onInit: commits:num=1
[junit4:junit4]   2> 		commit{dir=NRTCachingDirectory(org.apache.lucene.store.NIOFSDirectory@/usr/home/hudson/hudson-slave/workspace/Lucene-Solr-Tests-trunk-java7/solr/build/solr-core/test/J0/org.apache.solr.cloud.BasicDistributedZkTest-1350205756807/control/data/index lockFactory=org.apache.lucene.store.NativeFSLockFactory@7d17b2c3; maxCacheMB=48.0 maxMergeSizeMB=4.0),segFN=segments_1,generation=1,filenames=[segments_1]
[junit4:junit4]   2> 12497 T1150 C55 P63165 oasc.SolrDeletionPolicy.updateCommits newest commit = 1
[junit4:junit4]   2> 12498 T1150 C55 P63165 oass.SolrIndexSearcher.<init> Opening Searcher@ee6ba46 realtime
[junit4:junit4]   2> 12498 T1150 C55 P63165 /update {wt=javabin&version=2} {deleteByQuery=*:* (-1415793364745322496)} 0 5
[junit4:junit4]   2> 12499 T1138 oaz.ZooKeeper.<init> Initiating client connection, connectString=127.0.0.1:63159/solr sessionTimeout=10000 watcher=org.apache.solr.common.cloud.ConnectionManager@4dcf514e
[junit4:junit4]   2> 12500 T1202 oaz.ClientCnxn$SendThread.startConnect Opening socket connection to server /127.0.0.1:63159
[junit4:junit4]   2> 12500 T1138 oascc.ConnectionManager.waitForConnected Waiting for client to connect to ZooKeeper
[junit4:junit4]   2> 12501 T1202 oaz.ClientCnxn$SendThread.primeConnection Socket connection established to localhost/127.0.0.1:63159, initiating session
[junit4:junit4]   2> 12501 T1140 oazs.NIOServerCnxn$Factory.run Accepted socket connection from /140.211.11.196:63208
[junit4:junit4]   2> 12502 T1140 oazs.NIOServerCnxn.readConnectRequest Client attempting to establish new session at /140.211.11.196:63208
[junit4:junit4]   2> 12503 T1142 oazs.NIOServerCnxn.finishSessionInit Established session 0x13a5e88d58c0007 with negotiated timeout 10000 for client /140.211.11.196:63208
[junit4:junit4]   2> 12503 T1202 oaz.ClientCnxn$SendThread.readConnectResult Session establishment complete on server localhost/127.0.0.1:63159, sessionid = 0x13a5e88d58c0007, negotiated timeout = 10000
[junit4:junit4]   2> 12503 T1203 oascc.ConnectionManager.process Watcher org.apache.solr.common.cloud.ConnectionManager@4dcf514e name:ZooKeeperConnection Watcher:127.0.0.1:63159/solr got event WatchedEvent state:SyncConnected type:None path:null path:null type:None
[junit4:junit4]   2> 12504 T1138 oascc.ConnectionManager.waitForConnected Client is connected to ZooKeeper
[junit4:junit4]   2> 12504 T1138 oascc.ZkStateReader.createClusterStateWatchersAndUpdate Updating cluster state from ZooKeeper... 
[junit4:junit4]   2> ASYNC  NEW_CORE C56 name=collection1 org.apache.solr.core.SolrCore@12a0c1df url=http://127.0.0.1:63179/solr/collection1 node=127.0.0.1:63179_solr
[junit4:junit4]   2> 12515 T1176 C56 P63179 oasc.SolrDeletionPolicy.onInit SolrDeletionPolicy.onInit: commits:num=1
[junit4:junit4]   2> 		commit{dir=NRTCachingDirectory(org.apache.lucene.store.NIOFSDirectory@/usr/home/hudson/hudson-slave/workspace/Lucene-Solr-Tests-trunk-java7/solr/build/solr-core/test/J0/org.apache.solr.cloud.BasicDistributedZkTest-1350205756807/jetty2/index lockFactory=org.apache.lucene.store.NativeFSLockFactory@38ac7386; maxCacheMB=48.0 maxMergeSizeMB=4.0),segFN=segments_1,generation=1,filenames=[segments_1]
[junit4:junit4]   2> 12515 T1176 C56 P63179 oasc.SolrDeletionPolicy.updateCommits newest commit = 1
[junit4:junit4]   2> 12516 T1176 C56 P63179 oass.SolrIndexSearcher.<init> Opening Searcher@201301fd realtime
[junit4:junit4]   2>  C53_STATE=coll:collection1 core:collection1 props:{shard=shard1, roles=null, state=active, core=collection1, collection=collection1, node_name=127.0.0.1:63181_solr, base_url=http://127.0.0.1:63181/solr}
[junit4:junit4]   2> 12526 T1188 C53 P63181 oass.SolrIndexSearcher.<init> Opening Searcher@24e01fd0 realtime
[junit4:junit4]   2> 12526 T1188 C53 P63181 REQ /update {update.distrib=FROMLEADER&_version_=-1415793364771536896&update.from=http://127.0.0.1:63170/solr/collection1/&wt=javabin&version=2} status=0 QTime=2 
[junit4:junit4]   2> 12527 T1168 C54 P63170 REQ /update {update.distrib=TOLEADER&wt=javabin&version=2} status=0 QTime=9 
[junit4:junit4]   2> 12527 T1176 C56 P63179 /update {wt=javabin&version=2} {deleteByQuery=*:* (-1415793364764196864)} 0 16
[junit4:junit4]   2> 12534 T1150 C55 P63165 /update {wt=javabin&version=2} {add=[1 (1415793364785168384)]} 0 3
[junit4:junit4]   2> 12542 T1188 C53 P63181 REQ /update {distrib.from=http://127.0.0.1:63170/solr/collection1/&update.distrib=FROMLEADER&wt=javabin&version=2} status=0 QTime=3 
[junit4:junit4]   2> 12542 T1169 C54 P63170 /update {wt=javabin&version=2} {add=[1 (1415793364789362688)]} 0 7
[junit4:junit4]   2> 12547 T1150 C55 P63165 /update {wt=javabin&version=2} {add=[2 (1415793364799848448)]} 0 2
[junit4:junit4]   2> 12557 T1177 C56 P63179 REQ /update {distrib.from=http://127.0.0.1:63170/solr/collection1/&update.distrib=TOLEADER&wt=javabin&version=2} status=0 QTime=2 
[junit4:junit4]   2> 12558 T1169 C54 P63170 /update {wt=javabin&version=2} {add=[2]} 0 8
[junit4:junit4]   2> 12563 T1150 C55 P63165 /update {wt=javabin&version=2} {add=[3 (1415793364817674240)]} 0 2
[junit4:junit4]   2> 12570 T1177 C56 P63179 REQ /update {distrib.from=http://127.0.0.1:63170/solr/collection1/&update.distrib=TOLEADER&wt=javabin&version=2} status=0 QTime=1 
[junit4:junit4]   2> 12571 T1169 C54 P63170 /update {wt=javabin&version=2} {add=[3]} 0 5
[junit4:junit4]   2> 12575 T1150 C55 P63165 /update {wt=javabin&version=2} {add=[4 (1415793364829208576)]} 0 2
[junit4:junit4]   2> 12586 T1188 C53 P63181 REQ /update {distrib.from=http://127.0.0.1:63170/solr/collection1/&update.distrib=FROMLEADER&wt=javabin&version=2} status=0 QTime=2 
[junit4:junit4]   2> 12587 T1168 C54 P63170 REQ /update {distrib.from=http://127.0.0.1:63179/solr/collection1/&update.distrib=TOLEADER&wt=javabin&version=2} status=0 QTime=6 
[junit4:junit4]   2> 12587 T1176 C56 P63179 /update {wt=javabin&version=2} {add=[4]} 0 9
[junit4:junit4]   2> 12591 T1150 C55 P63165 /update {wt=javabin&version=2} {add=[5 (1415793364847034368)]} 0 1
[junit4:junit4]   2> 12595 T1176 C56 P63179 /update {wt=javabin&version=2} {add=[5 (1415793364851228672)]} 0 1
[junit4:junit4]   2> 12599 T1150 C55 P63165 /update {wt=javabin&version=2} {add=[6 (1415793364855422976)]} 0 1
[junit4:junit4]   2> 12602 T1176 C56 P63179 /update {wt=javabin&version=2} {add=[6 (1415793364858568704)]} 0 1
[junit4:junit4]   2> 12605 T1150 C55 P63165 /update {wt=javabin&version=2} {add=[7 (1415793364861714432)]} 0 1
[junit4:junit4]   2> 12610 T1177 C56 P63179 REQ /update {distrib.from=http://127.0.0.1:63170/solr/collection1/&update.distrib=TOLEADER&wt=javabin&version=2} status=0 QTime=1 
[junit4:junit4]   2> 12610 T1169 C54 P63170 /update {wt=javabin&version=2} {add=[7]} 0 3
[junit4:junit4]   2> 12614 T1150 C55 P63165 /update {wt=javabin&version=2} {add=[8 (1415793364871151616)]} 0 1
[junit4:junit4]   2> 12623 T1188 C53 P63181 REQ /update {distrib.from=http://127.0.0.1:63170/solr/collection1/&update.distrib=FROMLEADER&wt=javabin&version=2} status=0 QTime=2 
[junit4:junit4]   2> 12624 T1168 C54 P63170 REQ /update {distrib.from=http://127.0.0.1:63179/solr/collection1/&update.distrib=TOLEADER&wt=javabin&version=2} status=0 QTime=6 
[junit4:junit4]   2> 12624 T1176 C56 P63179 /update {wt=javabin&version=2} {add=[8]} 0 8
[junit4:junit4]   2> 12628 T1150 C55 P63165 /update {wt=javabin&version=2} {add=[9 (1415793364885831680)]} 0 1
[junit4:junit4]   2> 12631 T1176 C56 P63179 /update {wt=javabin&version=2} {add=[9 (1415793364888977408)]} 0 1
[junit4:junit4]   2> 12642 T1150 C55 P63165 /update {wt=javabin&version=2} {add=[10 (1415793364892123136)]} 0 9
[junit4:junit4]   2> 12650 T1188 C53 P63181 REQ /update {distrib.from=http://127.0.0.1:63170/solr/collection1/&update.distrib=FROMLEADER&wt=javabin&version=2} status=0 QTime=2 
[junit4:junit4]   2> 12651 T1169 C54 P63170 /update {wt=javabin&version=2} {add=[10 (1415793364904706048)]} 0 6
[junit4:junit4]   2> 12655 T1150 C55 P63165 /update {wt=javabin&version=2} {add=[11 (1415793364913094656)]} 0 2
[junit4:junit4]   2> 12662 T1188 C53 P63181 REQ /update {distrib.from=http://127.0.0.1:63170/solr/collection1/&update.distrib=FROMLEADER&wt=javabin&version=2} status=0 QTime=2 
[junit4:junit4]   2> 12663 T1169 C54 P63170 /update {wt=javabin&version=2} {add=[11 (1415793364917288960)]} 0 6
[junit4:junit4]   2> 12667 T1150 C55 P63165 /update {wt=javabin&version=2} {add=[12 (1415793364925677568)]} 0 2
[junit4:junit4]   2> 12674 T1188 C53 P63181 REQ /update {distrib.from=http://127.0.0.1:63170/solr/collection1/&update.distrib=FROMLEADER&wt=javabin&version=2} status=0 QTime=2 
[junit4:junit4]   2> 12674 T1169 C54 P63170 /update {wt=javabin&version=2} {add=[12 (1415793364929871872)]} 0 5
[junit4:junit4]   2> 12679 T1150 C55 P63165 /update {wt=javabin&version=2} {add=[13 (1415793364938260480)]} 0 2
[junit4:junit4]   2> 12688 T1188 C53 P63181 REQ /update {distrib.from=http://127.0.0.1:63170/solr/collection1/&update.distrib=FROMLEADER&wt=javabin&version=2} status=0 QTime=2 
[junit4:junit4]   2> 12688 T1168 C54 P63170 REQ /update {distrib.from=http://127.0.0.1:63179/solr/collection1/&update.distrib=TOLEADER&wt=javabin&version=2} status=0 QTime=5 
[junit4:junit4]   2> 12689 T1176 C56 P63179 /update {wt=javabin&version=2} {add=[13]} 0 8
[junit4:junit4]   2> 12693 T1150 C55 P63165 /update {wt=javabin&version=2} {add=[14 (1415793364953989120)]} 0 1
[junit4:junit4]   2> 12703 T1188 C53 P63181 REQ /update {distrib.from=http://127.0.0.1:63170/solr/collection1/&update.distrib=FROMLEADER&wt=javabin&version=2} status=0 QTime=2 
[junit4:junit4]   2> 12703 T1168 C54 P63170 REQ /update {distrib.from=http://127.0.0.1:63179/solr/collection1/&update.distrib=TOLEADER&wt=javabin&version=2} status=0 QTime=5 
[junit4:junit4]   2> 12704 T1176 C56 P63179 /update {wt=javabin&version=2} {add=[14]} 0 8
[junit4:junit4]   2> 12708 T1150 C55 P63165 /update {wt=javabin&version=2} {add=[15 (1415793364969717760)]} 0 1
[junit4:junit4]   2> 12716 T1188 C53 P63181 REQ /update {distrib.from=http://127.0.0.1:63170/solr/collection1/&update.distrib=FROMLEADER&wt=javabin&version=2} status=0 QTime=1 
[junit4:junit4]   2> 12717 T1168 C54 P63170 REQ /update {distrib.from=http://127.0.0.1:63179/solr/collection1/&update.distrib=TOLEADER&wt=javabin&version=2} status=0 QTime=5 
[junit4:junit4]   2> 12718 T1176 C56 P63179 /update {wt=javabin&version=2} {add=[15]} 0 8
[junit4:junit4]   2> 12721 T1150 C55 P63165 /update {wt=javabin&version=2} {add=[16 (1415793364983349248)]} 0 1
[junit4:junit4]   2> 12752 T1188 C53 P63181 REQ /update {distrib.from=http://127.0.0.1:63170/solr/collection1/&update.distrib=FROMLEADER&wt=javabin&version=2} status=0 QTime=14 
[junit4:junit4]   2> 12753 T1169 C54 P63170 /update {wt=javabin&version=2} {add=[16 (1415793364986494976)]} 0 30
[junit4:junit4]   2> 12758 T1150 C55 P63165 /update {wt=javabin&version=2} {add=[17 (1415793365022146560)]} 0 2
[junit4:junit4]   2> 12763 T1176 C56 P63179 /update {wt=javabin&version=2} {add=[17 (1415793365026340864)]} 0 2
[junit4:junit4]   2> 12767 T1150 C55 P63165 /update {wt=javabin&version=2} {add=[100 (1415793365031583744)]} 0 1
[junit4:junit4]   2> 12776 T1188 C53 P63181 REQ /update {distrib.from=http://127.0.0.1:63170/solr/collection1/&update.distrib=FROMLEADER&wt=javabin&version=2} status=0 QTime=1 
[junit4:junit4]   2> 12777 T1168 C54 P63170 REQ /update {distrib.from=http://127.0.0.1:63179/solr/collection1/&update.distrib=TOLEADER&wt=javabin&version=2} status=0 QTime=6 
[junit4:junit4]   2> 12777 T1176 C56 P63179 /update {wt=javabin&version=2} {add=[100]} 0 8
[junit4:junit4]   2> 12781 T1150 C55 P63165 /update {wt=javabin&version=2} {add=[101 (1415793365046263808)]} 0 1
[junit4:junit4]   2> 12801 T1188 C53 P63181 REQ /update {distrib.from=http://127.0.0.1:63170/solr/collection1/&update.distrib=FROMLEADER&wt=javabin&version=2} status=0 QTime=1 
[junit4:junit4]   2> 12802 T1169 C54 P63170 /update {wt=javabin&version=2} {add=[101 (1415793365050458112)]} 0 19
[junit4:junit4]   2> 12814 T1150 C55 P63165 /update {wt=javabin&version=2} {add=[102 (1415793365072478208)]} 0 9
[junit4:junit4]   2> 12822 T1188 C53 P63181 REQ /update {distrib.from=http://127.0.0.1:63170/solr/collection1/&update.distrib=FROMLEADER&wt=javabin&version=2} status=0 QTime=1 
[junit4:junit4]   2> 12822 T1169 C54 P63170 /update {wt=javabin&version=2} {add=[102 (1415793365085061120)]} 0 5
[junit4:junit4]   2> 12827 T1150 C55 P63165 /update {wt=javabin&version=2} {add=[103 (1415793365093449728)]} 0 2
[junit4:junit4]   2> 12833 T1177 C56 P63179 REQ /update {distrib.from=http://127.0.0.1:63170/solr/collection1/&update.distrib=TOLEADER&wt=javabin&version=2} status=0 QTime=1 
[junit4:junit4]   2> 12833 T1169 C54 P63170 /update {wt=javabin&version=2} {add=[103]} 0 4
[junit4:junit4]   2> 12837 T1150 C55 P63165 /update {wt=javabin&version=2} {add=[104 (1415793365104984064)]} 0 1
[junit4:junit4]   2> 12843 T1177 C56 P63179 REQ /update {distrib.from=http://127.0.0.1:63170/solr/collection1/&update.distrib=TOLEADER&wt=javabin&version=2} status=0 QTime=1 
[junit4:junit4]   2> 12843 T1169 C54 P63170 /update {wt=javabin&version=2} {add=[104]} 0 3
[junit4:junit4]   2> 12847 T1150 C55 P63165 /update {wt=javabin&version=2} {add=[105 (1415793365115469824)]} 0 1
[junit4:junit4]   2> 12861 T1177 C56 P63179 REQ /update {distrib.from=http://127.0.0.1:63170/solr/collection1/&update.distrib=TOLEADER&wt=javabin&version=2} status=0 QTime=9 
[junit4:junit4]   2> 12861 T1169 C54 P63170 /update {wt=javabin&version=2} {add=[105]} 0 11
[junit4:junit4]   2> 12865 T1150 C55 P63165 /update {wt=javabin&version=2} {add=[106 (1415793365134344192)]} 0 1
[junit4:junit4]   2> 12872 T1177 C56 P63179 REQ /update {distrib.from=http://127.0.0.1:63170/solr/collection1/&update.distrib=TOLEADER&wt=javabin&version=2} status=0 QTime=2 
[junit4:junit4]   2> 12872 T1169 C54 P63170 /update {wt=javabin&version=2} {add=[106]} 0 4
[junit4:junit4]   2> 12876 T1150 C55 P63165 /update {wt=javabin&version=2} {add=[107 (1415793365145878528)]} 0 1
[junit4:junit4]   2> 12883 T1188 C53 P63181 REQ /update {distrib.from=http://127.0.0.1:63170/solr/collection1/&update.distrib=FROMLEADER&wt=javabin&version=2} status=0 QTime=1 
[junit4:junit4]   2> 12884 T1169 C54 P63170 /update {wt=javabin&version=2} {add=[107 (1415793365150072832)]} 0 5
[junit4:junit4]   2> 12888 T1150 C55 P63165 /update {wt=javabin&version=2} {add=[108 (1415793365158461440)]} 0 1
[junit4:junit4]   2> 12895 T1188 C53 P63181 REQ /update {distrib.from=http://127.0.0.1:63170/solr/collection1/&update.distrib=FROMLEADER&wt=javabin&version=2} status=0 QTime=1 
[junit4:junit4]   2> 12896 T1169 C54 P63170 /update {wt=javabin&version=2} {add=[108 (1415793365162655744)]} 0 5
[junit4:junit4]   2> 12900 T1150 C55 P63165 /update {wt=javabin&version=2} {add=[109 (1415793365171044352)]} 0 1
[junit4:junit4]   2> 12910 T1188 C53 P63181 REQ /update {distrib.from=http://127.0.0.1:63170/solr/collection1/&update.distrib=FROMLEADER&wt=javabin&version=2} status=0 QTime=2 
[junit4:junit4]   2> 12910 T1168 C54 P63170 REQ /update {distrib.from=http://127.0.0.1:63179/solr/collection1/&update.distrib=TOLEADER&wt=javabin&version=2} status=0 QTime=5 
[junit4:junit4]   2> 12911 T1176 C56 P63179 /update {wt=javabin&version=2} {add=[109]} 0 8
[junit4:junit4]   2> 12914 T1150 C55 P63165 /update {wt=javabin&version=2} {add=[110 (1415793365185724416)]} 0 1
[junit4:junit4]   2> 12923 T1188 C53 P63181 REQ /update {distrib.from=http://127.0.0.1:63170/solr/collection1/&update.distrib=FROMLEADER&wt=javabin&version=2} status=0 QTime=1 
[junit4:junit4]   2> 12924 T1168 C54 P63170 REQ /update {distrib.from=http://127.0.0.1:63179/solr/collection1/&update.distrib=TOLEADER&wt=javabin&version=2} status=0 QTime=5 
[junit4:junit4]   2> 12924 T1176 C56 P63179 /update {wt=javabin&version=2} {add=[110]} 0 7
[junit4:junit4]   2> 12928 T1150 C55 P63165 /update {wt=javabin&version=2} {add=[111 (1415793365200404480)]} 0 1
[junit4:junit4]   2> 12935 T1188 C53 P63181 REQ /update {distrib.from=http://127.0.0.1:63170/solr/collection1/&update.distrib=FROMLEADER&wt=javabin&version=2} status=0 QTime=1 
[junit4:junit4]   2> 12936 T1169 C54 P63170 /update {wt=javabin&version=2} {add=[111 (1415793365204598784)]} 0 5
[junit4:junit4]   2> 12953 T1150 C55 P63165 /update {wt=javabin&version=2} {add=[112 (1415793365212987392)]} 0 14
[junit4:junit4]   2> 12957 T1176 C56 P63179 /update {wt=javabin&version=2} {add=[112 (1415793365230813184)]} 0 1
[junit4:junit4]   2> 12963 T1150 C55 P63165 /update {wt=javabin&version=2} {add=[113 (1415793365236056064)]} 0 3
[junit4:junit4]   2> 12971 T1188 C53 P63181 REQ /update {distrib.from=http://127.0.0.1:63170/solr/collection1/&update.distrib=FROMLEADER&wt=javabin&version=2} status=0 QTime=1 
[junit4:junit4]   2> 12972 T1169 C54 P63170 /update {wt=javabin&version=2} {add=[113 (1415793365241298944)]} 0 6
[junit4:junit4]   2> 12976 T1150 C55 P63165 /update {wt=javabin&version=2} {add=[114 (1415793365250736128)]} 0 1
[junit4:junit4]   2> 13003 T1188 C53 P63181 REQ /update {distrib.from=http://127.0.0.1:63170/solr/collection1/&update.distrib=FROMLEADER&wt=javabin&version=2} status=0 QTime=11 
[junit4:junit4]   2> 13004 T1169 C54 P63170 /update {wt=javabin&version=2} {add=[114 (1415793365254930432)]} 0 25
[junit4:junit4]   2> 13008 T1150 C55 P63165 /update {wt=javabin&version=2} {add=[115 (1415793365284290560)]} 0 1
[junit4:junit4]   2> 13014 T1177 C56 P63179 REQ /update {distrib.from=http://127.0.0.1:63170/solr/collection1/&update.distrib=TOLEADER&wt=javabin&version=2} status=0 QTime=1 
[junit4:junit4]   2> 13015 T1169 C54 P63170 /update {wt=javabin&version=2} {add=[115]} 0 3
[junit4:junit4]   2> 13018 T1150 C55 P63165 /update {wt=javabin&version=2} {add=[116 (1415793365294776320)]} 0 1
[junit4:junit4]   2> 13022 T1176 C56 P63179 /update {wt=javabin&version=2} {add=[116 (1415793365298970624)]} 0 1
[junit4:junit4]   2> 13025 T1150 C55 P63165 /update {wt=javabin&version=2} {add=[117 (1415793365302116352)]} 0 1
[junit4:junit4]   2> 13032 T1177 C56 P63179 REQ /update {distrib.from=http://127.0.0.1:63170/solr/collection1/&update.distrib=TOLEADER&wt=javabin&version=2} status=0 QTime=1 
[junit4:junit4]   2> 13032 T1169 C54 P63170 /update {wt=javabin&version=2} {add=[117]} 0 4
[junit4:junit4]   2> 13036 T1150 C55 P63165 /update {wt=javabin&version=2} {add=[118 (1415793365313650688)]} 0 1
[junit4:junit4]   2> 13046 T1188 C53 P63181 REQ /update {distrib.from=http://127.0.0.1:63170/solr/collection1/&update.distrib=FROMLEADER&wt=javabin&version=2} status=0 QTime=2 
[junit4:junit4]   2> 13047 T1168 C54 P63170 REQ /update {distrib.from=http://127.0.0.1:63179/solr/collection1/&update.distrib=TOLEADER&wt=javabin&version=2} status=0 QTime=7 
[junit4:junit4]   2> 13047 T1176 C56 P63179 /update {wt=javabin&version=2} {add=[118]} 0 9
[junit4:junit4]   2> 13051 T1150 C55 P63165 /update {wt=javabin&version=2} {add=[119 (1415793365329379328)]} 0 1
[junit4:junit4]   2> 13057 T1177 C56 P63179 REQ /update {distrib.from=http://127.0.0.1:63170/solr/collection1/&update.distrib=TOLEADER&wt=javabin&version=2} status=0 QTime=1 
[junit4:junit4]   2> 13058 T1169 C54 P63170 /update {wt=javabin&version=2} {add=[119]} 0 4
[junit4:junit4]   2> 13062 T1150 C55 P63165 /update {wt=javabin&version=2} {add=[120 (1415793365340913664)]} 0 1
[junit4:junit4]   2> 13066 T1176 C56 P63179 /update {wt=javabin&version=2} {add=[120 (1415793365345107968)]} 0 1
[junit4:junit4]   2> 13070 T1150 C55 P63165 /update {wt=javabin&version=2} {add=[121 (1415793365349302272)]} 0 1
[junit4:junit4]   2> 13076 T1177 C56 P63179 REQ /update {distrib.from=http://127.0.0.1:63170/solr/collection1/&update.distrib=TOLEADER&wt=javabin&version=2} status=0 QTime=1 
[junit4:junit4]   2> 13077 T1169 C54 P63170 /update {wt=javabin&version=2} {add=[121]} 0 4
[junit4:junit4]   2> 13091 T1150 C55 P63165 /update {wt=javabin&version=2} {add=[122 (1415793365359788032)]} 0 12
[junit4:junit4]   2> 13098 T1188 C53 P63181 REQ /update {distrib.from=http://127.0.0.1:63170/solr/collection1/&update.distrib=FROMLEADER&wt=javabin&version=2} status=0 QTime=1 
[junit4:junit4]   2> 13099 T1169 C54 P63170 /update {wt=javabin&version=2} {add=[122 (1415793365375516672)]} 0 5
[junit4:junit4]   2> 13103 T1150 C55 P63165 /update {wt=javabin&version=2} {add=[123 (1415793365382856704)]} 0 2
[junit4:junit4]   2> 13110 T1188 C53 P63181 REQ /update {distrib.from=http://127.0.0.1:63170/solr/collection1/&update.distrib=FROMLEADER&wt=javabin&version=2} status=0 QTime=1 
[junit4:junit4]   2> 13111 T1169 C54 P63170 /update {wt=javabin&version=2} {add=[123 (1415793365388099584)]} 0 5
[junit4:junit4]   2> 13114 T1150 C55 P63165 /update {wt=javabin&version=2} {add=[124 (1415793365395439616)]} 0 1
[junit4:junit4]   2> 13121 T1188 C53 P63181 REQ /update {distrib.from=http://127.0.0.1:63170/solr/collection1/&update.distrib=FROMLEADER&wt=javabin&version=2} status=0 QTime=1 
[junit4:junit4]   2> 13122 T1169 C54 P63170 /update {wt=javabin&version=2} {add=[124 (1415793365399633920)]} 0 5
[junit4:junit4]   2> 13125 T1150 C55 P63165 /update {wt=javabin&version=2} {add=[125 (1415793365406973952)]} 0 1
[junit4:junit4]   2> 13132 T1188 C53 P63181 REQ /update {distrib.from=http://127.0.0.1:63170/solr/collection1/&update.distrib=FROMLEADER&wt=javabin&version=2} status=0 QTime=1 
[junit4:junit4]   2> 13133 T1169 C54 P63170 /update {wt=javabin&version=2} {add=[125 (1415793365411168256)]} 0 5
[junit4:junit4]   2> 13136 T1150 C55 P63165 /update {wt=javabin&version=2} {add=[126 (1415793365418508288)]} 0 1
[junit4:junit4]   2> 13140 T1176 C56 P63179 /update {wt=javabin&version=2} {add=[126 (1415793365422702592)]} 0 1
[junit4:junit4]   2> 13144 T1150 C55 P63165 /update {wt=javabin&version=2} {add=[127 (1415793365426896896)]} 0 1
[junit4:junit4]   2> 13162 T1177 C56 P63179 REQ /update {distrib.from=http://127.0.0.1:63170/solr/collection1/&update.distrib=TOLEADER&wt=javabin&version=2} status=0 QTime=13 
[junit4:junit4]   2> 13163 T1169 C54 P63170 /update {wt=javabin&version=2} {add=[127]} 0 16
[junit4:junit4]   2> 13166 T1150 C55 P63165 /update {wt=javabin&version=2} {add=[128 (1415793365449965568)]} 0 1
[junit4:junit4]   2> 13170 T1176 C56 P63179 /update {wt=javabin&version=2} {add=[128 (1415793365454159872)]} 0 1
[junit4:junit4]   2> 13174 T1150 C55 P63165 /update {wt=javabin&version=2} {add=[129 (1415793365458354176)]} 0 1
[junit4:junit4]   2> 13181 T1188 C53 P63181 REQ /update {distrib.from=http://127.0.0.1:63170/solr/collection1/&update.distrib=FROMLEADER&wt=javabin&version=2} status=0 QTime=1 
[junit4:junit4]   2> 13182 T1169 C54 P63170 /update {wt=javabin&version=2} {add=[129 (1415793365462548480)]} 0 5
[junit4:junit4]   2> 13186 T1150 C55 P63165 /update {wt=javabin&version=2} {add=[130 (1415793365470937088)]} 0 1
[junit4:junit4]   2> 13192 T1177 C56 P63179 REQ /update {distrib.from=http://127.0.0.1:63170/solr/collection1/&update.distrib=TOLEADER&wt=javabin&version=2} status=0 QTime=1 
[junit4:junit4]   2> 13193 T1169 C54 P63170 /update {wt=javabin&version=2} {add=[130]} 0 4
[junit4:junit4]   2> 13197 T1150 C55 P63165 /update {wt=javabin&version=2} {add=[131 (1415793365482471424)]} 0 1
[junit4:junit4]   2> 13204 T1177 C56 P63179 REQ /update {distrib.from=http://127.0.0.1:63170/solr/collection1/&update.distrib=TOLEADER&wt=javabin&version=2} status=0 QTime=1 
[junit4:junit4]   2> 13204 T1169 C54 P63170 /update {wt=javabin&version=2} {add=[131]} 0 4
[junit4:junit4]   2> 13219 T1150 C55 P63165 /update {wt=javabin&version=2} {add=[132 (1415793365495054336)]} 0 11
[junit4:junit4]   2> 13230 T1188 C53 P63181 REQ /update {distrib.from=http://127.0.0.1:63170/solr/collection1/&update.distrib=FROMLEADER&wt=javabin&version=2} status=0 QTime=1 
[junit4:junit4]   2> 13231 T1168 C54 P63170 REQ /update {distrib.from=http://127.0.0.1:63179/solr/collection1/&update.distrib=TOLEADER&wt=javabin&version=2} status=0 QTime=6 
[junit4:junit4]   2> 13232 T1176 C56 P63179 /update {wt=javabin&version=2} {add=[132]} 0 10
[junit4:junit4]   2> 13237 T1150 C55 P63165 /update {wt=javabin&version=2} {add=[133 (1415793365523365888)]} 0 2
[junit4:junit4]   2> 13247 T1188 C53 P63181 REQ /update {distrib.from=http://127.0.0.1:63170/solr/collection1/&update.distrib=FROMLEADER&wt=javabin&version=2} status=0 QTime=1 
[junit4:junit4]   2> 13248 T1168 C54 P63170 REQ /update {distrib.from=http://127.0.0.1:63179/solr/collection1/&update.distrib=TOLEADER&wt=javabin&version=2} status=0 QTime=5 
[junit4:junit4]   2> 13249 T1176 C56 P63179 /update {wt=javabin&version=2} {add=[133]} 0 9
[junit4:junit4]   2> 13253 T1150 C55 P63165 /update {wt=javabin&version=2} {add=[134 (1415793365541191680)]} 0 1
[junit4:junit4]   2> 13260 T1177 C56 P63179 REQ /update {distrib.from=http://127.0.0.1:63170/solr/collection1/&update.distrib=TOLEADER&wt=javabin&version=2} status=0 QTime=1 
[junit4:junit4]   2> 13261 T1169 C54 P63170 /update {wt=javabin&version=2} {add=[134]} 0 5
[junit4:junit4]   2> 13265 T1150 C55 P63165 /update {wt=javabin&version=2} {add=[135 (1415793365553774592)]} 0 1
[junit4:junit4]   2> 13275 T1188 C53 P63181 REQ /update {distrib.from=http://127.0.0.1:63170/solr/collection1/&update.distrib=FROMLEADER&wt=javabin&version=2} status=0 QTime=1 
[junit4:junit4]   2> 13276 T1168 C54 P63170 REQ /update {distrib.from=http://127.0.0.1:63179/solr/collection1/&update.distrib=TOLEADER&wt=javabin&version=2} status=0 QTime=5 
[junit4:junit4]   2> 13277 T1176 C56 P63179 /update {wt=javabin&version=2} {add=[135]} 0 9
[junit4:junit4]   2> 13282 T1150 C55 P63165 /update {wt=javabin&version=2} {add=[136 (1415793365570551808)]} 0 2
[junit4:junit4]   2> 13286 T1176 C56 P63179 /update {wt=javabin&version=2} {add=[136 (1415793365575794688)]} 0 1
[junit4:junit4]   2> 13290 T1150 C55 P63165 /update {wt=javabin&version=2} {add=[137 (1415793365579988992)]} 0 1
[junit4:junit4]   2> 13297 T1177 C56 P63179 REQ /update {distrib.from=http://127.0.0.1:63170/solr/collection1/&update.distrib=TOLEADER&wt=javabin&version=2} status=0 QTime=1 
[junit4:junit4]   2> 13298 T1169 C54 P63170 /update {wt=javabin&version=2} {add=[137]} 0 5
[junit4:junit4]   2> 13302 T1150 C55 P63165 /update {wt=javabin&version=2} {add=[138 (1415793365592571904)]} 0 1
[junit4:junit4]   2> 13331 T1188 C53 P63181 REQ /update {distrib.from=http://127.0.0.1:63170/solr/collection1/&update.distrib=FROMLEADER&wt=javabin&version=2} status=0 QTime=12 
[junit4:junit4]   2> 13332 T1169 C54 P63170 /update {wt=javabin&version=2} {add=[138 (1415793365596766208)]} 0 27
[junit4:junit4]   2> 13336 T1150 C55 P63165 /update {wt=javabin&version=2} {add=[139 (1415793365628223488)]} 0 1
[junit4:junit4]   2> 13343 T1177 C56 P63179 REQ /update {distrib.from=http://127.0.0.1:63170/solr/collection1/&update.distrib=TOLEADER&wt=javabin&version=2} status=0 QTime=1 
[junit4:junit4]   2> 13344 T1169 C54 P63170 /update {wt=javabin&version=2} {add=[139]} 0 5
[junit4:junit4]   2> 13348 T1150 C55 P63165 /update {wt=javabin&version=2} {add=[140 (1415793365640806400)]} 0 1
[junit4:junit4]   2> 13352 T1176 C56 P63179 /update {wt=javabin&version=2} {add=[140 (1415793365645000704)]} 0 1
[junit4:junit4]   2> 13356 T1150 C55 P63165 /update {wt=javabin&version=2} {add=[141 (1415793365649195008)]} 0 1
[junit4:junit4]   2> 13363 T1177 C56 P63179 REQ /update {distrib.from=http://127.0.0.1:63170/solr/collection1/&update.distrib=TOLEADER&wt=javabin&version=2} status=0 QTime=1 
[junit4:junit4]   2> 13364 T1169 C54 P63170 /update {wt=javabin&version=2} {add=[141]} 0 5
[junit4:junit4]   2> 13380 T1150 C55 P63165 /update {wt=javabin&version=2} {add=[142 (1415793365661777920)]} 0 13
[junit4:junit4]   2> 13397 T1176 C56 P63179 /update {wt=javabin&version=2} {add=[142 (1415793365678555136)]} 0 14
[junit4:junit4]   2> 13402 T1150 C55 P63165 /update {wt=javabin&version=2} {add=[143 (1415793365696380928)]} 0 2
[junit4:junit4]   2> 13407 T1176 C56 P63179 /update {wt=javabin&version=2} {add=[143 (1415793365701623808)]} 0 2
[junit4:junit4]   2> 13411 T1150 C55 P63165 /update {wt=javabin&version=2} {add=[144 (1415793365706866688)]} 0 1
[junit4:junit4]   2> 13415 T1176 C56 P63179 /update {wt=javabin&version=2} {add=[144 (1415793365711060992)]} 0 1
[junit4:junit4]   2> 13419 T1150 C55 P63165 /update {wt=javabin&version=2} {add=[145 (1415793365715255296)]} 0 1
[junit4:junit4]   2> 13423 T1176 C56 P63179 /update {wt=javabin&version=2} {add=[145 (1415793365719449600)]} 0 1
[junit4:junit4]   2> 13427 T1150 C55 P63165 /update {wt=javabin&version=2} {add=[146 (1415793365723643904)]} 0 1
[junit4:junit4]   2> 13436 T1188 C53 P63181 REQ /update {distrib.from=http://127.0.0.1:63170/solr/collection1/&update.distrib=FROMLEADER&wt=javabin&version=2} status=0 QTime=2 
[junit4:junit4]   2> 13437 T1169 C54 P63170 /update {wt=javabin&version=2} {add=[146 (1415793365727838208)]} 0 7
[junit4:junit4]   2> 13441 T1150 C55 P63165 /update {wt=javabin&version=2} {add=[147 (1415793365738323968)]} 0 1
[junit4:junit4]   2> 13445 T1176 C56 P63179 /update {wt=javabin&version=2} {add=[147 (1415793365742518272)]} 0 1
[junit4:junit4]   2> 13449 T1150 C55 P63165 /update {wt=javabin&version=2} {add=[148 (1415793365746712576)]} 0 1
[junit4:junit4]   2> 13459 T1188 C53 P63181 REQ /update {distrib.from=http://127.0.0.1:63170/solr/collection1/&update.distrib=FROMLEADER&wt=javabin&version=2} status=0 QTime=1 
[junit4:junit4]   2> 13460 T1168 C54 P63170 REQ /update {distrib.from=http://127.0.0.1:63179/solr/collection1/&update.distrib=TOLEADER&wt=javabin&version=2} status=0 QTime=5 
[junit4:junit4]   2> 13460 T1176 C56 P63179 /update {wt=javabin&version=2} {add=[148]} 0 8
[junit4:junit4]   2> 13464 T1150 C55 P63165 /update {wt=javabin&version=2} {add=[149 (1415793365762441216)]} 0 1
[junit4:junit4]   2> 13470 T1177 C56 P63179 REQ /update {distrib.from=http://127.0.0.1:63170/solr/collection1/&update.distrib=TOLEADER&wt=javabin&version=2} status=0 QTime=1 
[junit4:junit4]   2> 13471 T1169 C54 P63170 /update {wt=javabin&version=2} {add=[149]} 0 4
[junit4:junit4]   2> 13473 T1150 C55 P63165 oasu.DirectUpdateHandler2.commit start commit{flags=0,_version_=0,optimize=false,openSearcher=true,waitSearcher=true,expungeDeletes=false,softCommit=false}
[junit4:junit4]   2> 13910 T1150 C55 P63165 oasc.SolrDeletionPolicy.onCommit SolrDeletionPolicy.onCommit: commits:num=2
[junit4:junit4]   2> 		commit{dir=NRTCachingDirectory(org.apache.lucene.store.NIOFSDirectory@/usr/home/hudson/hudson-slave/workspace/Lucene-Solr-Tests-trunk-java7/solr/build/solr-core/test/J0/org.apache.solr.cloud.BasicDistributedZkTest-1350205756807/control/data/index lockFactory=org.apache.lucene.store.NativeFSLockFactory@7d17b2c3; maxCacheMB=48.0 maxMergeSizeMB=4.0),segFN=segments_1,generation=1,filenames=[segments_1]
[junit4:junit4]   2> 		commit{dir=NRTCachingDirectory(org.apache.lucene.store.NIOFSDirectory@/usr/home/hudson/hudson-slave/workspace/Lucene-Solr-Tests-trunk-java7/solr/build/solr-core/test/J0/org.apache.solr.cloud.BasicDistributedZkTest-1350205756807/control/data/index lockFactory=org.apache.lucene.store.NativeFSLockFactory@7d17b2c3; maxCacheMB=48.0 maxMergeSizeMB=4.0),segFN=segments_2,generation=2,filenames=[_5_nrm.cfe, _3_MockRandom_0.prx, _3_MockVariableIntBlock_0.frq, _0_MockRandom_0.prx, _3.fdt, _4_MockVariableIntBlock_0.tii, _0_Lucene40_0.prx, _0_Pulsing40_0.frq, _3_Lucene40_0.frq, _4_MockRandom_0.pyl, _5_MockVariableIntBlock_0.tii, _5_Pulsing40_0.tip, _6_MockVariableIntBlock_0.tii, _5_Pulsing40_0.tim, _6_MockRandom_0.skp, _0_Lucene40_0.tim, _6_MockVariableIntBlock_0.tib, _0_Pulsing40_0.tim, _1_MockVariableIntBlock_0.tii, _4_MockVariableIntBlock_0.doc, _2.fdt, _3_Pulsing40_0.tip, _1_MockRandom_0.sd, _2.fdx, _3_Pulsing40_0.tim, _1_MockRandom_0.tii, _1_MockVariableIntBlock_0.tib, _0_Lucene40_0.tip, _1.fdx, _0_MockRandom_0.frq, _4_MockVariableIntBlock_0.tib, _1_MockRandom_0.tib, _5_nrm.cfs, _1.fdt, _4_MockRandom_0.sd, _2_Lucene40_0.prx, _0_MockVariableIntBlock_0.frq, _3.si, _6.fdt, _2_MockVariableIntBlock_0.skp, _1_MockVariableIntBlock_0.skp, _2.si, _3_Pulsing40_0.frq, _2_Pulsing40_0.tim, _6_MockRandom_0.tip, _2_MockRandom_0.tip, _2_MockVariableIntBlock_0.pyl, _0_MockVariableIntBlock_0.doc, _6_MockRandom_0.tim, _6.fdx, _2_Pulsing40_0.tip, _2_MockRandom_0.tim, _1_MockVariableIntBlock_0.pyl, _3_MockRandom_0.frq, _3.fnm, _2_MockVariableIntBlock_0.doc, _3_MockVariableIntBlock_0.tii, _4_Pulsing40_0.prx, _0_MockVariableIntBlock_0.pyl, _2_nrm.cfe, _5_Pulsing40_0.frq, _5_Lucene40_0.tim, _5_Lucene40_0.tip, _0_Lucene40_0.frq, _6_MockRandom_0.pyl, _1_MockVariableIntBlock_0.doc, _2_MockRandom_0.pyl, _0_MockVariableIntBlock_0.pos, _0_Pulsing40_0.tip, _6_MockRandom_0.doc, _2_nrm.cfs, _4_MockRandom_0.skp, _2_MockVariableIntBlock_0.tii, _3_Lucene40_0.tip, _3_Lucene40_0.tim, _5_MockVariableIntBlock_0.tib, _2_MockVariableIntBlock_0.tib, _1_MockVariableIntBlock_0.pos, _4_MockVariableIntBlock_0.frq, _1_Lucene40_0.frq, _5_MockVariableIntBlock_0.frq, _2.fnm, _3.fdx, _4_Pulsing40_0.tip, _2_MockRandom_0.sd, _4_Pulsing40_0.tim, _2_MockRandom_0.skp, _5_Pulsing40_0.prx, _2_Lucene40_0.frq, _1.si, _3_MockVariableIntBlock_0.pyl, _6.si, _6.fnm, _5_Lucene40_0.prx, _2_MockRandom_0.doc, _3_MockVariableIntBlock_0.pos, _6_MockRandom_0.frq, _4_MockRandom_0.pos, _1_Lucene40_0.tim, _3_nrm.cfe, _5.fdt, _6_Lucene40_0.tim, _1_Pulsing40_0.tip, _6_Pulsing40_0.frq, _5_MockVariableIntBlock_0.pyl, _6_Lucene40_0.tip, _1_Pulsing40_0.tim, _4_nrm.cfe, _4.fnm, _4_MockRandom_0.tib, _0_MockVariableIntBlock_0.skp, _0_Pulsing40_0.prx, _1.fnm, _1_Lucene40_0.tip, _4.fdx, _1_Pulsing40_0.frq, _2_Lucene40_0.tip, _4_MockRandom_0.doc, _6_Pulsing40_0.tim, _5_MockRandom_0.sd, _4_MockRandom_0.tiv, _1_Pulsing40_0.prx, _6_Pulsing40_0.tip, _2_Lucene40_0.tim, _6_MockVariableIntBlock_0.frq, _6_MockVariableIntBlock_0.doc, _2_Pulsing40_0.prx, _2_MockVariableIntBlock_0.pos, _5_Lucene40_0.frq, _5_MockVariableIntBlock_0.pos, _0.fnm, _3_MockVariableIntBlock_0.doc, _3_MockRandom_0.tib, _6_Lucene40_0.frq, _2_Pulsing40_0.frq, _1_Lucene40_0.prx, _5.si, _3_nrm.cfs, _6_MockRandom_0.sd, _4_MockVariableIntBlock_0.pyl, _6_Pulsing40_0.prx, _4_Lucene40_0.frq, _4_nrm.cfs, _3_MockVariableIntBlock_0.tib, _3_MockRandom_0.tiv, _6_Lucene40_0.prx, _1_MockRandom_0.frq, _5_MockVariableIntBlock_0.doc, _5_MockRandom_0.frq, _5_MockRandom_0.tib, _6_MockVariableIntBlock_0.pyl, _5_MockRandom_0.tii, _2_MockVariableIntBlock_0.frq, _6_MockRandom_0.pos, _6_nrm.cfs, _4_MockVariableIntBlock_0.skp, _0_MockVariableIntBlock_0.tib, _5_MockVariableIntBlock_0.skp, _6_MockVariableIntBlock_0.pos, _4_MockVariableIntBlock_0.pos, _4_Lucene40_0.tip, _3_Lucene40_0.prx, _2_MockRandom_0.pos, _4_Lucene40_0.tim, _0.si, _0_MockVariableIntBlock_0.tii, _4_Lucene40_0.prx, _1_nrm.cfs, _5.fnm, _6_nrm.cfe, _4.si, _4.fdt, _0_nrm.cfs, _6_MockVariableIntBlock_0.skp, _3_MockRandom_0.sd, _1_nrm.cfe, _1_MockVariableIntBlock_0.frq, _5_MockRandom_0.prx, _4_Pulsing40_0.frq, _3_Pulsing40_0.prx, _0_MockRandom_0.tip, _0_MockRandom_0.sd, _1_MockRandom_0.prx, _4_MockRandom_0.frq, _0_nrm.cfe, _5.fdx, segments_2, _2_MockRandom_0.frq, _0.fdx, _3_MockVariableIntBlock_0.skp, _0_MockRandom_0.tim, _0.fdt]
[junit4:junit4]   2> 13911 T1150 C55 P63165 oasc.SolrDeletionPolicy.updateCommits newest commit = 2
[junit4:junit4]   2> 13924 T1150 C55 P63165 oass.SolrIndexSearcher.<init> Opening Searcher@46566146 main
[junit4:junit4]   2> 13925 T1150 C55 P63165 oasu.DirectUpdateHandler2.commit end_commit_flush
[junit4:junit4]   2> 13927 T1161 oasc.SolrCore.registerSearcher [collection1] Registered new searcher Searcher@46566146 main{StandardDirectoryReader(segments_2:15:nrt _0(5.0):C10 _1(5.0):C10 _2(5.0):C10 _3(5.0):C10 _4(5.0):C10 _5(5.0):C10 _6(5.0):C7)}
[junit4:junit4]   2> 13928 T1150 C55 P63165 /update {waitSearcher=true&wt=javabin&commit=true&softCommit=false&version=2} {commit=} 0 455
[junit4:junit4]   2> 13931 T1176 C56 P63179 oasu.DirectUpdateHandler2.commit start commit{flags=0,_version_=0,optimize=false,openSearcher=true,waitSearcher=true,expungeDeletes=false,softCommit=false}
[junit4:junit4]   2> 14178 T1176 C56 P63179 oasc.SolrDeletionPolicy.onCommit SolrDeletionPolicy.onCommit: commits:num=2
[junit4:junit4]   2> 		commit{dir=NRTCachingDirectory(org.apache.lucene.store.NIOFSDirectory@/usr/home/hudson/hudson-slave/workspace/Lucene-Solr-Tests-trunk-java7/solr/build/solr-core/test/J0/org.apache.solr.cloud.BasicDistributedZkTest-1350205756807/jetty2/index lockFactory=org.apache.lucene.store.NativeFSLockFactory@38ac7386; maxCacheMB=48.0 maxMergeSizeMB=4.0),segFN=segments_1,generation=1,filenames=[segments_1]
[junit4:junit4]   2> 		commit{dir=NRTCachingDirectory(org.apache.lucene.store.NIOFSDirectory@/usr/home/hudson/hudson-slave/workspace/Lucene-Solr-Tests-trunk-java7/solr/build/solr-core/test/J0/org.apache.solr.cloud.BasicDistributedZkTest-1350205756807/jetty2/index lockFactory=org.apache.lucene.store.NativeFSLockFactory@38ac7386; maxCacheMB=48.0 maxMergeSizeMB=4.0),segFN=segments_2,generation=2,filenames=[_3_MockVariableIntBlock_0.frq, _0_MockRandom_0.prx, _3.fdt, _0_Lucene40_0.prx, _1_MockRandom_0.pos, _0_Pulsing40_0.frq, _3_Lucene40_0.frq, _3_MockRandom_0.skp, _1_MockRandom_0.tiv, _0_Lucene40_0.tim, _0_Pulsing40_0.tim, _1_MockVariableIntBlock_0.tii, _3_Pulsing40_0.tip, _2.fdt, _1_MockRandom_0.sd, _2.fdx, _3_Pulsing40_0.tim, _1_MockVariableIntBlock_0.tib, _0_Lucene40_0.tip, _1.fdx, _0_MockRandom_0.frq, _1_MockRandom_0.tib, _1.fdt, _2_Lucene40_0.prx, _0_MockVariableIntBlock_0.frq, _3.si, _1_MockRandom_0.doc, _2_MockVariableIntBlock_0.skp, _1_MockVariableIntBlock_0.skp, _2.si, _3_Pulsing40_0.frq, _2_Pulsing40_0.tim, _2_MockVariableIntBlock_0.pyl, _0_MockVariableIntBlock_0.doc, _2_Pulsing40_0.tip, _1_MockVariableIntBlock_0.pyl, _3_MockRandom_0.frq, _3.fnm, _2_MockRandom_0.tiv, _2_MockVariableIntBlock_0.doc, _3_MockVariableIntBlock_0.tii, _0_MockVariableIntBlock_0.pyl, _2_nrm.cfe, _0_Lucene40_0.frq, _1_MockVariableIntBlock_0.doc, _2_MockRandom_0.pyl, _0_MockVariableIntBlock_0.pos, _0_Pulsing40_0.tip, _2_MockRandom_0.tib, _2_nrm.cfs, _3_Lucene40_0.tip, _2_MockVariableIntBlock_0.tii, _3_Lucene40_0.tim, _2_MockVariableIntBlock_0.tib, _1_MockVariableIntBlock_0.pos, _1_Lucene40_0.frq, _2.fnm, _3.fdx, _2_MockRandom_0.sd, _2_MockRandom_0.skp, _2_Lucene40_0.frq, _1.si, _3_MockVariableIntBlock_0.pyl, _3_MockRandom_0.pyl, _3_MockRandom_0.pos, _2_MockRandom_0.doc, _3_MockVariableIntBlock_0.pos, _1_Lucene40_0.tim, _3_nrm.cfe, _1_Pulsing40_0.tip, _1_Pulsing40_0.tim, _0_MockVariableIntBlock_0.skp, _0_Pulsing40_0.prx, _1.fnm, _1_Lucene40_0.tip, _1_Pulsing40_0.frq, _2_Lucene40_0.tip, _1_Pulsing40_0.prx, _2_Lucene40_0.tim, _2_Pulsing40_0.prx, _2_MockVariableIntBlock_0.pos, _0.fnm, _3_MockVariableIntBlock_0.doc, _3_MockRandom_0.tii, _3_MockRandom_0.tib, _2_Pulsing40_0.frq, _1_Lucene40_0.prx, _3_nrm.cfs, _3_MockVariableIntBlock_0.tib, _1_MockRandom_0.frq, _3_MockRandom_0.doc, _2_MockVariableIntBlock_0.frq, _0_MockVariableIntBlock_0.tib, _3_Lucene40_0.prx, _2_MockRandom_0.pos, _0.si, _0_MockVariableIntBlock_0.tii, _1_nrm.cfs, _1_MockRandom_0.skp, _0_nrm.cfs, _3_MockRandom_0.sd, _1_nrm.cfe, _1_MockVariableIntBlock_0.frq, _3_Pulsing40_0.prx, _0_MockRandom_0.tip, _0_MockRandom_0.sd, _1_MockRandom_0.pyl, _0_nrm.cfe, segments_2, _2_MockRandom_0.frq, _0.fdx, _3_MockVariableIntBlock_0.skp, _0_MockRandom_0.tim, _0.fdt]
[junit4:junit4]   2> 14180 T1176 C56 P63179 oasc.SolrDeletionPolicy.updateCommits newest commit = 2
[junit4:junit4]   2> 14190 T1176 C56 P63179 oass.SolrIndexSearcher.<init> Opening Searcher@5cc088c9 main
[junit4:junit4]   2> 14191 T1176 C56 P63179 oasu.DirectUpdateHandler2.commit end_commit_flush
[junit4:junit4]   2> 14193 T1185 oasc.SolrCore.registerSearcher [collection1] Registered new searcher Searcher@5cc088c9 main{StandardDirectoryReader(segments_2:9:nrt _0(5.0):C10 _1(5.0):C10 _2(5.0):C10 _3(5.0):C5)}
[junit4:junit4]   2> 14194 T1176 C56 P63179 oasu.SolrCmdDistributor.distribCommit Distrib commit to:[StdNode: http://127.0.0.1:63170/solr/collection1/, StdNode: http://127.0.0.1:63181/solr/collection1/]
[junit4:junit4]   2> 14196 T1168 C54 P63170 oasu.DirectUpdateHandler2.commit start commit{flags=0,_version_=0,optimize=false,openSearcher=true,waitSearcher=true,expungeDeletes=false,softCommit=false}
[junit4:junit4]   2> 14197 T1188 C53 P63181 oasu.DirectUpdateHandler2.commit start commit{flags=0,_version_=0,optimize=false,openSearcher=true,waitSearcher=true,expungeDeletes=false,softCommit=false}
[junit4:junit4]   2> 14640 T1168 C54 P63170 oasc.SolrDeletionPolicy.onCommit SolrDeletionPolicy.onCommit: commits:num=2
[junit4:junit4]   2> 		commit{dir=NRTCachingDirectory(org.apache.lucene.store.NIOFSDirectory@/usr/home/hudson/hudson-slave/workspace/Lucene-Solr-Tests-trunk-java7/solr/build/solr-core/test/J0/org.apache.solr.cloud.BasicDistributedZkTest-1350205756807/jetty1/index lockFactory=org.apache.lucene.store.NativeFSLockFactory@51e9e252; maxCacheMB=48.0 maxMergeSizeMB=4.0),segFN=segments_1,generation=1,filenames=[segments_1]
[junit4:junit4]   2> 		commit{dir=NRTCachingDirectory(org.apache.lucene.store.NIOFSDirectory@/usr/home/hudson/hudson-slave/workspace/Lucene-Solr-Tests-trunk-java7/solr/build/solr-core/test/J0/org.apache.solr.cloud.BasicDistributedZkTest-1350205756807/jetty1/index lockFactory=org.apache.lucene.store.NativeFSLockFactory@51e9e252; maxCacheMB=48.0 maxMergeSizeMB=4.0),segFN=segments_2,generation=2,filenames=[_3_MockRandom_0.prx, _3_MockVariableIntBlock_0.frq, _0_MockRandom_0.prx, _3.fdt, _0_Lucene40_0.prx, _0_Pulsing40_0.frq, _3_Lucene40_0.frq, _0_Lucene40_0.tim, _0_Pulsing40_0.tim, _1_MockVariableIntBlock_0.tii, _1_MockRandom_0.tip, _2.fdt, _3_Pulsing40_0.tip, _1_MockRandom_0.sd, _1_MockRandom_0.tim, _2.fdx, _3_Pulsing40_0.tim, _1_MockVariableIntBlock_0.tib, _0_Lucene40_0.tip, _1.fdx, _0_MockRandom_0.frq, _1.fdt, _2_Lucene40_0.prx, _0_MockVariableIntBlock_0.frq, _3.si, _2_MockVariableIntBlock_0.skp, _1_MockVariableIntBlock_0.skp, _2.si, _3_Pulsing40_0.frq, _2_Pulsing40_0.tim, _2_MockRandom_0.tii, _2_MockVariableIntBlock_0.pyl, _0_MockVariableIntBlock_0.doc, _2_Pulsing40_0.tip, _1_MockVariableIntBlock_0.pyl, _3_MockRandom_0.frq, _3.fnm, _2_MockVariableIntBlock_0.doc, _3_MockVariableIntBlock_0.tii, _0_MockVariableIntBlock_0.pyl, _2_nrm.cfe, _0_Lucene40_0.frq, _1_MockVariableIntBlock_0.doc, _0_MockVariableIntBlock_0.pos, _0_Pulsing40_0.tip, _2_MockRandom_0.tib, _2_nrm.cfs, _2_MockRandom_0.prx, _2_MockVariableIntBlock_0.tii, _3_Lucene40_0.tip, _3_Lucene40_0.tim, _2_MockVariableIntBlock_0.tib, _1_MockVariableIntBlock_0.pos, _1_Lucene40_0.frq, _2.fnm, _3.fdx, _2_MockRandom_0.sd, _2_Lucene40_0.frq, _1.si, _3_MockVariableIntBlock_0.pyl, _3_MockVariableIntBlock_0.pos, _1_Lucene40_0.tim, _3_nrm.cfe, _1_Pulsing40_0.tip, _1_Pulsing40_0.tim, _0_MockVariableIntBlock_0.skp, _0_Pulsing40_0.prx, _1.fnm, _1_Lucene40_0.tip, _1_Pulsing40_0.frq, _2_Lucene40_0.tip, _1_Pulsing40_0.prx, _2_Lucene40_0.tim, _2_Pulsing40_0.prx, _2_MockVariableIntBlock_0.pos, _0.fnm, _3_MockVariableIntBlock_0.doc, _3_MockRandom_0.tib, _2_Pulsing40_0.frq, _1_Lucene40_0.prx, _3_nrm.cfs, _3_MockVariableIntBlock_0.tib, _3_MockRandom_0.tiv, _1_MockRandom_0.frq, _2_MockVariableIntBlock_0.frq, _0_MockVariableIntBlock_0.tib, _3_Lucene40_0.prx, _0.si, _0_MockVariableIntBlock_0.tii, _1_nrm.cfs, _0_MockRandom_0.tib, _0_nrm.cfs, _1_nrm.cfe, _3_MockRandom_0.sd, _1_MockVariableIntBlock_0.frq, _3_Pulsing40_0.prx, _0_MockRandom_0.sd, _1_MockRandom_0.prx, _0_nrm.cfe, _0_MockRandom_0.tii, segments_2, _2_MockRandom_0.frq, _0.fdx, _3_MockVariableIntBlock_0.skp, _0.fdt]
[junit4:junit4]   2> 14642 T1168 C54 P63170 oasc.SolrDeletionPolicy.updateCommits newest commit = 2
[junit4:junit4]   2> 14652 T1168 C54 P63170 oass.SolrIndexSearcher.<init> Opening Searcher@2c52479f main
[junit4:junit4]   2> 14653 T1168 C54 P63170 oasu.DirectUpdateHandler2.commit end_commit_flush
[junit4:junit4]   2> 14654 T1173 oasc.SolrCore.registerSearcher [collection1] Registered new searcher Searcher@2c52479f main{StandardDirectoryReader(segments_2:9:nrt _0(5.0):C10 _1(5.0):C10 _2(5.0):C10 _3(5.0):C2)}
[junit4:junit4]   2> 14655 T1168 C54 P63170 /update {waitSearcher=true&commit=true&commit_end_point=true&expungeDeletes=false&wt=javabin&softCommit=false&version=2} {commit=} 0 459
[junit4:junit4]   2> 14671 T1188 C53 P63181 oasc.SolrDeletionPolicy.onCommit SolrDeletionPolicy.onCommit: commits:num=2
[junit4:junit4]   2> 		commit{dir=NRTCachingDirectory(org.apache.lucene.store.NIOFSDirectory@/usr/home/hudson/hudson-slave/workspace/Lucene-Solr-Tests-trunk-java7/solr/build/solr-core/test/J0/org.apache.solr.cloud.BasicDistributedZkTest-1350205756807/jetty3/index lockFactory=org.apache.lucene.store.NativeFSLockFactory@484aa1ec; maxCacheMB=48.0 maxMergeSizeMB=4.0),segFN=segments_2,generation=2,filenames=[segments_2]
[junit4:junit4]   2> 		commit{dir=NRTCachingDirectory(org.apache.lucene.store.NIOFSDirectory@/usr/home/hudson/hudson-slave/workspace/Lucene-Solr-Tests-trunk-java7/solr/build/solr-core/test/J0/org.apache.solr.cloud.BasicDistributedZkTest-1350205756807/jetty3/index lockFactory=org.apache.lucene.store.NativeFSLockFactory@484aa1ec; maxCacheMB=48.0 maxMergeSizeMB=4.0),segFN=segments_3,generation=3,filenames=[_3_MockRandom_0.prx, _3_MockVariableIntBlock_0.frq, _3.fdt, _0_Lucene40_0.prx, _0_Pulsing40_0.frq, _3_Lucene40_0.frq, _0_Lucene40_0.tim, _0_Pulsing40_0.tim, _1_MockVariableIntBlock_0.tii, _2.fdt, _3_Pulsing40_0.tip, _1_MockRandom_0.sd, _2.fdx, _3_Pulsing40_0.tim, _1_MockRandom_0.tii, _0_MockRandom_0.skp, _1_MockVariableIntBlock_0.tib, _0_Lucene40_0.tip, _1.fdx, _0_MockRandom_0.frq, _1_MockRandom_0.tib, _1.fdt, _2_Lucene40_0.prx, _0_MockVariableIntBlock_0.frq, _3.si, _2_MockVariableIntBlock_0.skp, _1_MockVariableIntBlock_0.skp, _2.si, _3_Pulsing40_0.frq, _2_Pulsing40_0.tim, _2_MockRandom_0.tii, _2_MockVariableIntBlock_0.pyl, _0_MockVariableIntBlock_0.doc, _2_Pulsing40_0.tip, _1_MockVariableIntBlock_0.pyl, _3_MockRandom_0.frq, _3.fnm, _2_MockVariableIntBlock_0.doc, _3_MockVariableIntBlock_0.tii, _0_MockVariableIntBlock_0.pyl, _2_nrm.cfe, _0_Lucene40_0.frq, _1_MockVariableIntBlock_0.doc, _0_MockVariableIntBlock_0.pos, _0_Pulsing40_0.tip, _2_MockRandom_0.tib, _2_nrm.cfs, _2_MockRandom_0.prx, _2_MockVariableIntBlock_0.tii, _3_Lucene40_0.tip, _3_Lucene40_0.tim, _2_MockVariableIntBlock_0.tib, _1_MockVariableIntBlock_0.pos, _1_Lucene40_0.frq, _2.fnm, _3.fdx, _2_MockRandom_0.sd, _2_Lucene40_0.frq, _1.si, _3_MockVariableIntBlock_0.pyl, _3_MockVariableIntBlock_0.pos, _1_Lucene40_0.tim, _3_nrm.cfe, _1_Pulsing40_0.tip, _1_Pulsing40_0.tim, _0_MockVariableIntBlock_0.skp, _0_Pulsing40_0.prx, _1.fnm, _1_Lucene40_0.tip, _1_Pulsing40_0.frq, _2_Lucene40_0.tip, _1_Pulsing40_0.prx, _2_Lucene40_0.tim, _2_Pulsing40_0.prx, _2_MockVariableIntBlock_0.pos, _0.fnm, _3_MockVariableIntBlock_0.doc, _3_MockRandom_0.tii, _3_MockRandom_0.tib, _2_Pulsing40_0.frq, _1_Lucene40_0.prx, _3_nrm.cfs, _0_MockRandom_0.doc, _0_MockRandom_0.pos, _3_MockVariableIntBlock_0.tib, _1_MockRandom_0.frq, _2_MockVariableIntBlock_0.frq, _0_MockVariableIntBlock_0.tib, _3_Lucene40_0.prx, _0.si, _0_MockVariableIntBlock_0.tii, _1_nrm.cfs, _0_MockRandom_0.tib, _0_nrm.cfs, _3_MockRandom_0.sd, _1_nrm.cfe, _1_MockVariableIntBlock_0.frq, _3_Pulsing40_0.prx, _0_MockRandom_0.sd, _1_MockRandom_0.prx, _0_MockRandom_0.tiv, _0_nrm.cfe, _2_MockRandom_0.frq, _0.fdx, _0_MockRandom_0.pyl, _3_MockVariableIntBlock_0.skp, _0.fdt, segments_3]
[junit4:junit4]   2> 14672 T1188 C53 P63181 oasc.SolrDeletionPolicy.updateCommits newest commit = 3
[junit4:junit4]   2> 14683 T1188 C53 P63181 oass.SolrIndexSearcher.<init> Opening Searcher@530a40cd main
[junit4:junit4]   2> 14684 T1188 C53 P63181 oasu.DirectUpdateHandler2.commit end_commit_flush
[junit4:junit4]   2> 14686 T1197 oasc.SolrCore.registerSearcher [collection1] Registered new searcher Searcher@530a40cd main{StandardDirectoryReader(segments_3:10:nrt _0(5.0):C10 _1(5.0):C10 _2(5.0):C10 _3(5.0):C2)}
[junit4:junit4]   2> 14686 T1188 C53 P63181 /update {waitSearcher=true&commit=true&commit_end_point=true&expungeDeletes=false&wt=javabin&softCommit=false&version=2} {commit=} 0 489
[junit4:junit4]   2> 14687 T1176 C56 P63179 /update {waitSearcher=true&wt=javabin&commit=true&softCommit=false&version=2} {commit=} 0 756
[junit4:junit4]   2> 14691 T1150 C55 P63165 REQ /select {distrib=false&sort=n_ti1+desc&wt=javabin&q=*:*&version=2} hits=67 status=0 QTime=1 
[junit4:junit4]   2> 14694 T1138 oascsi.HttpClientUtil.createClient Creating new http client, config:
[junit4:junit4]   2> 14700 T1138 oaz.ZooKeeper.<init> Initiating client connection, connectString=127.0.0.1:63159/solr sessionTimeout=10000 watcher=org.apache.solr.common.cloud.ConnectionManager@4e33fac3
[junit4:junit4]   2> 14701 T1207 oaz.ClientCnxn$SendThread.startConnect Opening socket connection to server /127.0.0.1:63159
[junit4:junit4]   2> 14701 T1138 oascc.ConnectionManager.waitForConnected Waiting for client to connect to ZooKeeper
[junit4:junit4]   2> 14702 T1207 oaz.ClientCnxn$SendThread.primeConnection Socket connection established to localhost/127.0.0.1:63159, initiating session
[junit4:junit4]   2> 14702 T1140 oazs.NIOServerCnxn$Factory.run Accepted socket connection from /140.211.11.196:63220
[junit4:junit4]   2> 14703 T1140 oazs.NIOServerCnxn.readConnectRequest Client attempting to establish new session at /140.211.11.196:63220
[junit4:junit4]   2> 14704 T1142 oazs.NIOServerCnxn.finishSessionInit Established session 0x13a5e88d58c0008 with negotiated timeout 10000 for client /140.211.11.196:63220
[junit4:junit4]   2> 14704 T1207 oaz.ClientCnxn$SendThread.readConnectResult Session establishment complete on server localhost/127.0.0.1:63159, sessionid = 0x13a5e88d58c0008, negotiated timeout = 10000
[junit4:junit4]   2> 14705 T1208 oascc.ConnectionManager.process Watcher org.apache.solr.common.cloud.ConnectionManager@4e33fac3 name:ZooKeeperConnection Watcher:127.0.0.1:63159/solr got event WatchedEvent state:SyncConnected type:None path:null path:null type:None
[junit4:junit4]   2> 14705 T1138 oascc.ConnectionManager.waitForConnected Client is connected to ZooKeeper
[junit4:junit4]   2> 14706 T1138 oascc.ZkStateReader.createClusterStateWatchersAndUpdate Updating cluster state from ZooKeeper... 
[junit4:junit4]   2> 14716 T1179 C56 P63179 REQ /select {sort=n_ti1+desc&distrib=false&collection=collection1&wt=javabin&rows=10&version=2&NOW=1350205771515&shard.url=127.0.0.1:63179/solr/collection1/&fl=id&start=0&q=*:*&isShard=true&fsv=true} hits=35 status=0 QTime=1 
[junit4:junit4]   2> 14716 T1170 C54 P63170 REQ /select {sort=n_ti1+desc&distrib=false&collection=collection1&wt=javabin&rows=10&version=2&NOW=1350205771515&shard.url=127.0.0.1:63170/solr/collection1/|127.0.0.1:63181/solr/collection1/&fl=id&start=0&q=*:*&isShard=true&fsv=true} hits=32 status=0 QTime=1 
[junit4:junit4]   2> 14727 T1179 C56 P63179 REQ /select {shard.url=127.0.0.1:63179/solr/collection1/&NOW=1350205771515&q=*:*&ids=126,127,137,106,17,131&distrib=false&collection=collection1&isShard=true&wt=javabin&version=2} status=0 QTime=1 
[junit4:junit4]   2> 14727 T1170 C54 P63170 REQ /select {shard.url=127.0.0.1:63170/solr/collection1/|127.0.0.1:63181/solr/collection1/&NOW=1350205771515&q=*:*&ids=125,113,13,14&distrib=false&collection=collection1&isShard=true&wt=javabin&version=2} status=0 QTime=1 
[junit4:junit4]   2> 14728 T1178 C56 P63179 REQ /select {collection=collection1&sort=n_ti1+desc&wt=javabin&q=*:*&version=2} hits=67 status=0 QTime=16 
[junit4:junit4]   2> 14735 T1150 C55 P63165 REQ /select {distrib=false&sort=n_ti1+asc&wt=javabin&q=*:*&version=2} hits=67 status=0 QTime=0 
[junit4:junit4]   2> 14743 T1165 C54 P63170 REQ /select {sort=n_ti1+asc&distrib=false&collection=collection1&wt=javabin&rows=10&version=2&NOW=1350205771543&shard.url=127.0.0.1:63170/solr/collection1/|127.0.0.1:63181/solr/collection1/&fl=id&start=0&q=*:*&isShard=true&fsv=true} hits=32 status=0 QTime=1 
[junit4:junit4]   2> 14743 T1180 C56 P63179 REQ /select {sort=n_ti1+asc&distrib=false&collection=collection1&wt=javabin&rows=10&version=2&NOW=1350205771543&shard.url=127.0.0.1:63179/solr/collection1/&fl=id&start=0&q=*:*&isShard=true&fsv=true} hits=35 status=0 QTime=1 
[junit4:junit4]   2> 14747 T1180 C56 P63179 REQ /select {shard.url=127.0.0.1:63179/solr/collection1/&NOW=1350205771543&q=*:*&ids=134,128,5,105,142&distrib=false&collection=collection1&isShard=true&wt=javabin&version=2} status=0 QTime=1 
[junit4:junit4]   2> 14747 T1165 C54 P63170 REQ /select {shard.url=127.0.0.1:63170/solr/collection1/|127.0.0.1:63181/solr/collection1/&NOW=1350205771543&q=*:*&ids=135,10,110,108,118&distrib=false&collection=collection1&isShard=true&wt=javabin&version=2} status=0 QTime=0 
[junit4:junit4]   2> 14749 T1169 C54 P63170 REQ /select {collection=collection1&sort=n_ti1+asc&wt=javabin&q=*:*&version=2} hits=67 status=0 QTime=9 
[junit4:junit4]   2> 14754 T1150 C55 P63165 REQ /select {distrib=false&sort=n_f1+desc&wt=javabin&q=*:*&version=2} hits=67 status=0 QTime=1 
[junit4:junit4]   2> 14759 T1189 C53 P63181 REQ /select {sort=n_f1+desc&distrib=false&wt=javabin&rows=10&version=2&fl=id&shard.url=127.0.0.1:63170/solr/collection1/|127.0.0.1:63181/solr/collection1/&NOW=1350205771560&start=0&q=*:*&isShard=true&fsv=true} hits=32 status=0 QTime=1 
[junit4:junit4]   2> 14759 T1179 C56 P63179 REQ /select {sort=n_f1+desc&distrib=false&wt=javabin&rows=10&version=2&fl=id&shard.url=127.0.0.1:63179/solr/collection1/&NOW=1350205771560&start=0&q=*:*&isShard=true&fsv=true} hits=35 status=0 QTime=0 
[junit4:junit4]   2> 14763 T1179 C56 P63179 REQ /select {shard.url=127.0.0.1:63179/solr/collection1/&NOW=1350205771560&q=*:*&ids=3,126,130,142&distrib=false&isShard=true&wt=javabin&version=2} status=0 QTime=0 
[junit4:junit4]   2> 14764 T1189 C53 P63181 REQ /select {shard.url=127.0.0.1:63170/solr/collection1/|127.0.0.1:63181/solr/collection1/&NOW=1350205771560&q=*:*&ids=114,10,1,110,124,4&distrib=false&isShard=true&wt=javabin&version=2} status=0 QTime=1 
[junit4:junit4]   2> 14766 T1178 C56 P63179 REQ /select {sort=n_f1+desc&wt=javabin&q=*:*&version=2} hits=67 status=0 QTime=9 
[junit4:junit4]   2> 14770 T1150 C55 P63165 REQ /select {distrib=false&sort=n_f1+asc&wt=javabin&q=*:*&version=2} hits=67 status=0 QTime=0 
[junit4:junit4]   2> 14777 T1179 C56 P63179 REQ /select {sort=n_f1+asc&distrib=false&wt=javabin&rows=10&version=2&fl=id&shard.url=127.0.0.1:63179/solr/collection1/&NOW=1350205771577&start=0&q=*:*&isShard=true&fsv=true} hits=35 status=0 QTime=0 
[junit4:junit4]   2> 14777 T1189 C53 P63181 REQ /select {sort=n_f1+asc&distrib=false&wt=javabin&rows=10&version=2&fl=id&shard.url=127.0.0.1:63170/solr/collection1/|127.0.0.1:63181/solr/collection1/&NOW=1350205771577&start=0&q=*:*&isShard=true&fsv=true} hits=32 status=0 QTime=0 
[junit4:junit4]   2> 14782 T1179 C56 P63179 REQ /select {shard.url=127.0.0.1:63179/solr/collection1/&NOW=1350205771577&q=*:*&ids=128,115,5,103&distrib=false&isShard=true&wt=javabin&version=2} status=0 QTime=1 
[junit4:junit4]   2> 14782 T1189 C53 P63181 REQ /select {shard.url=127.0.0.1:63170/solr/collection1/|127.0.0.1:63181/solr/collection1/&NOW=1350205771577&q=*:*&ids=125,138,122,16,13,118&distrib=false&isShard=true&wt=javabin&version=2} status=0 QTime=1 
[junit4:junit4]   2> 14785 T1176 C56 P63179 REQ /select {sort=n_f1+asc&wt=javabin&q=*:*&version=2} hits=67 status=0 QTime=11 
[junit4:junit4]   2> 14791 T1150 C55 P63165 REQ /select {distrib=false&sort=n_tf1+desc&wt=javabin&q=*:*&version=2} hits=67 status=0 QTime=1 
[junit4:junit4]   2> 14798 T1179 C56 P63179 REQ /select {sort=n_tf1+desc&distrib=false&wt=javabin&rows=10&version=2&fl=id&shard.url=127.0.0.1:63179/solr/collection1/&NOW=1350205771598&start=0&q=*:*&isShard=true&fsv=true} hits=35 status=0 QTime=1 
[junit4:junit4]   2> 14798 T1189 C53 P63181 REQ /select {sort=n_tf1+desc&distrib=false&wt=javabin&rows=10&version=2&fl=id&shard.url=127.0.0.1:63170/solr/collection1/|127.0.0.1:63181/solr/collection1/&NOW=1350205771598&start=0&q=*:*&isShard=true&fsv=true} hits=32 status=0 QTime=1 
[junit4:junit4]   2> 14801 T1179 C56 P63179 REQ /select {shard.url=127.0.0.1:63179/solr/collection1/&NOW=1350205771598&q=*:*&ids=144,127,128,130&distrib=false&isShard=true&wt=javabin&version=2} status=0 QTime=0 
[junit4:junit4]   2> 14802 T1189 C53 P63181 REQ /select {shard.url=127.0.0.1:63170/solr/collection1/|127.0.0.1:63181/solr/collection1/&NOW=1350205771598&q=*:*&ids=125,135,114,146,138,107&distrib=false&isShard=true&wt=javabin&version=2} status=0 QTime=1 
[junit4:junit4]   2> 14819 T1178 C56 P63179 REQ /select {sort=n_tf1+desc&wt=javabin&q=*:*&version=2} hits=67 status=0 QTime=24 
[junit4:junit4]   2> 14823 T1150 C55 P63165 REQ /select {distrib=false&sort=n_tf1+asc&wt=javabin&q=*:*&version=2} hits=67 status=0 QTime=0 
[junit4:junit4]   2> 14829 T1179 C56 P63179 REQ /select {sort=n_tf1+asc&distrib=false&collection=collection1&wt=javabin&rows=10&version=2&fl=id&shard.url=127.0.0.1:63179/solr/collection1/&NOW=1350205771630&start=0&q=*:*&isShard=true&fsv=true} hits=35 status=0 QTime=0 
[junit4:junit4]   2> 14830 T1170 C54 P63170 REQ /select {sort=n_tf1+asc&distrib=false&collection=collection1&wt=javabin&rows=10&version=2&fl=id&shard.url=127.0.0.1:63170/solr/collection1/|127.0.0.1:63181/solr/collection1/&NOW=1350205771630&start=0&q=*:*&isShard=true&fsv=true} hits=32 status=0 QTime=1 
[junit4:junit4]   2> 14833 T1179 C56 P63179 REQ /select {shard.url=127.0.0.1:63179/solr/collection1/&NOW=1350205771630&q=*:*&ids=116,134,147,106,104&distrib=false&collection=collection1&isShard=true&wt=javabin&version=2} status=0 QTime=0 
[junit4:junit4]   2> 14833 T1170 C54 P63170 REQ /select {shard.url=127.0.0.1:63170/solr/collection1/|127.0.0.1:63181/solr/collection1/&NOW=1350205771630&q=*:*&ids=113,110,8,101,12&distrib=false&collection=collection1&isShard=true&wt=javabin&version=2} status=0 QTime=0 
[junit4:junit4]   2> 14835 T1176 C56 P63179 REQ /select {collection=collection1&sort=n_tf1+asc&wt=javabin&q=*:*&version=2} hits=67 status=0 QTime=8 
[junit4:junit4]   2> 14840 T1150 C55 P63165 REQ /select {distrib=false&sort=n_d1+desc&wt=javabin&q=*:*&version=2} hits=67 status=0 QTime=1 
[junit4:junit4]   2> 14846 T1179 C56 P63179 REQ /select {sort=n_d1+desc&distrib=false&wt=javabin&rows=10&version=2&fl=id&shard.url=127.0.0.1:63179/solr/collection1/&NOW=1350205771647&start=0&q=*:*&isShard=true&fsv=true} hits=35 status=0 QTime=0 
[junit4:junit4]   2> 14847 T1170 C54 P63170 REQ /select {sort=n_d1+desc&distrib=false&wt=javabin&rows=10&version=2&fl=id&shard.url=127.0.0.1:63170/solr/collection1/|127.0.0.1:63181/solr/collection1/&NOW=1350205771647&start=0&q=*:*&isShard=true&fsv=true} hits=32 status=0 QTime=1 
[junit4:junit4]   2> 14850 T1179 C56 P63179 REQ /select {shard.url=127.0.0.1:63179/solr/collection1/&NOW=1350205771647&q=*:*&ids=3,139,6,136&distrib=false&isShard=true&wt=javabin&version=2} status=0 QTime=0 
[junit4:junit4]   2> 14851 T1170 C54 P63170 REQ /select {shard.url=127.0.0.1:63170/solr/collection1/|127.0.0.1:63181/solr/collection1/&NOW=1350205771647&q=*:*&ids=146,122,123,111,129,14&distrib=false&isShard=true&wt=javabin&version=2} status=0 QTime=1 
[junit4:junit4]   2> 14852 T1178 C56 P63179 REQ /select {sort=n_d1+desc&wt=javabin&q=*:*&version=2} hits=67 status=0 QTime=8 
[junit4:junit4]   2> 14857 T1150 C55 P63165 REQ /select {distrib=false&sort=n_d1+asc&wt=javabin&q=*:*&version=2} hits=67 status=0 QTime=1 
[junit4:junit4]   2> 14863 T1179 C56 P63179 REQ /select {sort=n_d1+asc&distrib=false&wt=javabin&rows=10&version=2&fl=id&shard.url=127.0.0.1:63179/solr/collection1/&NOW=1350205771664&start=0&q=*:*&isShard=true&fsv=true} hits=35 status=0 QTime=0 
[junit4:junit4]   2> 14864 T1189 C53 P63181 REQ /select {sort=n_d1+asc&distrib=false&wt=javabin&rows=10&version=2&fl=id&shard.url=127.0.0.1:63170/solr/collection1/|127.0.0.1:63181/solr/collection1/&NOW=1350205771664&start=0&q=*:*&isShard=true&fsv=true} hits=32 status=0 QTime=1 
[junit4:junit4]   2> 14868 T1179 C56 P63179 REQ /select {shard.url=127.0.0.1:63179/solr/collection1/&NOW=1350205771664&q=*:*&ids=127,145,7,105,140,142&distrib=false&isShard=true&wt=javabin&version=2} status=0 QTime=0 
[junit4:junit4]   2> 14869 T1189 C53 P63181 REQ /select {shard.url=127.0.0.1:63170/solr/collection1/|127.0.0.1:63181/solr/collection1/&NOW=1350205771664&q=*:*&ids=1,110,4,16&distrib=false&isShard=true&wt=javabin&version=2} status=0 QTime=1 
[junit4:junit4]   2> 14871 T1176 C56 P63179 REQ /select {sort=n_d1+asc&wt=javabin&q=*:*&version=2} hits=67 status=0 QTime=10 
[junit4:junit4]   2> 14876 T1150 C55 P63165 REQ /select {distrib=false&sort=n_td1+desc&wt=javabin&q=*:*&version=2} hits=67 status=0 QTime=1 
[junit4:junit4]   2> 14882 T1179 C56 P63179 REQ /select {sort=n_td1+desc&distrib=false&collection=collection1&wt=javabin&rows=10&version=2&fl=id&shard.url=127.0.0.1:63179/solr/collection1/&NOW=1350205771682&start=0&q=*:*&isShard=true&fsv=true} hits=35 status=0 QTime=1 
[junit4:junit4]   2> 14883 T1189 C53 P63181 REQ /select {sort=n_td1+desc&distrib=false&collection=collection1&wt=javabin&rows=10&version=2&NOW=1350205771682&shard.url=127.0.0.1:63170/solr/collection1/|127.0.0.1:63181/solr/collection1/&fl=id&start=0&q=*:*&isShard=true&fsv=true} hits=32 status=0 QTime=2 
[junit4:junit4]   2> 14886 T1179 C56 P63179 REQ /select {shard.url=127.0.0.1:63179/solr/collection1/&NOW=1350205771682&q=*:*&ids=17,105,120,130,142&distrib=false&collection=collection1&isShard=true&wt=javabin&version=2} status=0 QTime=0 
[junit4:junit4]   2> 14887 T1189 C53 P63181 REQ /select {shard.url=127.0.0.1:63170/solr/collection1/|127.0.0.1:63181/solr/collection1/&NOW=1350205771682&q=*:*&ids=125,146,148,11,100&distrib=false&collection=collection1&isShard=true&wt=javabin&version=2} status=0 QTime=1 
[junit4:junit4]   2> 14889 T1178 C56 P63179 REQ /select {collection=collection1&sort=n_td1+desc&wt=javabin&q=*:*&version=2} hits=67 status=0 QTime=10 
[junit4:junit4]   2> 14893 T1150 C55 P63165 REQ /select {distrib=false&sort=n_td1+asc&wt=javabin&q=*:*&version=2} hits=67 status=0 QTime=0 
[junit4:junit4]   2> 14901 T1181 C56 P63179 REQ /select {sort=n_td1+asc&distrib=false&collection=collection1&wt=javabin&rows=10&version=2&NOW=1350205771700&shard.url=127.0.0.1:63179/solr/collection1/&fl=id&start=0&q=*:*&isShard=true&fsv=true} hits=35 status=0 QTime=0 
[junit4:junit4]   2> 14901 T1191 C53 P63181 REQ /select {sort=n_td1+asc&distrib=false&collection=collection1&wt=javabin&rows=10&version=2&NOW=1350205771700&shard.url=127.0.0.1:63170/solr/collection1/|127.0.0.1:63181/solr/collection1/&fl=id&start=0&q=*:*&isShard=true&fsv=true} hits=32 status=0 QTime=0 
[junit4:junit4]   2> 14906 T1191 C53 P63181 REQ /select {shard.url=127.0.0.1:63170/solr/collection1/|127.0.0.1:63181/solr/collection1/&NOW=1350205771700&q=*:*&ids=132,133,113&distrib=false&collection=collection1&isShard=true&wt=javabin&version=2} status=0 QTime=1 
[junit4:junit4]   2> 14906 T1181 C56 P63179 REQ /select {shard.url=127.0.0.1:63179/solr/collection1/&NOW=1350205771700&q=*:*&ids=145,127,128,115,139,5,131&distrib=false&collection=collection1&isShard=true&wt=javabin&version=2} status=0 QTime=1 
[junit4:junit4]   2> 14908 T1190 C53 P63181 REQ /select {collection=collection1&sort=n_td1+asc&wt=javabin&q=*:*&version=2} hits=67 status=0 QTime=11 
[junit4:junit4]   2> 14915 T1150 C55 P63165 REQ /select {distrib=false&sort=n_l1+desc&wt=javabin&q=*:*&version=2} hits=67 status=0 QTime=2 
[junit4:junit4]   2> 14922 T1191 C53 P63181 REQ /select {sort=n_l1+desc&distrib=false&collection=collection1&wt=javabin&rows=10&version=2&fl=id&shard.url=127.0.0.1:63170/solr/collection1/|127.0.0.1:63181/solr/collection1/&NOW=1350205771721&start=0&q=*:*&isShard=true&fsv=true} hits=32 status=0 QTime=1 
[junit4:junit4]   2> 14922 T1181 C56 P63179 REQ /select {sort=n_l1+desc&distrib=false&collection=collection1&wt=javabin&rows=10&version=2&fl=id&shard.url=127.0.0.1:63179/solr/collection1/&NOW=1350205771721&start=0&q=*:*&isShard=true&fsv=true} hits=35 status=0 QTime=1 
[junit4:junit4]   2> 14926 T1181 C56 P63179 REQ /select {shard.url=127.0.0.1:63179/solr/collection1/&NOW=1350205771721&q=*:*&ids=147,112,7,6,103&distrib=false&collection=collection1&isShard=true&wt=javabin&version=2} status=0 QTime=1 
[junit4:junit4]   2> 14926 T1191 C53 P63181 REQ /select {shard.url=127.0.0.1:63170/solr/collection1/|127.0.0.1:63181/solr/collection1/&NOW=1350205771721&q=*:*&ids=133,146,138,4,102&distrib=false&collection=collection1&isShard=true&wt=javabin&version=2} status=0 QTime=1 
[junit4:junit4]   2> 14929 T1192 C53 P63181 REQ /select {collection=collection1&sort=n_l1+desc&wt=javabin&q=*:*&version=2} hits=67 status=0 QTime=11 
[junit4:junit4]   2> 14934 T1150 C55 P63165 REQ /select {distrib=false&sort=n_l1+asc&wt=javabin&q=*:*&version=2} hits=67 status=0 QTime=1 
[junit4:junit4]   2> 14942 T1165 C54 P63170 REQ /select {sort=n_l1+asc&distrib=false&collection=collection1&wt=javabin&rows=10&version=2&fl=id&shard.url=127.0.0.1:63170/solr/collection1/|127.0.0.1:63181/solr/collection1/&NOW=1350205771741&start=0&q=*:*&isShard=true&fsv=true} hits=32 status=0 QTime=1 
[junit4:junit4]   2> 14942 T1180 C56 P63179 REQ /select {sort=n_l1+asc&distrib=false&collection=collection1&wt=javabin&rows=10&version=2&fl=id&shard.url=127.0.0.1:63179/solr/collection1/&NOW=1350205771741&start=0&q=*:*&isShard=true&fsv=true} hits=35 status=0 QTime=1 
[junit4:junit4]   2> 14946 T1165 C54 P63170 REQ /select {shard.url=127.0.0.1:63170/solr/collection1/|127.0.0.1:63181/solr/collection1/&NOW=1350205771741&q=*:*&ids=113,110,123,16&distrib=false&collection=collection1&isShard=true&wt=javabin&version=2} status=0 QTime=1 
[junit4:junit4]   2> 14946 T1180 C56 P63179 REQ /select {shard.url=127.0.0.1:63179/solr/collection1/&NOW=1350205771741&q=*:*&ids=126,2,121,104,120,141&distrib=false&collection=collection1&isShard=true&wt=javabin&version=2} status=0 QTime=1 
[junit4:junit4]   2> 14950 T1169 C54 P63170 REQ /select {collection=collection1&sort=n_l1+asc&wt=javabin&q=*:*&version=2} hits=67 status=0 QTime=12 
[junit4:junit4]   2> 14956 T1150 C55 P63165 REQ /select {distrib=false&sort=n_tl1+desc&wt=javabin&q=*:*&version=2} hits=67 status=0 QTime=2 
[junit4:junit4]   2> 14964 T1179 C56 P63179 REQ /select {sort=n_tl1+desc&distrib=false&wt=javabin&rows=10&version=2&fl=id&shard.url=127.0.0.1:63179/solr/collection1/&NOW=1350205771763&start=0&q=*:*&isShard=true&fsv=true} hits=35 status=0 QTime=1 
[junit4:junit4]   2> 14965 T1189 C53 P63181 REQ /select {sort=n_tl1+desc&distrib=false&wt=javabin&rows=10&version=2&fl=id&shard.url=127.0.0.1:63170/solr/collection1/|127.0.0.1:63181/solr/collection1/&NOW=1350205771763&start=0&q=*:*&isShard=true&fsv=true} hits=32 status=0 QTime=2 
[junit4:junit4]   2> 14969 T1179 C56 P63179 REQ /select {shard.url=127.0.0.1:63179/solr/collection1/&NOW=1350205771763&q=*:*&ids=3,144,127,5,119&distrib=false&isShard=true&wt=javabin&version=2} status=0 QTime=1 
[junit4:junit4]   2> 14969 T1189 C53 P63181 REQ /select {shard.url=127.0.0.1:63170/solr/collection1/|127.0.0.1:63181/solr/collection1/&NOW=1350205771763&q=*:*&ids=10,110,111,15,100&distrib=false&isShard=true&wt=javabin&version=2} status=0 QTime=1 
[junit4:junit4]   2> 14971 T1178 C56 P63179 REQ /select {sort=n_tl1+desc&wt=javabin&q=*:*&version=2} hits=67 status=0 QTime=11 
[junit4:junit4]   2> 14978 T1150 C55 P63165 REQ /select {distrib=false&sort=n_tl1+asc&wt=javabin&q=*:*&version=2} hits=67 status=0 QTime=1 
[junit4:junit4]   2> 14985 T1181 C56 P63179 REQ /select {sort=n_tl1+asc&distrib=false&collection=collection1&wt=javabin&rows=10&version=2&fl=id&shard.url=127.0.0.1:63179/solr/collection1/&NOW=1350205771784&start=0&q=*:*&isShard=true&fsv=true} hits=35 status=0 QTime=1 
[junit4:junit4]   2> 14985 T1166 C54 P63170 REQ /select {sort=n_tl1+asc&distrib=false&collection=collection1&wt=javabin&rows=10&version=2&NOW=1350205771784&shard.url=127.0.0.1:63170/solr/collection1/|127.0.0.1:63181/solr/collection1/&fl=id&start=0&q=*:*&isShard=true&fsv=true} hits=32 status=0 QTime=2 
[junit4:junit4]   2> 14988 T1181 C56 P63179 REQ /select {shard.url=127.0.0.1:63179/solr/collection1/&NOW=1350205771784&q=*:*&ids=134,128,147,112,136,130&distrib=false&collection=collection1&isShard=true&wt=javabin&version=2} status=0 QTime=1 
[junit4:junit4]   2> 14989 T1166 C54 P63170 REQ /select {shard.url=127.0.0.1:63170/solr/collection1/|127.0.0.1:63181/solr/collection1/&NOW=1350205771784&q=*:*&ids=114,138,109,12&distrib=false&collection=collection1&isShard=true&wt=javabin&version=2} status=0 QTime=1 
[junit4:junit4]   2> 14991 T1192 C53 P63181 REQ /select {collection=collection1&sort=n_tl1+asc&wt=javabin&q=*:*&version=2} hits=67 status=0 QTime=10 
[junit4:junit4]   2> 14997 T1150 C55 P63165 REQ /select {distrib=false&sort=n_dt1+desc&wt=javabin&q=*:*&version=2} hits=67 status=0 QTime=1 
[junit4:junit4]   2> 15005 T1181 C56 P63179 REQ /select {sort=n_dt1+desc&distrib=false&collection=collection1&wt=javabin&rows=10&version=2&fl=id&shard.url=127.0.0.1:63179/solr/collection1/&NOW=1350205771804&start=0&q=*:*&isShard=true&fsv=true} hits=35 status=0 QTime=1 
[junit4:junit4]   2> 15005 T1191 C53 P63181 REQ /select {sort=n_dt1+desc&distrib=false&collection=collection1&wt=javabin&rows=10&version=2&fl=id&shard.url=127.0.0.1:63170/solr/collection1/|127.0.0.1:63181/solr/collection1/&NOW=1350205771804&start=0&q=*:*&isShard=true&fsv=true} hits=32 status=0 QTime=1 
[junit4:junit4]   2> 15009 T1181 C56 P63179 REQ /select {shard.url=127.0.0.1:63179/solr/collection1/&NOW=1350205771804&q=*:*&ids=3,117,145,121,6,149,131,119&distrib=false&collection=collection1&isShard=true&wt=javabin&version=2} status=0 QTime=1 
[junit4:junit4]   2> 15009 T1191 C53 P63181 REQ /select {shard.url=127.0.0.1:63170/solr/collection1/|127.0.0.1:63181/solr/collection1/&NOW=1350205771804&q=*:*&ids=108,110&distrib=false&collection=collection1&isShard=true&wt=javabin&version=2} status=0 QTime=1 
[junit4:junit4]   2> 15011 T1192 C53 P63181 REQ /select {collection=collection1&sort=n_dt1+desc&wt=javabin&q=*:*&version=2} hits=67 status=0 QTime=10 
[junit4:junit4]   2> 15017 T1150 C55 P63165 REQ /select {distrib=false&sort=n_dt1+asc&wt=javabin&q=*:*&version=2} hits=67 status=0 QTime=1 
[junit4:junit4]   2> 15023 T1179 C56 P63179 REQ /select {sort=n_dt1+asc&distrib=false&wt=javabin&rows=10&version=2&fl=id&shard.url=127.0.0.1:63179/solr/collection1/&NOW=1350205771824&start=0&q=*:*&isShard=true&fsv=true} hits=35 status=0 QTime=0 
[junit4:junit4]   2> 15024 T1189 C53 P63181 REQ /select {sort=n_dt1+asc&distrib=false&wt=javabin&rows=10&version=2&fl=id&shard.url=127.0.0.1:63170/solr/collection1/|127.0.0.1:63181/solr/collection1/&NOW=1350205771824&start=0&q=*:*&isShard=true&fsv=true} hits=32 status=0 QTime=1 
[junit4:junit4]   2> 15029 T1179 C56 P63179 REQ /select {shard.url=127.0.0.1:63179/solr/collection1/&NOW=1350205771824&q=*:*&ids=144,115,137,104,140&distrib=false&isShard=true&wt=javabin&version=2} status=0 QTime=1 
[junit4:junit4]   2> 15030 T1189 C53 P63181 REQ /select {shard.url=127.0.0.1:63170/solr/collection1/|127.0.0.1:63181/solr/collection1/&NOW=1350205771824&q=*:*&ids=125,10,138,111,8&distrib=false&isShard=true&wt=javabin&version=2} status=0 QTime=2 
[junit4:junit4]   2> 15032 T1178 C56 P63179 REQ /select {sort=n_dt1+asc&wt=javabin&q=*:*&version=2} hits=67 status=0 QTime=11 
[junit4:junit4]   2> 15042 T1150 C55 P63165 REQ /select {distrib=false&sort=n_tdt1+desc&wt=javabin&q=*:*&version=2} hits=67 status=0 QTime=1 
[junit4:junit4]   2> 15051 T1181 C56 P63179 REQ /select {sort=n_tdt1+desc&distrib=false&wt=javabin&rows=10&version=2&fl=id&shard.url=127.0.0.1:63179/solr/collection1/&NOW=1350205771850&start=0&q=*:*&isShard=true&fsv=true} hits=35 status=0 QTime=1 
[junit4:junit4]   2> 15051 T1191 C53 P63181 REQ /select {sort=n_tdt1+desc&distrib=false&wt=javabin&rows=10&version=2&fl=id&shard.url=127.0.0.1:63170/solr/collection1/|127.0.0.1:63181/solr/collection1/&NOW=1350205771850&start=0&q=*:*&isShard=true&fsv=true} hits=32 status=0 QTime=1 
[junit4:junit4]   2> 15054 T1181 C56 P63179 REQ /select {shard.url=127.0.0.1:63179/solr/collection1/&NOW=1350205771850&q=*:*&ids=3,126,6,9,103&distrib=false&isShard=true&wt=javabin&version=2} status=0 QTime=0 
[junit4:junit4]   2> 15055 T1191 C53 P63181 REQ /select {shard.url=127.0.0.1:63170/solr/collection1/|127.0.0.1:63181/solr/collection1/&NOW=1350205771850&q=*:*&ids=114,110,100,118,12&distrib=false&isShard=true&wt=javabin&version=2} status=0 QTime=1 
[junit4:junit4]   2> 15057 T1190 C53 P63181 REQ /select {sort=n_tdt1+desc&wt=javabin&q=*:*&version=2} hits=67 status=0 QTime=10 
[junit4:junit4]   2> 15066 T1150 C55 P63165 REQ /select {distrib=false&sort=n_tdt1+asc&wt=javabin&q=*:*&version=2} hits=67 status=0 QTime=0 
[junit4:junit4]   2> 15072 T1193 C53 P63181 REQ /select {sort=n_tdt1+asc&distrib=false&wt=javabin&rows=10&version=2&fl=id&shard.url=127.0.0.1:63170/solr/collection1/|127.0.0.1:63181/solr/collection1/&NOW=1350205771873&start=0&q=*:*&isShard=true&fsv=true} hits=32 status=0 QTime=1 
[junit4:junit4]   2> 15073 T1180 C56 P63179 REQ /select {sort=n_tdt1+asc&distrib=false&wt=javabin&rows=10&version=2&fl=id&shard.url=127.0.0.1:63179/solr/collection1/&NOW=1350205771873&start=0&q=*:*&isShard=true&fsv=true} hits=35 status=0 QTime=1 
[junit4:junit4]   2> 15076 T1193 C53 P63181 REQ /select {shard.url=127.0.0.1:63170/solr/collection1/|127.0.0.1:63181/solr/collection1/&NOW=1350205771873&q=*:*&ids=138,108,4,124,15,14&distrib=false&isShard=true&wt=javabin&version=2} status=0 QTime=1 
[junit4:junit4]   2> 15077 T1180 C56 P63179 REQ /select {shard.url=127.0.0.1:63179/solr/collection1/&NOW=1350205771873&q=*:*&ids=143,112,5,137&distrib=false&isShard=true&wt=javabin&version=2} status=0 QTime=1 
[junit4:junit4]   2> 15079 T1215 C54 P63170 REQ /select {sort=n_tdt1+asc&wt=javabin&q=*:*&version=2} hits=67 status=0 QTime=9 
[junit4:junit4]   2> 15089 T1150 C55 P63165 REQ /select {distrib=false&sort=a_si+desc&wt=javabin&q=*:*&version=2} hits=67 status=0 QTime=1 
[junit4:junit4]   2> 15096 T1181 C56 P63179 REQ /select {sort=a_si+desc&distrib=false&collection=collection1&wt=javabin&rows=10&version=2&fl=id&shard.url=127.0.0.1:63179/solr/collection1/&NOW=1350205771896&start=0&q=*:*&isShard=true&fsv=true} hits=35 status=0 QTime=0 
[junit4:junit4]   2> 15097 T1166 C54 P63170 REQ /select {sort=a_si+desc&distrib=false&collection=collection1&wt=javabin&rows=10&version=2&fl=id&shard.url=127.0.0.1:63170/solr/collection1/|127.0.0.1:63181/solr/collection1/&NOW=1350205771896&start=0&q=*:*&isShard=true&fsv=true} hits=32 status=0 QTime=1 
[junit4:junit4]   2> 15101 T1181 C56 P63179 REQ /select {shard.url=127.0.0.1:63179/solr/collection1/&NOW=1350205771896&q=*:*&ids=3,2,7,5,9&distrib=false&collection=collection1&isShard=true&wt=javabin&version=2} status=0 QTime=0 
[junit4:junit4]   2> 15102 T1166 C54 P63170 REQ /select {shard.url=127.0.0.1:63170/solr/collection1/|127.0.0.1:63181/solr/collection1/&NOW=1350205771896&q=*:*&ids=10,1,8,13,12&distrib=false&collection=collection1&isShard=true&wt=javabin&version=2} status=0 QTime=1 
[junit4:junit4]   2> 15105 T1190 C53 P63181 REQ /select {collection=collection1&sort=a_si+desc&wt=javabin&q=*:*&version=2} hits=67 status=0 QTime=12 
[junit4:junit4]   2> 15114 T1150 C55 P63165 REQ /select {distrib=false&sort=a_si+asc&wt=javabin&q=*:*&version=2} hits=67 status=0 QTime=0 
[junit4:junit4]   2> 15119 T1179 C56 P63179 REQ /select {sort=a_si+asc&distrib=false&wt=javabin&rows=10&version=2&fl=id&shard.url=127.0.0.1:63179/solr/collection1/&NOW=1350205771920&start=0&q=*:*&isShard=true&fsv=true} hits=35 status=0 QTime=0 
[junit4:junit4]   2> 15120 T1189 C53 P63181 REQ /select {sort=a_si+asc&distrib=false&wt=javabin&rows=10&version=2&fl=id&shard.url=127.0.0.1:63170/solr/collection1/|127.0.0.1:63181/solr/collection1/&NOW=1350205771920&start=0&q=*:*&isShard=true&fsv=true} hits=32 status=0 QTime=1 
[junit4:junit4]   2> 15127 T1179 C56 P63179 REQ /select {shard.url=127.0.0.1:63179/solr/collection1/&NOW=1350205771920&q=*:*&ids=3,2,7,6,9&distrib=false&isShard=true&wt=javabin&version=2} status=0 QTime=0 
[junit4:junit4]   2> 15129 T1189 C53 P63181 REQ /select {shard.url=127.0.0.1:63170/solr/collection1/|127.0.0.1:63181/solr/collection1/&NOW=1350205771920&q=*:*&ids=1,4,13,11,12&distrib=false&isShard=true&wt=javabin&version=2} status=0 QTime=2 
[junit4:junit4]   2> 15131 T1178 C56 P63179 REQ /select {sort=a_si+asc&wt=javabin&q=*:*&version=2} hits=67 status=0 QTime=14 
[junit4:junit4]   2> 15139 T1150 C55 P63165 REQ /select {sort=a_si+desc&fl=*,score&q=*:*&distrib=false&wt=javabin&version=2} hits=67 status=0 QTime=1 
[junit4:junit4]   2> 15144 T1170 C54 P63170 REQ /select {sort=a_si+desc&distrib=false&wt=javabin&rows=10&version=2&fl=id,score&shard.url=127.0.0.1:63170/solr/collection1/|127.0.0.1:63181/solr/collection1/&NOW=1350205771945&start=0&q=*:*&isShard=true&fsv=true} hits=32 status=0 QTime=0 
[junit4:junit4]   2> 15144 T1179 C56 P63179 REQ /select {sort=a_si+desc&distrib=false&wt=javabin&rows=10&version=2&fl=id,score&shard.url=127.0.0.1:63179/solr/collection1/&NOW=1350205771945&start=0&q=*:*&isShard=true&fsv=true} hits=35 status=0 QTime=0 
[junit4:junit4]   2> 15147 T1179 C56 P63179 REQ /select {fl=*,score&shard.url=127.0.0.1:63179/solr/collection1/&NOW=1350205771945&q=*:*&ids=3,2,7,5,9&distrib=false&isShard=true&wt=javabin&version=2} status=0 QTime=0 
[junit4:junit4]   2> 15148 T1170 C54 P63170 REQ /select {fl=*,score&shard.url=127.0.0.1:63170/solr/collection1/|127.0.0.1:63181/solr/collection1/&NOW=1350205771945&q=*:*&ids=10,1,8,13,12&distrib=false&isShard=true&wt=javabin&version=2} status=0 QTime=1 
[junit4:junit4]   2> 15150 T1176 C56 P63179 REQ /select {sort=a_si+desc&fl=*,score&wt=javabin&q=*:*&version=2} hits=67 status=0 QTime=8 
[junit4:junit4]   2> 15161 T1150 C55 P63165 REQ /select {sort=n_tl1+asc&fl=*,score&q=*:*&distrib=false&wt=javabin&version=2} hits=67 status=0 QTime=1 
[junit4:junit4]   2> 15167 T1191 C53 P63181 REQ /select {sort=n_tl1+asc&distrib=false&collection=collection1&wt=javabin&rows=10&version=2&fl=id,score&shard.url=127.0.0.1:63170/solr/collection1/|127.0.0.1:63181/solr/collection1/&NOW=1350205771967&start=0&q=*:*&isShard=true&fsv=true} hits=32 status=0 QTime=1 
[junit4:junit4]   2> 15167 T1181 C56 P63179 REQ /select {sort=n_tl1+asc&distrib=false&collection=collection1&wt=javabin&rows=10&version=2&fl=id,score&shard.url=127.0.0.1:63179/solr/collection1/&NOW=1350205771967&start=0&q=*:*&isShard=true&fsv=true} hits=35 status=0 QTime=1 
[junit4:junit4]   2> 15171 T1191 C53 P63181 REQ /select {fl=*,score&shard.url=127.0.0.1:63170/solr/collection1/|127.0.0.1:63181/solr/collection1/&NOW=1350205771967&q=*:*&ids=114,138,109,12&distrib=false&collection=collection1&isShard=true&wt=javabin&version=2} status=0 QTime=1 
[junit4:junit4]   2> 15171 T1181 C56 P63179 REQ /select {fl=*,score&shard.url=127.0.0.1:63179/solr/collection1/&NOW=1350205771967&q=*:*&ids=134,128,147,112,136,130&distrib=false&collection=collection1&isShard=true&wt=javabin&version=2} status=0 QTime=1 
[junit4:junit4]   2> 15172 T1192 C53 P63181 REQ /select {sort=n_tl1+asc&fl=*,score&q=*:*&collection=collection1&wt=javabin&version=2} hits=67 status=0 QTime=8 
[junit4:junit4]   2> 15178 T1150 C55 P63165 REQ /select {distrib=false&sort=n_tl1+desc&wt=javabin&q=*:*&version=2} hits=67 status=0 QTime=0 
[junit4:junit4]   2> 15185 T1180 C56 P63179 REQ /select {sort=n_tl1+desc&distrib=false&wt=javabin&rows=10&version=2&fl=id&shard.url=127.0.0.1:63179/solr/collection1/&NOW=1350205771985&start=0&q=*:*&isShard=true&fsv=true} hits=35 status=0 QTime=1 
[junit4:junit4]   2> 15185 T1165 C54 P63170 REQ /select {sort=n_tl1+desc&distrib=false&wt=javabin&rows=10&version=2&fl=id&shard.url=127.0.0.1:63170/solr/collection1/|127.0.0.1:63181/solr/collection1/&NOW=1350205771985&start=0&q=*:*&isShard=true&fsv=true} hits=32 status=0 QTime=0 
[junit4:junit4]   2> 15189 T1165 C54 P63170 REQ /select {shard.url=127.0.0.1:63170/solr/collection1/|127.0.0.1:63181/solr/collection1/&NOW=1350205771985&q=*:*&ids=10,110,111,15,100&distrib=false&isShard=true&wt=javabin&version=2} status=0 QTime=1 
[junit4:junit4]   2> 15189 T1180 C56 P63179 REQ /select {shard.url=127.0.0.1:63179/solr/collection1/&NOW=1350205771985&q=*:*&ids=3,144,127,5,119&distrib=false&isShard=true&wt=javabin&version=2} status=0 QTime=1 
[junit4:junit4]   2> 15191 T1169 C54 P63170 REQ /select {sort=n_tl1+desc&wt=javabin&q=*:*&version=2} hits=67 status=0 QTime=9 
[junit4:junit4]   2> 15202 T1150 C55 P63165 REQ /select {distrib=false&wt=javabin&q={!func}a_si&version=2} hits=67 status=0 QTime=1 
[junit4:junit4]   2> 15208 T1179 C56 P63179 REQ /select {distrib=false&collection=collection1&wt=javabin&rows=10&version=2&fl=id,score&shard.url=127.0.0.1:63179/solr/collection1/&NOW=1350205772009&start=0&q={!func}a_si&isShard=true&fsv=true} hits=35 status=0 QTime=0 
[junit4:junit4]   2> 15209 T1170 C54 P63170 REQ /select {distrib=false&collection=collection1&wt=javabin&rows=10&version=2&fl=id,score&shard.url=127.0.0.1:63170/solr/collection1/|127.0.0.1:63181/solr/collection1/&NOW=1350205772009&start=0&q={!func}a_si&isShard=true&fsv=true} hits=32 status=0 QTime=1 
[junit4:junit4]   2> 15212 T1179 C56 P63179 REQ /select {shard.url=127.0.0.1:63179/solr/collection1/&NOW=1350205772009&q={!func}a_si&ids=3,2,7,5,9&distrib=false&collection=collection1&isShard=true&wt=javabin&version=2} status=0 QTime=0 
[junit4:junit4]   2> 15212 T1170 C54 P63170 REQ /select {shard.url=127.0.0.1:63170/solr/collection1/|127.0.0.1:63181/solr/collection1/&NOW=1350205772009&q={!func}a_si&ids=10,1,8,13,12&distrib=false&collection=collection1&isShard=true&wt=javabin&version=2} status=0 QTime=0 
[junit4:junit4]   2> 15213 T1176 C56 P63179 REQ /select {collection=collection1&wt=javabin&q={!func}a_si&version=2} hits=67 status=0 QTime=7 
[junit4:junit4]   2> 15221 T1150 C55 P63165 REQ /select {distrib=false&fl=*,score&wt=javabin&q={!func}a_si&version=2} hits=67 status=0 QTime=0 
[junit4:junit4]   2> 15226 T1179 C56 P63179 REQ /select {fl=id,score&shard.url=127.0.0.1:63179/solr/collection1/&NOW=1350205772027&start=0&q={!func}a_si&distrib=false&isShard=true&wt=javabin&fsv=true&rows=10&version=2} hits=35 status=0 QTime=0 
[junit4:junit4]   2> 15227 T1189 C53 P63181 REQ /select {fl=id,score&shard.url=127.0.0.1:63170/solr/collection1/|127.0.0.1:63181/solr/collection1/&NOW=1350205772027&start=0&q={!func}a_si&distrib=false&isShard=true&wt=javabin&fsv=true&rows=10&version=2} hits=32 status=0 QTime=0 
[junit4:junit4]   2> 15231 T1179 C56 P63179 REQ /select {fl=*,score&shard.url=127.0.0.1:63179/solr/collection1/&NOW=1350205772027&q={!func}a_si&ids=3,2,7,5,9&distrib=false&isShard=true&wt=javabin&version=2} status=0 QTime=0 
[junit4:junit4]   2> 15232 T1189 C53 P63181 REQ /select {fl=*,score&shard.url=127.0.0.1:63170/solr/collection1/|127.0.0.1:63181/solr/collection1/&NOW=1350205772027&q={!func}a_si&ids=10,1,8,13,12&distrib=false&isShard=true&wt=javabin&version=2} status=0 QTime=1 
[junit4:junit4]   2> 15234 T1178 C56 P63179 REQ /select {fl=*,score&wt=javabin&q={!func}a_si&version=2} hits=67 status=0 QTime=10 
[junit4:junit4]   2> 15244 T1150 C55 P63165 REQ /select {distrib=false&wt=javabin&q=quick&version=2} hits=2 status=0 QTime=1 
[junit4:junit4]   2> 15250 T1166 C54 P63170 REQ /select {fl=id,score&shard.url=127.0.0.1:63170/solr/collection1/|127.0.0.1:63181/solr/collection1/&NOW=1350205772050&start=0&q=quick&distrib=false&isShard=true&wt=javabin&fsv=true&rows=10&version=2} hits=1 status=0 QTime=1 
[junit4:junit4]   2> 15251 T1181 C56 P63179 REQ /select {fl=id,score&shard.url=127.0.0.1:63179/solr/collection1/&NOW=1350205772050&start=0&q=quick&distrib=false&isShard=true&wt=javabin&fsv=true&rows=10&version=2} hits=1 status=0 QTime=1 
[junit4:junit4]   2> 15255 T1181 C56 P63179 REQ /select {shard.url=127.0.0.1:63179/solr/collection1/&NOW=1350205772050&q=quick&ids=5&distrib=false&isShard=true&wt=javabin&version=2} status=0 QTime=1 
[junit4:junit4]   2> 15255 T1166 C54 P63170 REQ /select {shard.url=127.0.0.1:63170/solr/collection1/|127.0.0.1:63181/solr/collection1/&NOW=1350205772050&q=quick&ids=4&distrib=false&isShard=true&wt=javabin&version=2} status=0 QTime=1 
[junit4:junit4]   2> 15256 T1192 C53 P63181 REQ /select {wt=javabin&q=quick&version=2} hits=2 status=0 QTime=9 
[junit4:junit4]   2> 15260 T1150 C55 P63165 REQ /select {fl=id&start=0&q=all&distrib=false&wt=javabin&version=2} hits=2 status=0 QTime=1 
[junit4:junit4]   2> 15265 T1181 C56 P63179 REQ /select {distrib=false&collection=collection1&wt=javabin&rows=10&version=2&fl=id,score&shard.url=127.0.0.1:63179/solr/collection1/&NOW=1350205772065&start=0&q=all&isShard=true&fsv=true} hits=0 status=0 QTime=0 
[junit4:junit4]   2> 15266 T1191 C53 P63181 REQ /select {distrib=false&collection=collection1&wt=javabin&rows=10&version=2&fl=id,score&shard.url=127.0.0.1:63170/solr/collection1/|127.0.0.1:63181/solr/collection1/&NOW=1350205772065&start=0&q=all&isShard=true&fsv=true} hits=2 status=0 QTime=1 
[junit4:junit4]   2> 15270 T1191 C53 P63181 REQ /select {fl=id&shard.url=127.

[...truncated too long message...]

it4:junit4]    > 	at org.junit.Assert.assertTrue(Assert.java:43)
[junit4:junit4]    > 	at org.apache.solr.cloud.BasicDistributedZkTest.testCollectionsAPI(BasicDistributedZkTest.java:443)
[junit4:junit4]    > 	at org.apache.solr.cloud.BasicDistributedZkTest.doTest(BasicDistributedZkTest.java:332)
[junit4:junit4]    > 	at org.apache.solr.BaseDistributedSearchTestCase.testDistribSearch(BaseDistributedSearchTestCase.java:695)
[junit4:junit4]    > 	at sun.reflect.NativeMethodAccessorImpl.invoke0(Native Method)
[junit4:junit4]    > 	at sun.reflect.NativeMethodAccessorImpl.invoke(NativeMethodAccessorImpl.java:57)
[junit4:junit4]    > 	at sun.reflect.DelegatingMethodAccessorImpl.invoke(DelegatingMethodAccessorImpl.java:43)
[junit4:junit4]    > 	at java.lang.reflect.Method.invoke(Method.java:601)
[junit4:junit4]    > 	at com.carrotsearch.randomizedtesting.RandomizedRunner.invoke(RandomizedRunner.java:1559)
[junit4:junit4]    > 	at com.carrotsearch.randomizedtesting.RandomizedRunner.access$600(RandomizedRunner.java:79)
[junit4:junit4]    > 	at com.carrotsearch.randomizedtesting.RandomizedRunner$6.evaluate(RandomizedRunner.java:737)
[junit4:junit4]    > 	at com.carrotsearch.randomizedtesting.RandomizedRunner$7.evaluate(RandomizedRunner.java:773)
[junit4:junit4]    > 	at com.carrotsearch.randomizedtesting.RandomizedRunner$8.evaluate(RandomizedRunner.java:787)
[junit4:junit4]    > 	at com.carrotsearch.randomizedtesting.rules.SystemPropertiesRestoreRule$1.evaluate(SystemPropertiesRestoreRule.java:53)
[junit4:junit4]    > 	at org.apache.lucene.util.TestRuleSetupTeardownChained$1.evaluate(TestRuleSetupTeardownChained.java:50)
[junit4:junit4]    > 	at org.apache.lucene.util.TestRuleFieldCacheSanity$1.evaluate(TestRuleFieldCacheSanity.java:51)
[junit4:junit4]    > 	at org.apache.lucene.util.AbstractBeforeAfterRule$1.evaluate(AbstractBeforeAfterRule.java:45)
[junit4:junit4]    > 	at com.carrotsearch.randomizedtesting.rules.SystemPropertiesInvariantRule$1.evaluate(SystemPropertiesInvariantRule.java:55)
[junit4:junit4]    > 	at org.apache.lucene.util.TestRuleThreadAndTestName$1.evaluate(TestRuleThreadAndTestName.java:48)
[junit4:junit4]    > 	at org.apache.lucene.util.TestRuleIgnoreAfterMaxFailures$1.evaluate(TestRuleIgnoreAfterMaxFailures.java:70)
[junit4:junit4]    > 	at org.apache.lucene.util.TestRuleMarkFailure$1.evaluate(TestRuleMarkFailure.java:48)
[junit4:junit4]    > 	at com.carrotsearch.randomizedtesting.rules.StatementAdapter.evaluate(StatementAdapter.java:36)
[junit4:junit4]    > 	at com.carrotsearch.randomizedtesting.ThreadLeakControl$StatementRunner.run(ThreadLeakControl.java:358)
[junit4:junit4]    > 	at com.carrotsearch.randomizedtesting.ThreadLeakControl.forkTimeoutingTask(ThreadLeakControl.java:782)
[junit4:junit4]    > 	at com.carrotsearch.randomizedtesting.ThreadLeakControl$3.evaluate(ThreadLeakControl.java:442)
[junit4:junit4]    > 	at com.carrotsearch.randomizedtesting.RandomizedRunner.runSingleTest(RandomizedRunner.java:746)
[junit4:junit4]    > 	at com.carrotsearch.randomizedtesting.RandomizedRunner$3.evaluate(RandomizedRunner.java:648)
[junit4:junit4]    > 	at com.carrotsearch.randomizedtesting.RandomizedRunner$4.evaluate(RandomizedRunner.java:682)
[junit4:junit4]    > 	at com.carrotsearch.randomizedtesting.RandomizedRunner$5.evaluate(RandomizedRunner.java:693)
[junit4:junit4]    > 	at com.carrotsearch.randomizedtesting.rules.StatementAdapter.evaluate(StatementAdapter.java:36)
[junit4:junit4]    > 	at com.carrotsearch.randomizedtesting.rules.SystemPropertiesRestoreRule$1.evaluate(SystemPropertiesRestoreRule.java:53)
[junit4:junit4]    > 	at org.apache.lucene.util.AbstractBeforeAfterRule$1.evaluate(AbstractBeforeAfterRule.java:45)
[junit4:junit4]    > 	at org.apache.lucene.util.TestRuleStoreClassName$1.evaluate(TestRuleStoreClassName.java:42)
[junit4:junit4]    > 	at com.carrotsearch.randomizedtesting.rules.SystemPropertiesInvariantRule$1.evaluate(SystemPropertiesInvariantRule.java:55)
[junit4:junit4]    > 	at com.carrotsearch.randomizedtesting.rules.NoShadowingOrOverridesOnMethodsRule$1.evaluate(NoShadowingOrOverridesOnMethodsRule.java:39)
[junit4:junit4]    > 	at com.carrotsearch.randomizedtesting.rules.NoShadowingOrOverridesOnMethodsRule$1.evaluate(NoShadowingOrOverridesOnMethodsRule.java:39)
[junit4:junit4]    > 	at com.carrotsearch.randomizedtesting.rules.StatementAdapter.evaluate(StatementAdapter.java:36)
[junit4:junit4]    > 	at org.apache.lucene.util.TestRuleAssertionsRequired$1.evaluate(TestRuleAssertionsRequired.java:43)
[junit4:junit4]    > 	at org.apache.lucene.util.TestRuleMarkFailure$1.evaluate(TestRuleMarkFailure.java:48)
[junit4:junit4]    > 	at org.apache.lucene.util.TestRuleIgnoreAfterMaxFailures$1.evaluate(TestRuleIgnoreAfterMaxFailures.java:70)
[junit4:junit4]    > 	at org.apache.lucene.util.TestRuleIgnoreTestSuites$1.evaluate(TestRuleIgnoreTestSuites.java:55)
[junit4:junit4]    > 	at com.carrotsearch.randomizedtesting.rules.StatementAdapter.evaluate(StatementAdapter.java:36)
[junit4:junit4]    > 	at com.carrotsearch.randomizedtesting.ThreadLeakControl$StatementRunner.run(ThreadLeakControl.java:358)
[junit4:junit4]    > 	at java.lang.Thread.run(Thread.java:722)
[junit4:junit4]   2> 409913 T1138 oas.SolrTestCaseJ4.deleteCore ###deleteCore
[junit4:junit4]   2> NOTE: test params are: codec=Lucene40: {n_f1=PostingsFormat(name=MockRandom), foo_b=MockVariableIntBlock(baseBlockSize=95), cat=Pulsing40(freqCutoff=3 minBlockSize=85 maxBlockSize=205), foo_d=Lucene40(minBlockSize=85 maxBlockSize=205), foo_f=MockVariableIntBlock(baseBlockSize=95), n_tl1=PostingsFormat(name=MockRandom), n_d1=Pulsing40(freqCutoff=3 minBlockSize=85 maxBlockSize=205), rnd_b=Lucene40(minBlockSize=85 maxBlockSize=205), intDefault=Pulsing40(freqCutoff=3 minBlockSize=85 maxBlockSize=205), n_td1=PostingsFormat(name=MockRandom), timestamp=Pulsing40(freqCutoff=3 minBlockSize=85 maxBlockSize=205), id=Lucene40(minBlockSize=85 maxBlockSize=205), range_facet_sl=MockVariableIntBlock(baseBlockSize=95), range_facet_si=PostingsFormat(name=MockRandom), oddField_s=MockVariableIntBlock(baseBlockSize=95), sequence_i=MockVariableIntBlock(baseBlockSize=95), name=Lucene40(minBlockSize=85 maxBlockSize=205), foo_i=PostingsFormat(name=MockRandom), regex_dup_B_s=Pulsing40(freqCutoff=3 minBlockSize=85 maxBlockSize=205), multiDefault=PostingsFormat(name=MockRandom), n_tf1=Pulsing40(freqCutoff=3 minBlockSize=85 maxBlockSize=205), n_dt1=PostingsFormat(name=MockRandom), genre_s=MockVariableIntBlock(baseBlockSize=95), author_t=PostingsFormat(name=MockRandom), n_ti1=Lucene40(minBlockSize=85 maxBlockSize=205), range_facet_l=Pulsing40(freqCutoff=3 minBlockSize=85 maxBlockSize=205), text=MockVariableIntBlock(baseBlockSize=95), _version_=Pulsing40(freqCutoff=3 minBlockSize=85 maxBlockSize=205), val_i=Lucene40(minBlockSize=85 maxBlockSize=205), SubjectTerms_mfacet=Pulsing40(freqCutoff=3 minBlockSize=85 maxBlockSize=205), series_t=PostingsFormat(name=MockRandom), a_t=Pulsing40(freqCutoff=3 minBlockSize=85 maxBlockSize=205), n_tdt1=Pulsing40(freqCutoff=3 minBlockSize=85 maxBlockSize=205), regex_dup_A_s=MockVariableIntBlock(baseBlockSize=95), price=MockVariableIntBlock(baseBlockSize=95), other_tl1=Pulsing40(freqCutoff=3 minBlockSize=85 maxBlockSize=205), n_l1=Pulsing40(freqCutoff=3 minBlockSize=85 maxBlockSize=205), a_si=PostingsFormat(name=MockRandom), inStock=MockVariableIntBlock(baseBlockSize=95)}, sim=DefaultSimilarity, locale=es_DO, timezone=Africa/Lagos
[junit4:junit4]   2> NOTE: FreeBSD 9.0-RELEASE amd64/Oracle Corporation 1.7.0_06 (64-bit)/cpus=16,threads=1,free=82685992,total=440401920
[junit4:junit4]   2> NOTE: All tests run in this JVM: [CopyFieldTest, SystemInfoHandlerTest, DateMathParserTest, ClusterStateUpdateTest, DirectUpdateHandlerOptimizeTest, CurrencyFieldTest, TestWordDelimiterFilterFactory, TestSolrQueryParser, SolrCoreCheckLockOnStartupTest, TestCollationField, PluginInfoTest, TestPHPSerializedResponseWriter, CoreAdminHandlerTest, TestSystemIdResolver, SpellCheckCollatorTest, PathHierarchyTokenizerFactoryTest, JSONWriterTest, TestSuggestSpellingConverter, SolrCmdDistributorTest, TestRTGBase, DistributedSpellCheckComponentTest, TestSolrIndexConfig, CSVRequestHandlerTest, DirectSolrConnectionTest, TestSearchPerf, DefaultValueUpdateProcessorTest, TestPseudoReturnFields, FieldAnalysisRequestHandlerTest, TestJmxMonitoredMap, SortByFunctionTest, TestRangeQuery, SearchHandlerTest, TestFiltering, TestStressLucene, TestRandomFaceting, TestBinaryResponseWriter, SpellCheckComponentTest, TestGroupingSearch, MoreLikeThisHandlerTest, TestCoreContainer, SyncSliceTest, SimplePostToolTest, TestLMDirichletSimilarityFactory, DistributedTermsComponentTest, DistanceFunctionTest, TestQuerySenderNoQuery, TestFastLRUCache, TestLMJelinekMercerSimilarityFactory, JsonLoaderTest, TestIBSimilarityFactory, WordBreakSolrSpellCheckerTest, ScriptEngineTest, SuggesterWFSTTest, BasicDistributedZkTest]
[junit4:junit4] Completed on J0 in 410.25s, 1 test, 1 failure <<< FAILURES!

[...truncated 49 lines...]
BUILD FAILED
/usr/home/hudson/hudson-slave/workspace/Lucene-Solr-Tests-trunk-java7/build.xml:38: The following error occurred while executing this line:
/usr/home/hudson/hudson-slave/workspace/Lucene-Solr-Tests-trunk-java7/solr/build.xml:180: The following error occurred while executing this line:
/usr/home/hudson/hudson-slave/workspace/Lucene-Solr-Tests-trunk-java7/lucene/module-build.xml:61: The following error occurred while executing this line:
/usr/home/hudson/hudson-slave/workspace/Lucene-Solr-Tests-trunk-java7/lucene/common-build.xml:1143: The following error occurred while executing this line:
/usr/home/hudson/hudson-slave/workspace/Lucene-Solr-Tests-trunk-java7/lucene/common-build.xml:816: There were test failures: 231 suites, 957 tests, 1 failure, 21 ignored (3 assumptions)

Total time: 34 minutes 3 seconds
Build step 'Invoke Ant' marked build as failure
Archiving artifacts
Recording test results
Email was triggered for: Failure
Sending email for trigger: Failure



Mime
View raw message