lucene-dev mailing list archives

Site index · List index
Message view « Date » · « Thread »
Top « Date » · « Thread »
From Apache Jenkins Server <jenk...@builds.apache.org>
Subject [JENKINS] Lucene-Solr-Tests-4.x-java7 - Build # 535 - Failure
Date Wed, 10 Oct 2012 16:43:35 GMT
Build: https://builds.apache.org/job/Lucene-Solr-Tests-4.x-java7/535/

1 tests failed.
FAILED:  org.apache.solr.cloud.BasicDistributedZkTest.testDistribSearch

Error Message:
some core start times did not change on reload

Stack Trace:
java.lang.AssertionError: some core start times did not change on reload
	at __randomizedtesting.SeedInfo.seed([E3D642C2376F7A2E:6230CCDA40301A12]:0)
	at org.junit.Assert.fail(Assert.java:93)
	at org.junit.Assert.assertTrue(Assert.java:43)
	at org.apache.solr.cloud.BasicDistributedZkTest.testCollectionsAPI(BasicDistributedZkTest.java:442)
	at org.apache.solr.cloud.BasicDistributedZkTest.doTest(BasicDistributedZkTest.java:331)
	at org.apache.solr.BaseDistributedSearchTestCase.testDistribSearch(BaseDistributedSearchTestCase.java:695)
	at sun.reflect.NativeMethodAccessorImpl.invoke0(Native Method)
	at sun.reflect.NativeMethodAccessorImpl.invoke(NativeMethodAccessorImpl.java:57)
	at sun.reflect.DelegatingMethodAccessorImpl.invoke(DelegatingMethodAccessorImpl.java:43)
	at java.lang.reflect.Method.invoke(Method.java:601)
	at com.carrotsearch.randomizedtesting.RandomizedRunner.invoke(RandomizedRunner.java:1559)
	at com.carrotsearch.randomizedtesting.RandomizedRunner.access$600(RandomizedRunner.java:79)
	at com.carrotsearch.randomizedtesting.RandomizedRunner$6.evaluate(RandomizedRunner.java:737)
	at com.carrotsearch.randomizedtesting.RandomizedRunner$7.evaluate(RandomizedRunner.java:773)
	at com.carrotsearch.randomizedtesting.RandomizedRunner$8.evaluate(RandomizedRunner.java:787)
	at com.carrotsearch.randomizedtesting.rules.SystemPropertiesRestoreRule$1.evaluate(SystemPropertiesRestoreRule.java:53)
	at org.apache.lucene.util.TestRuleSetupTeardownChained$1.evaluate(TestRuleSetupTeardownChained.java:50)
	at org.apache.lucene.util.TestRuleFieldCacheSanity$1.evaluate(TestRuleFieldCacheSanity.java:51)
	at org.apache.lucene.util.AbstractBeforeAfterRule$1.evaluate(AbstractBeforeAfterRule.java:45)
	at com.carrotsearch.randomizedtesting.rules.SystemPropertiesInvariantRule$1.evaluate(SystemPropertiesInvariantRule.java:55)
	at org.apache.lucene.util.TestRuleThreadAndTestName$1.evaluate(TestRuleThreadAndTestName.java:48)
	at org.apache.lucene.util.TestRuleIgnoreAfterMaxFailures$1.evaluate(TestRuleIgnoreAfterMaxFailures.java:70)
	at org.apache.lucene.util.TestRuleMarkFailure$1.evaluate(TestRuleMarkFailure.java:48)
	at com.carrotsearch.randomizedtesting.rules.StatementAdapter.evaluate(StatementAdapter.java:36)
	at com.carrotsearch.randomizedtesting.ThreadLeakControl$StatementRunner.run(ThreadLeakControl.java:358)
	at com.carrotsearch.randomizedtesting.ThreadLeakControl.forkTimeoutingTask(ThreadLeakControl.java:782)
	at com.carrotsearch.randomizedtesting.ThreadLeakControl$3.evaluate(ThreadLeakControl.java:442)
	at com.carrotsearch.randomizedtesting.RandomizedRunner.runSingleTest(RandomizedRunner.java:746)
	at com.carrotsearch.randomizedtesting.RandomizedRunner$3.evaluate(RandomizedRunner.java:648)
	at com.carrotsearch.randomizedtesting.RandomizedRunner$4.evaluate(RandomizedRunner.java:682)
	at com.carrotsearch.randomizedtesting.RandomizedRunner$5.evaluate(RandomizedRunner.java:693)
	at com.carrotsearch.randomizedtesting.rules.StatementAdapter.evaluate(StatementAdapter.java:36)
	at com.carrotsearch.randomizedtesting.rules.SystemPropertiesRestoreRule$1.evaluate(SystemPropertiesRestoreRule.java:53)
	at org.apache.lucene.util.AbstractBeforeAfterRule$1.evaluate(AbstractBeforeAfterRule.java:45)
	at org.apache.lucene.util.TestRuleStoreClassName$1.evaluate(TestRuleStoreClassName.java:42)
	at com.carrotsearch.randomizedtesting.rules.SystemPropertiesInvariantRule$1.evaluate(SystemPropertiesInvariantRule.java:55)
	at com.carrotsearch.randomizedtesting.rules.NoShadowingOrOverridesOnMethodsRule$1.evaluate(NoShadowingOrOverridesOnMethodsRule.java:39)
	at com.carrotsearch.randomizedtesting.rules.NoShadowingOrOverridesOnMethodsRule$1.evaluate(NoShadowingOrOverridesOnMethodsRule.java:39)
	at com.carrotsearch.randomizedtesting.rules.StatementAdapter.evaluate(StatementAdapter.java:36)
	at org.apache.lucene.util.TestRuleAssertionsRequired$1.evaluate(TestRuleAssertionsRequired.java:43)
	at org.apache.lucene.util.TestRuleMarkFailure$1.evaluate(TestRuleMarkFailure.java:48)
	at org.apache.lucene.util.TestRuleIgnoreAfterMaxFailures$1.evaluate(TestRuleIgnoreAfterMaxFailures.java:70)
	at org.apache.lucene.util.TestRuleIgnoreTestSuites$1.evaluate(TestRuleIgnoreTestSuites.java:55)
	at com.carrotsearch.randomizedtesting.rules.StatementAdapter.evaluate(StatementAdapter.java:36)
	at com.carrotsearch.randomizedtesting.ThreadLeakControl$StatementRunner.run(ThreadLeakControl.java:358)
	at java.lang.Thread.run(Thread.java:722)




Build Log:
[...truncated 9060 lines...]
[junit4:junit4] Suite: org.apache.solr.cloud.BasicDistributedZkTest
[junit4:junit4]   2> 5 T725 oas.SolrTestCaseJ4.setUp ###Starting testDistribSearch
[junit4:junit4]   2> Creating dataDir: /usr/home/hudson/hudson-slave/workspace/Lucene-Solr-Tests-4.x-java7/solr/build/solr-core/test/J0/./solrtest-BasicDistributedZkTest-1349886657073
[junit4:junit4]   2> 6 T725 oasc.ZkTestServer.run STARTING ZK TEST SERVER
[junit4:junit4]   2> 9 T726 oazs.ZooKeeperServer.setTickTime tickTime set to 1000
[junit4:junit4]   2> 9 T726 oazs.NIOServerCnxn$Factory.<init> binding to port 0.0.0.0/0.0.0.0:0
[junit4:junit4]   2> 10 T726 oazsp.FileTxnSnapLog.save Snapshotting: 0
[junit4:junit4]   2> 107 T725 oasc.ZkTestServer.run start zk server on port:39050
[junit4:junit4]   2> 108 T725 oaz.ZooKeeper.<init> Initiating client connection, connectString=127.0.0.1:39050 sessionTimeout=10000 watcher=org.apache.solr.common.cloud.ConnectionManager@3d7a4ab2
[junit4:junit4]   2> 108 T731 oaz.ClientCnxn$SendThread.startConnect Opening socket connection to server /127.0.0.1:39050
[junit4:junit4]   2> 108 T725 oascc.ConnectionManager.waitForConnected Waiting for client to connect to ZooKeeper
[junit4:junit4]   2> 110 T731 oaz.ClientCnxn$SendThread.primeConnection Socket connection established to localhost/127.0.0.1:39050, initiating session
[junit4:junit4]   2> 110 T727 oazs.NIOServerCnxn$Factory.run Accepted socket connection from /140.211.11.196:39051
[junit4:junit4]   2> 110 T727 oazs.NIOServerCnxn.readConnectRequest Client attempting to establish new session at /140.211.11.196:39051
[junit4:junit4]   2> 111 T729 oazsp.FileTxnLog.append Creating new log file: log.1
[junit4:junit4]   2> 114 T729 oazs.NIOServerCnxn.finishSessionInit Established session 0x13a4b83c2360000 with negotiated timeout 10000 for client /140.211.11.196:39051
[junit4:junit4]   2> 114 T731 oaz.ClientCnxn$SendThread.readConnectResult Session establishment complete on server localhost/127.0.0.1:39050, sessionid = 0x13a4b83c2360000, negotiated timeout = 10000
[junit4:junit4]   2> 114 T732 oascc.ConnectionManager.process Watcher org.apache.solr.common.cloud.ConnectionManager@3d7a4ab2 name:ZooKeeperConnection Watcher:127.0.0.1:39050 got event WatchedEvent state:SyncConnected type:None path:null path:null type:None
[junit4:junit4]   2> 114 T725 oascc.ConnectionManager.waitForConnected Client is connected to ZooKeeper
[junit4:junit4]   2> 115 T725 oascc.SolrZkClient.makePath makePath: /solr
[junit4:junit4]   2> 117 T730 oazs.PrepRequestProcessor.pRequest Processed session termination for sessionid: 0x13a4b83c2360000
[junit4:junit4]   2> 126 T732 oaz.ClientCnxn$EventThread.run EventThread shut down
[junit4:junit4]   2> 126 T725 oaz.ZooKeeper.close Session: 0x13a4b83c2360000 closed
[junit4:junit4]   2> 126 T727 oazs.NIOServerCnxn.closeSock Closed socket connection for client /140.211.11.196:39051 which had sessionid 0x13a4b83c2360000
[junit4:junit4]   2> 127 T725 oaz.ZooKeeper.<init> Initiating client connection, connectString=127.0.0.1:39050/solr sessionTimeout=10000 watcher=org.apache.solr.common.cloud.ConnectionManager@57118b17
[junit4:junit4]   2> 128 T733 oaz.ClientCnxn$SendThread.startConnect Opening socket connection to server /127.0.0.1:39050
[junit4:junit4]   2> 128 T725 oascc.ConnectionManager.waitForConnected Waiting for client to connect to ZooKeeper
[junit4:junit4]   2> 129 T733 oaz.ClientCnxn$SendThread.primeConnection Socket connection established to localhost/127.0.0.1:39050, initiating session
[junit4:junit4]   2> 129 T727 oazs.NIOServerCnxn$Factory.run Accepted socket connection from /140.211.11.196:39052
[junit4:junit4]   2> 129 T727 oazs.NIOServerCnxn.readConnectRequest Client attempting to establish new session at /140.211.11.196:39052
[junit4:junit4]   2> 130 T729 oazs.NIOServerCnxn.finishSessionInit Established session 0x13a4b83c2360001 with negotiated timeout 10000 for client /140.211.11.196:39052
[junit4:junit4]   2> 130 T733 oaz.ClientCnxn$SendThread.readConnectResult Session establishment complete on server localhost/127.0.0.1:39050, sessionid = 0x13a4b83c2360001, negotiated timeout = 10000
[junit4:junit4]   2> 131 T734 oascc.ConnectionManager.process Watcher org.apache.solr.common.cloud.ConnectionManager@57118b17 name:ZooKeeperConnection Watcher:127.0.0.1:39050/solr got event WatchedEvent state:SyncConnected type:None path:null path:null type:None
[junit4:junit4]   2> 131 T725 oascc.ConnectionManager.waitForConnected Client is connected to ZooKeeper
[junit4:junit4]   2> 131 T725 oascc.SolrZkClient.makePath makePath: /collections/collection1
[junit4:junit4]   2> 141 T725 oascc.SolrZkClient.makePath makePath: /collections/collection1/shards
[junit4:junit4]   2> 144 T725 oascc.SolrZkClient.makePath makePath: /collections/control_collection
[junit4:junit4]   2> 146 T725 oascc.SolrZkClient.makePath makePath: /collections/control_collection/shards
[junit4:junit4]   2> 155 T725 oasc.AbstractZkTestCase.putConfig put /usr/home/hudson/hudson-slave/workspace/Lucene-Solr-Tests-4.x-java7/solr/build/solr-core/test-files/solr/collection1/conf/solrconfig.xml to /configs/conf1/solrconfig.xml
[junit4:junit4]   2> 155 T725 oascc.SolrZkClient.makePath makePath: /configs/conf1/solrconfig.xml
[junit4:junit4]   2> 168 T725 oasc.AbstractZkTestCase.putConfig put /usr/home/hudson/hudson-slave/workspace/Lucene-Solr-Tests-4.x-java7/solr/build/solr-core/test-files/solr/collection1/conf/schema.xml to /configs/conf1/schema.xml
[junit4:junit4]   2> 169 T725 oascc.SolrZkClient.makePath makePath: /configs/conf1/schema.xml
[junit4:junit4]   2> 274 T725 oasc.AbstractZkTestCase.putConfig put /usr/home/hudson/hudson-slave/workspace/Lucene-Solr-Tests-4.x-java7/solr/build/solr-core/test-files/solr/collection1/conf/solrconfig.xml to /configs/conf1/solrconfig.xml
[junit4:junit4]   2> 275 T725 oascc.SolrZkClient.makePath makePath: /configs/conf1/solrconfig.xml
[junit4:junit4]   2> 278 T725 oasc.AbstractZkTestCase.putConfig put /usr/home/hudson/hudson-slave/workspace/Lucene-Solr-Tests-4.x-java7/solr/build/solr-core/test-files/solr/collection1/conf/stopwords.txt to /configs/conf1/stopwords.txt
[junit4:junit4]   2> 278 T725 oascc.SolrZkClient.makePath makePath: /configs/conf1/stopwords.txt
[junit4:junit4]   2> 286 T725 oasc.AbstractZkTestCase.putConfig put /usr/home/hudson/hudson-slave/workspace/Lucene-Solr-Tests-4.x-java7/solr/build/solr-core/test-files/solr/collection1/conf/protwords.txt to /configs/conf1/protwords.txt
[junit4:junit4]   2> 287 T725 oascc.SolrZkClient.makePath makePath: /configs/conf1/protwords.txt
[junit4:junit4]   2> 292 T725 oasc.AbstractZkTestCase.putConfig put /usr/home/hudson/hudson-slave/workspace/Lucene-Solr-Tests-4.x-java7/solr/build/solr-core/test-files/solr/collection1/conf/currency.xml to /configs/conf1/currency.xml
[junit4:junit4]   2> 293 T725 oascc.SolrZkClient.makePath makePath: /configs/conf1/currency.xml
[junit4:junit4]   2> 323 T725 oasc.AbstractZkTestCase.putConfig put /usr/home/hudson/hudson-slave/workspace/Lucene-Solr-Tests-4.x-java7/solr/build/solr-core/test-files/solr/collection1/conf/open-exchange-rates.json to /configs/conf1/open-exchange-rates.json
[junit4:junit4]   2> 324 T725 oascc.SolrZkClient.makePath makePath: /configs/conf1/open-exchange-rates.json
[junit4:junit4]   2> 327 T725 oasc.AbstractZkTestCase.putConfig put /usr/home/hudson/hudson-slave/workspace/Lucene-Solr-Tests-4.x-java7/solr/build/solr-core/test-files/solr/collection1/conf/mapping-ISOLatin1Accent.txt to /configs/conf1/mapping-ISOLatin1Accent.txt
[junit4:junit4]   2> 327 T725 oascc.SolrZkClient.makePath makePath: /configs/conf1/mapping-ISOLatin1Accent.txt
[junit4:junit4]   2> 330 T725 oasc.AbstractZkTestCase.putConfig put /usr/home/hudson/hudson-slave/workspace/Lucene-Solr-Tests-4.x-java7/solr/build/solr-core/test-files/solr/collection1/conf/old_synonyms.txt to /configs/conf1/old_synonyms.txt
[junit4:junit4]   2> 331 T725 oascc.SolrZkClient.makePath makePath: /configs/conf1/old_synonyms.txt
[junit4:junit4]   2> 333 T725 oasc.AbstractZkTestCase.putConfig put /usr/home/hudson/hudson-slave/workspace/Lucene-Solr-Tests-4.x-java7/solr/build/solr-core/test-files/solr/collection1/conf/synonyms.txt to /configs/conf1/synonyms.txt
[junit4:junit4]   2> 334 T725 oascc.SolrZkClient.makePath makePath: /configs/conf1/synonyms.txt
[junit4:junit4]   2> 341 T730 oazs.PrepRequestProcessor.pRequest Processed session termination for sessionid: 0x13a4b83c2360001
[junit4:junit4]   2> 342 T734 oaz.ClientCnxn$EventThread.run EventThread shut down
[junit4:junit4]   2> 342 T727 oazs.NIOServerCnxn.closeSock Closed socket connection for client /140.211.11.196:39052 which had sessionid 0x13a4b83c2360001
[junit4:junit4]   2> 342 T725 oaz.ZooKeeper.close Session: 0x13a4b83c2360001 closed
[junit4:junit4]   2> 346 T725 oejs.Server.doStart jetty-8.1.2.v20120308
[junit4:junit4]   2> 349 T725 oejs.AbstractConnector.doStart Started SocketConnector@0.0.0.0:39054
[junit4:junit4]   2> 350 T725 oasc.SolrResourceLoader.locateSolrHome JNDI not configured for solr (NoInitialContextEx)
[junit4:junit4]   2> 350 T725 oasc.SolrResourceLoader.locateSolrHome using system property solr.solr.home: /usr/home/hudson/hudson-slave/workspace/Lucene-Solr-Tests-4.x-java7/solr/build/solr-core/test-files/solr
[junit4:junit4]   2> 351 T725 oasc.SolrResourceLoader.<init> new SolrResourceLoader for deduced Solr Home: '/usr/home/hudson/hudson-slave/workspace/Lucene-Solr-Tests-4.x-java7/solr/build/solr-core/test-files/solr/'
[junit4:junit4]   2> 381 T725 oass.SolrDispatchFilter.init SolrDispatchFilter.init()
[junit4:junit4]   2> 381 T725 oasc.SolrResourceLoader.locateSolrHome JNDI not configured for solr (NoInitialContextEx)
[junit4:junit4]   2> 382 T725 oasc.SolrResourceLoader.locateSolrHome using system property solr.solr.home: /usr/home/hudson/hudson-slave/workspace/Lucene-Solr-Tests-4.x-java7/solr/build/solr-core/test-files/solr
[junit4:junit4]   2> 382 T725 oasc.CoreContainer$Initializer.initialize looking for solr.xml: /usr/home/hudson/hudson-slave/workspace/Lucene-Solr-Tests-4.x-java7/solr/build/solr-core/test-files/solr/solr.xml
[junit4:junit4]   2> 382 T725 oasc.CoreContainer.<init> New CoreContainer 1460510485
[junit4:junit4]   2> 383 T725 oasc.CoreContainer.load Loading CoreContainer using Solr Home: '/usr/home/hudson/hudson-slave/workspace/Lucene-Solr-Tests-4.x-java7/solr/build/solr-core/test-files/solr/'
[junit4:junit4]   2> 383 T725 oasc.SolrResourceLoader.<init> new SolrResourceLoader for directory: '/usr/home/hudson/hudson-slave/workspace/Lucene-Solr-Tests-4.x-java7/solr/build/solr-core/test-files/solr/'
[junit4:junit4]   2> 408 T725 oasc.CoreContainer.load Registering Log Listener
[junit4:junit4]   2> 419 T725 oasc.CoreContainer.initZooKeeper Zookeeper client=127.0.0.1:39050/solr
[junit4:junit4]   2> 420 T725 oaz.ZooKeeper.<init> Initiating client connection, connectString=127.0.0.1:39050/solr sessionTimeout=5000 watcher=org.apache.solr.common.cloud.ConnectionManager@22e25481
[junit4:junit4]   2> 421 T744 oaz.ClientCnxn$SendThread.startConnect Opening socket connection to server /127.0.0.1:39050
[junit4:junit4]   2> 421 T725 oascc.ConnectionManager.waitForConnected Waiting for client to connect to ZooKeeper
[junit4:junit4]   2> 422 T744 oaz.ClientCnxn$SendThread.primeConnection Socket connection established to localhost/127.0.0.1:39050, initiating session
[junit4:junit4]   2> 423 T727 oazs.NIOServerCnxn$Factory.run Accepted socket connection from /140.211.11.196:39055
[junit4:junit4]   2> 423 T727 oazs.NIOServerCnxn.readConnectRequest Client attempting to establish new session at /140.211.11.196:39055
[junit4:junit4]   2> 424 T729 oazs.NIOServerCnxn.finishSessionInit Established session 0x13a4b83c2360002 with negotiated timeout 5000 for client /140.211.11.196:39055
[junit4:junit4]   2> 425 T744 oaz.ClientCnxn$SendThread.readConnectResult Session establishment complete on server localhost/127.0.0.1:39050, sessionid = 0x13a4b83c2360002, negotiated timeout = 5000
[junit4:junit4]   2> 425 T745 oascc.ConnectionManager.process Watcher org.apache.solr.common.cloud.ConnectionManager@22e25481 name:ZooKeeperConnection Watcher:127.0.0.1:39050/solr got event WatchedEvent state:SyncConnected type:None path:null path:null type:None
[junit4:junit4]   2> 425 T725 oascc.ConnectionManager.waitForConnected Client is connected to ZooKeeper
[junit4:junit4]   2> 427 T730 oazs.PrepRequestProcessor.pRequest Got user-level KeeperException when processing sessionid:0x13a4b83c2360002 type:create cxid:0x2 zxid:0xfffffffffffffffe txntype:unknown reqpath:n/a Error Path:/solr/overseer Error:KeeperErrorCode = NodeExists for /solr/overseer
[junit4:junit4]   2> 436 T725 oascc.SolrZkClient.makePath makePath: /live_nodes
[junit4:junit4]   2> 438 T725 oasc.ZkController.createEphemeralLiveNode Register node as live in ZooKeeper:/live_nodes/127.0.0.1:39054_solr
[junit4:junit4]   2> 438 T730 oazs.PrepRequestProcessor.pRequest Got user-level KeeperException when processing sessionid:0x13a4b83c2360002 type:delete cxid:0x7 zxid:0xfffffffffffffffe txntype:unknown reqpath:n/a Error Path:/solr/live_nodes/127.0.0.1:39054_solr Error:KeeperErrorCode = NoNode for /solr/live_nodes/127.0.0.1:39054_solr
[junit4:junit4]   2> 439 T725 oascc.SolrZkClient.makePath makePath: /live_nodes/127.0.0.1:39054_solr
[junit4:junit4]   2> 449 T725 oashc.HttpShardHandlerFactory.getParameter Setting socketTimeout to: 0
[junit4:junit4]   2> 449 T725 oashc.HttpShardHandlerFactory.getParameter Setting urlScheme to: http://
[junit4:junit4]   2> 450 T725 oashc.HttpShardHandlerFactory.getParameter Setting connTimeout to: 0
[junit4:junit4]   2> 450 T725 oashc.HttpShardHandlerFactory.getParameter Setting maxConnectionsPerHost to: 20
[junit4:junit4]   2> 450 T725 oashc.HttpShardHandlerFactory.getParameter Setting corePoolSize to: 0
[junit4:junit4]   2> 451 T725 oashc.HttpShardHandlerFactory.getParameter Setting maximumPoolSize to: 2147483647
[junit4:junit4]   2> 451 T725 oashc.HttpShardHandlerFactory.getParameter Setting maxThreadIdleTime to: 5
[junit4:junit4]   2> 451 T725 oashc.HttpShardHandlerFactory.getParameter Setting sizeOfQueue to: -1
[junit4:junit4]   2> 452 T725 oashc.HttpShardHandlerFactory.getParameter Setting fairnessPolicy to: false
[junit4:junit4]   2> 452 T725 oascsi.HttpClientUtil.createClient Creating new http client, config:maxConnectionsPerHost=20&maxConnections=10000&socketTimeout=0&connTimeout=0&retry=false
[junit4:junit4]   2> 463 T725 oascc.SolrZkClient.makePath makePath: /overseer_elect/election
[junit4:junit4]   2> 474 T730 oazs.PrepRequestProcessor.pRequest Got user-level KeeperException when processing sessionid:0x13a4b83c2360002 type:delete cxid:0x15 zxid:0xfffffffffffffffe txntype:unknown reqpath:n/a Error Path:/solr/overseer_elect/leader Error:KeeperErrorCode = NoNode for /solr/overseer_elect/leader
[junit4:junit4]   2> 481 T725 oascc.SolrZkClient.makePath makePath: /overseer_elect/leader
[junit4:junit4]   2> 483 T725 oasc.Overseer.start Overseer (id=88466171958263810-127.0.0.1:39054_solr-n_0000000000) starting
[junit4:junit4]   2> 484 T730 oazs.PrepRequestProcessor.pRequest Got user-level KeeperException when processing sessionid:0x13a4b83c2360002 type:create cxid:0x1a zxid:0xfffffffffffffffe txntype:unknown reqpath:n/a Error Path:/solr/overseer Error:KeeperErrorCode = NodeExists for /solr/overseer
[junit4:junit4]   2> 485 T730 oazs.PrepRequestProcessor.pRequest Got user-level KeeperException when processing sessionid:0x13a4b83c2360002 type:create cxid:0x1b zxid:0xfffffffffffffffe txntype:unknown reqpath:n/a Error Path:/solr/overseer Error:KeeperErrorCode = NodeExists for /solr/overseer
[junit4:junit4]   2> 486 T730 oazs.PrepRequestProcessor.pRequest Got user-level KeeperException when processing sessionid:0x13a4b83c2360002 type:create cxid:0x1c zxid:0xfffffffffffffffe txntype:unknown reqpath:n/a Error Path:/solr/overseer Error:KeeperErrorCode = NodeExists for /solr/overseer
[junit4:junit4]   2> 497 T730 oazs.PrepRequestProcessor.pRequest Got user-level KeeperException when processing sessionid:0x13a4b83c2360002 type:create cxid:0x1d zxid:0xfffffffffffffffe txntype:unknown reqpath:n/a Error Path:/solr/overseer Error:KeeperErrorCode = NodeExists for /solr/overseer
[junit4:junit4]   2> 498 T747 oasc.OverseerCollectionProcessor.run Process current queue of collection creations
[junit4:junit4]   2> 499 T725 oascc.SolrZkClient.makePath makePath: /clusterstate.json
[junit4:junit4]   2> 508 T725 oascc.ZkStateReader.createClusterStateWatchersAndUpdate Updating cluster state from ZooKeeper... 
[junit4:junit4]   2> 510 T746 oasc.Overseer$ClusterStateUpdater.run Starting to work on the main queue
[junit4:junit4]   2> 516 T725 oasc.CoreContainer.create Creating SolrCore 'collection1' using instanceDir: /usr/home/hudson/hudson-slave/workspace/Lucene-Solr-Tests-4.x-java7/solr/build/solr-core/test-files/solr/collection1
[junit4:junit4]   2> 516 T725 oasc.ZkController.createCollectionZkNode Check for collection zkNode:control_collection
[junit4:junit4]   2> 517 T725 oasc.ZkController.createCollectionZkNode Collection zkNode exists
[junit4:junit4]   2> 517 T725 oasc.ZkController.readConfigName Load collection config from:/collections/control_collection
[junit4:junit4]   2> 519 T725 oasc.SolrResourceLoader.<init> new SolrResourceLoader for directory: '/usr/home/hudson/hudson-slave/workspace/Lucene-Solr-Tests-4.x-java7/solr/build/solr-core/test-files/solr/collection1/'
[junit4:junit4]   2> 520 T725 oasc.SolrResourceLoader.replaceClassLoader Adding 'file:/usr/home/hudson/hudson-slave/workspace/Lucene-Solr-Tests-4.x-java7/solr/build/solr-core/test-files/solr/collection1/lib/README' to classloader
[junit4:junit4]   2> 521 T725 oasc.SolrResourceLoader.replaceClassLoader Adding 'file:/usr/home/hudson/hudson-slave/workspace/Lucene-Solr-Tests-4.x-java7/solr/build/solr-core/test-files/solr/collection1/lib/classes/' to classloader
[junit4:junit4]   2> 557 T725 oasc.SolrConfig.<init> Using Lucene MatchVersion: LUCENE_41
[junit4:junit4]   2> 606 T725 oasc.SolrConfig.<init> Loaded SolrConfig: solrconfig.xml
[junit4:junit4]   2> 708 T725 oass.IndexSchema.readSchema Reading Solr Schema
[junit4:junit4]   2> 714 T725 oass.IndexSchema.readSchema Schema name=test
[junit4:junit4]   2> 1154 T725 oass.OpenExchangeRatesOrgProvider.init Initialized with rates=open-exchange-rates.json, refreshInterval=1440.
[junit4:junit4]   2> 1163 T725 oass.IndexSchema.readSchema default search field in schema is text
[junit4:junit4]   2> 1166 T725 oass.IndexSchema.readSchema unique key field: id
[junit4:junit4]   2> 1176 T725 oass.FileExchangeRateProvider.reload Reloading exchange rates from file currency.xml
[junit4:junit4]   2> 1180 T725 oass.FileExchangeRateProvider.reload Reloading exchange rates from file currency.xml
[junit4:junit4]   2> 1184 T725 oass.OpenExchangeRatesOrgProvider.reload Reloading exchange rates from open-exchange-rates.json
[junit4:junit4]   2> 1185 T725 oass.OpenExchangeRatesOrgProvider.reload Reloading exchange rates from open-exchange-rates.json
[junit4:junit4]   2> 1186 T725 oasc.SolrCore.<init> [collection1] Opening new SolrCore at /usr/home/hudson/hudson-slave/workspace/Lucene-Solr-Tests-4.x-java7/solr/build/solr-core/test-files/solr/collection1/, dataDir=./org.apache.solr.cloud.BasicDistributedZkTest-1349886657073/control/data/
[junit4:junit4]   2> 1186 T725 oasc.JmxMonitoredMap.<init> JMX monitoring is enabled. Adding Solr mbeans to JMX Server: com.sun.jmx.mbeanserver.JmxMBeanServer@38559e4f
[junit4:junit4]   2> 1215 T725 oasc.SolrCore.getNewIndexDir New index directory detected: old=null new=./org.apache.solr.cloud.BasicDistributedZkTest-1349886657073/control/data/index/
[junit4:junit4]   2> 1216 T725 oasc.SolrCore.initIndex WARNING [collection1] Solr index directory './org.apache.solr.cloud.BasicDistributedZkTest-1349886657073/control/data/index' doesn't exist. Creating new index...
[junit4:junit4]   2> 1219 T725 oasc.CachingDirectoryFactory.get return new directory for /usr/home/hudson/hudson-slave/workspace/Lucene-Solr-Tests-4.x-java7/solr/build/solr-core/test/J0/./org.apache.solr.cloud.BasicDistributedZkTest-1349886657073/control/data/index forceNew:false
[junit4:junit4]   2> 1250 T725 oasc.SolrDeletionPolicy.onCommit SolrDeletionPolicy.onCommit: commits:num=1
[junit4:junit4]   2> 		commit{dir=NRTCachingDirectory(org.apache.lucene.store.NIOFSDirectory@/usr/home/hudson/hudson-slave/workspace/Lucene-Solr-Tests-4.x-java7/solr/build/solr-core/test/J0/org.apache.solr.cloud.BasicDistributedZkTest-1349886657073/control/data/index lockFactory=org.apache.lucene.store.NativeFSLockFactory@67511e43; maxCacheMB=48.0 maxMergeSizeMB=4.0),segFN=segments_1,generation=1,filenames=[segments_1]
[junit4:junit4]   2> 1250 T725 oasc.SolrDeletionPolicy.updateCommits newest commit = 1
[junit4:junit4]   2> 1251 T725 oasc.SolrCore.initWriters created xml: solr.XMLResponseWriter
[junit4:junit4]   2> 1253 T725 oasup.UpdateRequestProcessorChain.init inserting DistributedUpdateProcessorFactory into updateRequestProcessorChain "dedupe"
[junit4:junit4]   2> 1253 T725 oasup.UpdateRequestProcessorChain.init inserting DistributedUpdateProcessorFactory into updateRequestProcessorChain "dedupe-allfields"
[junit4:junit4]   2> 1254 T725 oasup.UpdateRequestProcessorChain.init inserting DistributedUpdateProcessorFactory into updateRequestProcessorChain "stored_sig"
[junit4:junit4]   2> 1254 T725 oasup.UpdateRequestProcessorChain.init inserting DistributedUpdateProcessorFactory into updateRequestProcessorChain "uniq-fields"
[junit4:junit4]   2> 1255 T725 oasup.UpdateRequestProcessorChain.init inserting DistributedUpdateProcessorFactory into updateRequestProcessorChain "distrib-dup-test-chain-implicit"
[junit4:junit4]   2> 1255 T725 oasc.RequestHandlers.initHandlersFromConfig adding lazy requestHandler: solr.ReplicationHandler
[junit4:junit4]   2> 1256 T725 oasc.RequestHandlers.initHandlersFromConfig created /replication: solr.ReplicationHandler
[junit4:junit4]   2> 1256 T725 oasc.RequestHandlers.initHandlersFromConfig created standard: solr.StandardRequestHandler
[junit4:junit4]   2> 1257 T725 oasc.RequestHandlers.initHandlersFromConfig created /get: solr.RealTimeGetHandler
[junit4:junit4]   2> 1257 T725 oasc.RequestHandlers.initHandlersFromConfig created dismax: solr.SearchHandler
[junit4:junit4]   2> 1258 T725 oasc.RequestHandlers.initHandlersFromConfig created mock: org.apache.solr.core.MockQuerySenderListenerReqHandler
[junit4:junit4]   2> 1258 T725 oasc.RequestHandlers.initHandlersFromConfig created /admin/: org.apache.solr.handler.admin.AdminHandlers
[junit4:junit4]   2> 1258 T725 oasc.RequestHandlers.initHandlersFromConfig created defaults: solr.StandardRequestHandler
[junit4:junit4]   2> 1259 T725 oasc.RequestHandlers.initHandlersFromConfig adding lazy requestHandler: solr.StandardRequestHandler
[junit4:junit4]   2> 1259 T725 oasc.RequestHandlers.initHandlersFromConfig created lazy: solr.StandardRequestHandler
[junit4:junit4]   2> 1260 T725 oasc.RequestHandlers.initHandlersFromConfig created /update: solr.UpdateRequestHandler
[junit4:junit4]   2> 1260 T725 oasc.RequestHandlers.initHandlersFromConfig created /terms: org.apache.solr.handler.component.SearchHandler
[junit4:junit4]   2> 1261 T725 oasc.RequestHandlers.initHandlersFromConfig created spellCheckCompRH: org.apache.solr.handler.component.SearchHandler
[junit4:junit4]   2> 1261 T725 oasc.RequestHandlers.initHandlersFromConfig created spellCheckCompRH_Direct: org.apache.solr.handler.component.SearchHandler
[junit4:junit4]   2> 1261 T725 oasc.RequestHandlers.initHandlersFromConfig created spellCheckWithWordbreak: org.apache.solr.handler.component.SearchHandler
[junit4:junit4]   2> 1262 T725 oasc.RequestHandlers.initHandlersFromConfig created spellCheckWithWordbreak_Direct: org.apache.solr.handler.component.SearchHandler
[junit4:junit4]   2> 1262 T725 oasc.RequestHandlers.initHandlersFromConfig created spellCheckCompRH1: org.apache.solr.handler.component.SearchHandler
[junit4:junit4]   2> 1263 T725 oasc.RequestHandlers.initHandlersFromConfig created tvrh: org.apache.solr.handler.component.SearchHandler
[junit4:junit4]   2> 1263 T725 oasc.RequestHandlers.initHandlersFromConfig created /mlt: solr.MoreLikeThisHandler
[junit4:junit4]   2> 1264 T725 oasc.RequestHandlers.initHandlersFromConfig created /debug/dump: solr.DumpRequestHandler
[junit4:junit4]   2> 1274 T725 oashl.XMLLoader.init xsltCacheLifetimeSeconds=60
[junit4:junit4]   2> 1278 T725 oasc.SolrCore.initDeprecatedSupport WARNING solrconfig.xml uses deprecated <admin/gettableFiles>, Please update your config to use the ShowFileRequestHandler.
[junit4:junit4]   2> 1280 T725 oasc.SolrCore.initDeprecatedSupport WARNING adding ShowFileRequestHandler with hidden files: [SCHEMA.XML, OLD_SYNONYMS.TXT, STOPWORDS.TXT, PROTWORDS.TXT, OPEN-EXCHANGE-RATES.JSON, SYNONYMS.TXT, CURRENCY.XML, MAPPING-ISOLATIN1ACCENT.TXT]
[junit4:junit4]   2> 1283 T725 oass.SolrIndexSearcher.<init> Opening Searcher@6bf7754f main
[junit4:junit4]   2> 1284 T725 oasu.CommitTracker.<init> Hard AutoCommit: disabled
[junit4:junit4]   2> 1284 T725 oasu.CommitTracker.<init> Soft AutoCommit: disabled
[junit4:junit4]   2> 1285 T725 oashc.SpellCheckComponent.inform Initializing spell checkers
[junit4:junit4]   2> 1300 T725 oass.DirectSolrSpellChecker.init init: {name=direct,classname=DirectSolrSpellChecker,field=lowerfilt,minQueryLength=3}
[junit4:junit4]   2> 1352 T748 oasc.SolrCore.registerSearcher [collection1] Registered new searcher Searcher@6bf7754f main{StandardDirectoryReader(segments_1:1)}
[junit4:junit4]   2> 1356 T730 oazs.PrepRequestProcessor.pRequest Got user-level KeeperException when processing sessionid:0x13a4b83c2360002 type:create cxid:0x53 zxid:0xfffffffffffffffe txntype:unknown reqpath:n/a Error Path:/solr/overseer/queue Error:KeeperErrorCode = NoNode for /solr/overseer/queue
[junit4:junit4]   2> 1367 T725 oasc.CoreContainer.register registering core: collection1
[junit4:junit4]   2> 1368 T725 oasc.ZkController.register Register shard - core:collection1 address:http://127.0.0.1:39054/solr shardId:control_shard
[junit4:junit4]   2> 1377 T725 oascsi.HttpClientUtil.createClient Creating new http client, config:maxConnections=10000&maxConnectionsPerHost=20&connTimeout=30000&socketTimeout=30000&retry=false
[junit4:junit4]   2> 1389 T725 oascc.SolrZkClient.makePath makePath: /collections/control_collection/leader_elect/control_shard/election
[junit4:junit4]   2> 1406 T730 oazs.PrepRequestProcessor.pRequest Got user-level KeeperException when processing sessionid:0x13a4b83c2360002 type:delete cxid:0x62 zxid:0xfffffffffffffffe txntype:unknown reqpath:n/a Error Path:/solr/collections/control_collection/leaders Error:KeeperErrorCode = NoNode for /solr/collections/control_collection/leaders
[junit4:junit4]   2> 1406 T725 oasc.ShardLeaderElectionContext.runLeaderProcess Running the leader process.
[junit4:junit4]   2> 1407 T730 oazs.PrepRequestProcessor.pRequest Got user-level KeeperException when processing sessionid:0x13a4b83c2360002 type:create cxid:0x63 zxid:0xfffffffffffffffe txntype:unknown reqpath:n/a Error Path:/solr/overseer Error:KeeperErrorCode = NodeExists for /solr/overseer
[junit4:junit4]   2> 1516 T746 oascc.ZkStateReader.updateClusterState Updating cloud state from ZooKeeper... 
[junit4:junit4]   2> 1530 T730 oazs.PrepRequestProcessor.pRequest Got user-level KeeperException when processing sessionid:0x13a4b83c2360002 type:create cxid:0x6a zxid:0xfffffffffffffffe txntype:unknown reqpath:n/a Error Path:/solr/overseer/queue-work Error:KeeperErrorCode = NoNode for /solr/overseer/queue-work
[junit4:junit4]   2> 1558 T745 oascc.ZkStateReader$2.process A cluster state change has occurred - updating...
[junit4:junit4]   2> 1918 T725 oasc.ShardLeaderElectionContext.waitForReplicasToComeUp Enough replicas found to continue.
[junit4:junit4]   2> 1919 T725 oasc.ShardLeaderElectionContext.runLeaderProcess I may be the new leader - try and sync
[junit4:junit4]   2> 1919 T725 oasc.SyncStrategy.sync Sync replicas to http://127.0.0.1:39054/solr/collection1/
[junit4:junit4]   2> 1920 T725 oasc.SyncStrategy.syncReplicas Sync Success - now sync replicas to me
[junit4:junit4]   2> 1920 T725 oasc.SyncStrategy.syncToMe http://127.0.0.1:39054/solr/collection1/ has no replicas
[junit4:junit4]   2> 1921 T725 oasc.ShardLeaderElectionContext.runLeaderProcess I am the new leader: http://127.0.0.1:39054/solr/collection1/
[junit4:junit4]   2> 1921 T725 oascc.SolrZkClient.makePath makePath: /collections/control_collection/leaders/control_shard
[junit4:junit4]   2> 1956 T730 oazs.PrepRequestProcessor.pRequest Got user-level KeeperException when processing sessionid:0x13a4b83c2360002 type:create cxid:0x88 zxid:0xfffffffffffffffe txntype:unknown reqpath:n/a Error Path:/solr/overseer Error:KeeperErrorCode = NodeExists for /solr/overseer
[junit4:junit4]   2> 2063 T746 oascc.ZkStateReader.updateClusterState Updating cloud state from ZooKeeper... 
[junit4:junit4]   2> 2081 T745 oascc.ZkStateReader$2.process A cluster state change has occurred - updating...
[junit4:junit4]   2> 2112 T725 oasc.ZkController.register We are http://127.0.0.1:39054/solr/collection1/ and leader is http://127.0.0.1:39054/solr/collection1/
[junit4:junit4]   2> 2112 T725 oasc.ZkController.register No LogReplay needed for core=collection1 baseURL=http://127.0.0.1:39054/solr
[junit4:junit4]   2> 2113 T725 oasc.ZkController.checkRecovery I am the leader, no recovery necessary
[junit4:junit4]   2> 2115 T725 oascc.ZkStateReader.updateClusterState Updating cloud state from ZooKeeper... 
[junit4:junit4]   2> 2116 T725 oass.SolrDispatchFilter.init user.dir=/usr/home/hudson/hudson-slave/workspace/Lucene-Solr-Tests-4.x-java7/solr/build/solr-core/test/J0
[junit4:junit4]   2> 2116 T725 oass.SolrDispatchFilter.init SolrDispatchFilter.init() done
[junit4:junit4]   2> 2117 T725 oascsi.HttpClientUtil.createClient Creating new http client, config:maxConnections=128&maxConnectionsPerHost=32&followRedirects=false
[junit4:junit4]   2> 2257 T725 oejs.Server.doStart jetty-8.1.2.v20120308
[junit4:junit4]   2> 2260 T725 oejs.AbstractConnector.doStart Started SocketConnector@0.0.0.0:39058
[junit4:junit4]   2> 2261 T725 oasc.SolrResourceLoader.locateSolrHome JNDI not configured for solr (NoInitialContextEx)
[junit4:junit4]   2> 2261 T725 oasc.SolrResourceLoader.locateSolrHome using system property solr.solr.home: /usr/home/hudson/hudson-slave/workspace/Lucene-Solr-Tests-4.x-java7/solr/build/solr-core/test/J0/./solrtest-jetty1-1349886659193
[junit4:junit4]   2> 2262 T725 oasc.SolrResourceLoader.<init> new SolrResourceLoader for deduced Solr Home: '/usr/home/hudson/hudson-slave/workspace/Lucene-Solr-Tests-4.x-java7/solr/build/solr-core/test/J0/./solrtest-jetty1-1349886659193/'
[junit4:junit4]   2> 2291 T725 oass.SolrDispatchFilter.init SolrDispatchFilter.init()
[junit4:junit4]   2> 2292 T725 oasc.SolrResourceLoader.locateSolrHome JNDI not configured for solr (NoInitialContextEx)
[junit4:junit4]   2> 2292 T725 oasc.SolrResourceLoader.locateSolrHome using system property solr.solr.home: /usr/home/hudson/hudson-slave/workspace/Lucene-Solr-Tests-4.x-java7/solr/build/solr-core/test/J0/./solrtest-jetty1-1349886659193
[junit4:junit4]   2> 2293 T725 oasc.CoreContainer$Initializer.initialize looking for solr.xml: /usr/home/hudson/hudson-slave/workspace/Lucene-Solr-Tests-4.x-java7/solr/build/solr-core/test/J0/./solrtest-jetty1-1349886659193/solr.xml
[junit4:junit4]   2> 2293 T725 oasc.CoreContainer.<init> New CoreContainer 796911480
[junit4:junit4]   2> 2293 T725 oasc.CoreContainer.load Loading CoreContainer using Solr Home: '/usr/home/hudson/hudson-slave/workspace/Lucene-Solr-Tests-4.x-java7/solr/build/solr-core/test/J0/./solrtest-jetty1-1349886659193/'
[junit4:junit4]   2> 2294 T725 oasc.SolrResourceLoader.<init> new SolrResourceLoader for directory: '/usr/home/hudson/hudson-slave/workspace/Lucene-Solr-Tests-4.x-java7/solr/build/solr-core/test/J0/./solrtest-jetty1-1349886659193/'
[junit4:junit4]   2> 2318 T725 oasc.CoreContainer.load Registering Log Listener
[junit4:junit4]   2> 2329 T725 oasc.CoreContainer.initZooKeeper Zookeeper client=127.0.0.1:39050/solr
[junit4:junit4]   2> 2330 T725 oaz.ZooKeeper.<init> Initiating client connection, connectString=127.0.0.1:39050/solr sessionTimeout=5000 watcher=org.apache.solr.common.cloud.ConnectionManager@37514cd
[junit4:junit4]   2> 2331 T758 oaz.ClientCnxn$SendThread.startConnect Opening socket connection to server /127.0.0.1:39050
[junit4:junit4]   2> 2331 T725 oascc.ConnectionManager.waitForConnected Waiting for client to connect to ZooKeeper
[junit4:junit4]   2> 2332 T758 oaz.ClientCnxn$SendThread.primeConnection Socket connection established to localhost/127.0.0.1:39050, initiating session
[junit4:junit4]   2> 2332 T727 oazs.NIOServerCnxn$Factory.run Accepted socket connection from /140.211.11.196:39059
[junit4:junit4]   2> 2333 T727 oazs.NIOServerCnxn.readConnectRequest Client attempting to establish new session at /140.211.11.196:39059
[junit4:junit4]   2> 2334 T729 oazs.NIOServerCnxn.finishSessionInit Established session 0x13a4b83c2360003 with negotiated timeout 5000 for client /140.211.11.196:39059
[junit4:junit4]   2> 2334 T758 oaz.ClientCnxn$SendThread.readConnectResult Session establishment complete on server localhost/127.0.0.1:39050, sessionid = 0x13a4b83c2360003, negotiated timeout = 5000
[junit4:junit4]   2> 2334 T759 oascc.ConnectionManager.process Watcher org.apache.solr.common.cloud.ConnectionManager@37514cd name:ZooKeeperConnection Watcher:127.0.0.1:39050/solr got event WatchedEvent state:SyncConnected type:None path:null path:null type:None
[junit4:junit4]   2> 2335 T725 oascc.ConnectionManager.waitForConnected Client is connected to ZooKeeper
[junit4:junit4]   2> 2336 T730 oazs.PrepRequestProcessor.pRequest Got user-level KeeperException when processing sessionid:0x13a4b83c2360003 type:create cxid:0x1 zxid:0xfffffffffffffffe txntype:unknown reqpath:n/a Error Path:/solr/overseer Error:KeeperErrorCode = NodeExists for /solr/overseer
[junit4:junit4]   2> 2337 T730 oazs.PrepRequestProcessor.pRequest Got user-level KeeperException when processing sessionid:0x13a4b83c2360003 type:create cxid:0x2 zxid:0xfffffffffffffffe txntype:unknown reqpath:n/a Error Path:/solr/overseer Error:KeeperErrorCode = NodeExists for /solr/overseer
[junit4:junit4]   2> 2346 T725 oasc.ZkController.createEphemeralLiveNode Register node as live in ZooKeeper:/live_nodes/127.0.0.1:39058_solr
[junit4:junit4]   2> 2347 T730 oazs.PrepRequestProcessor.pRequest Got user-level KeeperException when processing sessionid:0x13a4b83c2360003 type:delete cxid:0x4 zxid:0xfffffffffffffffe txntype:unknown reqpath:n/a Error Path:/solr/live_nodes/127.0.0.1:39058_solr Error:KeeperErrorCode = NoNode for /solr/live_nodes/127.0.0.1:39058_solr
[junit4:junit4]   2> 2348 T725 oascc.SolrZkClient.makePath makePath: /live_nodes/127.0.0.1:39058_solr
[junit4:junit4]   2> 2349 T745 oascc.ZkStateReader$3.process Updating live nodes
[junit4:junit4]   2> 2350 T725 oashc.HttpShardHandlerFactory.getParameter Setting socketTimeout to: 0
[junit4:junit4]   2> 2351 T725 oashc.HttpShardHandlerFactory.getParameter Setting urlScheme to: http://
[junit4:junit4]   2> 2351 T725 oashc.HttpShardHandlerFactory.getParameter Setting connTimeout to: 0
[junit4:junit4]   2> 2351 T725 oashc.HttpShardHandlerFactory.getParameter Setting maxConnectionsPerHost to: 20
[junit4:junit4]   2> 2352 T725 oashc.HttpShardHandlerFactory.getParameter Setting corePoolSize to: 0
[junit4:junit4]   2> 2352 T725 oashc.HttpShardHandlerFactory.getParameter Setting maximumPoolSize to: 2147483647
[junit4:junit4]   2> 2352 T725 oashc.HttpShardHandlerFactory.getParameter Setting maxThreadIdleTime to: 5
[junit4:junit4]   2> 2352 T725 oashc.HttpShardHandlerFactory.getParameter Setting sizeOfQueue to: -1
[junit4:junit4]   2> 2353 T725 oashc.HttpShardHandlerFactory.getParameter Setting fairnessPolicy to: false
[junit4:junit4]   2> 2353 T725 oascsi.HttpClientUtil.createClient Creating new http client, config:maxConnectionsPerHost=20&maxConnections=10000&socketTimeout=0&connTimeout=0&retry=false
[junit4:junit4]   2> 2371 T725 oascc.ZkStateReader.createClusterStateWatchersAndUpdate Updating cluster state from ZooKeeper... 
[junit4:junit4]   2> 2376 T725 oasc.CoreContainer.create Creating SolrCore 'collection1' using instanceDir: /usr/home/hudson/hudson-slave/workspace/Lucene-Solr-Tests-4.x-java7/solr/build/solr-core/test/J0/./solrtest-jetty1-1349886659193/collection1
[junit4:junit4]   2> 2376 T725 oasc.ZkController.createCollectionZkNode Check for collection zkNode:collection1
[junit4:junit4]   2> 2377 T725 oasc.ZkController.createCollectionZkNode Collection zkNode exists
[junit4:junit4]   2> 2377 T725 oasc.ZkController.readConfigName Load collection config from:/collections/collection1
[junit4:junit4]   2> 2378 T725 oasc.SolrResourceLoader.<init> new SolrResourceLoader for directory: '/usr/home/hudson/hudson-slave/workspace/Lucene-Solr-Tests-4.x-java7/solr/build/solr-core/test/J0/./solrtest-jetty1-1349886659193/collection1/'
[junit4:junit4]   2> 2379 T725 oasc.SolrResourceLoader.replaceClassLoader Adding 'file:/usr/home/hudson/hudson-slave/workspace/Lucene-Solr-Tests-4.x-java7/solr/build/solr-core/test/J0/solrtest-jetty1-1349886659193/collection1/lib/classes/' to classloader
[junit4:junit4]   2> 2380 T725 oasc.SolrResourceLoader.replaceClassLoader Adding 'file:/usr/home/hudson/hudson-slave/workspace/Lucene-Solr-Tests-4.x-java7/solr/build/solr-core/test/J0/solrtest-jetty1-1349886659193/collection1/lib/README' to classloader
[junit4:junit4]   2> 2417 T725 oasc.SolrConfig.<init> Using Lucene MatchVersion: LUCENE_41
[junit4:junit4]   2> 2465 T725 oasc.SolrConfig.<init> Loaded SolrConfig: solrconfig.xml
[junit4:junit4]   2> 2566 T725 oass.IndexSchema.readSchema Reading Solr Schema
[junit4:junit4]   2> 2574 T725 oass.IndexSchema.readSchema Schema name=test
[junit4:junit4]   2> 2589 T746 oascc.ZkStateReader.updateClusterState Updating cloud state from ZooKeeper... 
[junit4:junit4]   2> 2602 T759 oascc.ZkStateReader$2.process A cluster state change has occurred - updating...
[junit4:junit4]   2> 2602 T745 oascc.ZkStateReader$2.process A cluster state change has occurred - updating...
[junit4:junit4]   2> 3033 T725 oass.OpenExchangeRatesOrgProvider.init Initialized with rates=open-exchange-rates.json, refreshInterval=1440.
[junit4:junit4]   2> 3041 T725 oass.IndexSchema.readSchema default search field in schema is text
[junit4:junit4]   2> 3044 T725 oass.IndexSchema.readSchema unique key field: id
[junit4:junit4]   2> 3061 T725 oass.FileExchangeRateProvider.reload Reloading exchange rates from file currency.xml
[junit4:junit4]   2> 3067 T725 oass.FileExchangeRateProvider.reload Reloading exchange rates from file currency.xml
[junit4:junit4]   2> 3072 T725 oass.OpenExchangeRatesOrgProvider.reload Reloading exchange rates from open-exchange-rates.json
[junit4:junit4]   2> 3074 T725 oass.OpenExchangeRatesOrgProvider.reload Reloading exchange rates from open-exchange-rates.json
[junit4:junit4]   2> 3075 T725 oasc.SolrCore.<init> [collection1] Opening new SolrCore at /usr/home/hudson/hudson-slave/workspace/Lucene-Solr-Tests-4.x-java7/solr/build/solr-core/test/J0/./solrtest-jetty1-1349886659193/collection1/, dataDir=./org.apache.solr.cloud.BasicDistributedZkTest-1349886657073/jetty1/
[junit4:junit4]   2> 3076 T725 oasc.JmxMonitoredMap.<init> JMX monitoring is enabled. Adding Solr mbeans to JMX Server: com.sun.jmx.mbeanserver.JmxMBeanServer@38559e4f
[junit4:junit4]   2> 3078 T725 oasc.SolrCore.getNewIndexDir New index directory detected: old=null new=./org.apache.solr.cloud.BasicDistributedZkTest-1349886657073/jetty1/index/
[junit4:junit4]   2> 3079 T725 oasc.SolrCore.initIndex WARNING [collection1] Solr index directory './org.apache.solr.cloud.BasicDistributedZkTest-1349886657073/jetty1/index' doesn't exist. Creating new index...
[junit4:junit4]   2> 3080 T725 oasc.CachingDirectoryFactory.get return new directory for /usr/home/hudson/hudson-slave/workspace/Lucene-Solr-Tests-4.x-java7/solr/build/solr-core/test/J0/./org.apache.solr.cloud.BasicDistributedZkTest-1349886657073/jetty1/index forceNew:false
[junit4:junit4]   2> 3087 T725 oasc.SolrDeletionPolicy.onCommit SolrDeletionPolicy.onCommit: commits:num=1
[junit4:junit4]   2> 		commit{dir=NRTCachingDirectory(org.apache.lucene.store.NIOFSDirectory@/usr/home/hudson/hudson-slave/workspace/Lucene-Solr-Tests-4.x-java7/solr/build/solr-core/test/J0/org.apache.solr.cloud.BasicDistributedZkTest-1349886657073/jetty1/index lockFactory=org.apache.lucene.store.NativeFSLockFactory@7355f16f; maxCacheMB=48.0 maxMergeSizeMB=4.0),segFN=segments_1,generation=1,filenames=[segments_1]
[junit4:junit4]   2> 3087 T725 oasc.SolrDeletionPolicy.updateCommits newest commit = 1
[junit4:junit4]   2> 3089 T725 oasc.SolrCore.initWriters created xml: solr.XMLResponseWriter
[junit4:junit4]   2> 3092 T725 oasup.UpdateRequestProcessorChain.init inserting DistributedUpdateProcessorFactory into updateRequestProcessorChain "dedupe"
[junit4:junit4]   2> 3092 T725 oasup.UpdateRequestProcessorChain.init inserting DistributedUpdateProcessorFactory into updateRequestProcessorChain "dedupe-allfields"
[junit4:junit4]   2> 3093 T725 oasup.UpdateRequestProcessorChain.init inserting DistributedUpdateProcessorFactory into updateRequestProcessorChain "stored_sig"
[junit4:junit4]   2> 3093 T725 oasup.UpdateRequestProcessorChain.init inserting DistributedUpdateProcessorFactory into updateRequestProcessorChain "uniq-fields"
[junit4:junit4]   2> 3095 T725 oasup.UpdateRequestProcessorChain.init inserting DistributedUpdateProcessorFactory into updateRequestProcessorChain "distrib-dup-test-chain-implicit"
[junit4:junit4]   2> 3095 T725 oasc.RequestHandlers.initHandlersFromConfig adding lazy requestHandler: solr.ReplicationHandler
[junit4:junit4]   2> 3096 T725 oasc.RequestHandlers.initHandlersFromConfig created /replication: solr.ReplicationHandler
[junit4:junit4]   2> 3097 T725 oasc.RequestHandlers.initHandlersFromConfig created standard: solr.StandardRequestHandler
[junit4:junit4]   2> 3097 T725 oasc.RequestHandlers.initHandlersFromConfig created /get: solr.RealTimeGetHandler
[junit4:junit4]   2> 3098 T725 oasc.RequestHandlers.initHandlersFromConfig created dismax: solr.SearchHandler
[junit4:junit4]   2> 3099 T725 oasc.RequestHandlers.initHandlersFromConfig created mock: org.apache.solr.core.MockQuerySenderListenerReqHandler
[junit4:junit4]   2> 3100 T725 oasc.RequestHandlers.initHandlersFromConfig created /admin/: org.apache.solr.handler.admin.AdminHandlers
[junit4:junit4]   2> 3101 T725 oasc.RequestHandlers.initHandlersFromConfig created defaults: solr.StandardRequestHandler
[junit4:junit4]   2> 3101 T725 oasc.RequestHandlers.initHandlersFromConfig adding lazy requestHandler: solr.StandardRequestHandler
[junit4:junit4]   2> 3102 T725 oasc.RequestHandlers.initHandlersFromConfig created lazy: solr.StandardRequestHandler
[junit4:junit4]   2> 3103 T725 oasc.RequestHandlers.initHandlersFromConfig created /update: solr.UpdateRequestHandler
[junit4:junit4]   2> 3103 T725 oasc.RequestHandlers.initHandlersFromConfig created /terms: org.apache.solr.handler.component.SearchHandler
[junit4:junit4]   2> 3104 T725 oasc.RequestHandlers.initHandlersFromConfig created spellCheckCompRH: org.apache.solr.handler.component.SearchHandler
[junit4:junit4]   2> 3105 T725 oasc.RequestHandlers.initHandlersFromConfig created spellCheckCompRH_Direct: org.apache.solr.handler.component.SearchHandler
[junit4:junit4]   2> 3106 T725 oasc.RequestHandlers.initHandlersFromConfig created spellCheckWithWordbreak: org.apache.solr.handler.component.SearchHandler
[junit4:junit4]   2> 3107 T725 oasc.RequestHandlers.initHandlersFromConfig created spellCheckWithWordbreak_Direct: org.apache.solr.handler.component.SearchHandler
[junit4:junit4]   2> 3108 T725 oasc.RequestHandlers.initHandlersFromConfig created spellCheckCompRH1: org.apache.solr.handler.component.SearchHandler
[junit4:junit4]   2> 3108 T725 oasc.RequestHandlers.initHandlersFromConfig created tvrh: org.apache.solr.handler.component.SearchHandler
[junit4:junit4]   2> 3109 T725 oasc.RequestHandlers.initHandlersFromConfig created /mlt: solr.MoreLikeThisHandler
[junit4:junit4]   2> 3110 T725 oasc.RequestHandlers.initHandlersFromConfig created /debug/dump: solr.DumpRequestHandler
[junit4:junit4]   2> 3125 T725 oashl.XMLLoader.init xsltCacheLifetimeSeconds=60
[junit4:junit4]   2> 3130 T725 oasc.SolrCore.initDeprecatedSupport WARNING solrconfig.xml uses deprecated <admin/gettableFiles>, Please update your config to use the ShowFileRequestHandler.
[junit4:junit4]   2> 3132 T725 oasc.SolrCore.initDeprecatedSupport WARNING adding ShowFileRequestHandler with hidden files: [SCHEMA.XML, OLD_SYNONYMS.TXT, STOPWORDS.TXT, PROTWORDS.TXT, OPEN-EXCHANGE-RATES.JSON, SYNONYMS.TXT, CURRENCY.XML, MAPPING-ISOLATIN1ACCENT.TXT]
[junit4:junit4]   2> 3136 T725 oass.SolrIndexSearcher.<init> Opening Searcher@6ca65aeb main
[junit4:junit4]   2> 3138 T725 oasu.CommitTracker.<init> Hard AutoCommit: disabled
[junit4:junit4]   2> 3138 T725 oasu.CommitTracker.<init> Soft AutoCommit: disabled
[junit4:junit4]   2> 3139 T725 oashc.SpellCheckComponent.inform Initializing spell checkers
[junit4:junit4]   2> 3156 T725 oass.DirectSolrSpellChecker.init init: {name=direct,classname=DirectSolrSpellChecker,field=lowerfilt,minQueryLength=3}
[junit4:junit4]   2> 3213 T760 oasc.SolrCore.registerSearcher [collection1] Registered new searcher Searcher@6ca65aeb main{StandardDirectoryReader(segments_1:1)}
[junit4:junit4]   2> 3610 T746 oascc.ZkStateReader.updateClusterState Updating cloud state from ZooKeeper... 
[junit4:junit4]   2> 3632 T745 oascc.ZkStateReader$2.process A cluster state change has occurred - updating...
[junit4:junit4]   2> 3632 T759 oascc.ZkStateReader$2.process A cluster state change has occurred - updating...
[junit4:junit4]   2> 3722 T725 oasc.CoreContainer.register registering core: collection1
[junit4:junit4]   2> 3722 T725 oasc.ZkController.register Register shard - core:collection1 address:http://127.0.0.1:39058/solr shardId:shard1
[junit4:junit4]   2> 3723 T725 oascc.SolrZkClient.makePath makePath: /collections/collection1/leader_elect/shard1/election
[junit4:junit4]   2> 3740 T730 oazs.PrepRequestProcessor.pRequest Got user-level KeeperException when processing sessionid:0x13a4b83c2360003 type:delete cxid:0x43 zxid:0xfffffffffffffffe txntype:unknown reqpath:n/a Error Path:/solr/collections/collection1/leaders Error:KeeperErrorCode = NoNode for /solr/collections/collection1/leaders
[junit4:junit4]   2> 3741 T725 oasc.ShardLeaderElectionContext.runLeaderProcess Running the leader process.
[junit4:junit4]   2> 3742 T730 oazs.PrepRequestProcessor.pRequest Got user-level KeeperException when processing sessionid:0x13a4b83c2360003 type:create cxid:0x44 zxid:0xfffffffffffffffe txntype:unknown reqpath:n/a Error Path:/solr/overseer Error:KeeperErrorCode = NodeExists for /solr/overseer
[junit4:junit4]   2> 3744 T725 oasc.ShardLeaderElectionContext.waitForReplicasToComeUp Enough replicas found to continue.
[junit4:junit4]   2> 3745 T725 oasc.ShardLeaderElectionContext.runLeaderProcess I may be the new leader - try and sync
[junit4:junit4]   2> 3745 T725 oasc.SyncStrategy.sync Sync replicas to http://127.0.0.1:39058/solr/collection1/
[junit4:junit4]   2> 3746 T725 oasc.SyncStrategy.syncReplicas Sync Success - now sync replicas to me
[junit4:junit4]   2> 3746 T725 oasc.SyncStrategy.syncToMe http://127.0.0.1:39058/solr/collection1/ has no replicas
[junit4:junit4]   2> 3747 T725 oasc.ShardLeaderElectionContext.runLeaderProcess I am the new leader: http://127.0.0.1:39058/solr/collection1/
[junit4:junit4]   2> 3747 T725 oascc.SolrZkClient.makePath makePath: /collections/collection1/leaders/shard1
[junit4:junit4]   2> 3751 T730 oazs.PrepRequestProcessor.pRequest Got user-level KeeperException when processing sessionid:0x13a4b83c2360003 type:create cxid:0x4e zxid:0xfffffffffffffffe txntype:unknown reqpath:n/a Error Path:/solr/overseer Error:KeeperErrorCode = NodeExists for /solr/overseer
[junit4:junit4]   2> 4136 T746 oascc.ZkStateReader.updateClusterState Updating cloud state from ZooKeeper... 
[junit4:junit4]   2> 4146 T745 oascc.ZkStateReader$2.process A cluster state change has occurred - updating...
[junit4:junit4]   2> 4146 T759 oascc.ZkStateReader$2.process A cluster state change has occurred - updating...
[junit4:junit4]   2> 4162 T725 oasc.ZkController.register We are http://127.0.0.1:39058/solr/collection1/ and leader is http://127.0.0.1:39058/solr/collection1/
[junit4:junit4]   2> 4162 T725 oasc.ZkController.register No LogReplay needed for core=collection1 baseURL=http://127.0.0.1:39058/solr
[junit4:junit4]   2> 4162 T725 oasc.ZkController.checkRecovery I am the leader, no recovery necessary
[junit4:junit4]   2> 4164 T725 oascc.ZkStateReader.updateClusterState Updating cloud state from ZooKeeper... 
[junit4:junit4]   2> 4165 T725 oass.SolrDispatchFilter.init user.dir=/usr/home/hudson/hudson-slave/workspace/Lucene-Solr-Tests-4.x-java7/solr/build/solr-core/test/J0
[junit4:junit4]   2> 4165 T725 oass.SolrDispatchFilter.init SolrDispatchFilter.init() done
[junit4:junit4]   2> 4166 T725 oascsi.HttpClientUtil.createClient Creating new http client, config:maxConnections=128&maxConnectionsPerHost=32&followRedirects=false
[junit4:junit4]   2> 4369 T725 oejs.Server.doStart jetty-8.1.2.v20120308
[junit4:junit4]   2> 4372 T725 oejs.AbstractConnector.doStart Started SocketConnector@0.0.0.0:39062
[junit4:junit4]   2> 4372 T725 oasc.SolrResourceLoader.locateSolrHome JNDI not configured for solr (NoInitialContextEx)
[junit4:junit4]   2> 4373 T725 oasc.SolrResourceLoader.locateSolrHome using system property solr.solr.home: /usr/home/hudson/hudson-slave/workspace/Lucene-Solr-Tests-4.x-java7/solr/build/solr-core/test/J0/./solrtest-jetty2-1349886661245
[junit4:junit4]   2> 4373 T725 oasc.SolrResourceLoader.<init> new SolrResourceLoader for deduced Solr Home: '/usr/home/hudson/hudson-slave/workspace/Lucene-Solr-Tests-4.x-java7/solr/build/solr-core/test/J0/./solrtest-jetty2-1349886661245/'
[junit4:junit4]   2> 4405 T725 oass.SolrDispatchFilter.init SolrDispatchFilter.init()
[junit4:junit4]   2> 4406 T725 oasc.SolrResourceLoader.locateSolrHome JNDI not configured for solr (NoInitialContextEx)
[junit4:junit4]   2> 4406 T725 oasc.SolrResourceLoader.locateSolrHome using system property solr.solr.home: /usr/home/hudson/hudson-slave/workspace/Lucene-Solr-Tests-4.x-java7/solr/build/solr-core/test/J0/./solrtest-jetty2-1349886661245
[junit4:junit4]   2> 4406 T725 oasc.CoreContainer$Initializer.initialize looking for solr.xml: /usr/home/hudson/hudson-slave/workspace/Lucene-Solr-Tests-4.x-java7/solr/build/solr-core/test/J0/./solrtest-jetty2-1349886661245/solr.xml
[junit4:junit4]   2> 4407 T725 oasc.CoreContainer.<init> New CoreContainer 1374386713
[junit4:junit4]   2> 4407 T725 oasc.CoreContainer.load Loading CoreContainer using Solr Home: '/usr/home/hudson/hudson-slave/workspace/Lucene-Solr-Tests-4.x-java7/solr/build/solr-core/test/J0/./solrtest-jetty2-1349886661245/'
[junit4:junit4]   2> 4408 T725 oasc.SolrResourceLoader.<init> new SolrResourceLoader for directory: '/usr/home/hudson/hudson-slave/workspace/Lucene-Solr-Tests-4.x-java7/solr/build/solr-core/test/J0/./solrtest-jetty2-1349886661245/'
[junit4:junit4]   2> 4437 T725 oasc.CoreContainer.load Registering Log Listener
[junit4:junit4]   2> 4454 T725 oasc.CoreContainer.initZooKeeper Zookeeper client=127.0.0.1:39050/solr
[junit4:junit4]   2> 4455 T725 oaz.ZooKeeper.<init> Initiating client connection, connectString=127.0.0.1:39050/solr sessionTimeout=5000 watcher=org.apache.solr.common.cloud.ConnectionManager@4bf3d45a
[junit4:junit4]   2> 4456 T770 oaz.ClientCnxn$SendThread.startConnect Opening socket connection to server /127.0.0.1:39050
[junit4:junit4]   2> 4456 T725 oascc.ConnectionManager.waitForConnected Waiting for client to connect to ZooKeeper
[junit4:junit4]   2> 4457 T770 oaz.ClientCnxn$SendThread.primeConnection Socket connection established to localhost/127.0.0.1:39050, initiating session
[junit4:junit4]   2> 4457 T727 oazs.NIOServerCnxn$Factory.run Accepted socket connection from /140.211.11.196:39063
[junit4:junit4]   2> 4457 T727 oazs.NIOServerCnxn.readConnectRequest Client attempting to establish new session at /140.211.11.196:39063
[junit4:junit4]   2> 4465 T729 oazs.NIOServerCnxn.finishSessionInit Established session 0x13a4b83c2360004 with negotiated timeout 5000 for client /140.211.11.196:39063
[junit4:junit4]   2> 4465 T770 oaz.ClientCnxn$SendThread.readConnectResult Session establishment complete on server localhost/127.0.0.1:39050, sessionid = 0x13a4b83c2360004, negotiated timeout = 5000
[junit4:junit4]   2> 4465 T771 oascc.ConnectionManager.process Watcher org.apache.solr.common.cloud.ConnectionManager@4bf3d45a name:ZooKeeperConnection Watcher:127.0.0.1:39050/solr got event WatchedEvent state:SyncConnected type:None path:null path:null type:None
[junit4:junit4]   2> 4465 T725 oascc.ConnectionManager.waitForConnected Client is connected to ZooKeeper
[junit4:junit4]   2> 4467 T730 oazs.PrepRequestProcessor.pRequest Got user-level KeeperException when processing sessionid:0x13a4b83c2360004 type:create cxid:0x1 zxid:0xfffffffffffffffe txntype:unknown reqpath:n/a Error Path:/solr/overseer Error:KeeperErrorCode = NodeExists for /solr/overseer
[junit4:junit4]   2> 4483 T730 oazs.PrepRequestProcessor.pRequest Got user-level KeeperException when processing sessionid:0x13a4b83c2360004 type:create cxid:0x2 zxid:0xfffffffffffffffe txntype:unknown reqpath:n/a Error Path:/solr/overseer Error:KeeperErrorCode = NodeExists for /solr/overseer
[junit4:junit4]   2> 4501 T725 oasc.ZkController.createEphemeralLiveNode Register node as live in ZooKeeper:/live_nodes/127.0.0.1:39062_solr
[junit4:junit4]   2> 4502 T730 oazs.PrepRequestProcessor.pRequest Got user-level KeeperException when processing sessionid:0x13a4b83c2360004 type:delete cxid:0x4 zxid:0xfffffffffffffffe txntype:unknown reqpath:n/a Error Path:/solr/live_nodes/127.0.0.1:39062_solr Error:KeeperErrorCode = NoNode for /solr/live_nodes/127.0.0.1:39062_solr
[junit4:junit4]   2> 4503 T725 oascc.SolrZkClient.makePath makePath: /live_nodes/127.0.0.1:39062_solr
[junit4:junit4]   2> 4506 T745 oascc.ZkStateReader$3.process Updating live nodes
[junit4:junit4]   2> 4506 T759 oascc.ZkStateReader$3.process Updating live nodes
[junit4:junit4]   2> 4507 T725 oashc.HttpShardHandlerFactory.getParameter Setting socketTimeout to: 0
[junit4:junit4]   2> 4508 T725 oashc.HttpShardHandlerFactory.getParameter Setting urlScheme to: http://
[junit4:junit4]   2> 4508 T725 oashc.HttpShardHandlerFactory.getParameter Setting connTimeout to: 0
[junit4:junit4]   2> 4508 T725 oashc.HttpShardHandlerFactory.getParameter Setting maxConnectionsPerHost to: 20
[junit4:junit4]   2> 4509 T725 oashc.HttpShardHandlerFactory.getParameter Setting corePoolSize to: 0
[junit4:junit4]   2> 4510 T725 oashc.HttpShardHandlerFactory.getParameter Setting maximumPoolSize to: 2147483647
[junit4:junit4]   2> 4510 T725 oashc.HttpShardHandlerFactory.getParameter Setting maxThreadIdleTime to: 5
[junit4:junit4]   2> 4511 T725 oashc.HttpShardHandlerFactory.getParameter Setting sizeOfQueue to: -1
[junit4:junit4]   2> 4511 T725 oashc.HttpShardHandlerFactory.getParameter Setting fairnessPolicy to: false
[junit4:junit4]   2> 4512 T725 oascsi.HttpClientUtil.createClient Creating new http client, config:maxConnectionsPerHost=20&maxConnections=10000&socketTimeout=0&connTimeout=0&retry=false
[junit4:junit4]   2> 4554 T725 oascc.ZkStateReader.createClusterStateWatchersAndUpdate Updating cluster state from ZooKeeper... 
[junit4:junit4]   2> 4580 T725 oasc.CoreContainer.create Creating SolrCore 'collection1' using instanceDir: /usr/home/hudson/hudson-slave/workspace/Lucene-Solr-Tests-4.x-java7/solr/build/solr-core/test/J0/./solrtest-jetty2-1349886661245/collection1
[junit4:junit4]   2> 4580 T725 oasc.ZkController.createCollectionZkNode Check for collection zkNode:collection1
[junit4:junit4]   2> 4581 T725 oasc.ZkController.createCollectionZkNode Collection zkNode exists
[junit4:junit4]   2> 4581 T725 oasc.ZkController.readConfigName Load collection config from:/collections/collection1
[junit4:junit4]   2> 4583 T725 oasc.SolrResourceLoader.<init> new SolrResourceLoader for directory: '/usr/home/hudson/hudson-slave/workspace/Lucene-Solr-Tests-4.x-java7/solr/build/solr-core/test/J0/./solrtest-jetty2-1349886661245/collection1/'
[junit4:junit4]   2> 4584 T725 oasc.SolrResourceLoader.replaceClassLoader Adding 'file:/usr/home/hudson/hudson-slave/workspace/Lucene-Solr-Tests-4.x-java7/solr/build/solr-core/test/J0/solrtest-jetty2-1349886661245/collection1/lib/README' to classloader
[junit4:junit4]   2> 4584 T725 oasc.SolrResourceLoader.replaceClassLoader Adding 'file:/usr/home/hudson/hudson-slave/workspace/Lucene-Solr-Tests-4.x-java7/solr/build/solr-core/test/J0/solrtest-jetty2-1349886661245/collection1/lib/classes/' to classloader
[junit4:junit4]   2> 4634 T725 oasc.SolrConfig.<init> Using Lucene MatchVersion: LUCENE_41
[junit4:junit4]   2> 4651 T746 oascc.ZkStateReader.updateClusterState Updating cloud state from ZooKeeper... 
[junit4:junit4]   2> 4657 T745 oascc.ZkStateReader$2.process A cluster state change has occurred - updating...
[junit4:junit4]   2> 4657 T771 oascc.ZkStateReader$2.process A cluster state change has occurred - updating...
[junit4:junit4]   2> 4657 T759 oascc.ZkStateReader$2.process A cluster state change has occurred - updating...
[junit4:junit4]   2> 4682 T725 oasc.SolrConfig.<init> Loaded SolrConfig: solrconfig.xml
[junit4:junit4]   2> 4783 T725 oass.IndexSchema.readSchema Reading Solr Schema
[junit4:junit4]   2> 4788 T725 oass.IndexSchema.readSchema Schema name=test
[junit4:junit4]   2> 5214 T725 oass.OpenExchangeRatesOrgProvider.init Initialized with rates=open-exchange-rates.json, refreshInterval=1440.
[junit4:junit4]   2> 5221 T725 oass.IndexSchema.readSchema default search field in schema is text
[junit4:junit4]   2> 5224 T725 oass.IndexSchema.readSchema unique key field: id
[junit4:junit4]   2> 5236 T725 oass.FileExchangeRateProvider.reload Reloading exchange rates from file currency.xml
[junit4:junit4]   2> 5240 T725 oass.FileExchangeRateProvider.reload Reloading exchange rates from file currency.xml
[junit4:junit4]   2> 5243 T725 oass.OpenExchangeRatesOrgProvider.reload Reloading exchange rates from open-exchange-rates.json
[junit4:junit4]   2> 5244 T725 oass.OpenExchangeRatesOrgProvider.reload Reloading exchange rates from open-exchange-rates.json
[junit4:junit4]   2> 5245 T725 oasc.SolrCore.<init> [collection1] Opening new SolrCore at /usr/home/hudson/hudson-slave/workspace/Lucene-Solr-Tests-4.x-java7/solr/build/solr-core/test/J0/./solrtest-jetty2-1349886661245/collection1/, dataDir=./org.apache.solr.cloud.BasicDistributedZkTest-1349886657073/jetty2/
[junit4:junit4]   2> 5246 T725 oasc.JmxMonitoredMap.<init> JMX monitoring is enabled. Adding Solr mbeans to JMX Server: com.sun.jmx.mbeanserver.JmxMBeanServer@38559e4f
[junit4:junit4]   2> 5247 T725 oasc.SolrCore.getNewIndexDir New index directory detected: old=null new=./org.apache.solr.cloud.BasicDistributedZkTest-1349886657073/jetty2/index/
[junit4:junit4]   2> 5247 T725 oasc.SolrCore.initIndex WARNING [collection1] Solr index directory './org.apache.solr.cloud.BasicDistributedZkTest-1349886657073/jetty2/index' doesn't exist. Creating new index...
[junit4:junit4]   2> 5248 T725 oasc.CachingDirectoryFactory.get return new directory for /usr/home/hudson/hudson-slave/workspace/Lucene-Solr-Tests-4.x-java7/solr/build/solr-core/test/J0/./org.apache.solr.cloud.BasicDistributedZkTest-1349886657073/jetty2/index forceNew:false
[junit4:junit4]   2> 5276 T725 oasc.SolrDeletionPolicy.onCommit SolrDeletionPolicy.onCommit: commits:num=1
[junit4:junit4]   2> 		commit{dir=NRTCachingDirectory(org.apache.lucene.store.NIOFSDirectory@/usr/home/hudson/hudson-slave/workspace/Lucene-Solr-Tests-4.x-java7/solr/build/solr-core/test/J0/org.apache.solr.cloud.BasicDistributedZkTest-1349886657073/jetty2/index lockFactory=org.apache.lucene.store.NativeFSLockFactory@3f35a09e; maxCacheMB=48.0 maxMergeSizeMB=4.0),segFN=segments_1,generation=1,filenames=[segments_1]
[junit4:junit4]   2> 5276 T725 oasc.SolrDeletionPolicy.updateCommits newest commit = 1
[junit4:junit4]   2> 5277 T725 oasc.SolrCore.initWriters created xml: solr.XMLResponseWriter
[junit4:junit4]   2> 5280 T725 oasup.UpdateRequestProcessorChain.init inserting DistributedUpdateProcessorFactory into updateRequestProcessorChain "dedupe"
[junit4:junit4]   2> 5280 T725 oasup.UpdateRequestProcessorChain.init inserting DistributedUpdateProcessorFactory into updateRequestProcessorChain "dedupe-allfields"
[junit4:junit4]   2> 5280 T725 oasup.UpdateRequestProcessorChain.init inserting DistributedUpdateProcessorFactory into updateRequestProcessorChain "stored_sig"
[junit4:junit4]   2> 5281 T725 oasup.UpdateRequestProcessorChain.init inserting DistributedUpdateProcessorFactory into updateRequestProcessorChain "uniq-fields"
[junit4:junit4]   2> 5282 T725 oasup.UpdateRequestProcessorChain.init inserting DistributedUpdateProcessorFactory into updateRequestProcessorChain "distrib-dup-test-chain-implicit"
[junit4:junit4]   2> 5282 T725 oasc.RequestHandlers.initHandlersFromConfig adding lazy requestHandler: solr.ReplicationHandler
[junit4:junit4]   2> 5282 T725 oasc.RequestHandlers.initHandlersFromConfig created /replication: solr.ReplicationHandler
[junit4:junit4]   2> 5283 T725 oasc.RequestHandlers.initHandlersFromConfig created standard: solr.StandardRequestHandler
[junit4:junit4]   2> 5284 T725 oasc.RequestHandlers.initHandlersFromConfig created /get: solr.RealTimeGetHandler
[junit4:junit4]   2> 5284 T725 oasc.RequestHandlers.initHandlersFromConfig created dismax: solr.SearchHandler
[junit4:junit4]   2> 5285 T725 oasc.RequestHandlers.initHandlersFromConfig created mock: org.apache.solr.core.MockQuerySenderListenerReqHandler
[junit4:junit4]   2> 5285 T725 oasc.RequestHandlers.initHandlersFromConfig created /admin/: org.apache.solr.handler.admin.AdminHandlers
[junit4:junit4]   2> 5286 T725 oasc.RequestHandlers.initHandlersFromConfig created defaults: solr.StandardRequestHandler
[junit4:junit4]   2> 5286 T725 oasc.RequestHandlers.initHandlersFromConfig adding lazy requestHandler: solr.StandardRequestHandler
[junit4:junit4]   2> 5287 T725 oasc.RequestHandlers.initHandlersFromConfig created lazy: solr.StandardRequestHandler
[junit4:junit4]   2> 5288 T725 oasc.RequestHandlers.initHandlersFromConfig created /update: solr.UpdateRequestHandler
[junit4:junit4]   2> 5288 T725 oasc.RequestHandlers.initHandlersFromConfig created /terms: org.apache.solr.handler.component.SearchHandler
[junit4:junit4]   2> 5289 T725 oasc.RequestHandlers.initHandlersFromConfig created spellCheckCompRH: org.apache.solr.handler.component.SearchHandler
[junit4:junit4]   2> 5289 T725 oasc.RequestHandlers.initHandlersFromConfig created spellCheckCompRH_Direct: org.apache.solr.handler.component.SearchHandler
[junit4:junit4]   2> 5290 T725 oasc.RequestHandlers.initHandlersFromConfig created spellCheckWithWordbreak: org.apache.solr.handler.component.SearchHandler
[junit4:junit4]   2> 5290 T725 oasc.RequestHandlers.initHandlersFromConfig created spellCheckWithWordbreak_Direct: org.apache.solr.handler.component.SearchHandler
[junit4:junit4]   2> 5291 T725 oasc.RequestHandlers.initHandlersFromConfig created spellCheckCompRH1: org.apache.solr.handler.component.SearchHandler
[junit4:junit4]   2> 5291 T725 oasc.RequestHandlers.initHandlersFromConfig created tvrh: org.apache.solr.handler.component.SearchHandler
[junit4:junit4]   2> 5292 T725 oasc.RequestHandlers.initHandlersFromConfig created /mlt: solr.MoreLikeThisHandler
[junit4:junit4]   2> 5293 T725 oasc.RequestHandlers.initHandlersFromConfig created /debug/dump: solr.DumpRequestHandler
[junit4:junit4]   2> 5301 T725 oashl.XMLLoader.init xsltCacheLifetimeSeconds=60
[junit4:junit4]   2> 5305 T725 oasc.SolrCore.initDeprecatedSupport WARNING solrconfig.xml uses deprecated <admin/gettableFiles>, Please update your config to use the ShowFileRequestHandler.
[junit4:junit4]   2> 5306 T725 oasc.SolrCore.initDeprecatedSupport WARNING adding ShowFileRequestHandler with hidden files: [SCHEMA.XML, OLD_SYNONYMS.TXT, STOPWORDS.TXT, PROTWORDS.TXT, OPEN-EXCHANGE-RATES.JSON, SYNONYMS.TXT, CURRENCY.XML, MAPPING-ISOLATIN1ACCENT.TXT]
[junit4:junit4]   2> 5310 T725 oass.SolrIndexSearcher.<init> Opening Searcher@5abfe449 main
[junit4:junit4]   2> 5311 T725 oasu.CommitTracker.<init> Hard AutoCommit: disabled
[junit4:junit4]   2> 5311 T725 oasu.CommitTracker.<init> Soft AutoCommit: disabled
[junit4:junit4]   2> 5312 T725 oashc.SpellCheckComponent.inform Initializing spell checkers
[junit4:junit4]   2> 5318 T725 oass.DirectSolrSpellChecker.init init: {name=direct,classname=DirectSolrSpellChecker,field=lowerfilt,minQueryLength=3}
[junit4:junit4]   2> 5369 T772 oasc.SolrCore.registerSearcher [collection1] Registered new searcher Searcher@5abfe449 main{StandardDirectoryReader(segments_1:1)}
[junit4:junit4]   2> 5671 T746 oascc.ZkStateReader.updateClusterState Updating cloud state from ZooKeeper... 
[junit4:junit4]   2> 5684 T771 oascc.ZkStateReader$2.process A cluster state change has occurred - updating...
[junit4:junit4]   2> 5684 T759 oascc.ZkStateReader$2.process A cluster state change has occurred - updating...
[junit4:junit4]   2> 5684 T745 oascc.ZkStateReader$2.process A cluster state change has occurred - updating...
[junit4:junit4]   2> 5876 T725 oasc.CoreContainer.register registering core: collection1
[junit4:junit4]   2> 5876 T725 oasc.ZkController.register Register shard - core:collection1 address:http://127.0.0.1:39062/solr shardId:shard2
[junit4:junit4]   2> 5877 T725 oascc.SolrZkClient.makePath makePath: /collections/collection1/leader_elect/shard2/election
[junit4:junit4]   2> 5892 T730 oazs.PrepRequestProcessor.pRequest Got user-level KeeperException when processing sessionid:0x13a4b83c2360004 type:delete cxid:0x42 zxid:0xfffffffffffffffe txntype:unknown reqpath:n/a Error Path:/solr/collections/collection1/leaders/shard2 Error:KeeperErrorCode = NoNode for /solr/collections/collection1/leaders/shard2
[junit4:junit4]   2> 5893 T725 oasc.ShardLeaderElectionContext.runLeaderProcess Running the leader process.
[junit4:junit4]   2> 5894 T730 oazs.PrepRequestProcessor.pRequest Got user-level KeeperException when processing sessionid:0x13a4b83c2360004 type:create cxid:0x43 zxid:0xfffffffffffffffe txntype:unknown reqpath:n/a Error Path:/solr/overseer Error:KeeperErrorCode = NodeExists for /solr/overseer
[junit4:junit4]   2> 5896 T725 oasc.ShardLeaderElectionContext.waitForReplicasToComeUp Enough replicas found to continue.
[junit4:junit4]   2> 5896 T725 oasc.ShardLeaderElectionContext.runLeaderProcess I may be the new leader - try and sync
[junit4:junit4]   2> 5897 T725 oasc.SyncStrategy.sync Sync replicas to http://127.0.0.1:39062/solr/collection1/
[junit4:junit4]   2> 5897 T725 oasc.SyncStrategy.syncReplicas Sync Success - now sync replicas to me
[junit4:junit4]   2> 5897 T725 oasc.SyncStrategy.syncToMe http://127.0.0.1:39062/solr/collection1/ has no replicas
[junit4:junit4]   2> 5898 T725 oasc.ShardLeaderElectionContext.runLeaderProcess I am the new leader: http://127.0.0.1:39062/solr/collection1/
[junit4:junit4]   2> 5898 T725 oascc.SolrZkClient.makePath makePath: /collections/collection1/leaders/shard2
[junit4:junit4]   2> 5901 T730 oazs.PrepRequestProcessor.pRequest Got user-level KeeperException when processing sessionid:0x13a4b83c2360004 type:create cxid:0x4c zxid:0xfffffffffffffffe txntype:unknown reqpath:n/a Error Path:/solr/overseer Error:KeeperErrorCode = NodeExists for /solr/overseer
[junit4:junit4]   2> 6188 T746 oascc.ZkStateReader.updateClusterState Updating cloud state from ZooKeeper... 
[junit4:junit4]   2> 6204 T759 oascc.ZkStateReader$2.process A cluster state change has occurred - updating...
[junit4:junit4]   2> 6204 T745 oascc.ZkStateReader$2.process A cluster state change has occurred - updating...
[junit4:junit4]   2> 6204 T771 oascc.ZkStateReader$2.process A cluster state change has occurred - updating...
[junit4:junit4]   2> 6217 T725 oasc.ZkController.register We are http://127.0.0.1:39062/solr/collection1/ and leader is http://127.0.0.1:39062/solr/collection1/
[junit4:junit4]   2> 6217 T725 oasc.ZkController.register No LogReplay needed for core=collection1 baseURL=http://127.0.0.1:39062/solr
[junit4:junit4]   2> 6218 T725 oasc.ZkController.checkRecovery I am the leader, no recovery necessary
[junit4:junit4]   2> 6219 T725 oascc.ZkStateReader.updateClusterState Updating cloud state from ZooKeeper... 
[junit4:junit4]   2> 6220 T725 oass.SolrDispatchFilter.init user.dir=/usr/home/hudson/hudson-slave/workspace/Lucene-Solr-Tests-4.x-java7/solr/build/solr-core/test/J0
[junit4:junit4]   2> 6221 T725 oass.SolrDispatchFilter.init SolrDispatchFilter.init() done
[junit4:junit4]   2> 6221 T725 oascsi.HttpClientUtil.createClient Creating new http client, config:maxConnections=128&maxConnectionsPerHost=32&followRedirects=false
[junit4:junit4]   2> 6358 T725 oejs.Server.doStart jetty-8.1.2.v20120308
[junit4:junit4]   2> 6361 T725 oejs.AbstractConnector.doStart Started SocketConnector@0.0.0.0:39066
[junit4:junit4]   2> 6362 T725 oasc.SolrResourceLoader.locateSolrHome JNDI not configured for solr (NoInitialContextEx)
[junit4:junit4]   2> 6362 T725 oasc.SolrResourceLoader.locateSolrHome using system property solr.solr.home: /usr/home/hudson/hudson-slave/workspace/Lucene-Solr-Tests-4.x-java7/solr/build/solr-core/test/J0/./solrtest-jetty3-1349886663299
[junit4:junit4]   2> 6362 T725 oasc.SolrResourceLoader.<init> new SolrResourceLoader for deduced Solr Home: '/usr/home/hudson/hudson-slave/workspace/Lucene-Solr-Tests-4.x-java7/solr/build/solr-core/test/J0/./solrtest-jetty3-1349886663299/'
[junit4:junit4]   2> 6397 T725 oass.SolrDispatchFilter.init SolrDispatchFilter.init()
[junit4:junit4]   2> 6397 T725 oasc.SolrResourceLoader.locateSolrHome JNDI not configured for solr (NoInitialContextEx)
[junit4:junit4]   2> 6398 T725 oasc.SolrResourceLoader.locateSolrHome using system property solr.solr.home: /usr/home/hudson/hudson-slave/workspace/Lucene-Solr-Tests-4.x-java7/solr/build/solr-core/test/J0/./solrtest-jetty3-1349886663299
[junit4:junit4]   2> 6398 T725 oasc.CoreContainer$Initializer.initialize looking for solr.xml: /usr/home/hudson/hudson-slave/workspace/Lucene-Solr-Tests-4.x-java7/solr/build/solr-core/test/J0/./solrtest-jetty3-1349886663299/solr.xml
[junit4:junit4]   2> 6399 T725 oasc.CoreContainer.<init> New CoreContainer 1173938360
[junit4:junit4]   2> 6399 T725 oasc.CoreContainer.load Loading CoreContainer using Solr Home: '/usr/home/hudson/hudson-slave/workspace/Lucene-Solr-Tests-4.x-java7/solr/build/solr-core/test/J0/./solrtest-jetty3-1349886663299/'
[junit4:junit4]   2> 6400 T725 oasc.SolrResourceLoader.<init> new SolrResourceLoader for directory: '/usr/home/hudson/hudson-slave/workspace/Lucene-Solr-Tests-4.x-java7/solr/build/solr-core/test/J0/./solrtest-jetty3-1349886663299/'
[junit4:junit4]   2> 6436 T725 oasc.CoreContainer.load Registering Log Listener
[junit4:junit4]   2> 6453 T725 oasc.CoreContainer.initZooKeeper Zookeeper client=127.0.0.1:39050/solr
[junit4:junit4]   2> 6454 T725 oaz.ZooKeeper.<init> Initiating client connection, connectString=127.0.0.1:39050/solr sessionTimeout=5000 watcher=org.apache.solr.common.cloud.ConnectionManager@20b64f78
[junit4:junit4]   2> 6455 T782 oaz.ClientCnxn$SendThread.startConnect Opening socket connection to server /127.0.0.1:39050
[junit4:junit4]   2> 6455 T725 oascc.ConnectionManager.waitForConnected Waiting for client to connect to ZooKeeper
[junit4:junit4]   2> 6456 T782 oaz.ClientCnxn$SendThread.primeConnection Socket connection established to localhost/127.0.0.1:39050, initiating session
[junit4:junit4]   2> 6456 T727 oazs.NIOServerCnxn$Factory.run Accepted socket connection from /140.211.11.196:39067
[junit4:junit4]   2> 6457 T727 oazs.NIOServerCnxn.readConnectRequest Client attempting to establish new session at /140.211.11.196:39067
[junit4:junit4]   2> 6459 T729 oazs.NIOServerCnxn.finishSessionInit Established session 0x13a4b83c2360005 with negotiated timeout 5000 for client /140.211.11.196:39067
[junit4:junit4]   2> 6459 T782 oaz.ClientCnxn$SendThread.readConnectResult Session establishment complete on server localhost/127.0.0.1:39050, sessionid = 0x13a4b83c2360005, negotiated timeout = 5000
[junit4:junit4]   2> 6459 T783 oascc.ConnectionManager.process Watcher org.apache.solr.common.cloud.ConnectionManager@20b64f78 name:ZooKeeperConnection Watcher:127.0.0.1:39050/solr got event WatchedEvent state:SyncConnected type:None path:null path:null type:None
[junit4:junit4]   2> 6460 T725 oascc.ConnectionManager.waitForConnected Client is connected to ZooKeeper
[junit4:junit4]   2> 6461 T730 oazs.PrepRequestProcessor.pRequest Got user-level KeeperException when processing sessionid:0x13a4b83c2360005 type:create cxid:0x1 zxid:0xfffffffffffffffe txntype:unknown reqpath:n/a Error Path:/solr/overseer Error:KeeperErrorCode = NodeExists for /solr/overseer
[junit4:junit4]   2> 6462 T730 oazs.PrepRequestProcessor.pRequest Got user-level KeeperException when processing sessionid:0x13a4b83c2360005 type:create cxid:0x2 zxid:0xfffffffffffffffe txntype:unknown reqpath:n/a Error Path:/solr/overseer Error:KeeperErrorCode = NodeExists for /solr/overseer
[junit4:junit4]   2> 6477 T725 oasc.ZkController.createEphemeralLiveNode Register node as live in ZooKeeper:/live_nodes/127.0.0.1:39066_solr
[junit4:junit4]   2> 6478 T730 oazs.PrepRequestProcessor.pRequest Got user-level KeeperException when processing sessionid:0x13a4b83c2360005 type:delete cxid:0x4 zxid:0xfffffffffffffffe txntype:unknown reqpath:n/a Error Path:/solr/live_nodes/127.0.0.1:39066_solr Error:KeeperErrorCode = NoNode for /solr/live_nodes/127.0.0.1:39066_solr
[junit4:junit4]   2> 6480 T725 oascc.SolrZkClient.makePath makePath: /live_nodes/127.0.0.1:39066_solr
[junit4:junit4]   2> 6487 T745 oascc.ZkStateReader$3.process Updating live nodes
[junit4:junit4]   2> 6487 T759 oascc.ZkStateReader$3.process Updating live nodes
[junit4:junit4]   2> 6487 T771 oascc.ZkStateReader$3.process Updating live nodes
[junit4:junit4]   2> 6488 T725 oashc.HttpShardHandlerFactory.getParameter Setting socketTimeout to: 0
[junit4:junit4]   2> 6488 T725 oashc.HttpShardHandlerFactory.getParameter Setting urlScheme to: http://
[junit4:junit4]   2> 6488 T725 oashc.HttpShardHandlerFactory.getParameter Setting connTimeout to: 0
[junit4:junit4]   2> 6489 T725 oashc.HttpShardHandlerFactory.getParameter Setting maxConnectionsPerHost to: 20
[junit4:junit4]   2> 6489 T725 oashc.HttpShardHandlerFactory.getParameter Setting corePoolSize to: 0
[junit4:junit4]   2> 6489 T725 oashc.HttpShardHandlerFactory.getParameter Setting maximumPoolSize to: 2147483647
[junit4:junit4]   2> 6490 T725 oashc.HttpShardHandlerFactory.getParameter Setting maxThreadIdleTime to: 5
[junit4:junit4]   2> 6490 T725 oashc.HttpShardHandlerFactory.getParameter Setting sizeOfQueue to: -1
[junit4:junit4]   2> 6490 T725 oashc.HttpShardHandlerFactory.getParameter Setting fairnessPolicy to: false
[junit4:junit4]   2> 6490 T725 oascsi.HttpClientUtil.createClient Creating new http client, config:maxConnectionsPerHost=20&maxConnections=10000&socketTimeout=0&connTimeout=0&retry=false
[junit4:junit4]   2> 6513 T725 oascc.ZkStateReader.createClusterStateWatchersAndUpdate Updating cluster state from ZooKeeper... 
[junit4:junit4]   2> 6518 T725 oasc.CoreContainer.create Creating SolrCore 'collection1' using instanceDir: /usr/home/hudson/hudson-slave/workspace/Lucene-Solr-Tests-4.x-java7/solr/build/solr-core/test/J0/./solrtest-jetty3-1349886663299/collection1
[junit4:junit4]   2> 6519 T725 oasc.ZkController.createCollectionZkNode Check for collection zkNode:collection1
[junit4:junit4]   2> 6519 T725 oasc.ZkController.createCollectionZkNode Collection zkNode exists
[junit4:junit4]   2> 6520 T725 oasc.ZkController.readConfigName Load collection config from:/collections/collection1
[junit4:junit4]   2> 6521 T725 oasc.SolrResourceLoader.<init> new SolrResourceLoader for directory: '/usr/home/hudson/hudson-slave/workspace/Lucene-Solr-Tests-4.x-java7/solr/build/solr-core/test/J0/./solrtest-jetty3-1349886663299/collection1/'
[junit4:junit4]   2> 6522 T725 oasc.SolrResourceLoader.replaceClassLoader Adding 'file:/usr/home/hudson/hudson-slave/workspace/Lucene-Solr-Tests-4.x-java7/solr/build/solr-core/test/J0/solrtest-jetty3-1349886663299/collection1/lib/README' to classloader
[junit4:junit4]   2> 6522 T725 oasc.SolrResourceLoader.replaceClassLoader Adding 'file:/usr/home/hudson/hudson-slave/workspace/Lucene-Solr-Tests-4.x-java7/solr/build/solr-core/test/J0/solrtest-jetty3-1349886663299/collection1/lib/classes/' to classloader
[junit4:junit4]   2> 6557 T725 oasc.SolrConfig.<init> Using Lucene MatchVersion: LUCENE_41
[junit4:junit4]   2> 6604 T725 oasc.SolrConfig.<init> Loaded SolrConfig: solrconfig.xml
[junit4:junit4]   2> 6705 T725 oass.IndexSchema.readSchema Reading Solr Schema
[junit4:junit4]   2> 6714 T725 oass.IndexSchema.readSchema Schema name=test
[junit4:junit4]   2> 6717 T746 oascc.ZkStateReader.updateClusterState Updating cloud state from ZooKeeper... 
[junit4:junit4]   2> 6749 T759 oascc.ZkStateReader$2.process A cluster state change has occurred - updating...
[junit4:junit4]   2> 6749 T771 oascc.ZkStateReader$2.process A cluster state change has occurred - updating...
[junit4:junit4]   2> 6749 T745 oascc.ZkStateReader$2.process A cluster state change has occurred - updating...
[junit4:junit4]   2> 6749 T783 oascc.ZkStateReader$2.process A cluster state change has occurred - updating...
[junit4:junit4]   2> 7352 T725 oass.OpenExchangeRatesOrgProvider.init Initialized with rates=open-exchange-rates.json, refreshInterval=1440.
[junit4:junit4]   2> 7363 T725 oass.IndexSchema.readSchema default search field in schema is text
[junit4:junit4]   2> 7367 T725 oass.IndexSchema.readSchema unique key field: id
[junit4:junit4]   2> 7382 T725 oass.FileExchangeRateProvider.reload Reloading exchange rates from file currency.xml
[junit4:junit4]   2> 7387 T725 oass.FileExchangeRateProvider.reload Reloading exchange rates from file currency.xml
[junit4:junit4]   2> 7391 T725 oass.OpenExchangeRatesOrgProvider.reload Reloading exchange rates from open-exchange-rates.json
[junit4:junit4]   2> 7392 T725 oass.OpenExchangeRatesOrgProvider.reload Reloading exchange rates from open-exchange-rates.json
[junit4:junit4]   2> 7394 T725 oasc.SolrCore.<init> [collection1] Opening new SolrCore at /usr/home/hudson/hudson-slave/workspace/Lucene-Solr-Tests-4.x-java7/solr/build/solr-core/test/J0/./solrtest-jetty3-1349886663299/collection1/, dataDir=./org.apache.solr.cloud.BasicDistributedZkTest-1349886657073/jetty3/
[junit4:junit4]   2> 7394 T725 oasc.JmxMonitoredMap.<init> JMX monitoring is enabled. Adding Solr mbeans to JMX Server: com.sun.jmx.mbeanserver.JmxMBeanServer@38559e4f
[junit4:junit4]   2> 7396 T725 oasc.SolrCore.getNewIndexDir New index directory detected: old=null new=./org.apache.solr.cloud.BasicDistributedZkTest-1349886657073/jetty3/index/
[junit4:junit4]   2> 7396 T725 oasc.SolrCore.initIndex WARNING [collection1] Solr index directory './org.apache.solr.cloud.BasicDistributedZkTest-1349886657073/jetty3/index' doesn't exist. Creating new index...
[junit4:junit4]   2> 7397 T725 oasc.CachingDirectoryFactory.get return new directory for /usr/home/hudson/hudson-slave/workspace/Lucene-Solr-Tests-4.x-java7/solr/build/solr-core/test/J0/./org.apache.solr.cloud.BasicDistributedZkTest-1349886657073/jetty3/index forceNew:false
[junit4:junit4]   2> 7416 T725 oasc.SolrDeletionPolicy.onCommit SolrDeletionPolicy.onCommit: commits:num=1
[junit4:junit4]   2> 		commit{dir=NRTCachingDirectory(org.apache.lucene.store.NIOFSDirectory@/usr/home/hudson/hudson-slave/workspace/Lucene-Solr-Tests-4.x-java7/solr/build/solr-core/test/J0/org.apache.solr.cloud.BasicDistributedZkTest-1349886657073/jetty3/index lockFactory=org.apache.lucene.store.NativeFSLockFactory@70a6ecdc; maxCacheMB=48.0 maxMergeSizeMB=4.0),segFN=segments_1,generation=1,filenames=[segments_1]
[junit4:junit4]   2> 7416 T725 oasc.SolrDeletionPolicy.updateCommits newest commit = 1
[junit4:junit4]   2> 7418 T725 oasc.SolrCore.initWriters created xml: solr.XMLResponseWriter
[junit4:junit4]   2> 7421 T725 oasup.UpdateRequestProcessorChain.init inserting DistributedUpdateProcessorFactory into updateRequestProcessorChain "dedupe"
[junit4:junit4]   2> 7421 T725 oasup.UpdateRequestProcessorChain.init inserting DistributedUpdateProcessorFactory into updateRequestProcessorChain "dedupe-allfields"
[junit4:junit4]   2> 7422 T725 oasup.UpdateRequestProcessorChain.init inserting DistributedUpdateProcessorFactory into updateRequestProcessorChain "stored_sig"
[junit4:junit4]   2> 7423 T725 oasup.UpdateRequestProcessorChain.init inserting DistributedUpdateProcessorFactory into updateRequestProcessorChain "uniq-fields"
[junit4:junit4]   2> 7424 T725 oasup.UpdateRequestProcessorChain.init inserting DistributedUpdateProcessorFactory into updateRequestProcessorChain "distrib-dup-test-chain-implicit"
[junit4:junit4]   2> 7424 T725 oasc.RequestHandlers.initHandlersFromConfig adding lazy requestHandler: solr.ReplicationHandler
[junit4:junit4]   2> 7425 T725 oasc.RequestHandlers.initHandlersFromConfig created /replication: solr.ReplicationHandler
[junit4:junit4]   2> 7426 T725 oasc.RequestHandlers.initHandlersFromConfig created standard: solr.StandardRequestHandler
[junit4:junit4]   2> 7427 T725 oasc.RequestHandlers.initHandlersFromConfig created /get: solr.RealTimeGetHandler
[junit4:junit4]   2> 7428 T725 oasc.RequestHandlers.initHandlersFromConfig created dismax: solr.SearchHandler
[junit4:junit4]   2> 7429 T725 oasc.RequestHandlers.initHandlersFromConfig created mock: org.apache.solr.core.MockQuerySenderListenerReqHandler
[junit4:junit4]   2> 7429 T725 oasc.RequestHandlers.initHandlersFromConfig created /admin/: org.apache.solr.handler.admin.AdminHandlers
[junit4:junit4]   2> 7430 T725 oasc.RequestHandlers.initHandlersFromConfig created defaults: solr.StandardRequestHandler
[junit4:junit4]   2> 7430 T725 oasc.RequestHandlers.initHandlersFromConfig adding lazy requestHandler: solr.StandardRequestHandler
[junit4:junit4]   2> 7431 T725 oasc.RequestHandlers.initHandlersFromConfig created lazy: solr.StandardRequestHandler
[junit4:junit4]   2> 7432 T725 oasc.RequestHandlers.initHandlersFromConfig created /update: solr.UpdateRequestHandler
[junit4:junit4]   2> 7432 T725 oasc.RequestHandlers.initHandlersFromConfig created /terms: org.apache.solr.handler.component.SearchHandler
[junit4:junit4]   2> 7433 T725 oasc.RequestHandlers.initHandlersFromConfig created spellCheckCompRH: org.apache.solr.handler.component.SearchHandler
[junit4:junit4]   2> 7434 T725 oasc.RequestHandlers.initHandlersFromConfig created spellCheckCompRH_Direct: org.apache.solr.handler.component.SearchHandler
[junit4:junit4]   2> 7434 T725 oasc.RequestHandlers.initHandlersFromConfig created spellCheckWithWordbreak: org.apache.solr.handler.component.SearchHandler
[junit4:junit4]   2> 7435 T725 oasc.RequestHandlers.initHandlersFromConfig created spellCheckWithWordbreak_Direct: org.apache.solr.handler.component.SearchHandler
[junit4:junit4]   2> 7435 T725 oasc.RequestHandlers.initHandlersFromConfig created spellCheckCompRH1: org.apache.solr.handler.component.SearchHandler
[junit4:junit4]   2> 7436 T725 oasc.RequestHandlers.initHandlersFromConfig created tvrh: org.apache.solr.handler.component.SearchHandler
[junit4:junit4]   2> 7437 T725 oasc.RequestHandlers.initHandlersFromConfig created /mlt: solr.MoreLikeThisHandler
[junit4:junit4]   2> 7437 T725 oasc.RequestHandlers.initHandlersFromConfig created /debug/dump: solr.DumpRequestHandler
[junit4:junit4]   2> 7448 T725 oashl.XMLLoader.init xsltCacheLifetimeSeconds=60
[junit4:junit4]   2> 7853 T725 oasc.SolrCore.initDeprecatedSupport WARNING solrconfig.xml uses deprecated <admin/gettableFiles>, Please update your config to use the ShowFileRequestHandler.
[junit4:junit4]   2> 7855 T725 oasc.SolrCore.initDeprecatedSupport WARNING adding ShowFileRequestHandler with hidden files: [SCHEMA.XML, OLD_SYNONYMS.TXT, STOPWORDS.TXT, PROTWORDS.TXT, OPEN-EXCHANGE-RATES.JSON, SYNONYMS.TXT, CURRENCY.XML, MAPPING-ISOLATIN1ACCENT.TXT]
[junit4:junit4]   2> 7860 T725 oass.SolrIndexSearcher.<init> Opening Searcher@6f72a70f main
[junit4:junit4]   2> 7861 T725 oasu.CommitTracker.<init> Hard AutoCommit: disabled
[junit4:junit4]   2> 7862 T725 oasu.CommitTracker.<init> Soft AutoCommit: disabled
[junit4:junit4]   2> 7863 T725 oashc.SpellCheckComponent.inform Initializing spell checkers
[junit4:junit4]   2> 7871 T725 oass.DirectSolrSpellChecker.init init: {name=direct,classname=DirectSolrSpellChecker,field=lowerfilt,minQueryLength=3}
[junit4:junit4]   2> 7930 T784 oasc.SolrCore.registerSearcher [collection1] Registered new searcher Searcher@6f72a70f main{StandardDirectoryReader(segments_1:1)}
[junit4:junit4]   2> 8375 T746 oascc.ZkStateReader.updateClusterState Updating cloud state from ZooKeeper... 
[junit4:junit4]   2> 8392 T745 oascc.ZkStateReader$2.process A cluster state change has occurred - updating...
[junit4:junit4]   2> 8392 T759 oascc.ZkStateReader$2.process A cluster state change has occurred - updating...
[junit4:junit4]   2> 8392 T783 oascc.ZkStateReader$2.process A cluster state change has occurred - updating...
[junit4:junit4]   2> 8393 T771 oascc.ZkStateReader$2.process A cluster state change has occurred - updating...
[junit4:junit4]   2> 8437 T725 oasc.CoreContainer.register registering core: collection1
[junit4:junit4]   2> 8437 T725 oasc.ZkController.register Register shard - core:collection1 address:http://127.0.0.1:39066/solr shardId:shard1
[junit4:junit4]   2> 8441 T725 oasc.ZkController.register We are http://127.0.0.1:39066/solr/collection1/ and leader is http://127.0.0.1:39058/solr/collection1/
[junit4:junit4]   2> 8441 T725 oasc.ZkController.register No LogReplay needed for core=collection1 baseURL=http://127.0.0.1:39066/solr
[junit4:junit4]   2> 8441 T725 oasc.ZkController.checkRecovery Core needs to recover:collection1
[junit4:junit4]   2> 8442 T725 oasu.DefaultSolrCoreState.doRecovery Running recovery - first canceling any ongoing recovery
[junit4:junit4]   2> ASYNC  NEW_CORE C53 name=collection1 org.apache.solr.core.SolrCore@21187ba5 url=http://127.0.0.1:39066/solr/collection1 node=127.0.0.1:39066_solr
[junit4:junit4]   2> 8447 T785 C53 P39066 oasc.RecoveryStrategy.run Starting recovery process.  core=collection1 recoveringAfterStartup=true
[junit4:junit4]   2> 8448 T725 oascc.ZkStateReader.updateClusterState Updating cloud state from ZooKeeper... 
[junit4:junit4]   2> 8448 T785 C53 P39066 oasc.RecoveryStrategy.doRecovery ###### startupVersions=[]
[junit4:junit4]   2> 8449 T725 oass.SolrDispatchFilter.init user.dir=/usr/home/hudson/hudson-slave/workspace/Lucene-Solr-Tests-4.x-java7/solr/build/solr-core/test/J0
[junit4:junit4]   2> 8449 T725 oass.SolrDispatchFilter.init SolrDispatchFilter.init() done
[junit4:junit4]   2> 8450 T785 C53 P39066 oasc.RecoveryStrategy.doRecovery Attempting to PeerSync from http://127.0.0.1:39058/solr/collection1/ core=collection1 - recoveringAfterStartup=true
[junit4:junit4]   2> 8450 T725 oascsi.HttpClientUtil.createClient Creating new http client, config:maxConnections=128&maxConnectionsPerHost=32&followRedirects=false
[junit4:junit4]   2> 8457 T785 C53 P39066 oascsi.HttpClientUtil.createClient Creating new http client, config:maxConnectionsPerHost=20&maxConnections=10000&connTimeout=30000&socketTimeout=30000&retry=false
[junit4:junit4]   2> 8465 T725 oaz.ZooKeeper.<init> Initiating client connection, connectString=127.0.0.1:39050/solr sessionTimeout=10000 watcher=org.apache.solr.common.cloud.ConnectionManager@338bc9d2
[junit4:junit4]   2> 8465 T786 oaz.ClientCnxn$SendThread.startConnect Opening socket connection to server /127.0.0.1:39050
[junit4:junit4]   2> 8465 T725 oascc.ConnectionManager.waitForConnected Waiting for client to connect to ZooKeeper
[junit4:junit4]   2> 8466 T786 oaz.ClientCnxn$SendThread.primeConnection Socket connection established to localhost/127.0.0.1:39050, initiating session
[junit4:junit4]   2> 8466 T727 oazs.NIOServerCnxn$Factory.run Accepted socket connection from /140.211.11.196:39072
[junit4:junit4]   2> 8467 T727 oazs.NIOServerCnxn.readConnectRequest Client attempting to establish new session at /140.211.11.196:39072
[junit4:junit4]   2> 8468 T729 oazs.NIOServerCnxn.finishSessionInit Established session 0x13a4b83c2360006 with negotiated timeout 10000 for client /140.211.11.196:39072
[junit4:junit4]   2> 8468 T786 oaz.ClientCnxn$SendThread.readConnectResult Session establishment complete on server localhost/127.0.0.1:39050, sessionid = 0x13a4b83c2360006, negotiated timeout = 10000
[junit4:junit4]   2> 8469 T787 oascc.ConnectionManager.process Watcher org.apache.solr.common.cloud.ConnectionManager@338bc9d2 name:ZooKeeperConnection Watcher:127.0.0.1:39050/solr got event WatchedEvent state:SyncConnected type:None path:null path:null type:None
[junit4:junit4]   2> 8469 T725 oascc.ConnectionManager.waitForConnected Client is connected to ZooKeeper
[junit4:junit4]   2> 8470 T725 oascc.ZkStateReader.createClusterStateWatchersAndUpdate Updating cluster state from ZooKeeper... 
[junit4:junit4]   2> 8475 T785 C53 P39066 oasu.PeerSync.sync PeerSync: core=collection1 url=http://127.0.0.1:39066/solr START replicas=[http://127.0.0.1:39058/solr/collection1/] nUpdates=100
[junit4:junit4]   2> 8475 T725 oasc.ChaosMonkey.monkeyLog monkey: init - expire sessions:true cause connection loss:true
[junit4:junit4]   2> 8476 T725 oascsi.HttpClientUtil.createClient Creating new http client, config:
[junit4:junit4]   2> 8476 T785 C53 P39066 oasu.PeerSync.sync WARNING no frame of reference to tell of we've missed updates
[junit4:junit4]   2> 8477 T785 C53 P39066 oasc.RecoveryStrategy.doRecovery PeerSync Recovery was not successful - trying replication. core=collection1
[junit4:junit4]   2> 8477 T785 C53 P39066 oasc.RecoveryStrategy.doRecovery Starting Replication Recovery. core=collection1
[junit4:junit4]   2> 8477 T785 C53 P39066 oascsi.HttpClientUtil.createClient Creating new http client, config:maxConnections=128&maxConnectionsPerHost=32&followRedirects=false
[junit4:junit4]   2> ASYNC  NEW_CORE C54 name=collection1 org.apache.solr.core.SolrCore@59b4a73b url=http://127.0.0.1:39058/solr/collection1 node=127.0.0.1:39058_solr
[junit4:junit4]   2> 8486 T751 C54 P39058 REQ /get {distrib=false&qt=/get&wt=javabin&version=2&getVersions=100} status=0 QTime=3 
[junit4:junit4]   2> 8489 T725 oascc.ZkStateReader.updateClusterState Updating cloud state from ZooKeeper... 
[junit4:junit4]   2> 8491 T725 oasc.AbstractDistribZkTestBase.waitForRecoveriesToFinish Wait for recoveries to finish - collection: collection1 failOnTimeout:true timeout (sec):1800
[junit4:junit4]   2> 8491 T725 oascc.ZkStateReader.updateClusterState Updating cloud state from ZooKeeper... 
[junit4:junit4]   2> 8897 T746 oascc.ZkStateReader.updateClusterState Updating cloud state from ZooKeeper... 
[junit4:junit4]   2> 8904 T759 oascc.ZkStateReader$2.process A cluster state change has occurred - updating...
[junit4:junit4]   2> 8904 T745 oascc.ZkStateReader$2.process A cluster state change has occurred - updating...
[junit4:junit4]   2> 8904 T771 oascc.ZkStateReader$2.process A cluster state change has occurred - updating...
[junit4:junit4]   2> 8904 T783 oascc.ZkStateReader$2.process A cluster state change has occurred - updating...
[junit4:junit4]   2> 8904 T787 oascc.ZkStateReader$2.process A cluster state change has occurred - updating...
[junit4:junit4]   2> 9493 T725 oascc.ZkStateReader.updateClusterState Updating cloud state from ZooKeeper... 
[junit4:junit4]   2> 10496 T725 oascc.ZkStateReader.updateClusterState Updating cloud state from ZooKeeper... 
[junit4:junit4]   2> 11498 T725 oascc.ZkStateReader.updateClusterState Updating cloud state from ZooKeeper... 
[junit4:junit4]   2>  C53_STATE=coll:collection1 core:collection1 props:{shard=shard1, roles=null, state=recovering, core=collection1, collection=collection1, node_name=127.0.0.1:39066_solr, base_url=http://127.0.0.1:39066/solr}
[junit4:junit4]   2> 11505 T785 C53 P39066 oasc.RecoveryStrategy.doRecovery Begin buffering updates. core=collection1
[junit4:junit4]   2> 11505 T785 C53 P39066 oasu.UpdateLog.bufferUpdates Starting to buffer updates. FSUpdateLog{state=ACTIVE, tlog=null}
[junit4:junit4]   2> 11505 T785 C53 P39066 oasc.RecoveryStrategy.replicate Attempting to replicate from http://127.0.0.1:39058/solr/collection1/. core=collection1
[junit4:junit4]   2> 11505 T785 C53 P39066 oascsi.HttpClientUtil.createClient Creating new http client, config:maxConnections=128&maxConnectionsPerHost=32&followRedirects=false
[junit4:junit4]   2> 11516 T753 C54 P39058 oasu.DirectUpdateHandler2.commit start commit{flags=0,_version_=0,optimize=false,openSearcher=true,waitSearcher=true,expungeDeletes=false,softCommit=false}
[junit4:junit4]   2> 11520 T753 C54 P39058 oasc.SolrDeletionPolicy.onInit SolrDeletionPolicy.onInit: commits:num=1
[junit4:junit4]   2> 		commit{dir=NRTCachingDirectory(org.apache.lucene.store.NIOFSDirectory@/usr/home/hudson/hudson-slave/workspace/Lucene-Solr-Tests-4.x-java7/solr/build/solr-core/test/J0/org.apache.solr.cloud.BasicDistributedZkTest-1349886657073/jetty1/index lockFactory=org.apache.lucene.store.NativeFSLockFactory@7355f16f; maxCacheMB=48.0 maxMergeSizeMB=4.0),segFN=segments_1,generation=1,filenames=[segments_1]
[junit4:junit4]   2> 11521 T753 C54 P39058 oasc.SolrDeletionPolicy.updateCommits newest commit = 1
[junit4:junit4]   2> 11522 T753 C54 P39058 oass.SolrIndexSearcher.<init> Opening Searcher@8570d04 main
[junit4:junit4]   2> 11522 T753 C54 P39058 oasu.DirectUpdateHandler2.commit end_commit_flush
[junit4:junit4]   2> 11523 T760 oasc.SolrCore.registerSearcher [collection1] Registered new searcher Searcher@8570d04 main{StandardDirectoryReader(segments_1:1)}
[junit4:junit4]   2> 11524 T753 C54 P39058 /update {waitSearcher=true&commit=true&commit_end_point=true&wt=javabin&softCommit=false&version=2} {commit=} 0 9
[junit4:junit4]   2> 11525 T785 C53 P39066 oash.ReplicationHandler.inform Commits will be reserved for  10000
[junit4:junit4]   2> 11525 T785 C53 P39066 oascsi.HttpClientUtil.createClient Creating new http client, config:connTimeout=5000&socketTimeout=20000&allowCompression=false&maxConnections=10000&maxConnectionsPerHost=10000
[junit4:junit4]   2> 11541 T785 C53 P39066 oash.SnapPuller.<init>  No value set for 'pollInterval'. Timer Task not started.
[junit4:junit4]   2> 11543 T754 C54 P39058 oash.ReplicationHandler.inform Commits will be reserved for  10000
[junit4:junit4]   2> 11544 T754 C54 P39058 REQ /replication {command=indexversion&wt=javabin&qt=/replication&version=2} status=0 QTime=2 
[junit4:junit4]   2> 11548 T785 C53 P39066 oasc.SolrDeletionPolicy.onInit SolrDeletionPolicy.onInit: commits:num=1
[junit4:junit4]   2> 		commit{dir=NRTCachingDirectory(org.apache.lucene.store.NIOFSDirectory@/usr/home/hudson/hudson-slave/workspace/Lucene-Solr-Tests-4.x-java7/solr/build/solr-core/test/J0/org.apache.solr.cloud.BasicDistributedZkTest-1349886657073/jetty3/index lockFactory=org.apache.lucene.store.NativeFSLockFactory@70a6ecdc; maxCacheMB=48.0 maxMergeSizeMB=4.0),segFN=segments_1,generation=1,filenames=[segments_1]
[junit4:junit4]   2> 11548 T785 C53 P39066 oasc.SolrDeletionPolicy.updateCommits newest commit = 1
[junit4:junit4]   2> 11549 T785 C53 P39066 oasu.DirectUpdateHandler2.commit start commit{flags=0,_version_=0,optimize=false,openSearcher=true,waitSearcher=true,expungeDeletes=false,softCommit=false}
[junit4:junit4]   2> 11558 T785 C53 P39066 oasc.SolrDeletionPolicy.onCommit SolrDeletionPolicy.onCommit: commits:num=2
[junit4:junit4]   2> 		commit{dir=NRTCachingDirectory(org.apache.lucene.store.NIOFSDirectory@/usr/home/hudson/hudson-slave/workspace/Lucene-Solr-Tests-4.x-java7/solr/build/solr-core/test/J0/org.apache.solr.cloud.BasicDistributedZkTest-1349886657073/jetty3/index lockFactory=org.apache.lucene.store.NativeFSLockFactory@70a6ecdc; maxCacheMB=48.0 maxMergeSizeMB=4.0),segFN=segments_1,generation=1,filenames=[segments_1]
[junit4:junit4]   2> 		commit{dir=NRTCachingDirectory(org.apache.lucene.store.NIOFSDirectory@/usr/home/hudson/hudson-slave/workspace/Lucene-Solr-Tests-4.x-java7/solr/build/solr-core/test/J0/org.apache.solr.cloud.BasicDistributedZkTest-1349886657073/jetty3/index lockFactory=org.apache.lucene.store.NativeFSLockFactory@70a6ecdc; maxCacheMB=48.0 maxMergeSizeMB=4.0),segFN=segments_2,generation=2,filenames=[segments_2]
[junit4:junit4]   2> 11558 T785 C53 P39066 oasc.SolrDeletionPolicy.updateCommits newest commit = 2
[junit4:junit4]   2> 11561 T785 C53 P39066 oass.SolrIndexSearcher.<init> Opening Searcher@8f67f1 main
[junit4:junit4]   2> 11562 T785 C53 P39066 oasu.DirectUpdateHandler2.commit end_commit_flush
[junit4:junit4]   2> 11563 T784 oasc.SolrCore.registerSearcher [collection1] Registered new searcher Searcher@8f67f1 main{StandardDirectoryReader(segments_2:2)}
[junit4:junit4]   2> 11563 T785 C53 P39066 oasc.RecoveryStrategy.replay No replay needed. core=collection1
[junit4:junit4]   2> 11563 T785 C53 P39066 oasc.RecoveryStrategy.doRecovery Replication Recovery was successful - registering as Active. core=collection1
[junit4:junit4]   2> 11566 T785 C53 P39066 oasc.RecoveryStrategy.doRecovery Finished recovery process. core=collection1
[junit4:junit4]   2> 11972 T746 oascc.ZkStateReader.updateClusterState Updating cloud state from ZooKeeper... 
[junit4:junit4]   2> 11990 T759 oascc.ZkStateReader$2.process A cluster state change has occurred - updating...
[junit4:junit4]   2> 11990 T771 oascc.ZkStateReader$2.process A cluster state change has occurred - updating...
[junit4:junit4]   2> 11990 T783 oascc.ZkStateReader$2.process A cluster state change has occurred - updating...
[junit4:junit4]   2> 11990 T787 oascc.ZkStateReader$2.process A cluster state change has occurred - updating...
[junit4:junit4]   2> 11990 T745 oascc.ZkStateReader$2.process A cluster state change has occurred - updating...
[junit4:junit4]   2> 12500 T725 oascc.ZkStateReader.updateClusterState Updating cloud state from ZooKeeper... 
[junit4:junit4]   2> ASYNC  NEW_CORE C55 name=collection1 org.apache.solr.core.SolrCore@a91d491 url=http://127.0.0.1:39054/solr/collection1 node=127.0.0.1:39054_solr
[junit4:junit4]   2> 12513 T737 C55 P39054 oasc.SolrDeletionPolicy.onInit SolrDeletionPolicy.onInit: commits:num=1
[junit4:junit4]   2> 		commit{dir=NRTCachingDirectory(org.apache.lucene.store.NIOFSDirectory@/usr/home/hudson/hudson-slave/workspace/Lucene-Solr-Tests-4.x-java7/solr/build/solr-core/test/J0/org.apache.solr.cloud.BasicDistributedZkTest-1349886657073/control/data/index lockFactory=org.apache.lucene.store.NativeFSLockFactory@67511e43; maxCacheMB=48.0 maxMergeSizeMB=4.0),segFN=segments_1,generation=1,filenames=[segments_1]
[junit4:junit4]   2> 12514 T737 C55 P39054 oasc.SolrDeletionPolicy.updateCommits newest commit = 1
[junit4:junit4]   2> 12515 T737 C55 P39054 oass.SolrIndexSearcher.<init> Opening Searcher@6ac11e1 realtime
[junit4:junit4]   2> 12516 T737 C55 P39054 /update {wt=javabin&version=2} {deleteByQuery=*:* (-1415458764438372352)} 0 7
[junit4:junit4]   2> 12517 T725 oaz.ZooKeeper.<init> Initiating client connection, connectString=127.0.0.1:39050/solr sessionTimeout=10000 watcher=org.apache.solr.common.cloud.ConnectionManager@ac9ce33
[junit4:junit4]   2> 12518 T789 oaz.ClientCnxn$SendThread.startConnect Opening socket connection to server /127.0.0.1:39050
[junit4:junit4]   2> 12518 T725 oascc.ConnectionManager.waitForConnected Waiting for client to connect to ZooKeeper
[junit4:junit4]   2> 12518 T789 oaz.ClientCnxn$SendThread.primeConnection Socket connection established to localhost/127.0.0.1:39050, initiating session
[junit4:junit4]   2> 12519 T727 oazs.NIOServerCnxn$Factory.run Accepted socket connection from /140.211.11.196:39086
[junit4:junit4]   2> 12519 T727 oazs.NIOServerCnxn.readConnectRequest Client attempting to establish new session at /140.211.11.196:39086
[junit4:junit4]   2> 12521 T729 oazs.NIOServerCnxn.finishSessionInit Established session 0x13a4b83c2360007 with negotiated timeout 10000 for client /140.211.11.196:39086
[junit4:junit4]   2> 12522 T789 oaz.ClientCnxn$SendThread.readConnectResult Session establishment complete on server localhost/127.0.0.1:39050, sessionid = 0x13a4b83c2360007, negotiated timeout = 10000
[junit4:junit4]   2> 12522 T790 oascc.ConnectionManager.process Watcher org.apache.solr.common.cloud.ConnectionManager@ac9ce33 name:ZooKeeperConnection Watcher:127.0.0.1:39050/solr got event WatchedEvent state:SyncConnected type:None path:null path:null type:None
[junit4:junit4]   2> 12522 T725 oascc.ConnectionManager.waitForConnected Client is connected to ZooKeeper
[junit4:junit4]   2> 12523 T725 oascc.ZkStateReader.createClusterStateWatchersAndUpdate Updating cluster state from ZooKeeper... 
[junit4:junit4]   2> 12528 T755 C54 P39058 oass.SolrIndexSearcher.<init> Opening Searcher@7eb0937 realtime
[junit4:junit4]   2>  C53_STATE=coll:collection1 core:collection1 props:{shard=shard1, roles=null, state=active, core=collection1, collection=collection1, node_name=127.0.0.1:39066_solr, base_url=http://127.0.0.1:39066/solr}
[junit4:junit4]   2> 12536 T775 C53 P39066 oass.SolrIndexSearcher.<init> Opening Searcher@116ff695 realtime
[junit4:junit4]   2> 12536 T775 C53 P39066 REQ /update {update.distrib=FROMLEADER&_version_=-1415458764456198144&update.from=http://127.0.0.1:39058/solr/collection1/&wt=javabin&version=2} status=0 QTime=2 
[junit4:junit4]   2> ASYNC  NEW_CORE C56 name=collection1 org.apache.solr.core.SolrCore@7e4c2b5d url=http://127.0.0.1:39062/solr/collection1 node=127.0.0.1:39062_solr
[junit4:junit4]   2> 12538 T763 C56 P39062 oasc.SolrDeletionPolicy.onInit SolrDeletionPolicy.onInit: commits:num=1
[junit4:junit4]   2> 		commit{dir=NRTCachingDirectory(org.apache.lucene.store.NIOFSDirectory@/usr/home/hudson/hudson-slave/workspace/Lucene-Solr-Tests-4.x-java7/solr/build/solr-core/test/J0/org.apache.solr.cloud.BasicDistributedZkTest-1349886657073/jetty2/index lockFactory=org.apache.lucene.store.NativeFSLockFactory@3f35a09e; maxCacheMB=48.0 maxMergeSizeMB=4.0),segFN=segments_1,generation=1,filenames=[segments_1]
[junit4:junit4]   2> 12538 T763 C56 P39062 oasc.SolrDeletionPolicy.updateCommits newest commit = 1
[junit4:junit4]   2> 12539 T763 C56 P39062 oass.SolrIndexSearcher.<init> Opening Searcher@3d45d628 realtime
[junit4:junit4]   2> 12540 T763 C56 P39062 REQ /update {update.distrib=TOLEADER&wt=javabin&version=2} status=0 QTime=6 
[junit4:junit4]   2> 12540 T755 C54 P39058 /update {wt=javabin&version=2} {deleteByQuery=*:* (-1415458764456198144)} 0 14
[junit4:junit4]   2> 12550 T737 C55 P39054 /update {wt=javabin&version=2} {add=[1 (1415458764478218240)]} 0 4
[junit4:junit4]   2> 12567 T775 C53 P39066 REQ /update {distrib.from=http://127.0.0.1:39058/solr/collection1/&update.distrib=FROMLEADER&wt=javabin&version=2} status=0 QTime=3 
[junit4:junit4]   2> 12567 T756 C54 P39058 REQ /update {distrib.from=http://127.0.0.1:39062/solr/collection1/&update.distrib=TOLEADER&wt=javabin&version=2} status=0 QTime=8 
[junit4:junit4]   2> 12568 T764 C56 P39062 /update {wt=javabin&version=2} {add=[1]} 0 16
[junit4:junit4]   2> 12572 T737 C55 P39054 /update {wt=javabin&version=2} {add=[2 (1415458764503384064)]} 0 1
[junit4:junit4]   2> 12578 T764 C56 P39062 /update {wt=javabin&version=2} {add=[2 (1415458764507578368)]} 0 3
[junit4:junit4]   2> 12582 T737 C55 P39054 /update {wt=javabin&version=2} {add=[3 (1415458764513869824)]} 0 1
[junit4:junit4]   2> 12586 T764 C56 P39062 /update {wt=javabin&version=2} {add=[3 (1415458764518064128)]} 0 1
[junit4:junit4]   2> 12590 T737 C55 P39054 /update {wt=javabin&version=2} {add=[4 (1415458764522258432)]} 0 1
[junit4:junit4]   2> 12599 T775 C53 P39066 REQ /update {distrib.from=http://127.0.0.1:39058/solr/collection1/&update.distrib=FROMLEADER&wt=javabin&version=2} status=0 QTime=2 
[junit4:junit4]   2> 12599 T755 C54 P39058 /update {wt=javabin&version=2} {add=[4 (1415458764526452736)]} 0 6
[junit4:junit4]   2> 12603 T737 C55 P39054 /update {wt=javabin&version=2} {add=[5 (1415458764535889920)]} 0 1
[junit4:junit4]   2> 12611 T763 C56 P39062 REQ /update {distrib.from=http://127.0.0.1:39058/solr/collection1/&update.distrib=TOLEADER&wt=javabin&version=2} status=0 QTime=2 
[junit4:junit4]   2> 12611 T755 C54 P39058 /update {wt=javabin&version=2} {add=[5]} 0 5
[junit4:junit4]   2> 12615 T737 C55 P39054 /update {wt=javabin&version=2} {add=[6 (1415458764548472832)]} 0 1
[junit4:junit4]   2> 12621 T763 C56 P39062 REQ /update {distrib.from=http://127.0.0.1:39058/solr/collection1/&update.distrib=TOLEADER&wt=javabin&version=2} status=0 QTime=1 
[junit4:junit4]   2> 12622 T755 C54 P39058 /update {wt=javabin&version=2} {add=[6]} 0 4
[junit4:junit4]   2> 12626 T737 C55 P39054 /update {wt=javabin&version=2} {add=[7 (1415458764560007168)]} 0 1
[junit4:junit4]   2> 12633 T763 C56 P39062 REQ /update {distrib.from=http://127.0.0.1:39058/solr/collection1/&update.distrib=TOLEADER&wt=javabin&version=2} status=0 QTime=1 
[junit4:junit4]   2> 12634 T755 C54 P39058 /update {wt=javabin&version=2} {add=[7]} 0 5
[junit4:junit4]   2> 12639 T737 C55 P39054 /update {wt=javabin&version=2} {add=[8 (1415458764573638656)]} 0 2
[junit4:junit4]   2> 12649 T775 C53 P39066 REQ /update {distrib.from=http://127.0.0.1:39058/solr/collection1/&update.distrib=FROMLEADER&wt=javabin&version=2} status=0 QTime=2 
[junit4:junit4]   2> 12650 T755 C54 P39058 /update {wt=javabin&version=2} {add=[8 (1415458764578881536)]} 0 7
[junit4:junit4]   2> 12655 T737 C55 P39054 /update {wt=javabin&version=2} {add=[9 (1415458764589367296)]} 0 2
[junit4:junit4]   2> 12662 T763 C56 P39062 REQ /update {distrib.from=http://127.0.0.1:39058/solr/collection1/&update.distrib=TOLEADER&wt=javabin&version=2} status=0 QTime=2 
[junit4:junit4]   2> 12662 T755 C54 P39058 /update {wt=javabin&version=2} {add=[9]} 0 5
[junit4:junit4]   2> 12680 T737 C55 P39054 /update {wt=javabin&version=2} {add=[10 (1415458764601950208)]} 0 14
[junit4:junit4]   2> 12690 T775 C53 P39066 REQ /update {distrib.from=http://127.0.0.1:39058/solr/collection1/&update.distrib=FROMLEADER&wt=javabin&version=2} status=0 QTime=2 
[junit4:junit4]   2> 12691 T755 C54 P39058 /update {wt=javabin&version=2} {add=[10 (1415458764621873152)]} 0 8
[junit4:junit4]   2> 12697 T737 C55 P39054 /update {wt=javabin&version=2} {add=[11 (1415458764633407488)]} 0 3
[junit4:junit4]   2> 12706 T775 C53 P39066 REQ /update {distrib.from=http://127.0.0.1:39058/solr/collection1/&update.distrib=FROMLEADER&wt=javabin&version=2} status=0 QTime=2 
[junit4:junit4]   2> 12707 T755 C54 P39058 /update {wt=javabin&version=2} {add=[11 (1415458764639698944)]} 0 7
[junit4:junit4]   2> 12712 T737 C55 P39054 /update {wt=javabin&version=2} {add=[12 (1415458764650184704)]} 0 2
[junit4:junit4]   2> 12722 T775 C53 P39066 REQ /update {distrib.from=http://127.0.0.1:39058/solr/collection1/&update.distrib=FROMLEADER&wt=javabin&version=2} status=0 QTime=2 
[junit4:junit4]   2> 12723 T755 C54 P39058 /update {wt=javabin&version=2} {add=[12 (1415458764655427584)]} 0 8
[junit4:junit4]   2> 12728 T737 C55 P39054 /update {wt=javabin&version=2} {add=[13 (1415458764666961920)]} 0 2
[junit4:junit4]   2> 12740 T775 C53 P39066 REQ /update {distrib.from=http://127.0.0.1:39058/solr/collection1/&update.distrib=FROMLEADER&wt=javabin&version=2} status=0 QTime=2 
[junit4:junit4]   2> 12741 T756 C54 P39058 REQ /update {distrib.from=http://127.0.0.1:39062/solr/collection1/&update.distrib=TOLEADER&wt=javabin&version=2} status=0 QTime=7 
[junit4:junit4]   2> 12741 T764 C56 P39062 /update {wt=javabin&version=2} {add=[13]} 0 10
[junit4:junit4]   2> 12745 T737 C55 P39054 /update {wt=javabin&version=2} {add=[14 (1415458764684787712)]} 0 1
[junit4:junit4]   2> 12755 T775 C53 P39066 REQ /update {distrib.from=http://127.0.0.1:39058/solr/collection1/&update.distrib=FROMLEADER&wt=javabin&version=2} status=0 QTime=2 
[junit4:junit4]   2> 12756 T755 C54 P39058 /update {wt=javabin&version=2} {add=[14 (1415458764688982016)]} 0 8
[junit4:junit4]   2> 12760 T737 C55 P39054 /update {wt=javabin&version=2} {add=[15 (1415458764700516352)]} 0 1
[junit4:junit4]   2> 12771 T775 C53 P39066 REQ /update {distrib.from=http://127.0.0.1:39058/solr/collection1/&update.distrib=FROMLEADER&wt=javabin&version=2} status=0 QTime=1 
[junit4:junit4]   2> 12772 T756 C54 P39058 REQ /update {distrib.from=http://127.0.0.1:39062/solr/collection1/&update.distrib=TOLEADER&wt=javabin&version=2} status=0 QTime=6 
[junit4:junit4]   2> 12773 T764 C56 P39062 /update {wt=javabin&version=2} {add=[15]} 0 10
[junit4:junit4]   2> 12776 T737 C55 P39054 /update {wt=javabin&version=2} {add=[16 (1415458764717293568)]} 0 1
[junit4:junit4]   2> 12813 T775 C53 P39066 REQ /update {distrib.from=http://127.0.0.1:39058/solr/collection1/&update.distrib=FROMLEADER&wt=javabin&version=2} status=0 QTime=14 
[junit4:junit4]   2> 12813 T756 C54 P39058 REQ /update {distrib.from=http://127.0.0.1:39062/solr/collection1/&update.distrib=TOLEADER&wt=javabin&version=2} status=0 QTime=31 
[junit4:junit4]   2> 12814 T764 C56 P39062 /update {wt=javabin&version=2} {add=[16]} 0 35
[junit4:junit4]   2> 12820 T737 C55 P39054 /update {wt=javabin&version=2} {add=[17 (1415458764762382336)]} 0 3
[junit4:junit4]   2> 12827 T764 C56 P39062 /update {wt=javabin&version=2} {add=[17 (1415458764768673792)]} 0 4
[junit4:junit4]   2> 12831 T737 C55 P39054 /update {wt=javabin&version=2} {add=[100 (1415458764774965248)]} 0 1
[junit4:junit4]   2> 12843 T775 C53 P39066 REQ /update {distrib.from=http://127.0.0.1:39058/solr/collection1/&update.distrib=FROMLEADER&wt=javabin&version=2} status=0 QTime=2 
[junit4:junit4]   2> 12844 T756 C54 P39058 REQ /update {distrib.from=http://127.0.0.1:39062/solr/collection1/&update.distrib=TOLEADER&wt=javabin&version=2} status=0 QTime=7 
[junit4:junit4]   2> 12845 T764 C56 P39062 /update {wt=javabin&version=2} {add=[100]} 0 11
[junit4:junit4]   2> 12849 T737 C55 P39054 /update {wt=javabin&version=2} {add=[101 (1415458764793839616)]} 0 1
[junit4:junit4]   2> 12857 T775 C53 P39066 REQ /update {distrib.from=http://127.0.0.1:39058/solr/collection1/&update.distrib=FROMLEADER&wt=javabin&version=2} status=0 QTime=1 
[junit4:junit4]   2> 12858 T755 C54 P39058 /update {wt=javabin&version=2} {add=[101 (1415458764799082496)]} 0 6
[junit4:junit4]   2> 12875 T737 C55 P39054 /update {wt=javabin&version=2} {add=[102 (1415458764807471104)]} 0 14
[junit4:junit4]   2> 12884 T775 C53 P39066 REQ /update {distrib.from=http://127.0.0.1:39058/solr/collection1/&update.distrib=FROMLEADER&wt=javabin&version=2} status=0 QTime=1 
[junit4:junit4]   2> 12885 T756 C54 P39058 REQ /update {distrib.from=http://127.0.0.1:39062/solr/collection1/&update.distrib=TOLEADER&wt=javabin&version=2} status=0 QTime=6 
[junit4:junit4]   2> 12885 T764 C56 P39062 /update {wt=javabin&version=2} {add=[102]} 0 8
[junit4:junit4]   2> 12890 T737 C55 P39054 /update {wt=javabin&version=2} {add=[103 (1415458764835782656)]} 0 2
[junit4:junit4]   2> 12897 T763 C56 P39062 REQ /update {distrib.from=http://127.0.0.1:39058/solr/collection1/&update.distrib=TOLEADER&wt=javabin&version=2} status=0 QTime=1 
[junit4:junit4]   2> 12898 T755 C54 P39058 /update {wt=javabin&version=2} {add=[103]} 0 5
[junit4:junit4]   2> 12901 T737 C55 P39054 /update {wt=javabin&version=2} {add=[104 (1415458764848365568)]} 0 1
[junit4:junit4]   2> 12907 T763 C56 P39062 REQ /update {distrib.from=http://127.0.0.1:39058/solr/collection1/&update.distrib=TOLEADER&wt=javabin&version=2} status=0 QTime=1 
[junit4:junit4]   2> 12908 T755 C54 P39058 /update {wt=javabin&version=2} {add=[104]} 0 4
[junit4:junit4]   2> 12911 T737 C55 P39054 /update {wt=javabin&version=2} {add=[105 (1415458764858851328)]} 0 1
[junit4:junit4]   2> 12928 T764 C56 P39062 /update {wt=javabin&version=2} {add=[105 (1415458764863045632)]} 0 14
[junit4:junit4]   2> 12932 T737 C55 P39054 /update {wt=javabin&version=2} {add=[106 (1415458764880871424)]} 0 1
[junit4:junit4]   2> 12947 T763 C56 P39062 REQ /update {distrib.from=http://127.0.0.1:39058/solr/collection1/&update.distrib=TOLEADER&wt=javabin&version=2} status=0 QTime=3 
[junit4:junit4]   2> 12948 T755 C54 P39058 /update {wt=javabin&version=2} {add=[106]} 0 11
[junit4:junit4]   2> 12953 T737 C55 P39054 /update {wt=javabin&version=2} {add=[107 (1415458764902891520)]} 0 2
[junit4:junit4]   2> 12965 T775 C53 P39066 REQ /update {distrib.from=http://127.0.0.1:39058/solr/collection1/&update.distrib=FROMLEADER&wt=javabin&version=2} status=0 QTime=2 
[junit4:junit4]   2> 12965 T756 C54 P39058 REQ /update {distrib.from=http://127.0.0.1:39062/solr/collection1/&update.distrib=TOLEADER&wt=javabin&version=2} status=0 QTime=6 
[junit4:junit4]   2> 12966 T764 C56 P39062 /update {wt=javabin&version=2} {add=[107]} 0 10
[junit4:junit4]   2> 12970 T737 C55 P39054 /update {wt=javabin&version=2} {add=[108 (1415458764920717312)]} 0 1
[junit4:junit4]   2> 12981 T775 C53 P39066 REQ /update {distrib.from=http://127.0.0.1:39058/solr/collection1/&update.distrib=FROMLEADER&wt=javabin&version=2} status=0 QTime=1 
[junit4:junit4]   2> 12982 T756 C54 P39058 REQ /update {distrib.from=http://127.0.0.1:39062/solr/collection1/&update.distrib=TOLEADER&wt=javabin&version=2} status=0 QTime=6 
[junit4:junit4]   2> 12982 T764 C56 P39062 /update {wt=javabin&version=2} {add=[108]} 0 9
[junit4:junit4]   2> 12987 T737 C55 P39054 /update {wt=javabin&version=2} {add=[109 (1415458764937494528)]} 0 2
[junit4:junit4]   2> 12994 T775 C53 P39066 REQ /update {distrib.from=http://127.0.0.1:39058/solr/collection1/&update.distrib=FROMLEADER&wt=javabin&version=2} status=0 QTime=1 
[junit4:junit4]   2> 12995 T755 C54 P39058 /update {wt=javabin&version=2} {add=[109 (1415458764942737408)]} 0 6
[junit4:junit4]   2> 13000 T737 C55 P39054 /update {wt=javabin&version=2} {add=[110 (1415458764952174592)]} 0 2
[junit4:junit4]   2> 13010 T775 C53 P39066 REQ /update {distrib.from=http://127.0.0.1:39058/solr/collection1/&update.distrib=FROMLEADER&wt=javabin&version=2} status=0 QTime=1 
[junit4:junit4]   2> 13011 T756 C54 P39058 REQ /update {distrib.from=http://127.0.0.1:39062/solr/collection1/&update.distrib=TOLEADER&wt=javabin&version=2} status=0 QTime=6 
[junit4:junit4]   2> 13011 T764 C56 P39062 /update {wt=javabin&version=2} {add=[110]} 0 9
[junit4:junit4]   2> 13015 T737 C55 P39054 /update {wt=javabin&version=2} {add=[111 (1415458764967903232)]} 0 1
[junit4:junit4]   2> 13023 T775 C53 P39066 REQ /update {distrib.from=http://127.0.0.1:39058/solr/collection1/&update.distrib=FROMLEADER&wt=javabin&version=2} status=0 QTime=1 
[junit4:junit4]   2> 13024 T755 C54 P39058 /update {wt=javabin&version=2} {add=[111 (1415458764972097536)]} 0 6
[junit4:junit4]   2> 13046 T737 C55 P39054 /update {wt=javabin&version=2} {add=[112 (1415458764981534720)]} 0 19
[junit4:junit4]   2> 13051 T764 C56 P39062 /update {wt=javabin&version=2} {add=[112 (1415458765005651968)]} 0 2
[junit4:junit4]   2> 13057 T737 C55 P39054 /update {wt=javabin&version=2} {add=[113 (1415458765010894848)]} 0 3
[junit4:junit4]   2> 13069 T775 C53 P39066 REQ /update {distrib.from=http://127.0.0.1:39058/solr/collection1/&update.distrib=FROMLEADER&wt=javabin&version=2} status=0 QTime=1 
[junit4:junit4]   2> 13070 T756 C54 P39058 REQ /update {distrib.from=http://127.0.0.1:39062/solr/collection1/&update.distrib=TOLEADER&wt=javabin&version=2} status=0 QTime=6 
[junit4:junit4]   2> 13071 T764 C56 P39062 /update {wt=javabin&version=2} {add=[113]} 0 10
[junit4:junit4]   2> 13076 T737 C55 P39054 /update {wt=javabin&version=2} {add=[114 (1415458765030817792)]} 0 2
[junit4:junit4]   2> 13114 T775 C53 P39066 REQ /update {distrib.from=http://127.0.0.1:39058/solr/collection1/&update.distrib=FROMLEADER&wt=javabin&version=2} status=0 QTime=12 
[junit4:junit4]   2> 13115 T755 C54 P39058 /update {wt=javabin&version=2} {add=[114 (1415458765037109248)]} 0 36
[junit4:junit4]   2> 13121 T737 C55 P39054 /update {wt=javabin&version=2} {add=[115 (1415458765078003712)]} 0 3
[junit4:junit4]   2> 13125 T764 C56 P39062 /update {wt=javabin&version=2} {add=[115 (1415458765083246592)]} 0 2
[junit4:junit4]   2> 13130 T737 C55 P39054 /update {wt=javabin&version=2} {add=[116 (1415458765088489472)]} 0 2
[junit4:junit4]   2> 13135 T764 C56 P39062 /update {wt=javabin&version=2} {add=[116 (1415458765093732352)]} 0 2
[junit4:junit4]   2> 13139 T737 C55 P39054 /update {wt=javabin&version=2} {add=[117 (1415458765097926656)]} 0 1
[junit4:junit4]   2> 13146 T763 C56 P39062 REQ /update {distrib.from=http://127.0.0.1:39058/solr/collection1/&update.distrib=TOLEADER&wt=javabin&version=2} status=0 QTime=1 
[junit4:junit4]   2> 13147 T755 C54 P39058 /update {wt=javabin&version=2} {add=[117]} 0 5
[junit4:junit4]   2> 13152 T737 C55 P39054 /update {wt=javabin&version=2} {add=[118 (1415458765111558144)]} 0 2
[junit4:junit4]   2> 13166 T775 C53 P39066 REQ /update {distrib.from=http://127.0.0.1:39058/solr/collection1/&update.distrib=FROMLEADER&wt=javabin&version=2} status=0 QTime=2 
[junit4:junit4]   2> 13167 T756 C54 P39058 REQ /update {distrib.from=http://127.0.0.1:39062/solr/collection1/&update.distrib=TOLEADER&wt=javabin&version=2} status=0 QTime=9 
[junit4:junit4]   2> 13168 T764 C56 P39062 /update {wt=javabin&version=2} {add=[118]} 0 13
[junit4:junit4]   2> 13172 T737 C55 P39054 /update {wt=javabin&version=2} {add=[119 (1415458765132529664)]} 0 1
[junit4:junit4]   2> 13180 T763 C56 P39062 REQ /update {distrib.from=http://127.0.0.1:39058/solr/collection1/&update.distrib=TOLEADER&wt=javabin&version=2} status=0 QTime=2 
[junit4:junit4]   2> 13180 T755 C54 P39058 /update {wt=javabin&version=2} {add=[119]} 0 5
[junit4:junit4]   2> 13184 T737 C55 P39054 /update {wt=javabin&version=2} {add=[120 (1415458765145112576)]} 0 1
[junit4:junit4]   2> 13192 T763 C56 P39062 REQ /update {distrib.from=http://127.0.0.1:39058/solr/collection1/&update.distrib=TOLEADER&wt=javabin&version=2} status=0 QTime=1 
[junit4:junit4]   2> 13192 T755 C54 P39058 /update {wt=javabin&version=2} {add=[120]} 0 5
[junit4:junit4]   2> 13197 T737 C55 P39054 /update {wt=javabin&version=2} {add=[121 (1415458765157695488)]} 0 2
[junit4:junit4]   2> 13202 T764 C56 P39062 /update {wt=javabin&version=2} {add=[121 (1415458765163986944)]} 0 2
[junit4:junit4]   2> 13225 T737 C55 P39054 /update {wt=javabin&version=2} {add=[122 (1415458765169229824)]} 0 20
[junit4:junit4]   2> 13237 T775 C53 P39066 REQ /update {distrib.from=http://127.0.0.1:39058/solr/collection1/&update.distrib=FROMLEADER&wt=javabin&version=2} status=0 QTime=1 
[junit4:junit4]   2> 13238 T756 C54 P39058 REQ /update {distrib.from=http://127.0.0.1:39062/solr/collection1/&update.distrib=TOLEADER&wt=javabin&version=2} status=0 QTime=7 
[junit4:junit4]   2> 13239 T764 C56 P39062 /update {wt=javabin&version=2} {add=[122]} 0 11
[junit4:junit4]   2> 13246 T737 C55 P39054 /update {wt=javabin&version=2} {add=[123 (1415458765208027136)]} 0 4
[junit4:junit4]   2> 13259 T775 C53 P39066 REQ /update {distrib.from=http://127.0.0.1:39058/solr/collection1/&update.distrib=FROMLEADER&wt=javabin&version=2} status=0 QTime=2 
[junit4:junit4]   2> 13260 T756 C54 P39058 REQ /update {distrib.from=http://127.0.0.1:39062/solr/collection1/&update.distrib=TOLEADER&wt=javabin&version=2} status=0 QTime=8 
[junit4:junit4]   2> 13260 T764 C56 P39062 /update {wt=javabin&version=2} {add=[123]} 0 11
[junit4:junit4]   2> 13266 T737 C55 P39054 /update {wt=javabin&version=2} {add=[124 (1415458765231095808)]} 0 2
[junit4:junit4]   2> 13279 T775 C53 P39066 REQ /update {distrib.from=http://127.0.0.1:39058/solr/collection1/&update.distrib=FROMLEADER&wt=javabin&version=2} status=0 QTime=2 
[junit4:junit4]   2> 13280 T756 C54 P39058 REQ /update {distrib.from=http://127.0.0.1:39062/solr/collection1/&update.distrib=TOLEADER&wt=javabin&version=2} status=0 QTime=8 
[junit4:junit4]   2> 13280 T764 C56 P39062 /update {wt=javabin&version=2} {add=[124]} 0 11
[junit4:junit4]   2> 13286 T737 C55 P39054 /update {wt=javabin&version=2} {add=[125 (1415458765252067328)]} 0 2
[junit4:junit4]   2> 13300 T775 C53 P39066 REQ /update {distrib.from=http://127.0.0.1:39058/solr/collection1/&update.distrib=FROMLEADER&wt=javabin&version=2} status=0 QTime=2 
[junit4:junit4]   2> 13301 T756 C54 P39058 REQ /update {distrib.from=http://127.0.0.1:39062/solr/collection1/&update.distrib=TOLEADER&wt=javabin&version=2} status=0 QTime=8 
[junit4:junit4]   2> 13302 T764 C56 P39062 /update {wt=javabin&version=2} {add=[125]} 0 12
[junit4:junit4]   2> 13307 T737 C55 P39054 /update {wt=javabin&version=2} {add=[126 (1415458765274087424)]} 0 2
[junit4:junit4]   2> 13315 T763 C56 P39062 REQ /update {distrib.from=http://127.0.0.1:39058/solr/collection1/&update.distrib=TOLEADER&wt=javabin&version=2} status=0 QTime=2 
[junit4:junit4]   2> 13316 T755 C54 P39058 /update {wt=javabin&version=2} {add=[126]} 0 6
[junit4:junit4]   2> 13322 T737 C55 P39054 /update {wt=javabin&version=2} {add=[127 (1415458765289816064)]} 0 1
[junit4:junit4]   2> 13345 T764 C56 P39062 /update {wt=javabin&version=2} {add=[127 (1415458765295058944)]} 0 20
[junit4:junit4]   2> 13351 T737 C55 P39054 /update {wt=javabin&version=2} {add=[128 (1415458765320224768)]} 0 1
[junit4:junit4]   2> 13361 T763 C56 P39062 REQ /update {distrib.from=http://127.0.0.1:39058/solr/collection1/&update.distrib=TOLEADER&wt=javabin&version=2} status=0 QTime=4 
[junit4:junit4]   2> 13362 T755 C54 P39058 /update {wt=javabin&version=2} {add=[128]} 0 7
[junit4:junit4]   2> 13367 T737 C55 P39054 /update {wt=javabin&version=2} {add=[129 (1415458765337001984)]} 0 2
[junit4:junit4]   2> 13377 T775 C53 P39066 REQ /update {distrib.from=http://127.0.0.1:39058/solr/collection1/&update.distrib=FROMLEADER&wt=javabin&version=2} status=0 QTime=1 
[junit4:junit4]   2> 13379 T755 C54 P39058 /update {wt=javabin&version=2} {add=[129 (1415458765342244864)]} 0 8
[junit4:junit4]   2> 13384 T737 C55 P39054 /update {wt=javabin&version=2} {add=[130 (1415458765354827776)]} 0 2
[junit4:junit4]   2> 13389 T764 C56 P39062 /update {wt=javabin&version=2} {add=[130 (1415458765360070656)]} 0 2
[junit4:junit4]   2> 13394 T737 C55 P39054 /update {wt=javabin&version=2} {add=[131 (1415458765364264960)]} 0 2
[junit4:junit4]   2> 13400 T763 C56 P39062 REQ /update {distrib.from=http://127.0.0.1:39058/solr/collection1/&update.distrib=TOLEADER&wt=javabin&version=2} status=0 QTime=1 
[junit4:junit4]   2> 13401 T755 C54 P39058 /update {wt=javabin&version=2} {add=[131]} 0 5
[junit4:junit4]   2> 13417 T737 C55 P39054 /update {wt=javabin&version=2} {add=[132 (1415458765376847872)]} 0 13
[junit4:junit4]   2> 13427 T775 C53 P39066 REQ /update {distrib.from=http://127.0.0.1:39058/solr/collection1/&update.distrib=FROMLEADER&wt=javabin&version=2} status=0 QTime=2 
[junit4:junit4]   2> 13428 T755 C54 P39058 /update {wt=javabin&version=2} {add=[132 (1415458765394673664)]} 0 7
[junit4:junit4]   2> 13436 T737 C55 P39054 /update {wt=javabin&version=2} {add=[133 (1415458765407256576)]} 0 4
[junit4:junit4]   2> 13446 T775 C53 P39066 REQ /update {distrib.from=http://127.0.0.1:39058/solr/collection1/&update.distrib=FROMLEADER&wt=javabin&version=2} status=0 QTime=2 
[junit4:junit4]   2> 13447 T755 C54 P39058 /update {wt=javabin&version=2} {add=[133 (1415458765414596608)]} 0 8
[junit4:junit4]   2> 13454 T737 C55 P39054 /update {wt=javabin&version=2} {add=[134 (1415458765427179520)]} 0 3
[junit4:junit4]   2> 13460 T764 C56 P39062 /update {wt=javabin&version=2} {add=[134 (1415458765433470976)]} 0 3
[junit4:junit4]   2> 13465 T737 C55 P39054 /update {wt=javabin&version=2} {add=[135 (1415458765439762432)]} 0 2
[junit4:junit4]   2> 13479 T775 C53 P39066 REQ /update {distrib.from=http://127.0.0.1:39058/solr/collection1/&update.distrib=FROMLEADER&wt=javabin&version=2} status=0 QTime=2 
[junit4:junit4]   2> 13480 T756 C54 P39058 REQ /update {distrib.from=http://127.0.0.1:39062/solr/collection1/&update.distrib=TOLEADER&wt=javabin&version=2} status=0 QTime=8 
[junit4:junit4]   2> 13481 T764 C56 P39062 /update {wt=javabin&version=2} {add=[135]} 0 12
[junit4:junit4]   2> 13486 T737 C55 P39054 /update {wt=javabin&version=2} {add=[136 (1415458765461782528)]} 0 2
[junit4:junit4]   2> 13494 T763 C56 P39062 REQ /update {distrib.from=http://127.0.0.1:39058/solr/collection1/&update.distrib=TOLEADER&wt=javabin&version=2} status=0 QTime=2 
[junit4:junit4]   2> 13495 T755 C54 P39058 /update {wt=javabin&version=2} {add=[136]} 0 6
[junit4:junit4]   2> 13501 T737 C55 P39054 /update {wt=javabin&version=2} {add=[137 (1415458765477511168)]} 0 2
[junit4:junit4]   2> 13509 T763 C56 P39062 REQ /update {distrib.from=http://127.0.0.1:39058/solr/collection1/&update.distrib=TOLEADER&wt=javabin&version=2} status=0 QTime=2 
[junit4:junit4]   2> 13510 T755 C54 P39058 /update {wt=javabin&version=2} {add=[137]} 0 6
[junit4:junit4]   2> 13515 T737 C55 P39054 /update {wt=javabin&version=2} {add=[138 (1415458765492191232)]} 0 2
[junit4:junit4]   2> 13561 T775 C53 P39066 REQ /update {distrib.from=http://127.0.0.1:39058/solr/collection1/&update.distrib=FROMLEADER&wt=javabin&version=2} status=0 QTime=18 
[junit4:junit4]   2> 13562 T756 C54 P39058 REQ /update {distrib.from=http://127.0.0.1:39062/solr/collection1/&update.distrib=TOLEADER&wt=javabin&version=2} status=0 QTime=41 
[junit4:junit4]   2> 13563 T764 C56 P39062 /update {wt=javabin&version=2} {add=[138]} 0 45
[junit4:junit4]   2> 13569 T737 C55 P39054 /update {wt=javabin&version=2} {add=[139 (1415458765548814336)]} 0 2
[junit4:junit4]   2> 13577 T763 C56 P39062 REQ /update {distrib.from=http://127.0.0.1:39058/solr/collection1/&update.distrib=TOLEADER&wt=javabin&version=2} status=0 QTime=2 
[junit4:junit4]   2> 13578 T755 C54 P39058 /update {wt=javabin&version=2} {add=[139]} 0 6
[junit4:junit4]   2> 13583 T737 C55 P39054 /update {wt=javabin&version=2} {add=[140 (1415458765563494400)]} 0 2
[junit4:junit4]   2> 13591 T763 C56 P39062 REQ /update {distrib.from=http://127.0.0.1:39058/solr/collection1/&update.distrib=TOLEADER&wt=javabin&version=2} status=0 QTime=1 
[junit4:junit4]   2> 13591 T755 C54 P39058 /update {wt=javabin&version=2} {add=[140]} 0 5
[junit4:junit4]   2> 13595 T737 C55 P39054 /update {wt=javabin&version=2} {add=[141 (1415458765576077312)]} 0 1
[junit4:junit4]   2> 13599 T764 C56 P39062 /update {wt=javabin&version=2} {add=[141 (1415458765580271616)]} 0 1
[junit4:junit4]   2> 13613 T737 C55 P39054 /update {wt=javabin&version=2} {add=[142 (1415458765584465920)]} 0 11
[junit4:junit4]   2> 13631 T764 C56 P39062 /update {wt=javabin&version=2} {add=[142 (1415458765601243136)]} 0 14
[junit4:junit4]   2> 13638 T737 C55 P39054 /update {wt=javabin&version=2} {add=[143 (1415458765619068928)]} 0 4
[junit4:junit4]   2> 13644 T764 C56 P39062 /update {wt=javabin&version=2} {add=[143 (1415458765626408960)]} 0 3
[junit4:junit4]   2> 13649 T737 C55 P39054 /update {wt=javabin&version=2} {add=[144 (1415458765632700416)]} 0 2
[junit4:junit4]   2> 13657 T763 C56 P39062 REQ /update {distrib.from=http://127.0.0.1:39058/solr/collection1/&update.distrib=TOLEADER&wt=javabin&version=2} status=0 QTime=2 
[junit4:junit4]   2> 13658 T755 C54 P39058 /update {wt=javabin&version=2} {add=[144]} 0 6
[junit4:junit4]   2> 13663 T737 C55 P39054 /update {wt=javabin&version=2} {add=[145 (1415458765647380480)]} 0 2
[junit4:junit4]   2> 13671 T763 C56 P39062 REQ /update {distrib.from=http://127.0.0.1:39058/solr/collection1/&update.distrib=TOLEADER&wt=javabin&version=2} status=0 QTime=2 
[junit4:junit4]   2> 13672 T755 C54 P39058 /update {wt=javabin&version=2} {add=[145]} 0 6
[junit4:junit4]   2> 13677 T737 C55 P39054 /update {wt=javabin&version=2} {add=[146 (1415458765662060544)]} 0 2
[junit4:junit4]   2> 13691 T775 C53 P39066 REQ /update {distrib.from=http://127.0.0.1:39058/solr/collection1/&update.distrib=FROMLEADER&wt=javabin&version=2} status=0 QTime=4 
[junit4:junit4]   2> 13692 T755 C54 P39058 /update {wt=javabin&version=2} {add=[146 (1415458765667303424)]} 0 12
[junit4:junit4]   2> 13697 T737 C55 P39054 /update {wt=javabin&version=2} {add=[147 (1415458765683032064)]} 0 2
[junit4:junit4]   2> 13702 T764 C56 P39062 /update {wt=javabin&version=2} {add=[147 (1415458765688274944)]} 0 2
[junit4:junit4]   2> 13708 T737 C55 P39054 /update {wt=javabin&version=2} {add=[148 (1415458765693517824)]} 0 3
[junit4:junit4]   2> 13721 T775 C53 P39066 REQ /update {distrib.from=http://127.0.0.1:39058/solr/collection1/&update.distrib=FROMLEADER&wt=javabin&version=2} status=0 QTime=1 
[junit4:junit4]   2> 13723 T756 C54 P39058 REQ /update {distrib.from=http://127.0.0.1:39062/solr/collection1/&update.distrib=TOLEADER&wt=javabin&version=2} status=0 QTime=9 
[junit4:junit4]   2> 13724 T764 C56 P39062 /update {wt=javabin&version=2} {add=[148]} 0 13
[junit4:junit4]   2> 13730 T737 C55 P39054 /update {wt=javabin&version=2} {add=[149 (1415458765716586496)]} 0 3
[junit4:junit4]   2> 13736 T764 C56 P39062 /update {wt=javabin&version=2} {add=[149 (1415458765723926528)]} 0 2
[junit4:junit4]   2> 13740 T737 C55 P39054 oasu.DirectUpdateHandler2.commit start commit{flags=0,_version_=0,optimize=false,openSearcher=true,waitSearcher=true,expungeDeletes=false,softCommit=false}
[junit4:junit4]   2> 14643 T737 C55 P39054 oasc.SolrDeletionPolicy.onCommit SolrDeletionPolicy.onCommit: commits:num=2
[junit4:junit4]   2> 		commit{dir=NRTCachingDirectory(org.apache.lucene.store.NIOFSDirectory@/usr/home/hudson/hudson-slave/workspace/Lucene-Solr-Tests-4.x-java7/solr/build/solr-core/test/J0/org.apache.solr.cloud.BasicDistributedZkTest-1349886657073/control/data/index lockFactory=org.apache.lucene.store.NativeFSLockFactory@67511e43; maxCacheMB=48.0 maxMergeSizeMB=4.0),segFN=segments_1,generation=1,filenames=[segments_1]
[junit4:junit4]   2> 		commit{dir=NRTCachingDirectory(org.apache.lucene.store.NIOFSDirectory@/usr/home/hudson/hudson-slave/workspace/Lucene-Solr-Tests-4.x-java7/solr/build/solr-core/test/J0/org.apache.solr.cloud.BasicDistributedZkTest-1349886657073/control/data/index lockFactory=org.apache.lucene.store.NativeFSLockFactory@67511e43; maxCacheMB=48.0 maxMergeSizeMB=4.0),segFN=segments_2,generation=2,filenames=[_5_nrm.cfe, _2_Direct_0.tip, _5_Memory_0.ram, _6_MockFixedIntBlock_0.pyl, _2_Direct_0.tim, _0_MockSep_0.pos, _6_MockFixedIntBlock_0.frq, _4_MockSep_0.tib, _4_MockSep_0.skp, _6_Direct_0.tip, _6_Direct_0.tim, _3.fdt, _0_MockFixedIntBlock_0.tib, _3_MockSep_0.frq, _2_MockSep_0.doc, _6_MockFixedIntBlock_0.skp, _6_MockSep_0.doc, _0_MockFixedIntBlock_0.tii, _5_MockSep_0.skp, _4_MockSep_0.doc, _6_MockSep_0.frq, _1_MockSep_0.pyl, _5_Direct_0.prx, _1_MockSep_0.skp, _4_MockFixedIntBlock_0.pos, _1_MockSep_0.tib, _0_Memory_0.ram, _2.fdt, _5_MockSep_0.doc, _2.fdx, _1_MockSep_0.tii, _1.fdx, _5_nrm.cfs, _4_MockSep_0.pyl, _3_MockSep_0.pos, _1.fdt, _4_MockFixedIntBlock_0.frq, _3.si, _2_MockFixedIntBlock_0.doc, _1_MockFixedIntBlock_0.pos, _6.fdt, _4_MockSep_0.tii, _6_Memory_0.ram, _2.si, _5_Direct_0.tim, _3_MockFixedIntBlock_0.frq, _6_MockSep_0.pyl, _6.fdx, _2_MockSep_0.skp, _2_MockFixedIntBlock_0.skp, _6_MockFixedIntBlock_0.tib, _3.fnm, _6_MockFixedIntBlock_0.tii, _5_MockSep_0.tii, _3_MockSep_0.pyl, _1_Memory_0.ram, _2_nrm.cfe, _0_MockFixedIntBlock_0.pyl, _6_MockSep_0.pos, _2_nrm.cfs, _5_Direct_0.tip, _6_MockFixedIntBlock_0.doc, _5_MockFixedIntBlock_0.frq, _1_MockSep_0.pos, _5_MockFixedIntBlock_0.tib, _6_MockSep_0.skp, _1_Direct_0.prx, _3_MockFixedIntBlock_0.pos, _6_Direct_0.prx, _2.fnm, _3.fdx, _2_MockSep_0.pyl, _0_MockFixedIntBlock_0.doc, _5_MockSep_0.tib, _1.si, _6.si, _6.fnm, _0_Direct_0.tip, _3_MockSep_0.skp, _0_Direct_0.prx, _0_Direct_0.tim, _5_MockFixedIntBlock_0.tii, _1_Direct_0.frq, _3_nrm.cfe, _3_MockSep_0.doc, _3_Direct_0.frq, _5_MockSep_0.pos, _5.fdt, _4_MockFixedIntBlock_0.tib, _3_MockFixedIntBlock_0.skp, _1_MockFixedIntBlock_0.pyl, _4_nrm.cfe, _4.fnm, _1.fnm, _2_MockFixedIntBlock_0.tii, _4.fdx, _3_MockFixedIntBlock_0.pyl, _2_MockFixedIntBlock_0.tib, _2_MockFixedIntBlock_0.pyl, _4_Direct_0.frq, _0_MockSep_0.skp, _3_MockSep_0.tib, _4_MockFixedIntBlock_0.tii, _2_MockFixedIntBlock_0.frq, _1_Direct_0.tim, _3_Direct_0.prx, _1_Direct_0.tip, _6_MockSep_0.tii, _1_MockSep_0.doc, _3_Direct_0.tip, _6_MockSep_0.tib, _0.fnm, _1_MockFixedIntBlock_0.frq, _5_MockFixedIntBlock_0.pyl, _4_MockSep_0.pos, _4_Direct_0.tim, _4_MockFixedIntBlock_0.skp, _5_MockSep_0.frq, _0_MockFixedIntBlock_0.pos, _5_Direct_0.frq, _2_MockSep_0.tii, _0_Direct_0.frq, _2_MockSep_0.tib, _3_MockSep_0.tii, _5.si, _3_nrm.cfs, _6_MockFixedIntBlock_0.pos, _5_MockFixedIntBlock_0.skp, _1_MockFixedIntBlock_0.skp, _2_MockFixedIntBlock_0.pos, _4_Direct_0.prx, _4_Memory_0.ram, _4_MockFixedIntBlock_0.doc, _4_nrm.cfs, _4_Direct_0.tip, _2_MockSep_0.pos, _3_Direct_0.tim, _5_MockSep_0.pyl, _1_MockSep_0.frq, _1_MockFixedIntBlock_0.doc, _3_MockFixedIntBlock_0.doc, _6_nrm.cfs, _0_MockFixedIntBlock_0.skp, _2_Memory_0.ram, _4_MockFixedIntBlock_0.pyl, _0.si, _0_MockSep_0.doc, _3_Memory_0.ram, _1_MockFixedIntBlock_0.tii, _1_nrm.cfs, _5.fnm, _6_nrm.cfe, _5_MockFixedIntBlock_0.pos, _3_MockFixedIntBlock_0.tib, _5_MockFixedIntBlock_0.doc, _2_MockSep_0.frq, _4.si, _4.fdt, _0_nrm.cfs, _1_nrm.cfe, _0_MockSep_0.tib, _0_MockFixedIntBlock_0.frq, _2_Direct_0.prx, _0_nrm.cfe, _5.fdx, _4_MockSep_0.frq, segments_2, _0_MockSep_0.frq, _1_MockFixedIntBlock_0.tib, _0.fdx, _2_Direct_0.frq, _0_MockSep_0.tii, _0_MockSep_0.pyl, _6_Direct_0.frq, _0.fdt, _3_MockFixedIntBlock_0.tii]
[junit4:junit4]   2> 14644 T737 C55 P39054 oasc.SolrDeletionPolicy.updateCommits newest commit = 2
[junit4:junit4]   2> 14656 T737 C55 P39054 oass.SolrIndexSearcher.<init> Opening Searcher@c4dc0a8 main
[junit4:junit4]   2> 14657 T737 C55 P39054 oasu.DirectUpdateHandler2.commit end_commit_flush
[junit4:junit4]   2> 14659 T748 oasc.SolrCore.registerSearcher [collection1] Registered new searcher Searcher@c4dc0a8 main{StandardDirectoryReader(segments_2:15:nrt _0(4.1):C10 _1(4.1):C10 _2(4.1):C10 _3(4.1):C10 _4(4.1):C10 _5(4.1):C10 _6(4.1):C7)}
[junit4:junit4]   2> 14659 T737 C55 P39054 /update {waitSearcher=true&wt=javabin&commit=true&softCommit=false&version=2} {commit=} 0 920
[junit4:junit4]   2> 14663 T755 C54 P39058 oasu.DirectUpdateHandler2.commit start commit{flags=0,_version_=0,optimize=false,openSearcher=true,waitSearcher=true,expungeDeletes=false,softCommit=false}
[junit4:junit4]   2> 14931 T755 C54 P39058 oasc.SolrDeletionPolicy.onCommit SolrDeletionPolicy.onCommit: commits:num=2
[junit4:junit4]   2> 		commit{dir=NRTCachingDirectory(org.apache.lucene.store.NIOFSDirectory@/usr/home/hudson/hudson-slave/workspace/Lucene-Solr-Tests-4.x-java7/solr/build/solr-core/test/J0/org.apache.solr.cloud.BasicDistributedZkTest-1349886657073/jetty1/index lockFactory=org.apache.lucene.store.NativeFSLockFactory@7355f16f; maxCacheMB=48.0 maxMergeSizeMB=4.0),segFN=segments_1,generation=1,filenames=[segments_1]
[junit4:junit4]   2> 		commit{dir=NRTCachingDirectory(org.apache.lucene.store.NIOFSDirectory@/usr/home/hudson/hudson-slave/workspace/Lucene-Solr-Tests-4.x-java7/solr/build/solr-core/test/J0/org.apache.solr.cloud.BasicDistributedZkTest-1349886657073/jetty1/index lockFactory=org.apache.lucene.store.NativeFSLockFactory@7355f16f; maxCacheMB=48.0 maxMergeSizeMB=4.0),segFN=segments_2,generation=2,filenames=[_2_Direct_0.tip, _2_Direct_0.tim, _0_MockSep_0.pos, _3.fdt, _0_MockFixedIntBlock_0.tib, _3_MockSep_0.frq, _2_MockSep_0.doc, _0_MockFixedIntBlock_0.tii, _1_MockSep_0.pyl, _1_MockSep_0.skp, _1_MockSep_0.tib, _0_Memory_0.ram, _2.fdt, _2.fdx, _1_MockSep_0.tii, _1.fdx, _3_MockSep_0.pos, _1.fdt, _3.si, _2_MockFixedIntBlock_0.doc, _1_MockFixedIntBlock_0.pos, _2.si, _3_MockFixedIntBlock_0.frq, _2_MockSep_0.skp, _2_MockFixedIntBlock_0.skp, _3.fnm, _3_MockSep_0.pyl, _1_Memory_0.ram, _2_nrm.cfe, _0_MockFixedIntBlock_0.pyl, _2_nrm.cfs, _1_MockSep_0.pos, _1_Direct_0.prx, _3_MockFixedIntBlock_0.pos, _2.fnm, _3.fdx, _2_MockSep_0.pyl, _0_MockFixedIntBlock_0.doc, _1.si, _0_Direct_0.tip, _3_MockSep_0.skp, _0_Direct_0.prx, _0_Direct_0.tim, _1_Direct_0.frq, _3_nrm.cfe, _3_MockSep_0.doc, _3_Direct_0.frq, _3_MockFixedIntBlock_0.skp, _1_MockFixedIntBlock_0.pyl, _1.fnm, _2_MockFixedIntBlock_0.tii, _3_MockFixedIntBlock_0.pyl, _2_MockFixedIntBlock_0.tib, _2_MockFixedIntBlock_0.pyl, _0_MockSep_0.skp, _3_MockSep_0.tib, _2_MockFixedIntBlock_0.frq, _1_Direct_0.tim, _3_Direct_0.prx, _1_Direct_0.tip, _1_MockSep_0.doc, _3_Direct_0.tip, _0.fnm, _1_MockFixedIntBlock_0.frq, _0_MockFixedIntBlock_0.pos, _2_MockSep_0.tii, _0_Direct_0.frq, _2_MockSep_0.tib, _3_MockSep_0.tii, _3_nrm.cfs, _1_MockFixedIntBlock_0.skp, _2_MockFixedIntBlock_0.pos, _2_MockSep_0.pos, _3_Direct_0.tim, _1_MockSep_0.frq, _1_MockFixedIntBlock_0.doc, _3_MockFixedIntBlock_0.doc, _0_MockFixedIntBlock_0.skp, _2_Memory_0.ram, _0.si, _0_MockSep_0.doc, _3_Memory_0.ram, _1_MockFixedIntBlock_0.tii, _1_nrm.cfs, _3_MockFixedIntBlock_0.tib, _2_MockSep_0.frq, _0_nrm.cfs, _1_nrm.cfe, _0_MockSep_0.tib, _0_MockFixedIntBlock_0.frq, _2_Direct_0.prx, _0_nrm.cfe, segments_2, _0_MockSep_0.frq, _1_MockFixedIntBlock_0.tib, _0.fdx, _2_Direct_0.frq, _0_MockSep_0.tii, _0_MockSep_0.pyl, _0.fdt, _3_MockFixedIntBlock_0.tii]
[junit4:junit4]   2> 14932 T755 C54 P39058 oasc.SolrDeletionPolicy.updateCommits newest commit = 2
[junit4:junit4]   2> 14944 T755 C54 P39058 oass.SolrIndexSearcher.<init> Opening Searcher@29308cc2 main
[junit4:junit4]   2> 14946 T760 oasc.SolrCore.registerSearcher [collection1] Registered new searcher Searcher@29308cc2 main{StandardDirectoryReader(segments_2:9:nrt _0(4.1):C10 _1(4.1):C10 _2(4.1):C10 _3(4.1):C2)}
[junit4:junit4]   2> 14948 T755 C54 P39058 oasu.DirectUpdateHandler2.commit end_commit_flush
[junit4:junit4]   2> 14948 T755 C54 P39058 oasu.SolrCmdDistributor.distribCommit Distrib commit to:[StdNode: http://127.0.0.1:39066/solr/collection1/, StdNode: http://127.0.0.1:39062/solr/collection1/]
[junit4:junit4]   2> 14951 T775 C53 P39066 oasu.DirectUpdateHandler2.commit start commit{flags=0,_version_=0,optimize=false,openSearcher=true,waitSearcher=true,expungeDeletes=false,softCommit=false}
[junit4:junit4]   2> 14951 T763 C56 P39062 oasu.DirectUpdateHandler2.commit start commit{flags=0,_version_=0,optimize=false,openSearcher=true,waitSearcher=true,expungeDeletes=false,softCommit=false}
[junit4:junit4]   2> 15483 T763 C56 P39062 oasc.SolrDeletionPolicy.onCommit SolrDeletionPolicy.onCommit: commits:num=2
[junit4:junit4]   2> 		commit{dir=NRTCachingDirectory(org.apache.lucene.store.NIOFSDirectory@/usr/home/hudson/hudson-slave/workspace/Lucene-Solr-Tests-4.x-java7/solr/build/solr-core/test/J0/org.apache.solr.cloud.BasicDistributedZkTest-1349886657073/jetty2/index lockFactory=org.apache.lucene.store.NativeFSLockFactory@3f35a09e; maxCacheMB=48.0 maxMergeSizeMB=4.0),segFN=segments_1,generation=1,filenames=[segments_1]
[junit4:junit4]   2> 		commit{dir=NRTCachingDirectory(org.apache.lucene.store.NIOFSDirectory@/usr/home/hudson/hudson-slave/workspace/Lucene-Solr-Tests-4.x-java7/solr/build/solr-core/test/J0/org.apache.solr.cloud.BasicDistributedZkTest-1349886657073/jetty2/index lockFactory=org.apache.lucene.store.NativeFSLockFactory@3f35a09e; maxCacheMB=48.0 maxMergeSizeMB=4.0),segFN=segments_2,generation=2,filenames=[_2_Direct_0.tip, _2_Direct_0.tim, _0_MockSep_0.pos, _3.fdt, _0_MockFixedIntBlock_0.tib, _3_MockSep_0.frq, _2_MockSep_0.doc, _0_MockFixedIntBlock_0.tii, _1_MockSep_0.pyl, _1_MockSep_0.skp, _1_MockSep_0.tib, _0_Memory_0.ram, _2.fdt, _2.fdx, _1_MockSep_0.tii, _1.fdx, _3_MockSep_0.pos, _1.fdt, _3.si, _2_MockFixedIntBlock_0.doc, _1_MockFixedIntBlock_0.pos, _2.si, _3_MockFixedIntBlock_0.frq, _2_MockSep_0.skp, _2_MockFixedIntBlock_0.skp, _3.fnm, _3_MockSep_0.pyl, _1_Memory_0.ram, _2_nrm.cfe, _0_MockFixedIntBlock_0.pyl, _2_nrm.cfs, _1_MockSep_0.pos, _1_Direct_0.prx, _3_MockFixedIntBlock_0.pos, _2.fnm, _3.fdx, _2_MockSep_0.pyl, _0_MockFixedIntBlock_0.doc, _1.si, _0_Direct_0.tip, _3_MockSep_0.skp, _0_Direct_0.prx, _0_Direct_0.tim, _1_Direct_0.frq, _3_nrm.cfe, _3_MockSep_0.doc, _3_Direct_0.frq, _3_MockFixedIntBlock_0.skp, _1_MockFixedIntBlock_0.pyl, _1.fnm, _2_MockFixedIntBlock_0.tii, _3_MockFixedIntBlock_0.pyl, _2_MockFixedIntBlock_0.tib, _2_MockFixedIntBlock_0.pyl, _0_MockSep_0.skp, _3_MockSep_0.tib, _2_MockFixedIntBlock_0.frq, _1_Direct_0.tim, _3_Direct_0.prx, _1_Direct_0.tip, _1_MockSep_0.doc, _3_Direct_0.tip, _0.fnm, _1_MockFixedIntBlock_0.frq, _0_MockFixedIntBlock_0.pos, _2_MockSep_0.tii, _0_Direct_0.frq, _2_MockSep_0.tib, _3_MockSep_0.tii, _3_nrm.cfs, _1_MockFixedIntBlock_0.skp, _2_MockFixedIntBlock_0.pos, _2_MockSep_0.pos, _3_Direct_0.tim, _1_MockSep_0.frq, _1_MockFixedIntBlock_0.doc, _3_MockFixedIntBlock_0.doc, _0_MockFixedIntBlock_0.skp, _2_Memory_0.ram, _0.si, _0_MockSep_0.doc, _3_Memory_0.ram, _1_MockFixedIntBlock_0.tii, _1_nrm.cfs, _3_MockFixedIntBlock_0.tib, _2_MockSep_0.frq, _0_nrm.cfs, _1_nrm.cfe, _0_MockFixedIntBlock_0.frq, _0_MockSep_0.tib, _2_Direct_0.prx, _0_nrm.cfe, segments_2, _0_MockSep_0.frq, _1_MockFixedIntBlock_0.tib, _0.fdx, _2_Direct_0.frq, _0_MockSep_0.tii, _0_MockSep_0.pyl, _0.fdt, _3_MockFixedIntBlock_0.tii]
[junit4:junit4]   2> 15483 T775 C53 P39066 oasc.SolrDeletionPolicy.onCommit SolrDeletionPolicy.onCommit: commits:num=2
[junit4:junit4]   2> 		commit{dir=NRTCachingDirectory(org.apache.lucene.store.NIOFSDirectory@/usr/home/hudson/hudson-slave/workspace/Lucene-Solr-Tests-4.x-java7/solr/build/solr-core/test/J0/org.apache.solr.cloud.BasicDistributedZkTest-1349886657073/jetty3/index lockFactory=org.apache.lucene.store.NativeFSLockFactory@70a6ecdc; maxCacheMB=48.0 maxMergeSizeMB=4.0),segFN=segments_2,generation=2,filenames=[segments_2]
[junit4:junit4]   2> 		commit{dir=NRTCachingDirectory(org.apache.lucene.store.NIOFSDirectory@/usr/home/hudson/hudson-slave/workspace/Lucene-Solr-Tests-4.x-java7/solr/build/solr-core/test/J0/org.apache.solr.cloud.BasicDistributedZkTest-1349886657073/jetty3/index lockFactory=org.apache.lucene.store.NativeFSLockFactory@70a6ecdc; maxCacheMB=48.0 maxMergeSizeMB=4.0),segFN=segments_3,generation=3,filenames=[_2_Direct_0.tip, _2_Direct_0.tim, _0_MockSep_0.pos, _3.fdt, _0_MockFixedIntBlock_0.tib, _3_MockSep_0.frq, _2_MockSep_0.doc, _0_MockFixedIntBlock_0.tii, _1_MockSep_0.pyl, _1_MockSep_0.skp, _1_MockSep_0.tib, _0_Memory_0.ram, _2.fdt, _2.fdx, _1_MockSep_0.tii, _1.fdx, _3_MockSep_0.pos, _1.fdt, _3.si, _2_MockFixedIntBlock_0.doc, _1_MockFixedIntBlock_0.pos, _2.si, _3_MockFixedIntBlock_0.frq, _2_MockSep_0.skp, _2_MockFixedIntBlock_0.skp, _3.fnm, _3_MockSep_0.pyl, _1_Memory_0.ram, _2_nrm.cfe, _0_MockFixedIntBlock_0.pyl, _2_nrm.cfs, _1_MockSep_0.pos, _1_Direct_0.prx, _3_MockFixedIntBlock_0.pos, _2.fnm, _3.fdx, _2_MockSep_0.pyl, _0_MockFixedIntBlock_0.doc, _1.si, _0_Direct_0.tip, _3_MockSep_0.skp, _0_Direct_0.prx, _0_Direct_0.tim, _1_Direct_0.frq, _3_nrm.cfe, _3_MockSep_0.doc, _3_Direct_0.frq, _3_MockFixedIntBlock_0.skp, _1_MockFixedIntBlock_0.pyl, _1.fnm, _2_MockFixedIntBlock_0.tii, _3_MockFixedIntBlock_0.pyl, _2_MockFixedIntBlock_0.tib, _2_MockFixedIntBlock_0.pyl, _0_MockSep_0.skp, _3_MockSep_0.tib, _2_MockFixedIntBlock_0.frq, _1_Direct_0.tim, _3_Direct_0.prx, _1_Direct_0.tip, _1_MockSep_0.doc, _3_Direct_0.tip, _0.fnm, _1_MockFixedIntBlock_0.frq, _0_MockFixedIntBlock_0.pos, _2_MockSep_0.tii, _0_Direct_0.frq, _2_MockSep_0.tib, _3_MockSep_0.tii, _3_nrm.cfs, _1_MockFixedIntBlock_0.skp, _2_MockFixedIntBlock_0.pos, _2_MockSep_0.pos, _3_Direct_0.tim, _1_MockSep_0.frq, _1_MockFixedIntBlock_0.doc, _3_MockFixedIntBlock_0.doc, _0_MockFixedIntBlock_0.skp, _2_Memory_0.ram, _0.si, _0_MockSep_0.doc, _3_Memory_0.ram, _1_MockFixedIntBlock_0.tii, _1_nrm.cfs, _3_MockFixedIntBlock_0.tib, _2_MockSep_0.frq, _0_nrm.cfs, _1_nrm.cfe, _0_MockSep_0.tib, _0_MockFixedIntBlock_0.frq, _2_Direct_0.prx, _0_nrm.cfe, _0_MockSep_0.frq, _1_MockFixedIntBlock_0.tib, _0.fdx, _2_Direct_0.frq, _0_MockSep_0.tii, _0_MockSep_0.pyl, _0.fdt, segments_3, _3_MockFixedIntBlock_0.tii]
[junit4:junit4]   2> 15484 T775 C53 P39066 oasc.SolrDeletionPolicy.updateCommits newest commit = 3
[junit4:junit4]   2> 15484 T763 C56 P39062 oasc.SolrDeletionPolicy.updateCommits newest commit = 2
[junit4:junit4]   2> 15497 T775 C53 P39066 oass.SolrIndexSearcher.<init> Opening Searcher@41b82a5a main
[junit4:junit4]   2> 15498 T763 C56 P39062 oass.SolrIndexSearcher.<init> Opening Searcher@298ecc19 main
[junit4:junit4]   2> 15499 T763 C56 P39062 oasu.DirectUpdateHandler2.commit end_commit_flush
[junit4:junit4]   2> 15499 T775 C53 P39066 oasu.DirectUpdateHandler2.commit end_commit_flush
[junit4:junit4]   2> 15499 T784 oasc.JmxMonitoredMap.put WARNING Failed to register info bean: searcher javax.management.InstanceNotFoundException: solr/collection1:type=searcher,id=org.apache.solr.search.SolrIndexSearcher
[junit4:junit4]   2> 	at com.sun.jmx.interceptor.DefaultMBeanServerInterceptor.getMBean(DefaultMBeanServerInterceptor.java:1095)
[junit4:junit4]   2> 	at com.sun.jmx.interceptor.DefaultMBeanServerInterceptor.exclusiveUnregisterMBean(DefaultMBeanServerInterceptor.java:427)
[junit4:junit4]   2> 	at com.sun.jmx.interceptor.DefaultMBeanServerInterceptor.unregisterMBean(DefaultMBeanServerInterceptor.java:415)
[junit4:junit4]   2> 	at com.sun.jmx.mbeanserver.JmxMBeanServer.unregisterMBean(JmxMBeanServer.java:536)
[junit4:junit4]   2> 	at org.apache.solr.core.JmxMonitoredMap.put(JmxMonitoredMap.java:138)
[junit4:junit4]   2> 	at org.apache.solr.core.JmxMonitoredMap.put(JmxMonitoredMap.java:51)
[junit4:junit4]   2> 	at org.apache.solr.search.SolrIndexSearcher.register(SolrIndexSearcher.java:242)
[junit4:junit4]   2> 	at org.apache.solr.core.SolrCore.registerSearcher(SolrCore.java:1691)
[junit4:junit4]   2> 	at org.apache.solr.core.SolrCore.access$000(SolrCore.java:124)
[junit4:junit4]   2> 	at org.apache.solr.core.SolrCore$7.call(SolrCore.java:1568)
[junit4:junit4]   2> 	at java.util.concurrent.FutureTask$Sync.innerRun(FutureTask.java:334)
[junit4:junit4]   2> 	at java.util.concurrent.FutureTask.run(FutureTask.java:166)
[junit4:junit4]   2> 	at java.util.concurrent.ThreadPoolExecutor.runWorker(ThreadPoolExecutor.java:1110)
[junit4:junit4]   2> 	at java.util.concurrent.ThreadPoolExecutor$Worker.run(ThreadPoolExecutor.java:603)
[junit4:junit4]   2> 	at java.lang.Thread.run(Thread.java:722)
[junit4:junit4]   2> 
[junit4:junit4]   2> 15500 T772 oasc.SolrCore.registerSearcher [collection1] Registered new searcher Searcher@298ecc19 main{StandardDirectoryReader(segments_2:9:nrt _0(4.1):C10 _1(4.1):C10 _2(4.1):C10 _3(4.1):C5)}
[junit4:junit4]   2> 15500 T763 C56 P39062 /update {waitSearcher=true&commit=true&commit_end_point=true&expungeDeletes=false&wt=javabin&softCommit=false&version=2} {commit=} 0 549
[junit4:junit4]   2> 15501 T784 oasc.SolrCore.registerSearcher [collection1] Registered new searcher Searcher@41b82a5a main{StandardDirectoryReader(segments_3:10:nrt _0(4.1):C10 _1(4.1):C10 _2(4.1):C10 _3(4.1):C2)}
[junit4:junit4]   2> 15501 T775 C53 P39066 /update {waitSearcher=true&commit=true&commit_end_point=true&expungeDeletes=false&wt=javabin&softCommit=false&version=2} {commit=} 0 550
[junit4:junit4]   2> 15502 T755 C54 P39058 /update {waitSearcher=true&wt=javabin&commit=true&softCommit=false&version=2} {commit=} 0 839
[junit4:junit4]   2> 15507 T737 C55 P39054 REQ /select {distrib=false&sort=n_ti1+desc&wt=javabin&q=*:*&version=2} hits=67 status=0 QTime=2 
[junit4:junit4]   2> 15510 T725 oascsi.HttpClientUtil.createClient Creating new http client, config:
[junit4:junit4]   2> 15520 T725 oaz.ZooKeeper.<init> Initiating client connection, connectString=127.0.0.1:39050/solr sessionTimeout=10000 watcher=org.apache.solr.common.cloud.ConnectionManager@40ffc99f
[junit4:junit4]   2> 15522 T794 oaz.ClientCnxn$SendThread.startConnect Opening socket connection to server /127.0.0.1:39050
[junit4:junit4]   2> 15522 T725 oascc.ConnectionManager.waitForConnected Waiting for client to connect to ZooKeeper
[junit4:junit4]   2> 15523 T794 oaz.ClientCnxn$SendThread.primeConnection Socket connection established to localhost/127.0.0.1:39050, initiating session
[junit4:junit4]   2> 15523 T727 oazs.NIOServerCnxn$Factory.run Accepted socket connection from /140.211.11.196:39099
[junit4:junit4]   2> 15524 T727 oazs.NIOServerCnxn.readConnectRequest Client attempting to establish new session at /140.211.11.196:39099
[junit4:junit4]   2> 15526 T729 oazs.NIOServerCnxn.finishSessionInit Established session 0x13a4b83c2360008 with negotiated timeout 10000 for client /140.211.11.196:39099
[junit4:junit4]   2> 15526 T794 oaz.ClientCnxn$SendThread.readConnectResult Session establishment complete on server localhost/127.0.0.1:39050, sessionid = 0x13a4b83c2360008, negotiated timeout = 10000
[junit4:junit4]   2> 15526 T795 oascc.ConnectionManager.process Watcher org.apache.solr.common.cloud.ConnectionManager@40ffc99f name:ZooKeeperConnection Watcher:127.0.0.1:39050/solr got event WatchedEvent state:SyncConnected type:None path:null path:null type:None
[junit4:junit4]   2> 15526 T725 oascc.ConnectionManager.waitForConnected Client is connected to ZooKeeper
[junit4:junit4]   2> 15527 T725 oascc.ZkStateReader.createClusterStateWatchersAndUpdate Updating cluster state from ZooKeeper... 
[junit4:junit4]   2> 15563 T765 C56 P39062 REQ /select {sort=n_ti1+desc&distrib=false&wt=javabin&rows=10&version=2&fl=id&shard.url=127.0.0.1:39062/solr/collection1/&NOW=1349886672604&start=0&q=*:*&isShard=true&fsv=true} hits=35 status=0 QTime=1 
[junit4:junit4]   2> 15563 T752 C54 P39058 REQ /select {sort=n_ti1+desc&distrib=false&wt=javabin&rows=10&version=2&fl=id&shard.url=127.0.0.1:39058/solr/collection1/|127.0.0.1:39066/solr/collection1/&NOW=1349886672604&start=0&q=*:*&isShard=true&fsv=true} hits=32 status=0 QTime=1 
[junit4:junit4]   2> 15580 T752 C54 P39058 REQ /select {shard.url=127.0.0.1:39058/solr/collection1/|127.0.0.1:39066/solr/collection1/&NOW=1349886672604&q=*:*&ids=132,4,111,102&distrib=false&isShard=true&wt=javabin&version=2} status=0 QTime=1 
[junit4:junit4]   2> 15593 T765 C56 P39062 REQ /select {shard.url=127.0.0.1:39062/solr/collection1/&NOW=1349886672604&q=*:*&ids=134,116,126,149,103,130&distrib=false&isShard=true&wt=javabin&version=2} status=0 QTime=0 
[junit4:junit4]   2> 15595 T757 C54 P39058 REQ /select {sort=n_ti1+desc&wt=javabin&q=*:*&version=2} hits=67 status=0 QTime=59 
[junit4:junit4]   2> 15612 T737 C55 P39054 REQ /select {distrib=false&sort=n_ti1+asc&wt=javabin&q=*:*&version=2} hits=67 status=0 QTime=1 
[junit4:junit4]   2> 15619 T766 C56 P39062 REQ /select {sort=n_ti1+asc&distrib=false&collection=collection1&wt=javabin&rows=10&version=2&NOW=1349886672683&shard.url=127.0.0.1:39062/solr/collection1/&fl=id&start=0&q=*:*&isShard=true&fsv=true} hits=35 status=0 QTime=1 
[junit4:junit4]   2> 15619 T776 C53 P39066 REQ /select {sort=n_ti1+asc&distrib=false&collection=collection1&wt=javabin&rows=10&version=2&NOW=1349886672683&shard.url=127.0.0.1:39058/solr/collection1/|127.0.0.1:39066/solr/collection1/&fl=id&start=0&q=*:*&isShard=true&fsv=true} hits=32 status=0 QTime=0 
[junit4:junit4]   2> 15625 T776 C53 P39066 REQ /select {shard.url=127.0.0.1:39058/solr/collection1/|127.0.0.1:39066/solr/collection1/&NOW=1349886672683&q=*:*&ids=10,146,12&distrib=false&collection=collection1&isShard=true&wt=javabin&version=2} status=0 QTime=1 
[junit4:junit4]   2> 15625 T766 C56 P39062 REQ /select {shard.url=127.0.0.1:39062/solr/collection1/&NOW=1349886672683&q=*:*&ids=2,115,128,147,137,105,140&distrib=false&collection=collection1&isShard=true&wt=javabin&version=2} status=0 QTime=1 
[junit4:junit4]   2> 15627 T764 C56 P39062 REQ /select {collection=collection1&sort=n_ti1+asc&wt=javabin&q=*:*&version=2} hits=67 status=0 QTime=12 
[junit4:junit4]   2> 15632 T737 C55 P39054 REQ /select {distrib=false&sort=n_f1+desc&wt=javabin&q=*:*&version=2} hits=67 status=0 QTime=1 
[junit4:junit4]   2> 15639 T777 C53 P39066 REQ /select {sort=n_f1+desc&distrib=false&collection=collection1&wt=javabin&rows=10&version=2&NOW=1349886672704&shard.url=127.0.0.1:39058/solr/collection1/|127.0.0.1:39066/solr/collection1/&fl=id&start=0&q=*:*&isShard=true&fsv=true} hits=32 status=0 QTime=1 
[junit4:junit4]   2> 15640 T765 C56 P39062 REQ /select {sort=n_f1+desc&distrib=false&collection=collection1&wt=javabin&rows=10&version=2&NOW=1349886672704&shard.url=127.0.0.1:39062/solr/collection1/&fl=id&start=0&q=*:*&isShard=true&fsv=true} hits=35 status=0 QTime=1 
[junit4:junit4]   2> 15645 T765 C56 P39062 REQ /select {shard.url=127.0.0.1:39062/solr/collection1/&NOW=1349886672704&q=*:*&ids=144,112,6,103&distrib=false&collection=collection1&isShard=true&wt=javabin&version=2} status=0 QTime=1 
[junit4:junit4]   2> 15645 T777 C53 P39066 REQ /select {shard.url=127.0.0.1:39058/solr/collection1/|127.0.0.1:39066/solr/collection1/&NOW=1349886672704&q=*:*&ids=10,110,4,124,15,102&distrib=false&collection=collection1&isShard=true&wt=javabin&version=2} status=0 QTime=1 
[junit4:junit4]   2> 15649 T757 C54 P39058 REQ /select {collection=collection1&sort=n_f1+desc&wt=javabin&q=*:*&version=2} hits=67 status=0 QTime=13 
[junit4:junit4]   2> 15655 T737 C55 P39054 REQ /select {distrib=false&sort=n_f1+asc&wt=javabin&q=*:*&version=2} hits=67 status=0 QTime=1 
[junit4:junit4]   2> 15663 T765 C56 P39062 REQ /select {sort=n_f1+asc&distrib=false&wt=javabin&rows=10&version=2&fl=id&shard.url=127.0.0.1:39062/solr/collection1/&NOW=1349886672727&start=0&q=*:*&isShard=true&fsv=true} hits=35 status=0 QTime=1 
[junit4:junit4]   2> 15663 T752 C54 P39058 REQ /select {sort=n_f1+asc&distrib=false&wt=javabin&rows=10&version=2&fl=id&shard.url=127.0.0.1:39058/solr/collection1/|127.0.0.1:39066/solr/collection1/&NOW=1349886672727&start=0&q=*:*&isShard=true&fsv=true} hits=32 status=0 QTime=0 
[junit4:junit4]   2> 15669 T765 C56 P39062 REQ /select {shard.url=127.0.0.1:39062/solr/collection1/&NOW=1349886672727&q=*:*&ids=116,106,17,9,141&distrib=false&isShard=true&wt=javabin&version=2} status=0 QTime=1 
[junit4:junit4]   2> 15669 T752 C54 P39058 REQ /select {shard.url=127.0.0.1:39058/solr/collection1/|127.0.0.1:39066/solr/collection1/&NOW=1349886672727&q=*:*&ids=114,138,16,129,100&distrib=false&isShard=true&wt=javabin&version=2} status=0 QTime=1 
[junit4:junit4]   2> 15671 T757 C54 P39058 REQ /select {sort=n_f1+asc&wt=javabin&q=*:*&version=2} hits=67 status=0 QTime=12 
[junit4:junit4]   2> 15679 T737 C55 P39054 REQ /select {distrib=false&sort=n_tf1+desc&wt=javabin&q=*:*&version=2} hits=67 status=0 QTime=2 
[junit4:junit4]   2> 15687 T753 C54 P39058 REQ /select {sort=n_tf1+desc&distrib=false&wt=javabin&rows=10&version=2&fl=id&shard.url=127.0.0.1:39058/solr/collection1/|127.0.0.1:39066/solr/collection1/&NOW=1349886672752&start=0&q=*:*&isShard=true&fsv=true} hits=32 status=0 QTime=1 
[junit4:junit4]   2> 15688 T766 C56 P39062 REQ /select {sort=n_tf1+desc&distrib=false&wt=javabin&rows=10&version=2&fl=id&shard.url=127.0.0.1:39062/solr/collection1/&NOW=1349886672752&start=0&q=*:*&isShard=true&fsv=true} hits=35 status=0 QTime=1 
[junit4:junit4]   2> 15695 T753 C54 P39058 REQ /select {shard.url=127.0.0.1:39058/solr/collection1/|127.0.0.1:39066/solr/collection1/&NOW=1349886672752&q=*:*&ids=133,123,102&distrib=false&isShard=true&wt=javabin&version=2} status=0 QTime=1 
[junit4:junit4]   2> 15695 T766 C56 P39062 REQ /select {shard.url=127.0.0.1:39062/solr/collection1/&NOW=1349886672752&q=*:*&ids=134,3,143,115,105,104,103&distrib=false&isShard=true&wt=javabin&version=2} status=0 QTime=1 
[junit4:junit4]   2> 15713 T764 C56 P39062 REQ /select {sort=n_tf1+desc&wt=javabin&q=*:*&version=2} hits=67 status=0 QTime=29 
[junit4:junit4]   2> 15719 T737 C55 P39054 REQ /select {distrib=false&sort=n_tf1+asc&wt=javabin&q=*:*&version=2} hits=67 status=0 QTime=1 
[junit4:junit4]   2> 15728 T766 C56 P39062 REQ /select {sort=n_tf1+asc&distrib=false&collection=collection1&wt=javabin&rows=10&version=2&fl=id&shard.url=127.0.0.1:39062/solr/collection1/&NOW=1349886672792&start=0&q=*:*&isShard=true&fsv=true} hits=35 status=0 QTime=1 
[junit4:junit4]   2> 15728 T753 C54 P39058 REQ /select {sort=n_tf1+asc&distrib=false&collection=collection1&wt=javabin&rows=10&version=2&NOW=1349886672792&shard.url=127.0.0.1:39058/solr/collection1/|127.0.0.1:39066/solr/collection1/&fl=id&start=0&q=*:*&isShard=true&fsv=true} hits=32 status=0 QTime=1 
[junit4:junit4]   2> 15732 T766 C56 P39062 REQ /select {shard.url=127.0.0.1:39062/solr/collection1/&NOW=1349886672792&q=*:*&ids=6&distrib=false&collection=collection1&isShard=true&wt=javabin&version=2} status=0 QTime=0 
[junit4:junit4]   2> 15733 T753 C54 P39058 REQ /select {shard.url=127.0.0.1:39058/solr/collection1/|127.0.0.1:39066/solr/collection1/&NOW=1349886672792&q=*:*&ids=10,109,122,148,111,16,129,100,118&distrib=false&collection=collection1&isShard=true&wt=javabin&version=2} status=0 QTime=1 
[junit4:junit4]   2> 15735 T767 C56 P39062 REQ /select {collection=collection1&sort=n_tf1+asc&wt=javabin&q=*:*&version=2} hits=67 status=0 QTime=11 
[junit4:junit4]   2> 15741 T737 C55 P39054 REQ /select {distrib=false&sort=n_d1+desc&wt=javabin&q=*:*&version=2} hits=67 status=0 QTime=2 
[junit4:junit4]   2> 15749 T768 C56 P39062 REQ /select {sort=n_d1+desc&distrib=false&collection=collection1&wt=javabin&rows=10&version=2&NOW=1349886672813&shard.url=127.0.0.1:39062/solr/collection1/&fl=id&start=0&q=*:*&isShard=true&fsv=true} hits=35 status=0 QTime=1 
[junit4:junit4]   2> 15749 T779 C53 P39066 REQ /select {sort=n_d1+desc&distrib=false&collection=collection1&wt=javabin&rows=10&version=2&NOW=1349886672813&shard.url=127.0.0.1:39058/solr/collection1/|127.0.0.1:39066/solr/collection1/&fl=id&start=0&q=*:*&isShard=true&fsv=true} hits=32 status=0 QTime=1 
[junit4:junit4]   2> 15753 T779 C53 P39066 REQ /select {shard.url=127.0.0.1:39058/solr/collection1/|127.0.0.1:39066/solr/collection1/&NOW=1349886672813&q=*:*&ids=114,1,123,8,13,101&distrib=false&collection=collection1&isShard=true&wt=javabin&version=2} status=0 QTime=0 
[junit4:junit4]   2> 15753 T768 C56 P39062 REQ /select {shard.url=127.0.0.1:39062/solr/collection1/&NOW=1349886672813&q=*:*&ids=115,7,139,119&distrib=false&collection=collection1&isShard=true&wt=javabin&version=2} status=0 QTime=0 
[junit4:junit4]   2> 15756 T778 C53 P39066 REQ /select {collection=collection1&sort=n_d1+desc&wt=javabin&q=*:*&version=2} hits=67 status=0 QTime=11 
[junit4:junit4]   2> 15761 T737 C55 P39054 REQ /select {distrib=false&sort=n_d1+asc&wt=javabin&q=*:*&version=2} hits=67 status=0 QTime=1 
[junit4:junit4]   2> 15769 T777 C53 P39066 REQ /select {sort=n_d1+asc&distrib=false&collection=collection1&wt=javabin&rows=10&version=2&fl=id&shard.url=127.0.0.1:39058/solr/collection1/|127.0.0.1:39066/solr/collection1/&NOW=1349886672834&start=0&q=*:*&isShard=true&fsv=true} hits=32 status=0 QTime=0 
[junit4:junit4]   2> 15769 T765 C56 P39062 REQ /select {sort=n_d1+asc&distrib=false&collection=collection1&wt=javabin&rows=10&version=2&fl=id&shard.url=127.0.0.1:39062/solr/collection1/&NOW=1349886672834&start=0&q=*:*&isShard=true&fsv=true} hits=35 status=0 QTime=0 
[junit4:junit4]   2> 15773 T777 C53 P39066 REQ /select {shard.url=127.0.0.1:39058/solr/collection1/|127.0.0.1:39066/solr/collection1/&NOW=1349886672834&q=*:*&ids=132,146,15&distrib=false&collection=collection1&isShard=true&wt=javabin&version=2} status=0 QTime=0 
[junit4:junit4]   2> 15773 T765 C56 P39062 REQ /select {shard.url=127.0.0.1:39062/solr/collection1/&NOW=1349886672834&q=*:*&ids=134,121,147,9,140,131,142&distrib=false&collection=collection1&isShard=true&wt=javabin&version=2} status=0 QTime=0 
[junit4:junit4]   2> 15775 T757 C54 P39058 REQ /select {collection=collection1&sort=n_d1+asc&wt=javabin&q=*:*&version=2} hits=67 status=0 QTime=9 
[junit4:junit4]   2> 15781 T737 C55 P39054 REQ /select {distrib=false&sort=n_td1+desc&wt=javabin&q=*:*&version=2} hits=67 status=0 QTime=1 
[junit4:junit4]   2> 15789 T779 C53 P39066 REQ /select {sort=n_td1+desc&distrib=false&collection=collection1&wt=javabin&rows=10&version=2&fl=id&shard.url=127.0.0.1:39058/solr/collection1/|127.0.0.1:39066/solr/collection1/&NOW=1349886672853&start=0&q=*:*&isShard=true&fsv=true} hits=32 status=0 QTime=1 
[junit4:junit4]   2> 15789 T768 C56 P39062 REQ /select {sort=n_td1+desc&distrib=false&collection=collection1&wt=javabin&rows=10&version=2&fl=id&shard.url=127.0.0.1:39062/solr/collection1/&NOW=1349886672853&start=0&q=*:*&isShard=true&fsv=true} hits=35 status=0 QTime=1 
[junit4:junit4]   2> 15794 T779 C53 P39066 REQ /select {shard.url=127.0.0.1:39058/solr/collection1/|127.0.0.1:39066/solr/collection1/&NOW=1349886672853&q=*:*&ids=133,146,148,123&distrib=false&collection=collection1&isShard=true&wt=javabin&version=2} status=0 QTime=1 
[junit4:junit4]   2> 15794 T768 C56 P39062 REQ /select {shard.url=127.0.0.1:39062/solr/collection1/&NOW=1349886672853&q=*:*&ids=3,143,128,137,17,103&distrib=false&collection=collection1&isShard=true&wt=javabin&version=2} status=0 QTime=1 
[junit4:junit4]   2> 15797 T780 C53 P39066 REQ /select {collection=collection1&sort=n_td1+desc&wt=javabin&q=*:*&version=2} hits=67 status=0 QTime=12 
[junit4:junit4]   2> 15803 T737 C55 P39054 REQ /select {distrib=false&sort=n_td1+asc&wt=javabin&q=*:*&version=2} hits=67 status=0 QTime=1 
[junit4:junit4]   2> 15812 T768 C56 P39062 REQ /select {sort=n_td1+asc&distrib=false&collection=collection1&wt=javabin&rows=10&version=2&fl=id&shard.url=127.0.0.1:39062/solr/collection1/&NOW=1349886672876&start=0&q=*:*&isShard=true&fsv=true} hits=35 status=0 QTime=1 
[junit4:junit4]   2> 15812 T802 C54 P39058 REQ /select {sort=n_td1+asc&distrib=false&collection=collection1&wt=javabin&rows=10&version=2&NOW=1349886672876&shard.url=127.0.0.1:39058/solr/collection1/|127.0.0.1:39066/solr/collection1/&fl=id&start=0&q=*:*&isShard=true&fsv=true} hits=32 status=0 QTime=1 
[junit4:junit4]   2> 15816 T802 C54 P39058 REQ /select {shard.url=127.0.0.1:39058/solr/collection1/|127.0.0.1:39066/solr/collection1/&NOW=1349886672876&q=*:*&ids=108,8,100&distrib=false&collection=collection1&isShard=true&wt=javabin&version=2} status=0 QTime=0 
[junit4:junit4]   2> 15816 T768 C56 P39062 REQ /select {shard.url=127.0.0.1:39062/solr/collection1/&NOW=1349886672876&q=*:*&ids=2,7,6,136,149,105,120&distrib=false&collection=collection1&isShard=true&wt=javabin&version=2} status=0 QTime=0 
[junit4:junit4]   2> 15819 T780 C53 P39066 REQ /select {collection=collection1&sort=n_td1+asc&wt=javabin&q=*:*&version=2} hits=67 status=0 QTime=11 
[junit4:junit4]   2> 15826 T737 C55 P39054 REQ /select {distrib=false&sort=n_l1+desc&wt=javabin&q=*:*&version=2} hits=67 status=0 QTime=2 
[junit4:junit4]   2> 15835 T765 C56 P39062 REQ /select {sort=n_l1+desc&distrib=false&wt=javabin&rows=10&version=2&fl=id&shard.url=127.0.0.1:39062/solr/collection1/&NOW=1349886672899&start=0&q=*:*&isShard=true&fsv=true} hits=35 status=0 QTime=1 
[junit4:junit4]   2> 15835 T777 C53 P39066 REQ /select {sort=n_l1+desc&distrib=false&wt=javabin&rows=10&version=2&fl=id&shard.url=127.0.0.1:39058/solr/collection1/|127.0.0.1:39066/solr/collection1/&NOW=1349886672899&start=0&q=*:*&isShard=true&fsv=true} hits=32 status=0 QTime=1 
[junit4:junit4]   2> 15839 T765 C56 P39062 REQ /select {shard.url=127.0.0.1:39062/solr/collection1/&NOW=1349886672899&q=*:*&ids=104,140,130&distrib=false&isShard=true&wt=javabin&version=2} status=0 QTime=0 
[junit4:junit4]   2> 15841 T777 C53 P39066 REQ /select {shard.url=127.0.0.1:39058/solr/collection1/|127.0.0.1:39066/solr/collection1/&NOW=1349886672899&q=*:*&ids=135,1,122,110,107,118,100&distrib=false&isShard=true&wt=javabin&version=2} status=0 QTime=0 
[junit4:junit4]   2> 15843 T757 C54 P39058 REQ /select {sort=n_l1+desc&wt=javabin&q=*:*&version=2} hits=67 status=0 QTime=12 
[junit4:junit4]   2> 15849 T737 C55 P39054 REQ /select {distrib=false&sort=n_l1+asc&wt=javabin&q=*:*&version=2} hits=67 status=0 QTime=1 
[junit4:junit4]   2> 15858 T765 C56 P39062 REQ /select {sort=n_l1+asc&distrib=false&wt=javabin&rows=10&version=2&fl=id&shard.url=127.0.0.1:39062/solr/collection1/&NOW=1349886672922&start=0&q=*:*&isShard=true&fsv=true} hits=35 status=0 QTime=1 
[junit4:junit4]   2> 15858 T777 C53 P39066 REQ /select {sort=n_l1+asc&distrib=false&wt=javabin&rows=10&version=2&fl=id&shard.url=127.0.0.1:39058/solr/collection1/|127.0.0.1:39066/solr/collection1/&NOW=1349886672922&start=0&q=*:*&isShard=true&fsv=true} hits=32 status=0 QTime=1 
[junit4:junit4]   2> 15863 T765 C56 P39062 REQ /select {shard.url=127.0.0.1:39062/solr/collection1/&NOW=1349886672922&q=*:*&ids=143,144,127,136,137,103,142&distrib=false&isShard=true&wt=javabin&version=2} status=0 QTime=1 
[junit4:junit4]   2> 15863 T777 C53 P39066 REQ /select {shard.url=127.0.0.1:39058/solr/collection1/|127.0.0.1:39066/solr/collection1/&NOW=1349886672922&q=*:*&ids=124,111,16&distrib=false&isShard=true&wt=javabin&version=2} status=0 QTime=0 
[junit4:junit4]   2> 15866 T755 C54 P39058 REQ /select {sort=n_l1+asc&wt=javabin&q=*:*&version=2} hits=67 status=0 QTime=12 
[junit4:junit4]   2> 15873 T737 C55 P39054 REQ /select {distrib=false&sort=n_tl1+desc&wt=javabin&q=*:*&version=2} hits=67 status=0 QTime=2 
[junit4:junit4]   2> 15882 T765 C56 P39062 REQ /select {sort=n_tl1+desc&distrib=false&wt=javabin&rows=10&version=2&fl=id&shard.url=127.0.0.1:39062/solr/collection1/&NOW=1349886672946&start=0&q=*:*&isShard=true&fsv=true} hits=35 status=0 QTime=1 
[junit4:junit4]   2> 15882 T777 C53 P39066 REQ /select {sort=n_tl1+desc&distrib=false&wt=javabin&rows=10&version=2&fl=id&shard.url=127.0.0.1:39058/solr/collection1/|127.0.0.1:39066/solr/collection1/&NOW=1349886672946&start=0&q=*:*&isShard=true&fsv=true} hits=32 status=0 QTime=1 
[junit4:junit4]   2> 15886 T765 C56 P39062 REQ /select {shard.url=127.0.0.1:39062/solr/collection1/&NOW=1349886672946&q=*:*&ids=116,3,144,7,136,105,141&distrib=false&isShard=true&wt=javabin&version=2} status=0 QTime=0 
[junit4:junit4]   2> 15887 T777 C53 P39066 REQ /select {shard.url=127.0.0.1:39058/solr/collection1/|127.0.0.1:39066/solr/collection1/&NOW=1349886672946&q=*:*&ids=125,133,16&distrib=false&isShard=true&wt=javabin&version=2} status=0 QTime=1 
[junit4:junit4]   2> 15889 T755 C54 P39058 REQ /select {sort=n_tl1+desc&wt=javabin&q=*:*&version=2} hits=67 status=0 QTime=11 
[junit4:junit4]   2> 15895 T737 C55 P39054 REQ /select {distrib=false&sort=n_tl1+asc&wt=javabin&q=*:*&version=2} hits=67 status=0 QTime=1 
[junit4:junit4]   2> 15903 T777 C53 P39066 REQ /select {sort=n_tl1+asc&distrib=false&collection=collection1&wt=javabin&rows=10&version=2&fl=id&shard.url=127.0.0.1:39058/solr/collection1/|127.0.0.1:39066/solr/collection1/&NOW=1349886672967&start=0&q=*:*&isShard=true&fsv=true} hits=32 status=0 QTime=1 
[junit4:junit4]   2> 15904 T765 C56 P39062 REQ /select {sort=n_tl1+asc&distrib=false&collection=collection1&wt=javabin&rows=10&version=2&fl=id&shard.url=127.0.0.1:39062/solr/collection1/&NOW=1349886672967&start=0&q=*:*&isShard=true&fsv=true} hits=35 status=0 QTime=1 
[junit4:junit4]   2> 15907 T765 C56 P39062 REQ /select {shard.url=127.0.0.1:39062/solr/collection1/&NOW=1349886672967&q=*:*&ids=2,5,9,131,130&distrib=false&collection=collection1&isShard=true&wt=javabin&version=2} status=0 QTime=0 
[junit4:junit4]   2> 15907 T777 C53 P39066 REQ /select {shard.url=127.0.0.1:39058/solr/collection1/|127.0.0.1:39066/solr/collection1/&NOW=1349886672967&q=*:*&ids=114,138,124,129,12&distrib=false&collection=collection1&isShard=true&wt=javabin&version=2} status=0 QTime=0 
[junit4:junit4]   2> 15909 T755 C54 P39058 REQ /select {collection=collection1&sort=n_tl1+asc&wt=javabin&q=*:*&version=2} hits=67 status=0 QTime=10 
[junit4:junit4]   2> 15916 T737 C55 P39054 REQ /select {distrib=false&sort=n_dt1+desc&wt=javabin&q=*:*&version=2} hits=67 status=0 QTime=1 
[junit4:junit4]   2> 15925 T776 C53 P39066 REQ /select {sort=n_dt1+desc&distrib=false&wt=javabin&rows=10&version=2&fl=id&shard.url=127.0.0.1:39058/solr/collection1/|127.0.0.1:39066/solr/collection1/&NOW=1349886672989&start=0&q=*:*&isShard=true&fsv=true} hits=32 status=0 QTime=1 
[junit4:junit4]   2> 15925 T766 C56 P39062 REQ /select {sort=n_dt1+desc&distrib=false&wt=javabin&rows=10&version=2&fl=id&shard.url=127.0.0.1:39062/solr/collection1/&NOW=1349886672989&start=0&q=*:*&isShard=true&fsv=true} hits=35 status=0 QTime=1 
[junit4:junit4]   2> 15930 T776 C53 P39066 REQ /select {shard.url=127.0.0.1:39058/solr/collection1/|127.0.0.1:39066/solr/collection1/&NOW=1349886672989&q=*:*&ids=135,133,107,14&distrib=false&isShard=true&wt=javabin&version=2} status=0 QTime=1 
[junit4:junit4]   2> 15930 T766 C56 P39062 REQ /select {shard.url=127.0.0.1:39062/solr/collection1/&NOW=1349886672989&q=*:*&ids=7,139,106,105,9,142&distrib=false&isShard=true&wt=javabin&version=2} status=0 QTime=0 
[junit4:junit4]   2> 15933 T764 C56 P39062 REQ /select {sort=n_dt1+desc&wt=javabin&q=*:*&version=2} hits=67 status=0 QTime=12 
[junit4:junit4]   2> 15939 T737 C55 P39054 REQ /select {distrib=false&sort=n_dt1+asc&wt=javabin&q=*:*&version=2} hits=67 status=0 QTime=1 
[junit4:junit4]   2> 15947 T779 C53 P39066 REQ /select {sort=n_dt1+asc&distrib=false&wt=javabin&rows=10&version=2&fl=id&shard.url=127.0.0.1:39058/solr/collection1/|127.0.0.1:39066/solr/collection1/&NOW=1349886673011&start=0&q=*:*&isShard=true&fsv=true} hits=32 status=0 QTime=1 
[junit4:junit4]   2> 15947 T768 C56 P39062 REQ /select {sort=n_dt1+asc&distrib=false&wt=javabin&rows=10&version=2&fl=id&shard.url=127.0.0.1:39062/solr/collection1/&NOW=1349886673011&start=0&q=*:*&isShard=true&fsv=true} hits=35 status=0 QTime=1 
[junit4:junit4]   2> 15951 T779 C53 P39066 REQ /select {shard.url=127.0.0.1:39058/solr/collection1/|127.0.0.1:39066/solr/collection1/&NOW=1349886673011&q=*:*&ids=125,148,122,111&distrib=false&isShard=true&wt=javabin&version=2} status=0 QTime=1 
[junit4:junit4]   2> 15951 T768 C56 P39062 REQ /select {shard.url=127.0.0.1:39062/solr/collection1/&NOW=1349886673011&q=*:*&ids=3,116,144,5,149,120&distrib=false&isShard=true&wt=javabin&version=2} status=0 QTime=1 
[junit4:junit4]   2> 15952 T780 C53 P39066 REQ /select {sort=n_dt1+asc&wt=javabin&q=*:*&version=2} hits=67 status=0 QTime=9 
[junit4:junit4]   2> 15961 T737 C55 P39054 REQ /select {distrib=false&sort=n_tdt1+desc&wt=javabin&q=*:*&version=2} hits=67 status=0 QTime=2 
[junit4:junit4]   2> 15970 T765 C56 P39062 REQ /select {sort=n_tdt1+desc&distrib=false&collection=collection1&wt=javabin&rows=10&version=2&fl=id&shard.url=127.0.0.1:39062/solr/collection1/&NOW=1349886673033&start=0&q=*:*&isShard=true&fsv=true} hits=35 status=0 QTime=1 
[junit4:junit4]   2> 15970 T752 C54 P39058 REQ /select {sort=n_tdt1+desc&distrib=false&collection=collection1&wt=javabin&rows=10&version=2&NOW=1349886673033&shard.url=127.0.0.1:39058/solr/collection1/|127.0.0.1:39066/solr/collection1/&fl=id&start=0&q=*:*&isShard=true&fsv=true} hits=32 status=0 QTime=1 
[junit4:junit4]   2> 15975 T765 C56 P39062 REQ /select {shard.url=127.0.0.1:39062/solr/collection1/&NOW=1349886673033&q=*:*&ids=134,115,121,112,9,131,141&distrib=false&collection=collection1&isShard=true&wt=javabin&version=2} status=0 QTime=1 
[junit4:junit4]   2> 15975 T752 C54 P39058 REQ /select {shard.url=127.0.0.1:39058/solr/collection1/|127.0.0.1:39066/solr/collection1/&NOW=1349886673033&q=*:*&ids=108,4,12&distrib=false&collection=collection1&isShard=true&wt=javabin&version=2} status=0 QTime=1 
[junit4:junit4]   2> 15976 T755 C54 P39058 REQ /select {collection=collection1&sort=n_tdt1+desc&wt=javabin&q=*:*&version=2} hits=67 status=0 QTime=11 
[junit4:junit4]   2> 15985 T737 C55 P39054 REQ /select {distrib=false&sort=n_tdt1+asc&wt=javabin&q=*:*&version=2} hits=67 status=0 QTime=1 
[junit4:junit4]   2> 15993 T765 C56 P39062 REQ /select {sort=n_tdt1+asc&distrib=false&wt=javabin&rows=10&version=2&fl=id&shard.url=127.0.0.1:39062/solr/collection1/&NOW=1349886673057&start=0&q=*:*&isShard=true&fsv=true} hits=35 status=0 QTime=1 
[junit4:junit4]   2> 15993 T777 C53 P39066 REQ /select {sort=n_tdt1+asc&distrib=false&wt=javabin&rows=10&version=2&fl=id&shard.url=127.0.0.1:39058/solr/collection1/|127.0.0.1:39066/solr/collection1/&NOW=1349886673057&start=0&q=*:*&isShard=true&fsv=true} hits=32 status=0 QTime=1 
[junit4:junit4]   2> 15997 T765 C56 P39062 REQ /select {shard.url=127.0.0.1:39062/solr/collection1/&NOW=1349886673057&q=*:*&ids=3,137,17,104,140,130&distrib=false&isShard=true&wt=javabin&version=2} status=0 QTime=1 
[junit4:junit4]   2> 15998 T777 C53 P39066 REQ /select {shard.url=127.0.0.1:39058/solr/collection1/|127.0.0.1:39066/solr/collection1/&NOW=1349886673057&q=*:*&ids=109,15,14,11&distrib=false&isShard=true&wt=javabin&version=2} status=0 QTime=1 
[junit4:junit4]   2> 15999 T755 C54 P39058 REQ /select {sort=n_tdt1+asc&wt=javabin&q=*:*&version=2} hits=67 status=0 QTime=10 
[junit4:junit4]   2> 16009 T737 C55 P39054 REQ /select {distrib=false&sort=a_si+desc&wt=javabin&q=*:*&version=2} hits=67 status=0 QTime=2 
[junit4:junit4]   2> 16018 T768 C56 P39062 REQ /select {sort=a_si+desc&distrib=false&collection=collection1&wt=javabin&rows=10&version=2&fl=id&shard.url=127.0.0.1:39062/solr/collection1/&NOW=1349886673082&start=0&q=*:*&isShard=true&fsv=true} hits=35 status=0 QTime=1 
[junit4:junit4]   2> 16018 T779 C53 P39066 REQ /select {sort=a_si+desc&distrib=false&collection=collection1&wt=javabin&rows=10&version=2&fl=id&shard.url=127.0.0.1:39058/solr/collection1/|127.0.0.1:39066/solr/collection1/&NOW=1349886673082&start=0&q=*:*&isShard=true&fsv=true} hits=32 status=0 QTime=1 
[junit4:junit4]   2> 16023 T779 C53 P39066 REQ /select {shard.url=127.0.0.1:39058/solr/collection1/|127.0.0.1:39066/solr/collection1/&NOW=1349886673082&q=*:*&ids=10,1,8,13,12&distrib=false&collection=collection1&isShard=true&wt=javabin&version=2} status=0 QTime=1 
[junit4:junit4]   2> 16023 T768 C56 P39062 REQ /select {shard.url=127.0.0.1:39062/solr/collection1/&NOW=1349886673082&q=*:*&ids=3,2,7,5,9&distrib=false&collection=collection1&isShard=true&wt=javabin&version=2} status=0 QTime=1 
[junit4:junit4]   2> 16024 T780 C53 P39066 REQ /select {collection=collection1&sort=a_si+desc&wt=javabin&q=*:*&version=2} hits=67 status=0 QTime=10 
[junit4:junit4]   2> 16049 T737 C55 P39054 REQ /select {distrib=false&sort=a_si+asc&wt=javabin&q=*:*&version=2} hits=67 status=0 QTime=16 
[junit4:junit4]   2> 16057 T766 C56 P39062 REQ /select {sort=a_si+asc&distrib=false&wt=javabin&rows=10&version=2&fl=id&shard.url=127.0.0.1:39062/solr/collection1/&NOW=1349886673121&start=0&q=*:*&isShard=true&fsv=true} hits=35 status=0 QTime=1 
[junit4:junit4]   2> 16057 T753 C54 P39058 REQ /select {sort=a_si+asc&distrib=false&wt=javabin&rows=10&version=2&fl=id&shard.url=127.0.0.1:39058/solr/collection1/|127.0.0.1:39066/solr/collection1/&NOW=1349886673121&start=0&q=*:*&isShard=true&fsv=true} hits=32 status=0 QTime=1 
[junit4:junit4]   2> 16068 T766 C56 P39062 REQ /select {shard.url=127.0.0.1:39062/solr/collection1/&NOW=1349886673121&q=*:*&ids=3,2,7,6,9&distrib=false&isShard=true&wt=javabin&version=2} status=0 QTime=1 
[junit4:junit4]   2> 16068 T753 C54 P39058 REQ /select {shard.url=127.0.0.1:39058/solr/collection1/|127.0.0.1:39066/solr/collection1/&NOW=1349886673121&q=*:*&ids=1,4,13,11,12&distrib=false&isShard=true&wt=javabin&version=2} status=0 QTime=1 
[junit4:junit4]   2> 16070 T764 C56 P39062 REQ /select {sort=a_si+asc&wt=javabin&q=*:*&version=2} hits=67 status=0 QTime=17 
[junit4:junit4]   2> 16078 T737 C55 P39054 REQ /select {sort=a_si+desc&fl=*,score&q=*:*&distrib=false&wt=javabin&version=2} hits=67 status=0 QTime=1 
[junit4:junit4]   2> 16085 T779 C53 P39066 REQ /select {sort=a_si+desc&distrib=false&collection=collection1&wt=javabin&rows=10&version=2&fl=id,score&shard.url=127.0.0.1:39058/solr/collection1/|127.0.0.1:39066/solr/collection1/&NOW=1349886673149&start=0&q=*:*&isShard=true&fsv=true} hits=32 status=0 QTime=1 
[junit4:junit4]   2> 16085 T768 C56 P39062 REQ /select {sort=a_si+desc&distrib=false&collection=collection1&wt=javabin&rows=10&version=2&fl=id,score&shard.url=127.0.0.1:39062/solr/collection1/&NOW=1349886673149&start=0&q=*:*&isShard=true&fsv=true} hits=35 status=0 QTime=1 
[junit4:junit4]   2> 16089 T768 C56 P39062 REQ /select {fl=*,score&shard.url=127.0.0.1:39062/solr/collection1/&NOW=1349886673149&q=*:*&ids=3,2,7,5,9&distrib=false&collection=collection1&isShard=true&wt=javabin&version=2} status=0 QTime=1 
[junit4:junit4]   2> 16090 T779 C53 P39066 REQ /select {fl=*,score&shard.url=127.0.0.1:39058/solr/collection1/|127.0.0.1:39066/solr/collection1/&NOW=1349886673149&q=*:*&ids=10,1,8,13,12&distrib=false&collection=collection1&isShard=true&wt=javabin&version=2} status=0 QTime=1 
[junit4:junit4]   2> 16091 T778 C53 P39066 REQ /select {sort=a_si+desc&fl=*,score&q=*:*&collection=collection1&wt=javabin&version=2} hits=67 status=0 QTime=10 
[junit4:junit4]   2> 16100 T737 C55 P39054 REQ /select {sort=n_tl1+asc&fl=*,score&q=*:*&distrib=false&wt=javabin&version=2} hits=67 status=0 QTime=1 
[junit4:junit4]   2> 16108 T765 C56 P39062 REQ /select {sort=n_tl1+asc&distrib=false&collection=collection1&wt=javabin&rows=10&version=2&fl=id,score&shard.url=127.0.0.1:39062/solr/collection1/&NOW=1349886673172&start=0&q=*:*&isShard=true&fsv=true} hits=35 status=0 QTime=1 
[junit4:junit4]   2> 16108 T752 C54 P39058 REQ /select {sort=n_tl1+asc&distrib=false&collection=collection1&wt=javabin&rows=10&version=2&fl=id,score&shard.url=127.0.0.1:39058/solr/collection1/|127.0.0.1:39066/solr/collection1/&NOW=1349886673172&start=0&q=*:*&isShard=true&fsv=true} hits=32 status=0 QTime=1 
[junit4:junit4]   2> 16111 T765 C56 P39062 REQ /select {fl=*,score&shard.url=127.0.0.1:39062/solr/collection1/&NOW=1349886673172&q=*:*&ids=2,5,9,131,130&distrib=false&collection=collection1&isShard=true&wt=javabin&version=2} status=0 QTime=0 
[junit4:junit4]   2> 16112 T752 C54 P39058 REQ /select {fl=*,score&shard.url=127.0.0.1:39058/solr/collection1/|127.0.0.1:39066/solr/collection1/&NOW=1349886673172&q=*:*&ids=114,138,124,129,12&distrib=false&collection=collection1&isShard=true&wt=javabin&version=2} status=0 QTime=0 
[junit4:junit4]   2> 16114 T755 C54 P39058 REQ /select {sort=n_tl1+asc&fl=*,score&q=*:*&collection=collection1&wt=javabin&version=2} hits=67 status=0 QTime=10 
[junit4:junit4]   2> 16126 T737 C55 P39054 REQ /select {distrib=false&sort=n_tl1+desc&wt=javabin&q=*:*&version=2} hits=67 status=0 QTime=0 
[junit4:junit4]   2> 16132 T768 C56 P39062 REQ /select {sort=n_tl1+desc&distrib=false&collection=collection1&wt=javabin&rows=10&version=2&fl=id&shard.url=127.0.0.1:39062/solr/collection1/&NOW=1349886673197&start=0&q=*:*&isShard=true&fsv=true} hits=35 status=0 QTime=0 
[junit4:junit4]   2> 16133 T802 C54 P39058 REQ /select {sort=n_tl1+desc&distrib=false&collection=collection1&wt=javabin&rows=10&version=2&fl=id&shard.url=127.0.0.1:39058/solr/collection1/|127.0.0.1:39066/solr/collection1/&NOW=1349886673197&start=0&q=*:*&isShard=true&fsv=true} hits=32 status=0 QTime=1 
[junit4:junit4]   2> 16137 T768 C56 P39062 REQ /select {shard.url=127.0.0.1:39062/solr/collection1/&NOW=1349886673197&q=*:*&ids=116,3,144,7,136,105,141&distrib=false&collection=collection1&isShard=true&wt=javabin&version=2} status=0 QTime=1 
[junit4:junit4]   2> 16137 T802 C54 P39058 REQ /select {shard.url=127.0.0.1:39058/solr/collection1/|127.0.0.1:39066/solr/collection1/&NOW=1349886673197&q=*:*&ids=125,133,16&distrib=false&collection=collection1&isShard=true&wt=javabin&version=2} status=0 QTime=0 
[junit4:junit4]   2> 16138 T778 C53 P39066 REQ /select {collection=collection1&sort=n_tl1+desc&wt=javabin&q=*:*&version=2} hits=67 status=0 QTime=9 
[junit4:junit4]   2> 16149 T737 C55 P39054 REQ /select {distrib=false&wt=javabin&q={!func}a_si&version=2} hits=67 status=0 QTime=7 
[junit4:junit4]   2> 16156 T768 C56 P39062 REQ /select {fl=id,score&shard.url=127.0.0.1:39062/solr/collection1/&NOW=1349886673221&start=0&q={!func}a_si&distrib=false&isShard=true&wt=javabin&fsv=true&rows=10&version=2} hits=35 status=0 QTime=0 
[junit4:junit4]   2> 16157 T779 C53 P39066 REQ /select {fl=id,score&shard.url=127.0.0.1:39058/solr/collection1/|127.0.0.1:39066/solr/collection1/&NOW=1349886673221&start=0&q={!func}a_si&distrib=false&isShard=true&wt=javabin&fsv=true&rows=10&version=2} hits=32 status=0 QTime=1 
[junit4:junit4]   2> 16161 T768 C56 P39062 REQ /select {shard.url=127.0.0.1:39062/solr/collection1/&NOW=1349886673221&q={!func}a_si&ids=3,2,7,5,9&distrib=false&isShard=true&wt=javabin&version=2} status=0 QTime=0 
[junit4:junit4]   2> 16161 T779 C53 P39066 REQ /select {shard.url=127.0.0.1:39058/solr/collection1/|127.0.0.1:39066/solr/collection1/&NOW=1349886673221&q={!func}a_si&ids=10,1,8,13,12&distrib=false&isShard=true&wt=javabin&version=2} status=0 QTime=1 
[junit4:junit4]   2> 16162 T778 C53 P39066 REQ /select {wt=javabin&q={!func}a_si&version=2} hits=67 status=0 QTime=9 
[junit4:junit4]   2> 16165 T737 C55 P39054 REQ /select {distrib=false&fl=*,score&wt=javabin&q={!func}a_si&version=2} hits=67 status=0 QTime=0 
[junit4:junit4]   2> 16173 T768 C56 P39062 REQ /select {fl=id,score&shard.url=127.0.0.1:39062/solr/collection1/&NOW=1349886673237&start=0&q={!func}a_si&distrib=false&isShard=true&wt=javabin&fsv=true&rows=10&version=2} hits=35 status=0 QTime=0 
[junit4:junit4]   2> 16173 T802 C54 P39058 REQ /select {fl=id,score&shard.url=127.0.0.1:39058/solr/collection1/|127.0.0.1:39066/solr/collection1/&NOW=1349886673237&start=0&q={!func}a_si&distrib=false&isShard=true&wt=javabin&fsv=true&rows=10&version=2} hits=32 status=0 QTime=1 
[junit4:junit4]   2> 16177 T768 C56 P39062 REQ /select {fl=*,score&shard.url=127.0.0.1:39062/solr/collection1/&NOW=1349886673237&q={!func}a_si&ids=3,2,7,5,9&distrib=false&isShard=true&wt=javabin&version=2} status=0 QTime=1 
[junit4:junit4]   2> 16177 T802 C54 P39058 REQ /select {fl=*,score&shard.url=127.0.0.1:39058/solr/collection1/|127.0.0.1:39066/solr/collection1/&NOW=1349886673237&q={!func}a_si&ids=10,1,8,13,12&distrib=false&isShard=true&wt=javabin&version=2} status=0 QTime=1 
[junit4:junit4]   2> 16178 T778 C53 P39066 REQ /select {fl=*,score&wt=javabin&q={!func}a_si&version=2} hits=67 status=0 QTime=9 
[junit4:junit4]   2> 16183 T737 C55 P39054 REQ /select {distrib=false&wt=javabin&q=quick&version=2} hits=2 status=0 QTime=1 
[junit4:junit4]   2> 16190 T766 C56 P39062 REQ /select {fl=id,score&shard.url=127.0.0.1:39062/solr/collection1/&NOW=1349886673254&start=0&q=quick&distrib=false&isShard=true&wt=javabin&fsv=true&rows=10&version=2} hits=1 status=0 QTime=1 
[junit4:junit4]   2> 16190 T776 C53 P39066 REQ /select {fl=id,score&shard.url=127.0.0.1:39058/solr/collection1/|127.0.0.1:39066/solr/collection1/&NOW=1349886673254&start=0&q=quick&distrib=false&isShard=true&wt=javabin&fsv=true&rows=10&version=2} hits=1 status=0 QTime=1 
[junit4:junit4]   2> 16194 T776 C53 P39066 REQ /select {shard.url=127.0.0.1:39058/solr/collection1/|127.0.0.1:39066/solr/collection1/&NOW=1349886673254&q=quick&ids=4&distrib=false&isShard=true&wt=javabin&version=2} status=0 QTime=1 
[junit4:junit4]   2> 16194 T766 C56 P39062 REQ /select {shard.url=127.0.0.1:39062/solr/collection1/&NOW=1349886673254&q=quick&ids=5&distrib=false&isShard=true&wt=javabin&version=2} status=0 QTime=1 
[junit4:junit4]   2> 16195 T767 C56 P39062 REQ /select {wt=javabin&q=quick&version=2} hits=2 status=0 QTime=9 
[junit4:junit4]   2> 16199 T737 C55 P39054 REQ /select {fl=id&start=0&q=all&distrib=false&wt=javabin&version=2} hits=2 status=0 QTime=1 
[junit4:junit4]   2> 16206 T766 C56 P39062 REQ /select {distrib=false&collection=collection1&wt=javabin&rows=10&version=2&fl=id,score&shard.url=127.0.0.1:39062/solr/collection1/&NOW=1349886673270&start=0&q=all&isShard=true&fsv=true} hits=0 status=0 QTime=1 
[junit4:junit4]   2> 16206 T776 C53 P39066 REQ /select {distrib=false&collection=collection1&wt=javabin&rows=10&version=2&fl=id,score&shard.url=127.0.0.1:39058/solr/collection1/|127.0.0.1:39066/solr/collection1/&NOW=1349886673270&start=0&q=all&isShard=true&fsv=true} hits=2 status=0 QTime=1 
[junit4:junit4]   2> 16210 T776 C53 P39066 REQ /select {fl=id&shard.url=127.0.0.1:39058/solr/collection1/|127.0.0.1:39066/solr/collection1/&NOW=1349886673270&start=0&q=all&ids=1,8&distrib=false&collection=collection1&isShard=true&wt=javabin&version=2} status=0 QTime=1 
[junit4:junit4]   2> 16211 T767 C56 P39062 REQ /select {fl=id&start=0&q=all&collection=collection1&wt=javabin&version=2} hits=2 status=0 QTime=9 
[junit4:junit4]   2> 16213 T737 C55 P39054 REQ /select {fl=foofoofoo&start=0&q=all&distrib=false&wt=javabin&version=2} hits=2 status=0 QTime=0 
[junit4:junit4]   2> 16219 T776 C53 P39066 REQ /select {fl=id,score&shard.url=127.0.0.1:39058/solr/collection1/|127.0.0.1:39066/solr/collection1/&NOW=1349886673284&start=0&q=all&distrib=false&isShard=true&wt=javabin&fsv=true&rows=10&version=2} hits=2 status=0 QTime=0 
[junit4:junit4]   2> 16219 T766 C56 P39062 REQ /select {fl=id,score&shard.url=127.0.0.1:39062/solr/collection1/&NOW=1349886673284&start=0&q=all&distrib=false&isShard=true&wt=javabin&fsv=true&rows=10&version=2} hits=0 status=0 QTime=0 
[junit4:junit4]   2> 16223 T776 C53 P39066 REQ /select {fl=foofoofoo&fl=id&shard.url=127.0.0.1:39058/solr/collection1/|127.0.0.1:39066/solr/collection1/&NOW=1349886673284&start=0&q=all&ids=1,8&distrib=false&isShard=true&wt=javabin&version=2} status=0 QTime=0 
[junit4:junit4]   2> 16224 T767 C56 P39062 REQ /select {fl=foofoofoo&wt=javabin&start=0&q=all&version=2} hits=2 status=0 QTime=8 
[junit4:junit4]   2> 16227 T737 C55 P39054 REQ /s

[...truncated too long message...]

.1:39058/solr"}}}}}
[junit4:junit4]   1>  /zookeeper (1)
[junit4:junit4]   1>  DATA:
[junit4:junit4]   1>      
[junit4:junit4]   1> 
[junit4:junit4]   2> NOTE: reproduce with: ant test  -Dtestcase=BasicDistributedZkTest -Dtests.method=testDistribSearch -Dtests.seed=E3D642C2376F7A2E -Dtests.multiplier=3 -Dtests.slow=true -Dtests.locale=et -Dtests.timezone=America/St_Thomas -Dtests.file.encoding=US-ASCII
[junit4:junit4] FAILURE  604s J0 | BasicDistributedZkTest.testDistribSearch <<<
[junit4:junit4]    > Throwable #1: java.lang.AssertionError: some core start times did not change on reload
[junit4:junit4]    > 	at __randomizedtesting.SeedInfo.seed([E3D642C2376F7A2E:6230CCDA40301A12]:0)
[junit4:junit4]    > 	at org.junit.Assert.fail(Assert.java:93)
[junit4:junit4]    > 	at org.junit.Assert.assertTrue(Assert.java:43)
[junit4:junit4]    > 	at org.apache.solr.cloud.BasicDistributedZkTest.testCollectionsAPI(BasicDistributedZkTest.java:442)
[junit4:junit4]    > 	at org.apache.solr.cloud.BasicDistributedZkTest.doTest(BasicDistributedZkTest.java:331)
[junit4:junit4]    > 	at org.apache.solr.BaseDistributedSearchTestCase.testDistribSearch(BaseDistributedSearchTestCase.java:695)
[junit4:junit4]    > 	at sun.reflect.NativeMethodAccessorImpl.invoke0(Native Method)
[junit4:junit4]    > 	at sun.reflect.NativeMethodAccessorImpl.invoke(NativeMethodAccessorImpl.java:57)
[junit4:junit4]    > 	at sun.reflect.DelegatingMethodAccessorImpl.invoke(DelegatingMethodAccessorImpl.java:43)
[junit4:junit4]    > 	at java.lang.reflect.Method.invoke(Method.java:601)
[junit4:junit4]    > 	at com.carrotsearch.randomizedtesting.RandomizedRunner.invoke(RandomizedRunner.java:1559)
[junit4:junit4]    > 	at com.carrotsearch.randomizedtesting.RandomizedRunner.access$600(RandomizedRunner.java:79)
[junit4:junit4]    > 	at com.carrotsearch.randomizedtesting.RandomizedRunner$6.evaluate(RandomizedRunner.java:737)
[junit4:junit4]    > 	at com.carrotsearch.randomizedtesting.RandomizedRunner$7.evaluate(RandomizedRunner.java:773)
[junit4:junit4]    > 	at com.carrotsearch.randomizedtesting.RandomizedRunner$8.evaluate(RandomizedRunner.java:787)
[junit4:junit4]    > 	at com.carrotsearch.randomizedtesting.rules.SystemPropertiesRestoreRule$1.evaluate(SystemPropertiesRestoreRule.java:53)
[junit4:junit4]    > 	at org.apache.lucene.util.TestRuleSetupTeardownChained$1.evaluate(TestRuleSetupTeardownChained.java:50)
[junit4:junit4]    > 	at org.apache.lucene.util.TestRuleFieldCacheSanity$1.evaluate(TestRuleFieldCacheSanity.java:51)
[junit4:junit4]    > 	at org.apache.lucene.util.AbstractBeforeAfterRule$1.evaluate(AbstractBeforeAfterRule.java:45)
[junit4:junit4]    > 	at com.carrotsearch.randomizedtesting.rules.SystemPropertiesInvariantRule$1.evaluate(SystemPropertiesInvariantRule.java:55)
[junit4:junit4]    > 	at org.apache.lucene.util.TestRuleThreadAndTestName$1.evaluate(TestRuleThreadAndTestName.java:48)
[junit4:junit4]    > 	at org.apache.lucene.util.TestRuleIgnoreAfterMaxFailures$1.evaluate(TestRuleIgnoreAfterMaxFailures.java:70)
[junit4:junit4]    > 	at org.apache.lucene.util.TestRuleMarkFailure$1.evaluate(TestRuleMarkFailure.java:48)
[junit4:junit4]    > 	at com.carrotsearch.randomizedtesting.rules.StatementAdapter.evaluate(StatementAdapter.java:36)
[junit4:junit4]    > 	at com.carrotsearch.randomizedtesting.ThreadLeakControl$StatementRunner.run(ThreadLeakControl.java:358)
[junit4:junit4]    > 	at com.carrotsearch.randomizedtesting.ThreadLeakControl.forkTimeoutingTask(ThreadLeakControl.java:782)
[junit4:junit4]    > 	at com.carrotsearch.randomizedtesting.ThreadLeakControl$3.evaluate(ThreadLeakControl.java:442)
[junit4:junit4]    > 	at com.carrotsearch.randomizedtesting.RandomizedRunner.runSingleTest(RandomizedRunner.java:746)
[junit4:junit4]    > 	at com.carrotsearch.randomizedtesting.RandomizedRunner$3.evaluate(RandomizedRunner.java:648)
[junit4:junit4]    > 	at com.carrotsearch.randomizedtesting.RandomizedRunner$4.evaluate(RandomizedRunner.java:682)
[junit4:junit4]    > 	at com.carrotsearch.randomizedtesting.RandomizedRunner$5.evaluate(RandomizedRunner.java:693)
[junit4:junit4]    > 	at com.carrotsearch.randomizedtesting.rules.StatementAdapter.evaluate(StatementAdapter.java:36)
[junit4:junit4]    > 	at com.carrotsearch.randomizedtesting.rules.SystemPropertiesRestoreRule$1.evaluate(SystemPropertiesRestoreRule.java:53)
[junit4:junit4]    > 	at org.apache.lucene.util.AbstractBeforeAfterRule$1.evaluate(AbstractBeforeAfterRule.java:45)
[junit4:junit4]    > 	at org.apache.lucene.util.TestRuleStoreClassName$1.evaluate(TestRuleStoreClassName.java:42)
[junit4:junit4]    > 	at com.carrotsearch.randomizedtesting.rules.SystemPropertiesInvariantRule$1.evaluate(SystemPropertiesInvariantRule.java:55)
[junit4:junit4]    > 	at com.carrotsearch.randomizedtesting.rules.NoShadowingOrOverridesOnMethodsRule$1.evaluate(NoShadowingOrOverridesOnMethodsRule.java:39)
[junit4:junit4]    > 	at com.carrotsearch.randomizedtesting.rules.NoShadowingOrOverridesOnMethodsRule$1.evaluate(NoShadowingOrOverridesOnMethodsRule.java:39)
[junit4:junit4]    > 	at com.carrotsearch.randomizedtesting.rules.StatementAdapter.evaluate(StatementAdapter.java:36)
[junit4:junit4]    > 	at org.apache.lucene.util.TestRuleAssertionsRequired$1.evaluate(TestRuleAssertionsRequired.java:43)
[junit4:junit4]    > 	at org.apache.lucene.util.TestRuleMarkFailure$1.evaluate(TestRuleMarkFailure.java:48)
[junit4:junit4]    > 	at org.apache.lucene.util.TestRuleIgnoreAfterMaxFailures$1.evaluate(TestRuleIgnoreAfterMaxFailures.java:70)
[junit4:junit4]    > 	at org.apache.lucene.util.TestRuleIgnoreTestSuites$1.evaluate(TestRuleIgnoreTestSuites.java:55)
[junit4:junit4]    > 	at com.carrotsearch.randomizedtesting.rules.StatementAdapter.evaluate(StatementAdapter.java:36)
[junit4:junit4]    > 	at com.carrotsearch.randomizedtesting.ThreadLeakControl$StatementRunner.run(ThreadLeakControl.java:358)
[junit4:junit4]    > 	at java.lang.Thread.run(Thread.java:722)
[junit4:junit4]   2> 604350 T725 oas.SolrTestCaseJ4.deleteCore ###deleteCore
[junit4:junit4]   2> NOTE: test params are: codec=Lucene40: {n_f1=PostingsFormat(name=Memory doPackFST= false), foo_b=MockFixedIntBlock(blockSize=140), cat=PostingsFormat(name=MockSep), foo_d=PostingsFormat(name=Direct), foo_f=MockFixedIntBlock(blockSize=140), n_tl1=PostingsFormat(name=Memory doPackFST= false), n_d1=PostingsFormat(name=MockSep), rnd_b=PostingsFormat(name=Direct), intDefault=PostingsFormat(name=MockSep), n_td1=PostingsFormat(name=Memory doPackFST= false), timestamp=PostingsFormat(name=MockSep), id=PostingsFormat(name=Direct), range_facet_sl=MockFixedIntBlock(blockSize=140), range_facet_si=PostingsFormat(name=Memory doPackFST= false), oddField_s=MockFixedIntBlock(blockSize=140), sequence_i=MockFixedIntBlock(blockSize=140), name=PostingsFormat(name=Direct), foo_i=PostingsFormat(name=Memory doPackFST= false), regex_dup_B_s=PostingsFormat(name=MockSep), multiDefault=PostingsFormat(name=Memory doPackFST= false), n_tf1=PostingsFormat(name=MockSep), n_dt1=PostingsFormat(name=Memory doPackFST= false), genre_s=MockFixedIntBlock(blockSize=140), author_t=PostingsFormat(name=Memory doPackFST= false), n_ti1=PostingsFormat(name=Direct), range_facet_l=PostingsFormat(name=MockSep), text=MockFixedIntBlock(blockSize=140), _version_=PostingsFormat(name=MockSep), val_i=PostingsFormat(name=Direct), SubjectTerms_mfacet=PostingsFormat(name=MockSep), series_t=PostingsFormat(name=Memory doPackFST= false), a_t=PostingsFormat(name=MockSep), n_tdt1=PostingsFormat(name=MockSep), regex_dup_A_s=MockFixedIntBlock(blockSize=140), price=MockFixedIntBlock(blockSize=140), other_tl1=PostingsFormat(name=MockSep), n_l1=PostingsFormat(name=MockSep), a_si=PostingsFormat(name=Memory doPackFST= false), inStock=MockFixedIntBlock(blockSize=140)}, sim=DefaultSimilarity, locale=et, timezone=America/St_Thomas
[junit4:junit4]   2> NOTE: FreeBSD 9.0-RELEASE amd64/Oracle Corporation 1.7.0_06 (64-bit)/cpus=16,threads=1,free=111015640,total=476053504
[junit4:junit4]   2> NOTE: All tests run in this JVM: [TestJmxMonitoredMap, FastVectorHighlighterTest, ResourceLoaderTest, SuggesterFSTTest, DistributedTermsComponentTest, FieldAnalysisRequestHandlerTest, ZkControllerTest, TestQuerySenderNoQuery, HighlighterConfigTest, DistanceFunctionTest, JSONWriterTest, SpellCheckCollatorTest, TestSearchPerf, TestPseudoReturnFields, TestCollationField, IndexBasedSpellCheckerTest, NumericFieldsTest, TestStressReorder, ResponseLogComponentTest, TestSolr4Spatial, CacheHeaderTest, PluginInfoTest, SolrCmdDistributorTest, NoCacheHeaderTest, TestSolrJ, UniqFieldsUpdateProcessorFactoryTest, SpellPossibilityIteratorTest, SolrCoreCheckLockOnStartupTest, MBeansHandlerTest, TestFiltering, TestCoreContainer, ZkCLITest, JsonLoaderTest, TestSolrQueryParser, DistributedSpellCheckComponentTest, TestBadConfig, TestConfig, TestExtendedDismaxParser, CircularListTest, TestSuggestSpellingConverter, BasicDistributedZkTest]
[junit4:junit4] Completed on J0 in 604.68s, 1 test, 1 failure <<< FAILURES!

[...truncated 50 lines...]
BUILD FAILED
/usr/home/hudson/hudson-slave/workspace/Lucene-Solr-Tests-4.x-java7/build.xml:38: The following error occurred while executing this line:
/usr/home/hudson/hudson-slave/workspace/Lucene-Solr-Tests-4.x-java7/solr/build.xml:180: The following error occurred while executing this line:
/usr/home/hudson/hudson-slave/workspace/Lucene-Solr-Tests-4.x-java7/lucene/module-build.xml:61: The following error occurred while executing this line:
/usr/home/hudson/hudson-slave/workspace/Lucene-Solr-Tests-4.x-java7/lucene/common-build.xml:1143: The following error occurred while executing this line:
/usr/home/hudson/hudson-slave/workspace/Lucene-Solr-Tests-4.x-java7/lucene/common-build.xml:816: There were test failures: 231 suites, 960 tests, 1 failure, 21 ignored (3 assumptions)

Total time: 50 minutes 46 seconds
Build step 'Invoke Ant' marked build as failure
Archiving artifacts
Recording test results
Email was triggered for: Failure
Sending email for trigger: Failure



Mime
View raw message