lucene-dev mailing list archives

Site index · List index
Message view « Date » · « Thread »
Top « Date » · « Thread »
From Policeman Jenkins Server <jenk...@sd-datasolutions.de>
Subject [JENKINS] Lucene-Solr-trunk-Windows (32bit/jdk1.7.0_07) - Build # 1362 - Still Failing!
Date Tue, 30 Oct 2012 03:12:35 GMT
Build: http://jenkins.sd-datasolutions.de/job/Lucene-Solr-trunk-Windows/1362/
Java: 32bit/jdk1.7.0_07 -server -XX:+UseG1GC

2 tests failed.
FAILED:  junit.framework.TestSuite.org.apache.solr.client.solrj.embedded.TestEmbeddedSolrServer

Error Message:
2 threads leaked from SUITE scope at org.apache.solr.client.solrj.embedded.TestEmbeddedSolrServer:     1) Thread[id=14, name=metrics-meter-tick-thread-1, state=TIMED_WAITING, group=TGRP-TestEmbeddedSolrServer]         at sun.misc.Unsafe.park(Native Method)         at java.util.concurrent.locks.LockSupport.parkNanos(LockSupport.java:226)         at java.util.concurrent.locks.AbstractQueuedSynchronizer$ConditionObject.awaitNanos(AbstractQueuedSynchronizer.java:2082)         at java.util.concurrent.ScheduledThreadPoolExecutor$DelayedWorkQueue.take(ScheduledThreadPoolExecutor.java:1090)         at java.util.concurrent.ScheduledThreadPoolExecutor$DelayedWorkQueue.take(ScheduledThreadPoolExecutor.java:807)         at java.util.concurrent.ThreadPoolExecutor.getTask(ThreadPoolExecutor.java:1043)         at java.util.concurrent.ThreadPoolExecutor.runWorker(ThreadPoolExecutor.java:1103)         at java.util.concurrent.ThreadPoolExecutor$Worker.run(ThreadPoolExecutor.java:603)         at java.lang.Thread.run(Thread.java:722)    2) Thread[id=15, name=metrics-meter-tick-thread-2, state=WAITING, group=TGRP-TestEmbeddedSolrServer]         at sun.misc.Unsafe.park(Native Method)         at java.util.concurrent.locks.LockSupport.park(LockSupport.java:186)         at java.util.concurrent.locks.AbstractQueuedSynchronizer$ConditionObject.await(AbstractQueuedSynchronizer.java:2043)         at java.util.concurrent.ScheduledThreadPoolExecutor$DelayedWorkQueue.take(ScheduledThreadPoolExecutor.java:1085)         at java.util.concurrent.ScheduledThreadPoolExecutor$DelayedWorkQueue.take(ScheduledThreadPoolExecutor.java:807)         at java.util.concurrent.ThreadPoolExecutor.getTask(ThreadPoolExecutor.java:1043)         at java.util.concurrent.ThreadPoolExecutor.runWorker(ThreadPoolExecutor.java:1103)         at java.util.concurrent.ThreadPoolExecutor$Worker.run(ThreadPoolExecutor.java:603)         at java.lang.Thread.run(Thread.java:722)

Stack Trace:
com.carrotsearch.randomizedtesting.ThreadLeakError: 2 threads leaked from SUITE scope at org.apache.solr.client.solrj.embedded.TestEmbeddedSolrServer: 
   1) Thread[id=14, name=metrics-meter-tick-thread-1, state=TIMED_WAITING, group=TGRP-TestEmbeddedSolrServer]
        at sun.misc.Unsafe.park(Native Method)
        at java.util.concurrent.locks.LockSupport.parkNanos(LockSupport.java:226)
        at java.util.concurrent.locks.AbstractQueuedSynchronizer$ConditionObject.awaitNanos(AbstractQueuedSynchronizer.java:2082)
        at java.util.concurrent.ScheduledThreadPoolExecutor$DelayedWorkQueue.take(ScheduledThreadPoolExecutor.java:1090)
        at java.util.concurrent.ScheduledThreadPoolExecutor$DelayedWorkQueue.take(ScheduledThreadPoolExecutor.java:807)
        at java.util.concurrent.ThreadPoolExecutor.getTask(ThreadPoolExecutor.java:1043)
        at java.util.concurrent.ThreadPoolExecutor.runWorker(ThreadPoolExecutor.java:1103)
        at java.util.concurrent.ThreadPoolExecutor$Worker.run(ThreadPoolExecutor.java:603)
        at java.lang.Thread.run(Thread.java:722)
   2) Thread[id=15, name=metrics-meter-tick-thread-2, state=WAITING, group=TGRP-TestEmbeddedSolrServer]
        at sun.misc.Unsafe.park(Native Method)
        at java.util.concurrent.locks.LockSupport.park(LockSupport.java:186)
        at java.util.concurrent.locks.AbstractQueuedSynchronizer$ConditionObject.await(AbstractQueuedSynchronizer.java:2043)
        at java.util.concurrent.ScheduledThreadPoolExecutor$DelayedWorkQueue.take(ScheduledThreadPoolExecutor.java:1085)
        at java.util.concurrent.ScheduledThreadPoolExecutor$DelayedWorkQueue.take(ScheduledThreadPoolExecutor.java:807)
        at java.util.concurrent.ThreadPoolExecutor.getTask(ThreadPoolExecutor.java:1043)
        at java.util.concurrent.ThreadPoolExecutor.runWorker(ThreadPoolExecutor.java:1103)
        at java.util.concurrent.ThreadPoolExecutor$Worker.run(ThreadPoolExecutor.java:603)
        at java.lang.Thread.run(Thread.java:722)
	at __randomizedtesting.SeedInfo.seed([A0A278763AEF4D11]:0)


FAILED:  junit.framework.TestSuite.org.apache.solr.client.solrj.embedded.TestEmbeddedSolrServer

Error Message:
There are still zombie threads that couldn't be terminated:    1) Thread[id=14, name=metrics-meter-tick-thread-1, state=TIMED_WAITING, group=TGRP-TestEmbeddedSolrServer]         at sun.misc.Unsafe.park(Native Method)         at java.util.concurrent.locks.LockSupport.parkNanos(LockSupport.java:226)         at java.util.concurrent.locks.AbstractQueuedSynchronizer$ConditionObject.awaitNanos(AbstractQueuedSynchronizer.java:2082)         at java.util.concurrent.ScheduledThreadPoolExecutor$DelayedWorkQueue.take(ScheduledThreadPoolExecutor.java:1090)         at java.util.concurrent.ScheduledThreadPoolExecutor$DelayedWorkQueue.take(ScheduledThreadPoolExecutor.java:807)         at java.util.concurrent.ThreadPoolExecutor.getTask(ThreadPoolExecutor.java:1043)         at java.util.concurrent.ThreadPoolExecutor.runWorker(ThreadPoolExecutor.java:1103)         at java.util.concurrent.ThreadPoolExecutor$Worker.run(ThreadPoolExecutor.java:603)         at java.lang.Thread.run(Thread.java:722)    2) Thread[id=15, name=metrics-meter-tick-thread-2, state=WAITING, group=TGRP-TestEmbeddedSolrServer]         at sun.misc.Unsafe.park(Native Method)         at java.util.concurrent.locks.LockSupport.park(LockSupport.java:186)         at java.util.concurrent.locks.AbstractQueuedSynchronizer$ConditionObject.await(AbstractQueuedSynchronizer.java:2043)         at java.util.concurrent.ScheduledThreadPoolExecutor$DelayedWorkQueue.take(ScheduledThreadPoolExecutor.java:1085)         at java.util.concurrent.ScheduledThreadPoolExecutor$DelayedWorkQueue.take(ScheduledThreadPoolExecutor.java:807)         at java.util.concurrent.ThreadPoolExecutor.getTask(ThreadPoolExecutor.java:1043)         at java.util.concurrent.ThreadPoolExecutor.runWorker(ThreadPoolExecutor.java:1103)         at java.util.concurrent.ThreadPoolExecutor$Worker.run(ThreadPoolExecutor.java:603)         at java.lang.Thread.run(Thread.java:722)

Stack Trace:
com.carrotsearch.randomizedtesting.ThreadLeakError: There are still zombie threads that couldn't be terminated:
   1) Thread[id=14, name=metrics-meter-tick-thread-1, state=TIMED_WAITING, group=TGRP-TestEmbeddedSolrServer]
        at sun.misc.Unsafe.park(Native Method)
        at java.util.concurrent.locks.LockSupport.parkNanos(LockSupport.java:226)
        at java.util.concurrent.locks.AbstractQueuedSynchronizer$ConditionObject.awaitNanos(AbstractQueuedSynchronizer.java:2082)
        at java.util.concurrent.ScheduledThreadPoolExecutor$DelayedWorkQueue.take(ScheduledThreadPoolExecutor.java:1090)
        at java.util.concurrent.ScheduledThreadPoolExecutor$DelayedWorkQueue.take(ScheduledThreadPoolExecutor.java:807)
        at java.util.concurrent.ThreadPoolExecutor.getTask(ThreadPoolExecutor.java:1043)
        at java.util.concurrent.ThreadPoolExecutor.runWorker(ThreadPoolExecutor.java:1103)
        at java.util.concurrent.ThreadPoolExecutor$Worker.run(ThreadPoolExecutor.java:603)
        at java.lang.Thread.run(Thread.java:722)
   2) Thread[id=15, name=metrics-meter-tick-thread-2, state=WAITING, group=TGRP-TestEmbeddedSolrServer]
        at sun.misc.Unsafe.park(Native Method)
        at java.util.concurrent.locks.LockSupport.park(LockSupport.java:186)
        at java.util.concurrent.locks.AbstractQueuedSynchronizer$ConditionObject.await(AbstractQueuedSynchronizer.java:2043)
        at java.util.concurrent.ScheduledThreadPoolExecutor$DelayedWorkQueue.take(ScheduledThreadPoolExecutor.java:1085)
        at java.util.concurrent.ScheduledThreadPoolExecutor$DelayedWorkQueue.take(ScheduledThreadPoolExecutor.java:807)
        at java.util.concurrent.ThreadPoolExecutor.getTask(ThreadPoolExecutor.java:1043)
        at java.util.concurrent.ThreadPoolExecutor.runWorker(ThreadPoolExecutor.java:1103)
        at java.util.concurrent.ThreadPoolExecutor$Worker.run(ThreadPoolExecutor.java:603)
        at java.lang.Thread.run(Thread.java:722)
	at __randomizedtesting.SeedInfo.seed([A0A278763AEF4D11]:0)




Build Log:
[...truncated 9366 lines...]
[junit4:junit4] Suite: org.apache.solr.client.solrj.embedded.TestEmbeddedSolrServer
[junit4:junit4]   2> -21 T12 oasc.CoreContainer.<init> New CoreContainer 12783446
[junit4:junit4]   2> 19 T12 oasc.CoreContainer.load Loading CoreContainer using Solr Home: 'C:\Users\JenkinsSlave\workspace\Lucene-Solr-trunk-Windows\solr\solrj\src\test-files\solrj\solr\shared'
[junit4:junit4]   2> 74 T12 oasc.SolrResourceLoader.<init> new SolrResourceLoader for directory: 'C:\Users\JenkinsSlave\workspace\Lucene-Solr-trunk-Windows\solr\solrj\src\test-files\solrj\solr\shared\'
[junit4:junit4]   2> 710 T12 oasc.CoreContainer.load Registering Log Listener
[junit4:junit4]   2> 1027 T12 oasc.CoreContainer.create Creating SolrCore 'collection1' using instanceDir: C:\Users\JenkinsSlave\workspace\Lucene-Solr-trunk-Windows\solr\solrj\src\test-files\solrj\solr\shared\.
[junit4:junit4]   2> 1029 T12 oasc.SolrResourceLoader.<init> new SolrResourceLoader for directory: 'C:\Users\JenkinsSlave\workspace\Lucene-Solr-trunk-Windows\solr\solrj\src\test-files\solrj\solr\shared\.\'
[junit4:junit4]   2> 1151 T12 oasc.SolrConfig.<init> Using Lucene MatchVersion: LUCENE_50
[junit4:junit4]   2> 1491 T12 oasc.SolrConfig.<init> Loaded SolrConfig: solrconfig.xml
[junit4:junit4]   2> 1529 T12 oass.IndexSchema.readSchema Reading Solr Schema
[junit4:junit4]   2> 1551 T12 oass.IndexSchema.readSchema Schema name=example core 
[junit4:junit4]   2> 1932 T12 oass.IndexSchema.readSchema default search field in schema is name
[junit4:junit4]   2> 1937 T12 oass.IndexSchema.readSchema query parser default operator is OR
[junit4:junit4]   2> 1942 T12 oass.IndexSchema.readSchema unique key field: id
[junit4:junit4]   2> 2187 T12 oasc.SolrCore.<init> [collection1] Opening new SolrCore at C:\Users\JenkinsSlave\workspace\Lucene-Solr-trunk-Windows\solr\solrj\src\test-files\solrj\solr\shared\.\, dataDir=C:\Users\JenkinsSlave\workspace\Lucene-Solr-trunk-Windows\solr\build\solr-solrj\test\J0\.\solrtest-TestEmbeddedSolrServer-1351566708026/data/-1.3\
[junit4:junit4]   2> 2188 T12 oasc.SolrCore.<init> JMX monitoring not detected for core: collection1
[junit4:junit4]   2> 2204 T12 oasc.SolrCore.initDirectoryFactory org.apache.solr.core.MockDirectoryFactory
[junit4:junit4]   2> 2325 T12 oasc.CachingDirectoryFactory.injectLockFactory WARNING No lockType configured for MockDirWrapper(org.apache.lucene.store.RAMDirectory@1024134 lockFactory=org.apache.lucene.store.SingleInstanceLockFactory@106c7b2) assuming 'simple'
[junit4:junit4]   2> 2329 T12 oasc.CachingDirectoryFactory.get return new directory for C:\Users\JenkinsSlave\workspace\Lucene-Solr-trunk-Windows\solr\build\solr-solrj\test\J0\.\solrtest-TestEmbeddedSolrServer-1351566708026\data\-1.3 forceNew:false
[junit4:junit4]   2> 2329 T12 oasc.CachingDirectoryFactory.close Releasing directory:C:\Users\JenkinsSlave\workspace\Lucene-Solr-trunk-Windows\solr\build\solr-solrj\test\J0\.\solrtest-TestEmbeddedSolrServer-1351566708026\data\-1.3
[junit4:junit4]   2> 2330 T12 oasc.SolrCore.getNewIndexDir New index directory detected: old=null new=C:\Users\JenkinsSlave\workspace\Lucene-Solr-trunk-Windows\solr\build\solr-solrj\test\J0\.\solrtest-TestEmbeddedSolrServer-1351566708026/data/-1.3\index/
[junit4:junit4]   2> 2332 T12 oasc.SolrCore.initIndex WARNING [collection1] Solr index directory 'C:\Users\JenkinsSlave\workspace\Lucene-Solr-trunk-Windows\solr\build\solr-solrj\test\J0\.\solrtest-TestEmbeddedSolrServer-1351566708026\data\-1.3\index' doesn't exist. Creating new index...
[junit4:junit4]   2> 2352 T12 oasc.CachingDirectoryFactory.get return new directory for C:\Users\JenkinsSlave\workspace\Lucene-Solr-trunk-Windows\solr\build\solr-solrj\test\J0\.\solrtest-TestEmbeddedSolrServer-1351566708026\data\-1.3\index forceNew:false
[junit4:junit4]   2> 2691 T12 oasc.SolrDeletionPolicy.onCommit SolrDeletionPolicy.onCommit: commits:num=1
[junit4:junit4]   2> 		commit{dir=MockDirWrapper(org.apache.lucene.store.RAMDirectory@1d35aa2 lockFactory=org.apache.lucene.store.NativeFSLockFactory@1eb0518),segFN=segments_1,generation=1,filenames=[segments_1]
[junit4:junit4]   2> 2692 T12 oasc.SolrDeletionPolicy.updateCommits newest commit = 1[segments_1]
[junit4:junit4]   2> 2696 T12 oasc.CachingDirectoryFactory.close Releasing directory:C:\Users\JenkinsSlave\workspace\Lucene-Solr-trunk-Windows\solr\build\solr-solrj\test\J0\.\solrtest-TestEmbeddedSolrServer-1351566708026\data\-1.3\index
[junit4:junit4]   2> 3594 T12 oasc.RequestHandlers.initHandlersFromConfig created standard: solr.StandardRequestHandler
[junit4:junit4]   2> 3627 T12 oasc.RequestHandlers.initHandlersFromConfig created /update: solr.UpdateRequestHandler
[junit4:junit4]   2> 3632 T12 oasc.RequestHandlers.initHandlersFromConfig created /admin/: org.apache.solr.handler.admin.AdminHandlers
[junit4:junit4]   2> 3732 T12 oashl.XMLLoader.init xsltCacheLifetimeSeconds=60
[junit4:junit4]   2> 3761 T12 oasc.CachingDirectoryFactory.close Releasing directory:C:\Users\JenkinsSlave\workspace\Lucene-Solr-trunk-Windows\solr\build\solr-solrj\test\J0\.\solrtest-TestEmbeddedSolrServer-1351566708026\data\-1.3
[junit4:junit4]   2> 3809 T12 oass.SolrIndexSearcher.<init> Opening Searcher@1133050 main
[junit4:junit4]   2> 3883 T12 oasu.CommitTracker.<init> Hard AutoCommit: disabled
[junit4:junit4]   2> 3884 T12 oasu.CommitTracker.<init> Soft AutoCommit: disabled
[junit4:junit4]   2> 3981 T12 oashc.HttpShardHandlerFactory.getParameter Setting socketTimeout to: 0
[junit4:junit4]   2> 3982 T12 oashc.HttpShardHandlerFactory.getParameter Setting urlScheme to: http://
[junit4:junit4]   2> 3982 T12 oashc.HttpShardHandlerFactory.getParameter Setting connTimeout to: 0
[junit4:junit4]   2> 3984 T12 oashc.HttpShardHandlerFactory.getParameter Setting maxConnectionsPerHost to: 20
[junit4:junit4]   2> 3985 T12 oashc.HttpShardHandlerFactory.getParameter Setting corePoolSize to: 0
[junit4:junit4]   2> 3985 T12 oashc.HttpShardHandlerFactory.getParameter Setting maximumPoolSize to: 2147483647
[junit4:junit4]   2> 3986 T12 oashc.HttpShardHandlerFactory.getParameter Setting maxThreadIdleTime to: 5
[junit4:junit4]   2> 3987 T12 oashc.HttpShardHandlerFactory.getParameter Setting sizeOfQueue to: -1
[junit4:junit4]   2> 3987 T12 oashc.HttpShardHandlerFactory.getParameter Setting fairnessPolicy to: false
[junit4:junit4]   2> 4020 T12 oascsi.HttpClientUtil.createClient Creating new http client, config:maxConnectionsPerHost=20&maxConnections=10000&socketTimeout=0&connTimeout=0&retry=false
[junit4:junit4]   2> 4524 T12 oasc.CoreContainer.register registering core: collection1
[junit4:junit4]   2> 4524 T16 oasc.SolrCore.registerSearcher [collection1] Registered new searcher Searcher@1133050 main{StandardDirectoryReader(segments_1:1)}
[junit4:junit4]   2> 4533 T12 oasc.CoreContainer.create Creating SolrCore 'core0' using instanceDir: C:\Users\JenkinsSlave\workspace\Lucene-Solr-trunk-Windows\solr\solrj\src\test-files\solrj\solr\shared\.
[junit4:junit4]   2> 4534 T12 oasc.SolrResourceLoader.<init> new SolrResourceLoader for directory: 'C:\Users\JenkinsSlave\workspace\Lucene-Solr-trunk-Windows\solr\solrj\src\test-files\solrj\solr\shared\.\'
[junit4:junit4]   2> 4671 T12 oasc.SolrConfig.<init> Using Lucene MatchVersion: LUCENE_50
[junit4:junit4]   2> 4785 T12 oasc.SolrConfig.<init> Loaded SolrConfig: solrconfig.xml
[junit4:junit4]   2> 4786 T12 oass.IndexSchema.readSchema Reading Solr Schema
[junit4:junit4]   2> 4798 T12 oass.IndexSchema.readSchema Schema name=example core EN
[junit4:junit4]   2> 4933 T12 oass.IndexSchema.readSchema default search field in schema is name
[junit4:junit4]   2> 4938 T12 oass.IndexSchema.readSchema query parser default operator is OR
[junit4:junit4]   2> 4941 T12 oass.IndexSchema.readSchema unique key field: id
[junit4:junit4]   2> 4947 T12 oasc.SolrCore.<init> [core0] Opening new SolrCore at C:\Users\JenkinsSlave\workspace\Lucene-Solr-trunk-Windows\solr\solrj\src\test-files\solrj\solr\shared\.\, dataDir=C:\Users\JenkinsSlave\workspace\Lucene-Solr-trunk-Windows\solr\build\solr-solrj\test\J0\.\solrtest-TestEmbeddedSolrServer-1351566708026/data/EN-3.5\
[junit4:junit4]   2> 4948 T12 oasc.SolrCore.<init> JMX monitoring not detected for core: core0
[junit4:junit4]   2> 4949 T12 oasc.SolrCore.initDirectoryFactory org.apache.solr.core.MockDirectoryFactory
[junit4:junit4]   2> 4950 T12 oasc.CachingDirectoryFactory.injectLockFactory WARNING No lockType configured for MockDirWrapper(org.apache.lucene.store.RAMDirectory@ac7212 lockFactory=org.apache.lucene.store.SingleInstanceLockFactory@1753aa9) assuming 'simple'
[junit4:junit4]   2> 4952 T12 oasc.CachingDirectoryFactory.get return new directory for C:\Users\JenkinsSlave\workspace\Lucene-Solr-trunk-Windows\solr\build\solr-solrj\test\J0\.\solrtest-TestEmbeddedSolrServer-1351566708026\data\EN-3.5 forceNew:false
[junit4:junit4]   2> 4953 T12 oasc.CachingDirectoryFactory.close Releasing directory:C:\Users\JenkinsSlave\workspace\Lucene-Solr-trunk-Windows\solr\build\solr-solrj\test\J0\.\solrtest-TestEmbeddedSolrServer-1351566708026\data\EN-3.5
[junit4:junit4]   2> 4953 T12 oasc.SolrCore.getNewIndexDir New index directory detected: old=null new=C:\Users\JenkinsSlave\workspace\Lucene-Solr-trunk-Windows\solr\build\solr-solrj\test\J0\.\solrtest-TestEmbeddedSolrServer-1351566708026/data/EN-3.5\index/
[junit4:junit4]   2> 4956 T12 oasc.SolrCore.initIndex WARNING [core0] Solr index directory 'C:\Users\JenkinsSlave\workspace\Lucene-Solr-trunk-Windows\solr\build\solr-solrj\test\J0\.\solrtest-TestEmbeddedSolrServer-1351566708026\data\EN-3.5\index' doesn't exist. Creating new index...
[junit4:junit4]   2> 4957 T12 oasc.CachingDirectoryFactory.get return new directory for C:\Users\JenkinsSlave\workspace\Lucene-Solr-trunk-Windows\solr\build\solr-solrj\test\J0\.\solrtest-TestEmbeddedSolrServer-1351566708026\data\EN-3.5\index forceNew:false
[junit4:junit4]   2> 4962 T12 oasc.SolrDeletionPolicy.onCommit SolrDeletionPolicy.onCommit: commits:num=1
[junit4:junit4]   2> 		commit{dir=MockDirWrapper(org.apache.lucene.store.RAMDirectory@a13626 lockFactory=org.apache.lucene.store.NativeFSLockFactory@124bcc6),segFN=segments_1,generation=1,filenames=[segments_1]
[junit4:junit4]   2> 4965 T12 oasc.SolrDeletionPolicy.updateCommits newest commit = 1[segments_1]
[junit4:junit4]   2> 4968 T12 oasc.CachingDirectoryFactory.close Releasing directory:C:\Users\JenkinsSlave\workspace\Lucene-Solr-trunk-Windows\solr\build\solr-solrj\test\J0\.\solrtest-TestEmbeddedSolrServer-1351566708026\data\EN-3.5\index
[junit4:junit4]   2> 4972 T12 oasc.RequestHandlers.initHandlersFromConfig created standard: solr.StandardRequestHandler
[junit4:junit4]   2> 4975 T12 oasc.RequestHandlers.initHandlersFromConfig created /update: solr.UpdateRequestHandler
[junit4:junit4]   2> 4976 T12 oasc.RequestHandlers.initHandlersFromConfig created /admin/: org.apache.solr.handler.admin.AdminHandlers
[junit4:junit4]   2> 4990 T12 oashl.XMLLoader.init xsltCacheLifetimeSeconds=60
[junit4:junit4]   2> 4997 T12 oasc.CachingDirectoryFactory.close Releasing directory:C:\Users\JenkinsSlave\workspace\Lucene-Solr-trunk-Windows\solr\build\solr-solrj\test\J0\.\solrtest-TestEmbeddedSolrServer-1351566708026\data\EN-3.5
[junit4:junit4]   2> 4997 T12 oass.SolrIndexSearcher.<init> Opening Searcher@13f17b0 main
[junit4:junit4]   2> 4998 T12 oasu.CommitTracker.<init> Hard AutoCommit: disabled
[junit4:junit4]   2> 4998 T12 oasu.CommitTracker.<init> Soft AutoCommit: disabled
[junit4:junit4]   2> 5012 T12 oasc.CoreContainer.register registering core: core0
[junit4:junit4]   2> 5016 T12 oasc.CoreContainer.create Creating SolrCore 'core1' using instanceDir: C:\Users\JenkinsSlave\workspace\Lucene-Solr-trunk-Windows\solr\solrj\src\test-files\solrj\solr\shared\.
[junit4:junit4]   2> 5017 T12 oasc.SolrResourceLoader.<init> new SolrResourceLoader for directory: 'C:\Users\JenkinsSlave\workspace\Lucene-Solr-trunk-Windows\solr\solrj\src\test-files\solrj\solr\shared\.\'
[junit4:junit4]   2> 5066 T17 oasc.SolrCore.registerSearcher [core0] Registered new searcher Searcher@13f17b0 main{StandardDirectoryReader(segments_1:1)}
[junit4:junit4]   2> 5101 T12 oasc.SolrConfig.<init> Using Lucene MatchVersion: LUCENE_50
[junit4:junit4]   2> 5177 T12 oasc.SolrConfig.<init> Loaded SolrConfig: solrconfig.xml
[junit4:junit4]   2> 5178 T12 oass.IndexSchema.readSchema Reading Solr Schema
[junit4:junit4]   2> 5186 T12 oass.IndexSchema.readSchema Schema name=example core FR
[junit4:junit4]   2> 5245 T12 oass.IndexSchema.readSchema default search field in schema is name
[junit4:junit4]   2> 5248 T12 oass.IndexSchema.readSchema query parser default operator is OR
[junit4:junit4]   2> 5250 T12 oass.IndexSchema.readSchema unique key field: id
[junit4:junit4]   2> 5253 T12 oasc.SolrCore.<init> [core1] Opening new SolrCore at C:\Users\JenkinsSlave\workspace\Lucene-Solr-trunk-Windows\solr\solrj\src\test-files\solrj\solr\shared\.\, dataDir=C:\Users\JenkinsSlave\workspace\Lucene-Solr-trunk-Windows\solr\build\solr-solrj\test\J0\.\solrtest-TestEmbeddedSolrServer-1351566708026/data/FR-2.4\
[junit4:junit4]   2> 5254 T12 oasc.SolrCore.<init> JMX monitoring not detected for core: core1
[junit4:junit4]   2> 5254 T12 oasc.SolrCore.initDirectoryFactory org.apache.solr.core.MockDirectoryFactory
[junit4:junit4]   2> 5255 T12 oasc.CachingDirectoryFactory.injectLockFactory WARNING No lockType configured for MockDirWrapper(org.apache.lucene.store.RAMDirectory@173bbbe lockFactory=org.apache.lucene.store.SingleInstanceLockFactory@12acc34) assuming 'simple'
[junit4:junit4]   2> 5256 T12 oasc.CachingDirectoryFactory.get return new directory for C:\Users\JenkinsSlave\workspace\Lucene-Solr-trunk-Windows\solr\build\solr-solrj\test\J0\.\solrtest-TestEmbeddedSolrServer-1351566708026\data\FR-2.4 forceNew:false
[junit4:junit4]   2> 5257 T12 oasc.CachingDirectoryFactory.close Releasing directory:C:\Users\JenkinsSlave\workspace\Lucene-Solr-trunk-Windows\solr\build\solr-solrj\test\J0\.\solrtest-TestEmbeddedSolrServer-1351566708026\data\FR-2.4
[junit4:junit4]   2> 5257 T12 oasc.SolrCore.getNewIndexDir New index directory detected: old=null new=C:\Users\JenkinsSlave\workspace\Lucene-Solr-trunk-Windows\solr\build\solr-solrj\test\J0\.\solrtest-TestEmbeddedSolrServer-1351566708026/data/FR-2.4\index/
[junit4:junit4]   2> 5259 T12 oasc.SolrCore.initIndex WARNING [core1] Solr index directory 'C:\Users\JenkinsSlave\workspace\Lucene-Solr-trunk-Windows\solr\build\solr-solrj\test\J0\.\solrtest-TestEmbeddedSolrServer-1351566708026\data\FR-2.4\index' doesn't exist. Creating new index...
[junit4:junit4]   2> 5260 T12 oasc.CachingDirectoryFactory.get return new directory for C:\Users\JenkinsSlave\workspace\Lucene-Solr-trunk-Windows\solr\build\solr-solrj\test\J0\.\solrtest-TestEmbeddedSolrServer-1351566708026\data\FR-2.4\index forceNew:false
[junit4:junit4]   2> 5264 T12 oasc.SolrDeletionPolicy.onCommit SolrDeletionPolicy.onCommit: commits:num=1
[junit4:junit4]   2> 		commit{dir=MockDirWrapper(org.apache.lucene.store.RAMDirectory@22c7d6 lockFactory=org.apache.lucene.store.NativeFSLockFactory@1d201c8),segFN=segments_1,generation=1,filenames=[segments_1]
[junit4:junit4]   2> 5265 T12 oasc.SolrDeletionPolicy.updateCommits newest commit = 1[segments_1]
[junit4:junit4]   2> 5266 T12 oasc.CachingDirectoryFactory.close Releasing directory:C:\Users\JenkinsSlave\workspace\Lucene-Solr-trunk-Windows\solr\build\solr-solrj\test\J0\.\solrtest-TestEmbeddedSolrServer-1351566708026\data\FR-2.4\index
[junit4:junit4]   2> 5269 T12 oasc.RequestHandlers.initHandlersFromConfig created standard: solr.StandardRequestHandler
[junit4:junit4]   2> 5270 T12 oasc.RequestHandlers.initHandlersFromConfig created /update: solr.UpdateRequestHandler
[junit4:junit4]   2> 5271 T12 oasc.RequestHandlers.initHandlersFromConfig created /admin/: org.apache.solr.handler.admin.AdminHandlers
[junit4:junit4]   2> 5286 T12 oashl.XMLLoader.init xsltCacheLifetimeSeconds=60
[junit4:junit4]   2> 5296 T12 oasc.CachingDirectoryFactory.close Releasing directory:C:\Users\JenkinsSlave\workspace\Lucene-Solr-trunk-Windows\solr\build\solr-solrj\test\J0\.\solrtest-TestEmbeddedSolrServer-1351566708026\data\FR-2.4
[junit4:junit4]   2> 5296 T12 oass.SolrIndexSearcher.<init> Opening Searcher@69dbd7 main
[junit4:junit4]   2> 5298 T12 oasu.CommitTracker.<init> Hard AutoCommit: disabled
[junit4:junit4]   2> 5298 T12 oasu.CommitTracker.<init> Soft AutoCommit: disabled
[junit4:junit4]   2> 5309 T12 oasc.CoreContainer.register registering core: core1
[junit4:junit4]   2> 5344 T18 oasc.SolrCore.registerSearcher [core1] Registered new searcher Searcher@69dbd7 main{StandardDirectoryReader(segments_1:1)}
[junit4:junit4]   2> 5377 T12 oasc.CoreContainer.shutdown Shutting down CoreContainer instance=12783446
[junit4:junit4]   2> 5378 T12 oasc.SolrCore.close [collection1]  CLOSING SolrCore org.apache.solr.core.SolrCore@ef1ce5
[junit4:junit4]   2> 5379 T12 oasu.DirectUpdateHandler2.close closing DirectUpdateHandler2{commits=0,autocommits=0,soft autocommits=0,optimizes=0,rollbacks=0,expungeDeletes=0,docsPending=0,adds=0,deletesById=0,deletesByQuery=0,errors=0,cumulative_adds=0,cumulative_deletesById=0,cumulative_deletesByQuery=0,cumulative_errors=0}
[junit4:junit4]   2> 5380 T12 oasc.SolrCore.decrefSolrCoreState Closing SolrCoreState
[junit4:junit4]   2> 5380 T12 oasu.DefaultSolrCoreState.closeIndexWriter SolrCoreState ref count has reached 0 - closing IndexWriter
[junit4:junit4]   2> 5381 T12 oasu.DefaultSolrCoreState.closeIndexWriter closing IndexWriter with IndexWriterCloser
[junit4:junit4]   2> 5388 T12 oasc.SolrCore.closeSearcher [collection1] Closing main searcher on request.
[junit4:junit4]   2> 5389 T12 oasc.CachingDirectoryFactory.close Releasing directory:C:\Users\JenkinsSlave\workspace\Lucene-Solr-trunk-Windows\solr\build\solr-solrj\test\J0\.\solrtest-TestEmbeddedSolrServer-1351566708026\data\-1.3\index
[junit4:junit4]   2> 5390 T12 oasc.SolrCore.close [core0]  CLOSING SolrCore org.apache.solr.core.SolrCore@ea5b70
[junit4:junit4]   2> 5391 T12 oasu.DirectUpdateHandler2.close closing DirectUpdateHandler2{commits=0,autocommits=0,soft autocommits=0,optimizes=0,rollbacks=0,expungeDeletes=0,docsPending=0,adds=0,deletesById=0,deletesByQuery=0,errors=0,cumulative_adds=0,cumulative_deletesById=0,cumulative_deletesByQuery=0,cumulative_errors=0}
[junit4:junit4]   2> 5391 T12 oasc.SolrCore.decrefSolrCoreState Closing SolrCoreState
[junit4:junit4]   2> 5392 T12 oasu.DefaultSolrCoreState.closeIndexWriter SolrCoreState ref count has reached 0 - closing IndexWriter
[junit4:junit4]   2> 5392 T12 oasu.DefaultSolrCoreState.closeIndexWriter closing IndexWriter with IndexWriterCloser
[junit4:junit4]   2> 5393 T12 oasc.SolrCore.closeSearcher [core0] Closing main searcher on request.
[junit4:junit4]   2> 5393 T12 oasc.CachingDirectoryFactory.close Releasing directory:C:\Users\JenkinsSlave\workspace\Lucene-Solr-trunk-Windows\solr\build\solr-solrj\test\J0\.\solrtest-TestEmbeddedSolrServer-1351566708026\data\EN-3.5\index
[junit4:junit4]   2> 5394 T12 oasc.SolrCore.close [core1]  CLOSING SolrCore org.apache.solr.core.SolrCore@c18858
[junit4:junit4]   2> 5394 T12 oasu.DirectUpdateHandler2.close closing DirectUpdateHandler2{commits=0,autocommits=0,soft autocommits=0,optimizes=0,rollbacks=0,expungeDeletes=0,docsPending=0,adds=0,deletesById=0,deletesByQuery=0,errors=0,cumulative_adds=0,cumulative_deletesById=0,cumulative_deletesByQuery=0,cumulative_errors=0}
[junit4:junit4]   2> 5395 T12 oasc.SolrCore.decrefSolrCoreState Closing SolrCoreState
[junit4:junit4]   2> 5395 T12 oasu.DefaultSolrCoreState.closeIndexWriter SolrCoreState ref count has reached 0 - closing IndexWriter
[junit4:junit4]   2> 5395 T12 oasu.DefaultSolrCoreState.closeIndexWriter closing IndexWriter with IndexWriterCloser
[junit4:junit4]   2> 5396 T12 oasc.SolrCore.closeSearcher [core1] Closing main searcher on request.
[junit4:junit4]   2> 5397 T12 oasc.CachingDirectoryFactory.close Releasing directory:C:\Users\JenkinsSlave\workspace\Lucene-Solr-trunk-Windows\solr\build\solr-solrj\test\J0\.\solrtest-TestEmbeddedSolrServer-1351566708026\data\FR-2.4\index
[junit4:junit4]   2> 5401 T12 oasc.CoreContainer.shutdown Shutting down CoreContainer instance=12783446
[junit4:junit4]   2> 5589 T12 oasc.CoreContainer.<init> New CoreContainer 20790165
[junit4:junit4]   2> 5590 T12 oasc.CoreContainer.load Loading CoreContainer using Solr Home: 'C:\Users\JenkinsSlave\workspace\Lucene-Solr-trunk-Windows\solr\solrj\src\test-files\solrj\solr\shared'
[junit4:junit4]   2> 5590 T12 oasc.SolrResourceLoader.<init> new SolrResourceLoader for directory: 'C:\Users\JenkinsSlave\workspace\Lucene-Solr-trunk-Windows\solr\solrj\src\test-files\solrj\solr\shared\'
[junit4:junit4]   2> 5644 T12 oasc.CoreContainer.load Registering Log Listener
[junit4:junit4]   2> 5670 T12 oasc.CoreContainer.create Creating SolrCore 'collection1' using instanceDir: C:\Users\JenkinsSlave\workspace\Lucene-Solr-trunk-Windows\solr\solrj\src\test-files\solrj\solr\shared\.
[junit4:junit4]   2> 5671 T12 oasc.SolrResourceLoader.<init> new SolrResourceLoader for directory: 'C:\Users\JenkinsSlave\workspace\Lucene-Solr-trunk-Windows\solr\solrj\src\test-files\solrj\solr\shared\.\'
[junit4:junit4]   2> 5742 T12 oasc.SolrConfig.<init> Using Lucene MatchVersion: LUCENE_50
[junit4:junit4]   2> 5836 T12 oasc.SolrConfig.<init> Loaded SolrConfig: solrconfig.xml
[junit4:junit4]   2> 5837 T12 oass.IndexSchema.readSchema Reading Solr Schema
[junit4:junit4]   2> 5846 T12 oass.IndexSchema.readSchema Schema name=example core 
[junit4:junit4]   2> 5906 T12 oass.IndexSchema.readSchema default search field in schema is name
[junit4:junit4]   2> 5909 T12 oass.IndexSchema.readSchema query parser default operator is OR
[junit4:junit4]   2> 5911 T12 oass.IndexSchema.readSchema unique key field: id
[junit4:junit4]   2> 5917 T12 oasc.SolrCore.<init> [collection1] Opening new SolrCore at C:\Users\JenkinsSlave\workspace\Lucene-Solr-trunk-Windows\solr\solrj\src\test-files\solrj\solr\shared\.\, dataDir=C:\Users\JenkinsSlave\workspace\Lucene-Solr-trunk-Windows\solr\build\solr-solrj\test\J0\.\solrtest-TestEmbeddedSolrServer-1351566713712/data/-1.3\
[junit4:junit4]   2> 5918 T12 oasc.SolrCore.<init> JMX monitoring not detected for core: collection1
[junit4:junit4]   2> 5919 T12 oasc.SolrCore.initDirectoryFactory org.apache.solr.core.MockDirectoryFactory
[junit4:junit4]   2> 5919 T12 oasc.CachingDirectoryFactory.injectLockFactory WARNING No lockType configured for MockDirWrapper(org.apache.lucene.store.RAMDirectory@d7ef8f lockFactory=org.apache.lucene.store.SingleInstanceLockFactory@b0c7fb) assuming 'simple'
[junit4:junit4]   2> 5919 T12 oasc.CachingDirectoryFactory.get return new directory for C:\Users\JenkinsSlave\workspace\Lucene-Solr-trunk-Windows\solr\build\solr-solrj\test\J0\.\solrtest-TestEmbeddedSolrServer-1351566713712\data\-1.3 forceNew:false
[junit4:junit4]   2> 5921 T12 oasc.CachingDirectoryFactory.close Releasing directory:C:\Users\JenkinsSlave\workspace\Lucene-Solr-trunk-Windows\solr\build\solr-solrj\test\J0\.\solrtest-TestEmbeddedSolrServer-1351566713712\data\-1.3
[junit4:junit4]   2> 5921 T12 oasc.SolrCore.getNewIndexDir New index directory detected: old=null new=C:\Users\JenkinsSlave\workspace\Lucene-Solr-trunk-Windows\solr\build\solr-solrj\test\J0\.\solrtest-TestEmbeddedSolrServer-1351566713712/data/-1.3\index/
[junit4:junit4]   2> 5922 T12 oasc.SolrCore.initIndex WARNING [collection1] Solr index directory 'C:\Users\JenkinsSlave\workspace\Lucene-Solr-trunk-Windows\solr\build\solr-solrj\test\J0\.\solrtest-TestEmbeddedSolrServer-1351566713712\data\-1.3\index' doesn't exist. Creating new index...
[junit4:junit4]   2> 5923 T12 oasc.CachingDirectoryFactory.get return new directory for C:\Users\JenkinsSlave\workspace\Lucene-Solr-trunk-Windows\solr\build\solr-solrj\test\J0\.\solrtest-TestEmbeddedSolrServer-1351566713712\data\-1.3\index forceNew:false
[junit4:junit4]   2> 5928 T12 oasc.SolrDeletionPolicy.onCommit SolrDeletionPolicy.onCommit: commits:num=1
[junit4:junit4]   2> 		commit{dir=MockDirWrapper(org.apache.lucene.store.RAMDirectory@18a8c0 lockFactory=org.apache.lucene.store.NativeFSLockFactory@1b17530),segFN=segments_1,generation=1,filenames=[segments_1]
[junit4:junit4]   2> 5928 T12 oasc.SolrDeletionPolicy.updateCommits newest commit = 1[segments_1]
[junit4:junit4]   2> 5930 T12 oasc.CachingDirectoryFactory.close Releasing directory:C:\Users\JenkinsSlave\workspace\Lucene-Solr-trunk-Windows\solr\build\solr-solrj\test\J0\.\solrtest-TestEmbeddedSolrServer-1351566713712\data\-1.3\index
[junit4:junit4]   2> 5932 T12 oasc.RequestHandlers.initHandlersFromConfig created standard: solr.StandardRequestHandler
[junit4:junit4]   2> 5933 T12 oasc.RequestHandlers.initHandlersFromConfig created /update: solr.UpdateRequestHandler
[junit4:junit4]   2> 5933 T12 oasc.RequestHandlers.initHandlersFromConfig created /admin/: org.apache.solr.handler.admin.AdminHandlers
[junit4:junit4]   2> 5942 T12 oashl.XMLLoader.init xsltCacheLifetimeSeconds=60
[junit4:junit4]   2> 5959 T12 oasc.CachingDirectoryFactory.close Releasing directory:C:\Users\JenkinsSlave\workspace\Lucene-Solr-trunk-Windows\solr\build\solr-solrj\test\J0\.\solrtest-TestEmbeddedSolrServer-1351566713712\data\-1.3
[junit4:junit4]   2> 5960 T12 oass.SolrIndexSearcher.<init> Opening Searcher@184b70e main
[junit4:junit4]   2> 5960 T12 oasu.CommitTracker.<init> Hard AutoCommit: disabled
[junit4:junit4]   2> 5969 T12 oasu.CommitTracker.<init> Soft AutoCommit: disabled
[junit4:junit4]   2> 5969 T12 oashc.HttpShardHandlerFactory.getParameter Setting socketTimeout to: 0
[junit4:junit4]   2> 5970 T12 oashc.HttpShardHandlerFactory.getParameter Setting urlScheme to: http://
[junit4:junit4]   2> 5970 T12 oashc.HttpShardHandlerFactory.getParameter Setting connTimeout to: 0
[junit4:junit4]   2> 5970 T12 oashc.HttpShardHandlerFactory.getParameter Setting maxConnectionsPerHost to: 20
[junit4:junit4]   2> 5971 T12 oashc.HttpShardHandlerFactory.getParameter Setting corePoolSize to: 0
[junit4:junit4]   2> 5971 T12 oashc.HttpShardHandlerFactory.getParameter Setting maximumPoolSize to: 2147483647
[junit4:junit4]   2> 5972 T12 oashc.HttpShardHandlerFactory.getParameter Setting maxThreadIdleTime to: 5
[junit4:junit4]   2> 5972 T12 oashc.HttpShardHandlerFactory.getParameter Setting sizeOfQueue to: -1
[junit4:junit4]   2> 5973 T12 oashc.HttpShardHandlerFactory.getParameter Setting fairnessPolicy to: false
[junit4:junit4]   2> 5973 T12 oascsi.HttpClientUtil.createClient Creating new http client, config:maxConnectionsPerHost=20&maxConnections=10000&socketTimeout=0&connTimeout=0&retry=false
[junit4:junit4]   2> 5990 T19 oasc.SolrCore.registerSearcher [collection1] Registered new searcher Searcher@184b70e main{StandardDirectoryReader(segments_1:1)}
[junit4:junit4]   2> 5989 T12 oasc.CoreContainer.register registering core: collection1
[junit4:junit4]   2> 5991 T12 oasc.CoreContainer.create Creating SolrCore 'core0' using instanceDir: C:\Users\JenkinsSlave\workspace\Lucene-Solr-trunk-Windows\solr\solrj\src\test-files\solrj\solr\shared\.
[junit4:junit4]   2> 5992 T12 oasc.SolrResourceLoader.<init> new SolrResourceLoader for directory: 'C:\Users\JenkinsSlave\workspace\Lucene-Solr-trunk-Windows\solr\solrj\src\test-files\solrj\solr\shared\.\'
[junit4:junit4]   2> 6063 T12 oasc.SolrConfig.<init> Using Lucene MatchVersion: LUCENE_50
[junit4:junit4]   2> 6141 T12 oasc.SolrConfig.<init> Loaded SolrConfig: solrconfig.xml
[junit4:junit4]   2> 6142 T12 oass.IndexSchema.readSchema Reading Solr Schema
[junit4:junit4]   2> 6151 T12 oass.IndexSchema.readSchema Schema name=example core EN
[junit4:junit4]   2> 6210 T12 oass.IndexSchema.readSchema default search field in schema is name
[junit4:junit4]   2> 6212 T12 oass.IndexSchema.readSchema query parser default operator is OR
[junit4:junit4]   2> 6214 T12 oass.IndexSchema.readSchema unique key field: id
[junit4:junit4]   2> 6219 T12 oasc.SolrCore.<init> [core0] Opening new SolrCore at C:\Users\JenkinsSlave\workspace\Lucene-Solr-trunk-Windows\solr\solrj\src\test-files\solrj\solr\shared\.\, dataDir=C:\Users\JenkinsSlave\workspace\Lucene-Solr-trunk-Windows\solr\build\solr-solrj\test\J0\.\solrtest-TestEmbeddedSolrServer-1351566713712/data/EN-3.5\
[junit4:junit4]   2> 6219 T12 oasc.SolrCore.<init> JMX monitoring not detected for core: core0
[junit4:junit4]   2> 6220 T12 oasc.SolrCore.initDirectoryFactory org.apache.solr.core.MockDirectoryFactory
[junit4:junit4]   2> 6220 T12 oasc.CachingDirectoryFactory.injectLockFactory WARNING No lockType configured for BaseDirectoryWrapper(org.apache.lucene.store.RAMDirectory@11ee57f lockFactory=org.apache.lucene.store.SingleInstanceLockFactory@16d02c2) assuming 'simple'
[junit4:junit4]   2> 6221 T12 oasc.CachingDirectoryFactory.get return new directory for C:\Users\JenkinsSlave\workspace\Lucene-Solr-trunk-Windows\solr\build\solr-solrj\test\J0\.\solrtest-TestEmbeddedSolrServer-1351566713712\data\EN-3.5 forceNew:false
[junit4:junit4]   2> 6221 T12 oasc.CachingDirectoryFactory.close Releasing directory:C:\Users\JenkinsSlave\workspace\Lucene-Solr-trunk-Windows\solr\build\solr-solrj\test\J0\.\solrtest-TestEmbeddedSolrServer-1351566713712\data\EN-3.5
[junit4:junit4]   2> 6222 T12 oasc.SolrCore.getNewIndexDir New index directory detected: old=null new=C:\Users\JenkinsSlave\workspace\Lucene-Solr-trunk-Windows\solr\build\solr-solrj\test\J0\.\solrtest-TestEmbeddedSolrServer-1351566713712/data/EN-3.5\index/
[junit4:junit4]   2> 6223 T12 oasc.SolrCore.initIndex WARNING [core0] Solr index directory 'C:\Users\JenkinsSlave\workspace\Lucene-Solr-trunk-Windows\solr\build\solr-solrj\test\J0\.\solrtest-TestEmbeddedSolrServer-1351566713712\data\EN-3.5\index' doesn't exist. Creating new index...
[junit4:junit4]   2> 6224 T12 oasc.CachingDirectoryFactory.get return new directory for C:\Users\JenkinsSlave\workspace\Lucene-Solr-trunk-Windows\solr\build\solr-solrj\test\J0\.\solrtest-TestEmbeddedSolrServer-1351566713712\data\EN-3.5\index forceNew:false
[junit4:junit4]   2> 6226 T12 oasc.SolrDeletionPolicy.onCommit SolrDeletionPolicy.onCommit: commits:num=1
[junit4:junit4]   2> 		commit{dir=MockDirWrapper(org.apache.lucene.store.RAMDirectory@10ef717 lockFactory=org.apache.lucene.store.NativeFSLockFactory@7ba739),segFN=segments_1,generation=1,filenames=[segments_1]
[junit4:junit4]   2> 6227 T12 oasc.SolrDeletionPolicy.updateCommits newest commit = 1[segments_1]
[junit4:junit4]   2> 6228 T12 oasc.CachingDirectoryFactory.close Releasing directory:C:\Users\JenkinsSlave\workspace\Lucene-Solr-trunk-Windows\solr\build\solr-solrj\test\J0\.\solrtest-TestEmbeddedSolrServer-1351566713712\data\EN-3.5\index
[junit4:junit4]   2> 6230 T12 oasc.RequestHandlers.initHandlersFromConfig created standard: solr.StandardRequestHandler
[junit4:junit4]   2> 6232 T12 oasc.RequestHandlers.initHandlersFromConfig created /update: solr.UpdateRequestHandler
[junit4:junit4]   2> 6232 T12 oasc.RequestHandlers.initHandlersFromConfig created /admin/: org.apache.solr.handler.admin.AdminHandlers
[junit4:junit4]   2> 6242 T12 oashl.XMLLoader.init xsltCacheLifetimeSeconds=60
[junit4:junit4]   2> 6248 T12 oasc.CachingDirectoryFactory.close Releasing directory:C:\Users\JenkinsSlave\workspace\Lucene-Solr-trunk-Windows\solr\build\solr-solrj\test\J0\.\solrtest-TestEmbeddedSolrServer-1351566713712\data\EN-3.5
[junit4:junit4]   2> 6250 T12 oass.SolrIndexSearcher.<init> Opening Searcher@1cb8429 main
[junit4:junit4]   2> 6250 T12 oasu.CommitTracker.<init> Hard AutoCommit: disabled
[junit4:junit4]   2> 6250 T12 oasu.CommitTracker.<init> Soft AutoCommit: disabled
[junit4:junit4]   2> 6259 T20 oasc.SolrCore.registerSearcher [core0] Registered new searcher Searcher@1cb8429 main{StandardDirectoryReader(segments_1:1)}
[junit4:junit4]   2> 6259 T12 oasc.CoreContainer.register registering core: core0
[junit4:junit4]   2> 6261 T12 oasc.CoreContainer.create Creating SolrCore 'core1' using instanceDir: C:\Users\JenkinsSlave\workspace\Lucene-Solr-trunk-Windows\solr\solrj\src\test-files\solrj\solr\shared\.
[junit4:junit4]   2> 6261 T12 oasc.SolrResourceLoader.<init> new SolrResourceLoader for directory: 'C:\Users\JenkinsSlave\workspace\Lucene-Solr-trunk-Windows\solr\solrj\src\test-files\solrj\solr\shared\.\'
[junit4:junit4]   2> 6351 T12 oasc.SolrConfig.<init> Using Lucene MatchVersion: LUCENE_50
[junit4:junit4]   2> 6424 T12 oasc.SolrConfig.<init> Loaded SolrConfig: solrconfig.xml
[junit4:junit4]   2> 6424 T12 oass.IndexSchema.readSchema Reading Solr Schema
[junit4:junit4]   2> 6433 T12 oass.IndexSchema.readSchema Schema name=example core FR
[junit4:junit4]   2> 6472 T12 oass.IndexSchema.readSchema default search field in schema is name
[junit4:junit4]   2> 6473 T12 oass.IndexSchema.readSchema query parser default operator is OR
[junit4:junit4]   2> 6475 T12 oass.IndexSchema.readSchema unique key field: id
[junit4:junit4]   2> 6477 T12 oasc.SolrCore.<init> [core1] Opening new SolrCore at C:\Users\JenkinsSlave\workspace\Lucene-Solr-trunk-Windows\solr\solrj\src\test-files\solrj\solr\shared\.\, dataDir=C:\Users\JenkinsSlave\workspace\Lucene-Solr-trunk-Windows\solr\build\solr-solrj\test\J0\.\solrtest-TestEmbeddedSolrServer-1351566713712/data/FR-2.4\
[junit4:junit4]   2> 6477 T12 oasc.SolrCore.<init> JMX monitoring not detected for core: core1
[junit4:junit4]   2> 6478 T12 oasc.SolrCore.initDirectoryFactory org.apache.solr.core.MockDirectoryFactory
[junit4:junit4]   2> 6478 T12 oasc.CachingDirectoryFactory.injectLockFactory WARNING No lockType configured for BaseDirectoryWrapper(org.apache.lucene.store.RAMDirectory@119847 lockFactory=org.apache.lucene.store.SingleInstanceLockFactory@12499df) assuming 'simple'
[junit4:junit4]   2> 6478 T12 oasc.CachingDirectoryFactory.get return new directory for C:\Users\JenkinsSlave\workspace\Lucene-Solr-trunk-Windows\solr\build\solr-solrj\test\J0\.\solrtest-TestEmbeddedSolrServer-1351566713712\data\FR-2.4 forceNew:false
[junit4:junit4]   2> 6479 T12 oasc.CachingDirectoryFactory.close Releasing directory:C:\Users\JenkinsSlave\workspace\Lucene-Solr-trunk-Windows\solr\build\solr-solrj\test\J0\.\solrtest-TestEmbeddedSolrServer-1351566713712\data\FR-2.4
[junit4:junit4]   2> 6480 T12 oasc.SolrCore.getNewIndexDir New index directory detected: old=null new=C:\Users\JenkinsSlave\workspace\Lucene-Solr-trunk-Windows\solr\build\solr-solrj\test\J0\.\solrtest-TestEmbeddedSolrServer-1351566713712/data/FR-2.4\index/
[junit4:junit4]   2> 6480 T12 oasc.SolrCore.initIndex WARNING [core1] Solr index directory 'C:\Users\JenkinsSlave\workspace\Lucene-Solr-trunk-Windows\solr\build\solr-solrj\test\J0\.\solrtest-TestEmbeddedSolrServer-1351566713712\data\FR-2.4\index' doesn't exist. Creating new index...
[junit4:junit4]   2> 6481 T12 oasc.CachingDirectoryFactory.get return new directory for C:\Users\JenkinsSlave\workspace\Lucene-Solr-trunk-Windows\solr\build\solr-solrj\test\J0\.\solrtest-TestEmbeddedSolrServer-1351566713712\data\FR-2.4\index forceNew:false
[junit4:junit4]   2> 6485 T12 oasc.SolrDeletionPolicy.onCommit SolrDeletionPolicy.onCommit: commits:num=1
[junit4:junit4]   2> 		commit{dir=MockDirWrapper(org.apache.lucene.store.RAMDirectory@6048c0 lockFactory=org.apache.lucene.store.NativeFSLockFactory@ef9969),segFN=segments_1,generation=1,filenames=[segments_1]
[junit4:junit4]   2> 6485 T12 oasc.SolrDeletionPolicy.updateCommits newest commit = 1[segments_1]
[junit4:junit4]   2> 6487 T12 oasc.CachingDirectoryFactory.close Releasing directory:C:\Users\JenkinsSlave\workspace\Lucene-Solr-trunk-Windows\solr\build\solr-solrj\test\J0\.\solrtest-TestEmbeddedSolrServer-1351566713712\data\FR-2.4\index
[junit4:junit4]   2> 6499 T12 oasc.RequestHandlers.initHandlersFromConfig created standard: solr.StandardRequestHandler
[junit4:junit4]   2> 6501 T12 oasc.RequestHandlers.initHandlersFromConfig created /update: solr.UpdateRequestHandler
[junit4:junit4]   2> 6501 T12 oasc.RequestHandlers.initHandlersFromConfig created /admin/: org.apache.solr.handler.admin.AdminHandlers
[junit4:junit4]   2> 6512 T12 oashl.XMLLoader.init xsltCacheLifetimeSeconds=60
[junit4:junit4]   2> 6519 T12 oasc.CachingDirectoryFactory.close Releasing directory:C:\Users\JenkinsSlave\workspace\Lucene-Solr-trunk-Windows\solr\build\solr-solrj\test\J0\.\solrtest-TestEmbeddedSolrServer-1351566713712\data\FR-2.4
[junit4:junit4]   2> 6519 T12 oass.SolrIndexSearcher.<init> Opening Searcher@2d26d5 main
[junit4:junit4]   2> 6520 T12 oasu.CommitTracker.<init> Hard AutoCommit: disabled
[junit4:junit4]   2> 6520 T12 oasu.CommitTracker.<init> Soft AutoCommit: disabled
[junit4:junit4]   2> 6528 T21 oasc.SolrCore.registerSearcher [core1] Registered new searcher Searcher@2d26d5 main{StandardDirectoryReader(segments_1:1)}
[junit4:junit4]   2> 6528 T12 oasc.CoreContainer.register registering core: core1
[junit4:junit4]   2> 6529 T12 oasc.CoreContainer.shutdown Shutting down CoreContainer instance=20790165
[junit4:junit4]   2> 6529 T12 oasc.SolrCore.close [collection1]  CLOSING SolrCore org.apache.solr.core.SolrCore@1f0279
[junit4:junit4]   2> 6530 T12 oasu.DirectUpdateHandler2.close closing DirectUpdateHandler2{commits=0,autocommits=0,soft autocommits=0,optimizes=0,rollbacks=0,expungeDeletes=0,docsPending=0,adds=0,deletesById=0,deletesByQuery=0,errors=0,cumulative_adds=0,cumulative_deletesById=0,cumulative_deletesByQuery=0,cumulative_errors=0}
[junit4:junit4]   2> 6530 T12 oasc.SolrCore.decrefSolrCoreState Closing SolrCoreState
[junit4:junit4]   2> 6531 T12 oasu.DefaultSolrCoreState.closeIndexWriter SolrCoreState ref count has reached 0 - closing IndexWriter
[junit4:junit4]   2> 6531 T12 oasu.DefaultSolrCoreState.closeIndexWriter closing IndexWriter with IndexWriterCloser
[junit4:junit4]   2> 6532 T12 oasc.SolrCore.closeSearcher [collection1] Closing main searcher on request.
[junit4:junit4]   2> 6532 T12 oasc.CachingDirectoryFactory.close Releasing directory:C:\Users\JenkinsSlave\workspace\Lucene-Solr-trunk-Windows\solr\build\solr-solrj\test\J0\.\solrtest-TestEmbeddedSolrServer-1351566713712\data\-1.3\index
[junit4:junit4]   2> 6533 T12 oasc.SolrCore.close [core0]  CLOSING SolrCore org.apache.solr.core.SolrCore@11bd2a0
[junit4:junit4]   2> 6533 T12 oasu.DirectUpdateHandler2.close closing DirectUpdateHandler2{commits=0,autocommits=0,soft autocommits=0,optimizes=0,rollbacks=0,expungeDeletes=0,docsPending=0,adds=0,deletesById=0,deletesByQuery=0,errors=0,cumulative_adds=0,cumulative_deletesById=0,cumulative_deletesByQuery=0,cumulative_errors=0}
[junit4:junit4]   2> 6533 T12 oasc.SolrCore.decrefSolrCoreState Closing SolrCoreState
[junit4:junit4]   2> 6533 T12 oasu.DefaultSolrCoreState.closeIndexWriter SolrCoreState ref count has reached 0 - closing IndexWriter
[junit4:junit4]   2> 6534 T12 oasu.DefaultSolrCoreState.closeIndexWriter closing IndexWriter with IndexWriterCloser
[junit4:junit4]   2> 6536 T12 oasc.SolrCore.closeSearcher [core0] Closing main searcher on request.
[junit4:junit4]   2> 6536 T12 oasc.CachingDirectoryFactory.close Releasing directory:C:\Users\JenkinsSlave\workspace\Lucene-Solr-trunk-Windows\solr\build\solr-solrj\test\J0\.\solrtest-TestEmbeddedSolrServer-1351566713712\data\EN-3.5\index
[junit4:junit4]   2> 6537 T12 oasc.SolrCore.close [core1]  CLOSING SolrCore org.apache.solr.core.SolrCore@b8bab0
[junit4:junit4]   2> 6537 T12 oasu.DirectUpdateHandler2.close closing DirectUpdateHandler2{commits=0,autocommits=0,soft autocommits=0,optimizes=0,rollbacks=0,expungeDeletes=0,docsPending=0,adds=0,deletesById=0,deletesByQuery=0,errors=0,cumulative_adds=0,cumulative_deletesById=0,cumulative_deletesByQuery=0,cumulative_errors=0}
[junit4:junit4]   2> 6537 T12 oasc.SolrCore.decrefSolrCoreState Closing SolrCoreState
[junit4:junit4]   2> 6537 T12 oasu.DefaultSolrCoreState.closeIndexWriter SolrCoreState ref count has reached 0 - closing IndexWriter
[junit4:junit4]   2> 6538 T12 oasu.DefaultSolrCoreState.closeIndexWriter closing IndexWriter with IndexWriterCloser
[junit4:junit4]   2> 6539 T12 oasc.SolrCore.closeSearcher [core1] Closing main searcher on request.
[junit4:junit4]   2> 6539 T12 oasc.CachingDirectoryFactory.close Releasing directory:C:\Users\JenkinsSlave\workspace\Lucene-Solr-trunk-Windows\solr\build\solr-solrj\test\J0\.\solrtest-TestEmbeddedSolrServer-1351566713712\data\FR-2.4\index
[junit4:junit4]   2> 6571 T11 ccr.ThreadLeakControl.checkThreadLeaks WARNING Will linger awaiting termination of 2 leaked thread(s).
[junit4:junit4]   2> 26684 T11 ccr.ThreadLeakControl.checkThreadLeaks SEVERE 2 threads leaked from SUITE scope at org.apache.solr.client.solrj.embedded.TestEmbeddedSolrServer: 
[junit4:junit4]   2> 	   1) Thread[id=14, name=metrics-meter-tick-thread-1, state=TIMED_WAITING, group=TGRP-TestEmbeddedSolrServer]
[junit4:junit4]   2> 	        at sun.misc.Unsafe.park(Native Method)
[junit4:junit4]   2> 	        at java.util.concurrent.locks.LockSupport.parkNanos(LockSupport.java:226)
[junit4:junit4]   2> 	        at java.util.concurrent.locks.AbstractQueuedSynchronizer$ConditionObject.awaitNanos(AbstractQueuedSynchronizer.java:2082)
[junit4:junit4]   2> 	        at java.util.concurrent.ScheduledThreadPoolExecutor$DelayedWorkQueue.take(ScheduledThreadPoolExecutor.java:1090)
[junit4:junit4]   2> 	        at java.util.concurrent.ScheduledThreadPoolExecutor$DelayedWorkQueue.take(ScheduledThreadPoolExecutor.java:807)
[junit4:junit4]   2> 	        at java.util.concurrent.ThreadPoolExecutor.getTask(ThreadPoolExecutor.java:1043)
[junit4:junit4]   2> 	        at java.util.concurrent.ThreadPoolExecutor.runWorker(ThreadPoolExecutor.java:1103)
[junit4:junit4]   2> 	        at java.util.concurrent.ThreadPoolExecutor$Worker.run(ThreadPoolExecutor.java:603)
[junit4:junit4]   2> 	        at java.lang.Thread.run(Thread.java:722)
[junit4:junit4]   2> 	   2) Thread[id=15, name=metrics-meter-tick-thread-2, state=WAITING, group=TGRP-TestEmbeddedSolrServer]
[junit4:junit4]   2> 	        at sun.misc.Unsafe.park(Native Method)
[junit4:junit4]   2> 	        at java.util.concurrent.locks.LockSupport.park(LockSupport.java:186)
[junit4:junit4]   2> 	        at java.util.concurrent.locks.AbstractQueuedSynchronizer$ConditionObject.await(AbstractQueuedSynchronizer.java:2043)
[junit4:junit4]   2> 	        at java.util.concurrent.ScheduledThreadPoolExecutor$DelayedWorkQueue.take(ScheduledThreadPoolExecutor.java:1085)
[junit4:junit4]   2> 	        at java.util.concurrent.ScheduledThreadPoolExecutor$DelayedWorkQueue.take(ScheduledThreadPoolExecutor.java:807)
[junit4:junit4]   2> 	        at java.util.concurrent.ThreadPoolExecutor.getTask(ThreadPoolExecutor.java:1043)
[junit4:junit4]   2> 	        at java.util.concurrent.ThreadPoolExecutor.runWorker(ThreadPoolExecutor.java:1103)
[junit4:junit4]   2> 	        at java.util.concurrent.ThreadPoolExecutor$Worker.run(ThreadPoolExecutor.java:603)
[junit4:junit4]   2> 	        at java.lang.Thread.run(Thread.java:722)
[junit4:junit4]   2> 26685 T11 ccr.ThreadLeakControl.tryToInterruptAll Starting to interrupt leaked threads:
[junit4:junit4]   2> 	   1) Thread[id=14, name=metrics-meter-tick-thread-1, state=TIMED_WAITING, group=TGRP-TestEmbeddedSolrServer]
[junit4:junit4]   2> 	   2) Thread[id=15, name=metrics-meter-tick-thread-2, state=WAITING, group=TGRP-TestEmbeddedSolrServer]
[junit4:junit4]   2> 29699 T11 ccr.ThreadLeakControl.tryToInterruptAll SEVERE There are still zombie threads that couldn't be terminated:
[junit4:junit4]   2> 	   1) Thread[id=14, name=metrics-meter-tick-thread-1, state=TIMED_WAITING, group=TGRP-TestEmbeddedSolrServer]
[junit4:junit4]   2> 	        at sun.misc.Unsafe.park(Native Method)
[junit4:junit4]   2> 	        at java.util.concurrent.locks.LockSupport.parkNanos(LockSupport.java:226)
[junit4:junit4]   2> 	        at java.util.concurrent.locks.AbstractQueuedSynchronizer$ConditionObject.awaitNanos(AbstractQueuedSynchronizer.java:2082)
[junit4:junit4]   2> 	        at java.util.concurrent.ScheduledThreadPoolExecutor$DelayedWorkQueue.take(ScheduledThreadPoolExecutor.java:1090)
[junit4:junit4]   2> 	        at java.util.concurrent.ScheduledThreadPoolExecutor$DelayedWorkQueue.take(ScheduledThreadPoolExecutor.java:807)
[junit4:junit4]   2> 	        at java.util.concurrent.ThreadPoolExecutor.getTask(ThreadPoolExecutor.java:1043)
[junit4:junit4]   2> 	        at java.util.concurrent.ThreadPoolExecutor.runWorker(ThreadPoolExecutor.java:1103)
[junit4:junit4]   2> 	        at java.util.concurrent.ThreadPoolExecutor$Worker.run(ThreadPoolExecutor.java:603)
[junit4:junit4]   2> 	        at java.lang.Thread.run(Thread.java:722)
[junit4:junit4]   2> 	   2) Thread[id=15, name=metrics-meter-tick-thread-2, state=WAITING, group=TGRP-TestEmbeddedSolrServer]
[junit4:junit4]   2> 	        at sun.misc.Unsafe.park(Native Method)
[junit4:junit4]   2> 	        at java.util.concurrent.locks.LockSupport.park(LockSupport.java:186)
[junit4:junit4]   2> 	        at java.util.concurrent.locks.AbstractQueuedSynchronizer$ConditionObject.await(AbstractQueuedSynchronizer.java:2043)
[junit4:junit4]   2> 	        at java.util.concurrent.ScheduledThreadPoolExecutor$DelayedWorkQueue.take(ScheduledThreadPoolExecutor.java:1085)
[junit4:junit4]   2> 	        at java.util.concurrent.ScheduledThreadPoolExecutor$DelayedWorkQueue.take(ScheduledThreadPoolExecutor.java:807)
[junit4:junit4]   2> 	        at java.util.concurrent.ThreadPoolExecutor.getTask(ThreadPoolExecutor.java:1043)
[junit4:junit4]   2> 	        at java.util.concurrent.ThreadPoolExecutor.runWorker(ThreadPoolExecutor.java:1103)
[junit4:junit4]   2> 	        at java.util.concurrent.ThreadPoolExecutor$Worker.run(ThreadPoolExecutor.java:603)
[junit4:junit4]   2> 	        at java.lang.Thread.run(Thread.java:722)
[junit4:junit4]   2> NOTE: test params are: codec=Lucene41: {}, sim=DefaultSimilarity, locale=es_PA, timezone=CNT
[junit4:junit4]   2> NOTE: Windows 7 6.1 x86/Oracle Corporation 1.7.0_07 (32-bit)/cpus=2,threads=3,free=20315968,total=33554432
[junit4:junit4]   2> NOTE: All tests run in this JVM: [TestEmbeddedSolrServer]
[junit4:junit4]   2> NOTE: reproduce with: ant test  -Dtestcase=TestEmbeddedSolrServer -Dtests.seed=A0A278763AEF4D11 -Dtests.slow=true -Dtests.locale=es_PA -Dtests.timezone=CNT -Dtests.file.encoding=Cp1252
[junit4:junit4] ERROR   0.00s | TestEmbeddedSolrServer (suite) <<<
[junit4:junit4]    > Throwable #1: com.carrotsearch.randomizedtesting.ThreadLeakError: 2 threads leaked from SUITE scope at org.apache.solr.client.solrj.embedded.TestEmbeddedSolrServer: 
[junit4:junit4]    >    1) Thread[id=14, name=metrics-meter-tick-thread-1, state=TIMED_WAITING, group=TGRP-TestEmbeddedSolrServer]
[junit4:junit4]    >         at sun.misc.Unsafe.park(Native Method)
[junit4:junit4]    >         at java.util.concurrent.locks.LockSupport.parkNanos(LockSupport.java:226)
[junit4:junit4]    >         at java.util.concurrent.locks.AbstractQueuedSynchronizer$ConditionObject.awaitNanos(AbstractQueuedSynchronizer.java:2082)
[junit4:junit4]    >         at java.util.concurrent.ScheduledThreadPoolExecutor$DelayedWorkQueue.take(ScheduledThreadPoolExecutor.java:1090)
[junit4:junit4]    >         at java.util.concurrent.ScheduledThreadPoolExecutor$DelayedWorkQueue.take(ScheduledThreadPoolExecutor.java:807)
[junit4:junit4]    >         at java.util.concurrent.ThreadPoolExecutor.getTask(ThreadPoolExecutor.java:1043)
[junit4:junit4]    >         at java.util.concurrent.ThreadPoolExecutor.runWorker(ThreadPoolExecutor.java:1103)
[junit4:junit4]    >         at java.util.concurrent.ThreadPoolExecutor$Worker.run(ThreadPoolExecutor.java:603)
[junit4:junit4]    >         at java.lang.Thread.run(Thread.java:722)
[junit4:junit4]    >    2) Thread[id=15, name=metrics-meter-tick-thread-2, state=WAITING, group=TGRP-TestEmbeddedSolrServer]
[junit4:junit4]    >         at sun.misc.Unsafe.park(Native Method)
[junit4:junit4]    >         at java.util.concurrent.locks.LockSupport.park(LockSupport.java:186)
[junit4:junit4]    >         at java.util.concurrent.locks.AbstractQueuedSynchronizer$ConditionObject.await(AbstractQueuedSynchronizer.java:2043)
[junit4:junit4]    >         at java.util.concurrent.ScheduledThreadPoolExecutor$DelayedWorkQueue.take(ScheduledThreadPoolExecutor.java:1085)
[junit4:junit4]    >         at java.util.concurrent.ScheduledThreadPoolExecutor$DelayedWorkQueue.take(ScheduledThreadPoolExecutor.java:807)
[junit4:junit4]    >         at java.util.concurrent.ThreadPoolExecutor.getTask(ThreadPoolExecutor.java:1043)
[junit4:junit4]    >         at java.util.concurrent.ThreadPoolExecutor.runWorker(ThreadPoolExecutor.java:1103)
[junit4:junit4]    >         at java.util.concurrent.ThreadPoolExecutor$Worker.run(ThreadPoolExecutor.java:603)
[junit4:junit4]    >         at java.lang.Thread.run(Thread.java:722)
[junit4:junit4]    > 	at __randomizedtesting.SeedInfo.seed([A0A278763AEF4D11]:0)
[junit4:junit4]    > Throwable #2: com.carrotsearch.randomizedtesting.ThreadLeakError: There are still zombie threads that couldn't be terminated:
[junit4:junit4]    >    1) Thread[id=14, name=metrics-meter-tick-thread-1, state=TIMED_WAITING, group=TGRP-TestEmbeddedSolrServer]
[junit4:junit4]    >         at sun.misc.Unsafe.park(Native Method)
[junit4:junit4]    >         at java.util.concurrent.locks.LockSupport.parkNanos(LockSupport.java:226)
[junit4:junit4]    >         at java.util.concurrent.locks.AbstractQueuedSynchronizer$ConditionObject.awaitNanos(AbstractQueuedSynchronizer.java:2082)
[junit4:junit4]    >         at java.util.concurrent.ScheduledThreadPoolExecutor$DelayedWorkQueue.take(ScheduledThreadPoolExecutor.java:1090)
[junit4:junit4]    >         at java.util.concurrent.ScheduledThreadPoolExecutor$DelayedWorkQueue.take(ScheduledThreadPoolExecutor.java:807)
[junit4:junit4]    >         at java.util.concurrent.ThreadPoolExecutor.getTask(ThreadPoolExecutor.java:1043)
[junit4:junit4]    >         at java.util.concurrent.ThreadPoolExecutor.runWorker(ThreadPoolExecutor.java:1103)
[junit4:junit4]    >         at java.util.concurrent.ThreadPoolExecutor$Worker.run(ThreadPoolExecutor.java:603)
[junit4:junit4]    >         at java.lang.Thread.run(Thread.java:722)
[junit4:junit4]    >    2) Thread[id=15, name=metrics-meter-tick-thread-2, state=WAITING, group=TGRP-TestEmbeddedSolrServer]
[junit4:junit4]    >         at sun.misc.Unsafe.park(Native Method)
[junit4:junit4]    >         at java.util.concurrent.locks.LockSupport.park(LockSupport.java:186)
[junit4:junit4]    >         at java.util.concurrent.locks.AbstractQueuedSynchronizer$ConditionObject.await(AbstractQueuedSynchronizer.java:2043)
[junit4:junit4]    >         at java.util.concurrent.ScheduledThreadPoolExecutor$DelayedWorkQueue.take(ScheduledThreadPoolExecutor.java:1085)
[junit4:junit4]    >         at java.util.concurrent.ScheduledThreadPoolExecutor$DelayedWorkQueue.take(ScheduledThreadPoolExecutor.java:807)
[junit4:junit4]    >         at java.util.concurrent.ThreadPoolExecutor.getTask(ThreadPoolExecutor.java:1043)
[junit4:junit4]    >         at java.util.concurrent.ThreadPoolExecutor.runWorker(ThreadPoolExecutor.java:1103)
[junit4:junit4]    >         at java.util.concurrent.ThreadPoolExecutor$Worker.run(ThreadPoolExecutor.java:603)
[junit4:junit4]    >         at java.lang.Thread.run(Thread.java:722)
[junit4:junit4]    > 	at __randomizedtesting.SeedInfo.seed([A0A278763AEF4D11]:0)
[junit4:junit4] Completed in 31.15s, 2 tests, 2 errors <<< FAILURES!

[...truncated 135 lines...]
BUILD FAILED
C:\Users\JenkinsSlave\workspace\Lucene-Solr-trunk-Windows\build.xml:335: The following error occurred while executing this line:
C:\Users\JenkinsSlave\workspace\Lucene-Solr-trunk-Windows\build.xml:39: The following error occurred while executing this line:
C:\Users\JenkinsSlave\workspace\Lucene-Solr-trunk-Windows\solr\build.xml:185: The following error occurred while executing this line:
C:\Users\JenkinsSlave\workspace\Lucene-Solr-trunk-Windows\lucene\module-build.xml:61: The following error occurred while executing this line:
C:\Users\JenkinsSlave\workspace\Lucene-Solr-trunk-Windows\lucene\common-build.xml:1159: The following error occurred while executing this line:
C:\Users\JenkinsSlave\workspace\Lucene-Solr-trunk-Windows\lucene\common-build.xml:827: There were test failures: 43 suites, 239 tests, 2 suite-level errors, 234 ignored

Total time: 40 minutes 0 seconds
Build step 'Invoke Ant' marked build as failure
Archiving artifacts
Recording test results
Description set: Java: 32bit/jdk1.7.0_07 -server -XX:+UseG1GC
Email was triggered for: Failure
Sending email for trigger: Failure



Mime
View raw message