lucene-dev mailing list archives

Site index · List index
Message view « Date » · « Thread »
Top « Date » · « Thread »
From Charlie Cron <hudsonsevilt...@gmail.com>
Subject Build failed in Jenkins: fast-io-beasting #6278
Date Mon, 29 Oct 2012 21:23:00 GMT
See <http://sierranevada.servebeer.com/job/fast-io-beasting/6278/>

------------------------------------------
[...truncated 13589 lines...]
[junit4:junit4]   2> 250469 T389 oaz.ClientCnxn$SendThread.run Unable to read additional
data from server sessionid 0x13aae6417810006, likely server has closed socket, closing socket
connection and attempting reconnect
[junit4:junit4]   2> 250469 T318 oazs.NIOServerCnxn.closeSock Closed socket connection
for client /127.0.0.1:51280 which had sessionid 0x13aae6417810003
[junit4:junit4]   2> 250470 T351 oaz.ClientCnxn$SendThread.run Unable to read additional
data from server sessionid 0x13aae6417810003, likely server has closed socket, closing socket
connection and attempting reconnect
[junit4:junit4]   2> 250470 T318 oazs.NIOServerCnxn.closeSock Closed socket connection
for client /127.0.0.1:51275 which had sessionid 0x13aae6417810002
[junit4:junit4]   2> 250470 T337 oaz.ClientCnxn$SendThread.run Unable to read additional
data from server sessionid 0x13aae6417810002, likely server has closed socket, closing socket
connection and attempting reconnect
[junit4:junit4]   2> 250470 T318 oazs.NIOServerCnxn.closeSock Closed socket connection
for client /127.0.0.1:51302 which had sessionid 0x13aae6417810005
[junit4:junit4]   2> 250470 T320 oazs.NIOServerCnxn$Factory.run NIOServerCnxn factory exited
run method
[junit4:junit4]   2> 250470 T375 oaz.ClientCnxn$SendThread.run Unable to read additional
data from server sessionid 0x13aae6417810005, likely server has closed socket, closing socket
connection and attempting reconnect
[junit4:junit4]   2> 250471 T318 oazs.FinalRequestProcessor.shutdown shutdown of request
processor complete
[junit4:junit4]   2> 250471 T318 oasc.ChaosMonkey.monkeyLog monkey: stop shard! 44163
[junit4:junit4]   2> 250471 T318 oasc.CoreContainer.shutdown Shutting down CoreContainer
instance=490205887
[junit4:junit4]   2> 250471 T318 oasc.SolrCore.close [collection1]  CLOSING SolrCore org.apache.solr.core.SolrCore@7789bd81
[junit4:junit4]   2> 250474 T318 oasu.DirectUpdateHandler2.close closing DirectUpdateHandler2{commits=0,autocommits=0,soft
autocommits=0,optimizes=0,rollbacks=0,expungeDeletes=0,docsPending=0,adds=0,deletesById=0,deletesByQuery=0,errors=0,cumulative_adds=0,cumulative_deletesById=0,cumulative_deletesByQuery=0,cumulative_errors=0}
[junit4:junit4]   2> 250474 T318 oasc.SolrCore.decrefSolrCoreState Closing SolrCoreState
[junit4:junit4]   2> 250475 T318 oasu.DefaultSolrCoreState.closeIndexWriter SolrCoreState
ref count has reached 0 - closing IndexWriter
[junit4:junit4]   2> 250475 T318 oasu.DefaultSolrCoreState.closeIndexWriter closing IndexWriter
with IndexWriterCloser
[junit4:junit4]   2> 250476 T318 oasc.SolrCore.closeSearcher [collection1] Closing main
searcher on request.
[junit4:junit4]   2> 250478 T339 oasc.Overseer$ClusterStateUpdater.amILeader According
to ZK I (id=88574887601438722-127.0.0.1:44163_solr-n_0000000000) am no longer a leader.
[junit4:junit4]   2> 250570 T364 oascc.ConnectionManager.process Watcher org.apache.solr.common.cloud.ConnectionManager@54911265
name:ZooKeeperConnection Watcher:127.0.0.1:50886/solr got event WatchedEvent state:Disconnected
type:None path:null path:null type:None
[junit4:junit4]   2> 250570 T390 oascc.ConnectionManager.process Watcher org.apache.solr.common.cloud.ConnectionManager@7498213f
name:ZooKeeperConnection Watcher:127.0.0.1:50886/solr got event WatchedEvent state:Disconnected
type:None path:null path:null type:None
[junit4:junit4]   2> 250570 T364 oascc.ConnectionManager.process zkClient has disconnected
[junit4:junit4]   2> 250570 T390 oascc.ConnectionManager.process zkClient has disconnected
[junit4:junit4]   2> 250570 T338 oascc.ConnectionManager.process Watcher org.apache.solr.common.cloud.ConnectionManager@104a73cb
name:ZooKeeperConnection Watcher:127.0.0.1:50886/solr got event WatchedEvent state:Disconnected
type:None path:null path:null type:None
[junit4:junit4]   2> 250570 T352 oascc.ConnectionManager.process Watcher org.apache.solr.common.cloud.ConnectionManager@1c52dd05
name:ZooKeeperConnection Watcher:127.0.0.1:50886/solr got event WatchedEvent state:Disconnected
type:None path:null path:null type:None
[junit4:junit4]   2> 250570 T318 oaz.ZooKeeper.close Session: 0x13aae6417810002 closed
[junit4:junit4]   2> 250570 T338 oascc.ConnectionManager.process zkClient has disconnected
[junit4:junit4]   2> 250571 T376 oascc.ConnectionManager.process Watcher org.apache.solr.common.cloud.ConnectionManager@6ed36d63
name:ZooKeeperConnection Watcher:127.0.0.1:50886/solr got event WatchedEvent state:Disconnected
type:None path:null path:null type:None
[junit4:junit4]   2> 250571 T338 oaz.ClientCnxn$EventThread.run EventThread shut down
[junit4:junit4]   2> 250571 T352 oascc.ConnectionManager.process zkClient has disconnected
[junit4:junit4]   2> 250571 T376 oascc.ConnectionManager.process zkClient has disconnected
[junit4:junit4]   2> 250594 T318 oejsh.ContextHandler.doStop stopped o.e.j.s.ServletContextHandler{/solr,null}
[junit4:junit4]   2> 250646 T318 oasc.ChaosMonkey.monkeyLog monkey: stop shard! 57919
[junit4:junit4]   2> 250646 T318 oasc.CoreContainer.shutdown Shutting down CoreContainer
instance=1216016055
[junit4:junit4]   2> 250647 T318 oasc.SolrCore.close [collection1]  CLOSING SolrCore org.apache.solr.core.SolrCore@2c6c58db
[junit4:junit4]   2> 250649 T318 oasu.DirectUpdateHandler2.close closing DirectUpdateHandler2{commits=1,autocommits=0,soft
autocommits=0,optimizes=0,rollbacks=0,expungeDeletes=0,docsPending=0,adds=0,deletesById=0,deletesByQuery=0,errors=0,cumulative_adds=0,cumulative_deletesById=0,cumulative_deletesByQuery=0,cumulative_errors=0}
[junit4:junit4]   2> 250658 T318 oasc.SolrCore.decrefSolrCoreState Closing SolrCoreState
[junit4:junit4]   2> 250658 T318 oasu.DefaultSolrCoreState.closeIndexWriter SolrCoreState
ref count has reached 0 - closing IndexWriter
[junit4:junit4]   2> 250658 T318 oasu.DefaultSolrCoreState.closeIndexWriter closing IndexWriter
with IndexWriterCloser
[junit4:junit4]   2> 250660 T318 oasc.SolrCore.closeSearcher [collection1] Closing main
searcher on request.
[junit4:junit4]   2> 251006 T321 oazs.SessionTrackerImpl.run SessionTrackerImpl exited
loop!
[junit4:junit4]   2> 251780 T363 oaz.ClientCnxn$SendThread.startConnect Opening socket
connection to server localhost.localdomain/127.0.0.1:50886
[junit4:junit4]   2> 251781 T363 oaz.ClientCnxn$SendThread.run WARNING Session 0x13aae6417810004
for server null, unexpected error, closing socket connection and attempting reconnect java.net.ConnectException:
Connection refused
[junit4:junit4]   2> 	at sun.nio.ch.SocketChannelImpl.checkConnect(Native Method)
[junit4:junit4]   2> 	at sun.nio.ch.SocketChannelImpl.finishConnect(SocketChannelImpl.java:567)
[junit4:junit4]   2> 	at org.apache.zookeeper.ClientCnxn$SendThread.run(ClientCnxn.java:1143)
[junit4:junit4]   2> 
[junit4:junit4]   2> 252000 T351 oaz.ClientCnxn$SendThread.startConnect Opening socket
connection to server localhost.localdomain/127.0.0.1:50886
[junit4:junit4]   2> 252010 T375 oaz.ClientCnxn$SendThread.startConnect Opening socket
connection to server localhost.localdomain/127.0.0.1:50886
[junit4:junit4]   2> 252010 T375 oaz.ClientCnxn$SendThread.run WARNING Session 0x13aae6417810005
for server null, unexpected error, closing socket connection and attempting reconnect java.net.ConnectException:
Connection refused
[junit4:junit4]   2> 	at sun.nio.ch.SocketChannelImpl.checkConnect(Native Method)
[junit4:junit4]   2> 	at sun.nio.ch.SocketChannelImpl.finishConnect(SocketChannelImpl.java:567)
[junit4:junit4]   2> 	at org.apache.zookeeper.ClientCnxn$SendThread.run(ClientCnxn.java:1143)
[junit4:junit4]   2> 
[junit4:junit4]   2> 252101 T352 oaz.ClientCnxn$EventThread.run EventThread shut down
[junit4:junit4]   2> 252101 T318 oaz.ZooKeeper.close Session: 0x13aae6417810003 closed
[junit4:junit4]   2> 252124 T318 oejsh.ContextHandler.doStop stopped o.e.j.s.ServletContextHandler{/solr,null}
[junit4:junit4]   2> 252175 T318 oasc.ChaosMonkey.monkeyLog monkey: stop shard! 39244
[junit4:junit4]   2> 252176 T318 oasc.CoreContainer.shutdown Shutting down CoreContainer
instance=226528415
[junit4:junit4]   2> 252176 T318 oasc.SolrCore.close [collection1]  CLOSING SolrCore org.apache.solr.core.SolrCore@7f3b2f29
[junit4:junit4]   2> 252179 T318 oasu.DirectUpdateHandler2.close closing DirectUpdateHandler2{commits=0,autocommits=0,soft
autocommits=0,optimizes=0,rollbacks=0,expungeDeletes=0,docsPending=0,adds=0,deletesById=0,deletesByQuery=0,errors=0,cumulative_adds=0,cumulative_deletesById=0,cumulative_deletesByQuery=0,cumulative_errors=0}
[junit4:junit4]   2> 252179 T318 oasc.SolrCore.decrefSolrCoreState Closing SolrCoreState
[junit4:junit4]   2> 252180 T318 oasu.DefaultSolrCoreState.closeIndexWriter SolrCoreState
ref count has reached 0 - closing IndexWriter
[junit4:junit4]   2> 252180 T318 oasu.DefaultSolrCoreState.closeIndexWriter closing IndexWriter
with IndexWriterCloser
[junit4:junit4]   2> 252181 T318 oasc.SolrCore.closeSearcher [collection1] Closing main
searcher on request.
[junit4:junit4]   2> 252324 T389 oaz.ClientCnxn$SendThread.startConnect Opening socket
connection to server localhost.localdomain/127.0.0.1:50886
[junit4:junit4]   2> 252325 T389 oaz.ClientCnxn$SendThread.run WARNING Session 0x13aae6417810006
for server null, unexpected error, closing socket connection and attempting reconnect java.net.ConnectException:
Connection refused
[junit4:junit4]   2> 	at sun.nio.ch.SocketChannelImpl.checkConnect(Native Method)
[junit4:junit4]   2> 	at sun.nio.ch.SocketChannelImpl.finishConnect(SocketChannelImpl.java:567)
[junit4:junit4]   2> 	at org.apache.zookeeper.ClientCnxn$SendThread.run(ClientCnxn.java:1143)
[junit4:junit4]   2> 
[junit4:junit4]   2> 253073 T363 oaz.ClientCnxn$SendThread.startConnect Opening socket
connection to server localhost.localdomain/127.0.0.1:50886
[junit4:junit4]   2> 253169 T375 oaz.ClientCnxn$SendThread.startConnect Opening socket
connection to server localhost.localdomain/127.0.0.1:50886
[junit4:junit4]   2> 253170 T375 oaz.ClientCnxn$SendThread.run WARNING Session 0x13aae6417810005
for server null, unexpected error, closing socket connection and attempting reconnect java.net.ConnectException:
Connection refused
[junit4:junit4]   2> 	at sun.nio.ch.SocketChannelImpl.checkConnect(Native Method)
[junit4:junit4]   2> 	at sun.nio.ch.SocketChannelImpl.finishConnect(SocketChannelImpl.java:567)
[junit4:junit4]   2> 	at org.apache.zookeeper.ClientCnxn$SendThread.run(ClientCnxn.java:1143)
[junit4:junit4]   2> 
[junit4:junit4]   2> 253174 T364 oaz.ClientCnxn$EventThread.run EventThread shut down
[junit4:junit4]   2> 253174 T318 oaz.ZooKeeper.close Session: 0x13aae6417810004 closed
[junit4:junit4]   2> 253196 T318 oejsh.ContextHandler.doStop stopped o.e.j.s.ServletContextHandler{/solr,null}
[junit4:junit4]   2> 253248 T318 oasc.ChaosMonkey.monkeyLog monkey: stop shard! 54527
[junit4:junit4]   2> 253248 T318 oasc.CoreContainer.shutdown Shutting down CoreContainer
instance=774664918
[junit4:junit4]   2> 253249 T318 oasc.SolrCore.close [collection1]  CLOSING SolrCore org.apache.solr.core.SolrCore@332fccf9
[junit4:junit4]   2> 253252 T318 oasu.DirectUpdateHandler2.close closing DirectUpdateHandler2{commits=1,autocommits=0,soft
autocommits=0,optimizes=0,rollbacks=0,expungeDeletes=0,docsPending=0,adds=0,deletesById=0,deletesByQuery=0,errors=0,cumulative_adds=0,cumulative_deletesById=0,cumulative_deletesByQuery=0,cumulative_errors=0}
[junit4:junit4]   2> 253253 T318 oasc.SolrCore.decrefSolrCoreState Closing SolrCoreState
[junit4:junit4]   2> 253253 T318 oasu.DefaultSolrCoreState.closeIndexWriter SolrCoreState
ref count has reached 0 - closing IndexWriter
[junit4:junit4]   2> 253253 T318 oasu.DefaultSolrCoreState.closeIndexWriter closing IndexWriter
with IndexWriterCloser
[junit4:junit4]   2> 253254 T318 oasc.SolrCore.closeSearcher [collection1] Closing main
searcher on request.
[junit4:junit4]   2> 253270 T376 oaz.ClientCnxn$EventThread.run EventThread shut down
[junit4:junit4]   2> 253270 T318 oaz.ZooKeeper.close Session: 0x13aae6417810005 closed
[junit4:junit4]   2> 253292 T318 oejsh.ContextHandler.doStop stopped o.e.j.s.ServletContextHandler{/solr,null}
[junit4:junit4]   2> 253343 T318 oasc.ChaosMonkey.monkeyLog monkey: stop shard! 50900
[junit4:junit4]   2> 253344 T318 oasc.CoreContainer.shutdown Shutting down CoreContainer
instance=2063030831
[junit4:junit4]   2> 253563 T389 oaz.ClientCnxn$SendThread.startConnect Opening socket
connection to server localhost.localdomain/127.0.0.1:50886
[junit4:junit4]   2> 253664 T390 oaz.ClientCnxn$EventThread.run EventThread shut down
[junit4:junit4]   2> 253664 T318 oaz.ZooKeeper.close Session: 0x13aae6417810006 closed
[junit4:junit4]   2> 253686 T318 oejsh.ContextHandler.doStop stopped o.e.j.s.ServletContextHandler{/solr,null}
[junit4:junit4]   2> 253754 T318 oas.SolrTestCaseJ4.tearDown ###Ending testDistribSearch
[junit4:junit4]   1>     /solr/collections/control_collection/shards (0)
[junit4:junit4]   1>     /solr/collections/control_collection/leader_elect (1)
[junit4:junit4]   1>      /solr/collections/control_collection/leader_elect/control_shard
(1)
[junit4:junit4]   1>       /solr/collections/control_collection/leader_elect/control_shard/election
(1)
[junit4:junit4]   1>        /solr/collections/control_collection/leader_elect/control_shard/election/88574887601438722-127.0.0.1:44163_solr_collection1-n_0000000000
(0)
[junit4:junit4]   1>     /solr/collections/control_collection/leaders (1)
[junit4:junit4]   1>      /solr/collections/control_collection/leaders/control_shard (0)
[junit4:junit4]   1>      DATA:
[junit4:junit4]   1>          {
[junit4:junit4]   1>            "core":"collection1",
[junit4:junit4]   1>            "node_name":"127.0.0.1:44163_solr",
[junit4:junit4]   1>            "base_url":"http://127.0.0.1:44163/solr"}
[junit4:junit4]   1>   /solr/clusterstate.json (0)
[junit4:junit4]   1>   DATA:
[junit4:junit4]   1>       {
[junit4:junit4]   1>         "collection1":{
[junit4:junit4]   1>           "shard1":{
[junit4:junit4]   1>             "range":"80000000-ffffffff",
[junit4:junit4]   1>             "replicas":{
[junit4:junit4]   1>               "127.0.0.1:57919_solr_collection1":{
[junit4:junit4]   1>                 "shard":"shard1",
[junit4:junit4]   1>                 "roles":null,
[junit4:junit4]   1>                 "state":"active",
[junit4:junit4]   1>                 "core":"collection1",
[junit4:junit4]   1>                 "collection":"collection1",
[junit4:junit4]   1>                 "node_name":"127.0.0.1:57919_solr",
[junit4:junit4]   1>                 "base_url":"http://127.0.0.1:57919/solr",
[junit4:junit4]   1>                 "leader":"true"},
[junit4:junit4]   1>               "127.0.0.1:54527_solr_collection1":{
[junit4:junit4]   1>                 "shard":"shard1",
[junit4:junit4]   1>                 "roles":null,
[junit4:junit4]   1>                 "state":"active",
[junit4:junit4]   1>                 "core":"collection1",
[junit4:junit4]   1>                 "collection":"collection1",
[junit4:junit4]   1>                 "node_name":"127.0.0.1:54527_solr",
[junit4:junit4]   1>                 "base_url":"http://127.0.0.1:54527/solr"}}},
[junit4:junit4]   1>           "shard2":{
[junit4:junit4]   1>             "range":"0-7fffffff",
[junit4:junit4]   1>             "replicas":{
[junit4:junit4]   1>               "127.0.0.1:39244_solr_collection1":{
[junit4:junit4]   1>                 "shard":"shard2",
[junit4:junit4]   1>                 "roles":null,
[junit4:junit4]   1>                 "state":"active",
[junit4:junit4]   1>                 "core":"collection1",
[junit4:junit4]   1>                 "collection":"collection1",
[junit4:junit4]   1>                 "node_name":"127.0.0.1:39244_solr",
[junit4:junit4]   1>                 "base_url":"http://127.0.0.1:39244/solr",
[junit4:junit4]   1>                 "leader":"true"},
[junit4:junit4]   1>               "127.0.0.1:50900_solr_collection1":{
[junit4:junit4]   1>                 "shard":null,
[junit4:junit4]   1>                 "roles":null,
[junit4:junit4]   1>                 "state":"down",
[junit4:junit4]   1>                 "core":"collection1",
[junit4:junit4]   1>                 "collection":"collection1",
[junit4:junit4]   1>                 "node_name":"127.0.0.1:50900_solr",
[junit4:junit4]   1>                 "base_url":"http://127.0.0.1:50900/solr"}}}},
[junit4:junit4]   1>         "control_collection":{"control_shard":{"replicas":{"127.0.0.1:44163_solr_collection1":{
[junit4:junit4]   1>                 "shard":"control_shard",
[junit4:junit4]   1>                 "roles":null,
[junit4:junit4]   1>                 "state":"active",
[junit4:junit4]   1>                 "core":"collection1",
[junit4:junit4]   1>                 "collection":"control_collection",
[junit4:junit4]   1>                 "node_name":"127.0.0.1:44163_solr",
[junit4:junit4]   1>                 "base_url":"http://127.0.0.1:44163/solr",
[junit4:junit4]   1>                 "leader":"true"}}}}}
[junit4:junit4]   1>  /zookeeper (1)
[junit4:junit4]   1>  DATA:
[junit4:junit4]   1>      
[junit4:junit4]   1> 
[junit4:junit4]   2> NOTE: reproduce with: ant test  -Dtestcase=FullSolrCloudDistribCmdsTest
-Dtests.method=testDistribSearch -Dtests.seed=42810EE56EFB47E7 -Dtests.slow=true -Dtests.locale=sr
-Dtests.timezone=Europe/Isle_of_Man -Dtests.file.encoding=UTF-8
[junit4:junit4] FAILURE  254s J4 | FullSolrCloudDistribCmdsTest.testDistribSearch <<<
[junit4:junit4]    > Throwable #1: java.lang.AssertionError: There are still nodes recoverying
- waited for 180 seconds
[junit4:junit4]    > 	at __randomizedtesting.SeedInfo.seed([42810EE56EFB47E7:C36780FD19A427DB]:0)
[junit4:junit4]    > 	at org.junit.Assert.fail(Assert.java:93)
[junit4:junit4]    > 	at org.apache.solr.cloud.AbstractDistribZkTestBase.waitForRecoveriesToFinish(AbstractDistribZkTestBase.java:165)
[junit4:junit4]    > 	at org.apache.solr.cloud.AbstractDistribZkTestBase.waitForRecoveriesToFinish(AbstractDistribZkTestBase.java:115)
[junit4:junit4]    > 	at org.apache.solr.cloud.AbstractDistribZkTestBase.waitForRecoveriesToFinish(AbstractDistribZkTestBase.java:110)
[junit4:junit4]    > 	at org.apache.solr.cloud.AbstractFullDistribZkTestBase.waitForRecoveriesToFinish(AbstractFullDistribZkTestBase.java:553)
[junit4:junit4]    > 	at org.apache.solr.cloud.FullSolrCloudDistribCmdsTest.doTest(FullSolrCloudDistribCmdsTest.java:65)
[junit4:junit4]    > 	at org.apache.solr.BaseDistributedSearchTestCase.testDistribSearch(BaseDistributedSearchTestCase.java:695)
[junit4:junit4]    > 	at sun.reflect.NativeMethodAccessorImpl.invoke0(Native Method)
[junit4:junit4]    > 	at sun.reflect.NativeMethodAccessorImpl.invoke(NativeMethodAccessorImpl.java:39)
[junit4:junit4]    > 	at sun.reflect.DelegatingMethodAccessorImpl.invoke(DelegatingMethodAccessorImpl.java:25)
[junit4:junit4]    > 	at java.lang.reflect.Method.invoke(Method.java:597)
[junit4:junit4]    > 	at com.carrotsearch.randomizedtesting.RandomizedRunner.invoke(RandomizedRunner.java:1559)
[junit4:junit4]    > 	at com.carrotsearch.randomizedtesting.RandomizedRunner.access$600(RandomizedRunner.java:79)
[junit4:junit4]    > 	at com.carrotsearch.randomizedtesting.RandomizedRunner$6.evaluate(RandomizedRunner.java:737)
[junit4:junit4]    > 	at com.carrotsearch.randomizedtesting.RandomizedRunner$7.evaluate(RandomizedRunner.java:773)
[junit4:junit4]    > 	at com.carrotsearch.randomizedtesting.RandomizedRunner$8.evaluate(RandomizedRunner.java:787)
[junit4:junit4]    > 	at com.carrotsearch.randomizedtesting.rules.SystemPropertiesRestoreRule$1.evaluate(SystemPropertiesRestoreRule.java:53)
[junit4:junit4]    > 	at org.apache.lucene.util.TestRuleSetupTeardownChained$1.evaluate(TestRuleSetupTeardownChained.java:50)
[junit4:junit4]    > 	at org.apache.lucene.util.TestRuleFieldCacheSanity$1.evaluate(TestRuleFieldCacheSanity.java:51)
[junit4:junit4]    > 	at org.apache.lucene.util.AbstractBeforeAfterRule$1.evaluate(AbstractBeforeAfterRule.java:45)
[junit4:junit4]    > 	at com.carrotsearch.randomizedtesting.rules.SystemPropertiesInvariantRule$1.evaluate(SystemPropertiesInvariantRule.java:55)
[junit4:junit4]    > 	at org.apache.lucene.util.TestRuleThreadAndTestName$1.evaluate(TestRuleThreadAndTestName.java:48)
[junit4:junit4]    > 	at org.apache.lucene.util.TestRuleIgnoreAfterMaxFailures$1.evaluate(TestRuleIgnoreAfterMaxFailures.java:70)
[junit4:junit4]    > 	at org.apache.lucene.util.TestRuleMarkFailure$1.evaluate(TestRuleMarkFailure.java:48)
[junit4:junit4]    > 	at com.carrotsearch.randomizedtesting.rules.StatementAdapter.evaluate(StatementAdapter.java:36)
[junit4:junit4]    > 	at com.carrotsearch.randomizedtesting.ThreadLeakControl$StatementRunner.run(ThreadLeakControl.java:358)
[junit4:junit4]    > 	at com.carrotsearch.randomizedtesting.ThreadLeakControl.forkTimeoutingTask(ThreadLeakControl.java:782)
[junit4:junit4]    > 	at com.carrotsearch.randomizedtesting.ThreadLeakControl$3.evaluate(ThreadLeakControl.java:442)
[junit4:junit4]    > 	at com.carrotsearch.randomizedtesting.RandomizedRunner.runSingleTest(RandomizedRunner.java:746)
[junit4:junit4]    > 	at com.carrotsearch.randomizedtesting.RandomizedRunner$3.evaluate(RandomizedRunner.java:648)
[junit4:junit4]    > 	at com.carrotsearch.randomizedtesting.RandomizedRunner$4.evaluate(RandomizedRunner.java:682)
[junit4:junit4]    > 	at com.carrotsearch.randomizedtesting.RandomizedRunner$5.evaluate(RandomizedRunner.java:693)
[junit4:junit4]    > 	at com.carrotsearch.randomizedtesting.rules.StatementAdapter.evaluate(StatementAdapter.java:36)
[junit4:junit4]    > 	at com.carrotsearch.randomizedtesting.rules.SystemPropertiesRestoreRule$1.evaluate(SystemPropertiesRestoreRule.java:53)
[junit4:junit4]    > 	at org.apache.lucene.util.AbstractBeforeAfterRule$1.evaluate(AbstractBeforeAfterRule.java:45)
[junit4:junit4]    > 	at org.apache.lucene.util.TestRuleStoreClassName$1.evaluate(TestRuleStoreClassName.java:42)
[junit4:junit4]    > 	at com.carrotsearch.randomizedtesting.rules.SystemPropertiesInvariantRule$1.evaluate(SystemPropertiesInvariantRule.java:55)
[junit4:junit4]    > 	at com.carrotsearch.randomizedtesting.rules.NoShadowingOrOverridesOnMethodsRule$1.evaluate(NoShadowingOrOverridesOnMethodsRule.java:39)
[junit4:junit4]    > 	at com.carrotsearch.randomizedtesting.rules.NoShadowingOrOverridesOnMethodsRule$1.evaluate(NoShadowingOrOverridesOnMethodsRule.java:39)
[junit4:junit4]    > 	at com.carrotsearch.randomizedtesting.rules.StatementAdapter.evaluate(StatementAdapter.java:36)
[junit4:junit4]    > 	at org.apache.lucene.util.TestRuleAssertionsRequired$1.evaluate(TestRuleAssertionsRequired.java:43)
[junit4:junit4]    > 	at org.apache.lucene.util.TestRuleMarkFailure$1.evaluate(TestRuleMarkFailure.java:48)
[junit4:junit4]    > 	at org.apache.lucene.util.TestRuleIgnoreAfterMaxFailures$1.evaluate(TestRuleIgnoreAfterMaxFailures.java:70)
[junit4:junit4]    > 	at org.apache.lucene.util.TestRuleIgnoreTestSuites$1.evaluate(TestRuleIgnoreTestSuites.java:55)
[junit4:junit4]    > 	at com.carrotsearch.randomizedtesting.rules.StatementAdapter.evaluate(StatementAdapter.java:36)
[junit4:junit4]    > 	at com.carrotsearch.randomizedtesting.ThreadLeakControl$StatementRunner.run(ThreadLeakControl.java:358)
[junit4:junit4]    > 	at java.lang.Thread.run(Thread.java:662)
[junit4:junit4]   2> 253763 T318 oas.SolrTestCaseJ4.deleteCore ###deleteCore
[junit4:junit4]   2> NOTE: test params are: codec=Asserting, sim=DefaultSimilarity, locale=sr,
timezone=Europe/Isle_of_Man
[junit4:junit4]   2> NOTE: Linux 3.2.0-24-generic amd64/Sun Microsystems Inc. 1.6.0_27
(64-bit)/cpus=8,threads=1,free=98690560,total=338165760
[junit4:junit4]   2> NOTE: All tests run in this JVM: [MultiTermTest, TestDistributedGrouping,
TestFaceting, EchoParamsTest, TestSystemIdResolver, TestReload, TestLMJelinekMercerSimilarityFactory,
TestStressReorder, FastVectorHighlighterTest, XsltUpdateRequestHandlerTest, TestRTGBase, TestCSVResponseWriter,
LukeRequestHandlerTest, ScriptEngineTest, TestDocSet, TestIndexSearcher, SystemInfoHandlerTest,
FullSolrCloudDistribCmdsTest]
[junit4:junit4] Completed on J4 in 253.78s, 1 test, 1 failure <<< FAILURES!
[junit4:junit4] 
[junit4:junit4] 
[junit4:junit4] Tests with failures:
[junit4:junit4]   - org.apache.solr.cloud.FullSolrCloudDistribCmdsTest.testDistribSearch
[junit4:junit4] 
[junit4:junit4] 
[junit4:junit4] JVM J0:     1.18 ..   193.38 =   192.21s
[junit4:junit4] JVM J1:     1.15 ..   134.31 =   133.16s
[junit4:junit4] JVM J2:     1.16 ..   127.58 =   126.42s
[junit4:junit4] JVM J3:     1.16 ..   131.58 =   130.43s
[junit4:junit4] JVM J4:     1.15 ..   337.95 =   336.80s
[junit4:junit4] JVM J5:     1.39 ..   132.97 =   131.58s
[junit4:junit4] JVM J6:     1.16 ..   128.12 =   126.96s
[junit4:junit4] JVM J7:     1.17 ..   134.94 =   133.77s
[junit4:junit4] Execution time total: 5 minutes 37 seconds
[junit4:junit4] Tests summary: 233 suites, 965 tests, 1 failure, 9 ignored (4 assumptions)

BUILD FAILED
<http://sierranevada.servebeer.com/job/fast-io-beasting/ws/build.xml>:39: The following
error occurred while executing this line:
<http://sierranevada.servebeer.com/job/fast-io-beasting/ws/solr/build.xml>:178: The
following error occurred while executing this line:
<http://sierranevada.servebeer.com/job/fast-io-beasting/ws/lucene/module-build.xml>:61:
The following error occurred while executing this line:
<http://sierranevada.servebeer.com/job/fast-io-beasting/ws/lucene/common-build.xml>:1159:
The following error occurred while executing this line:
<http://sierranevada.servebeer.com/job/fast-io-beasting/ws/lucene/common-build.xml>:827:
There were test failures: 233 suites, 965 tests, 1 failure, 9 ignored (4 assumptions)

Total time: 10 minutes 36 seconds
Build step 'Invoke Ant' marked build as failure

---------------------------------------------------------------------
To unsubscribe, e-mail: dev-unsubscribe@lucene.apache.org
For additional commands, e-mail: dev-help@lucene.apache.org


Mime
View raw message