lucene-dev mailing list archives

Site index · List index
Message view « Date » · « Thread »
Top « Date » · « Thread »
From Apache Jenkins Server <jenk...@builds.apache.org>
Subject [JENKINS] Lucene-Solr-Tests-4.x-java7 - Build # 515 - Still Failing
Date Wed, 03 Oct 2012 16:29:15 GMT
Build: https://builds.apache.org/job/Lucene-Solr-Tests-4.x-java7/515/

1 tests failed.
REGRESSION:  org.apache.solr.cloud.BasicDistributedZkTest.testDistribSearch

Error Message:
some core start times did not change on reload

Stack Trace:
java.lang.AssertionError: some core start times did not change on reload
	at __randomizedtesting.SeedInfo.seed([3D47748569CBFB94:BCA1FA9D1E949BA8]:0)
	at org.junit.Assert.fail(Assert.java:93)
	at org.junit.Assert.assertTrue(Assert.java:43)
	at org.apache.solr.cloud.BasicDistributedZkTest.testCollectionsAPI(BasicDistributedZkTest.java:442)
	at org.apache.solr.cloud.BasicDistributedZkTest.doTest(BasicDistributedZkTest.java:331)
	at org.apache.solr.BaseDistributedSearchTestCase.testDistribSearch(BaseDistributedSearchTestCase.java:695)
	at sun.reflect.NativeMethodAccessorImpl.invoke0(Native Method)
	at sun.reflect.NativeMethodAccessorImpl.invoke(NativeMethodAccessorImpl.java:57)
	at sun.reflect.DelegatingMethodAccessorImpl.invoke(DelegatingMethodAccessorImpl.java:43)
	at java.lang.reflect.Method.invoke(Method.java:601)
	at com.carrotsearch.randomizedtesting.RandomizedRunner.invoke(RandomizedRunner.java:1559)
	at com.carrotsearch.randomizedtesting.RandomizedRunner.access$600(RandomizedRunner.java:79)
	at com.carrotsearch.randomizedtesting.RandomizedRunner$6.evaluate(RandomizedRunner.java:737)
	at com.carrotsearch.randomizedtesting.RandomizedRunner$7.evaluate(RandomizedRunner.java:773)
	at com.carrotsearch.randomizedtesting.RandomizedRunner$8.evaluate(RandomizedRunner.java:787)
	at com.carrotsearch.randomizedtesting.rules.SystemPropertiesRestoreRule$1.evaluate(SystemPropertiesRestoreRule.java:53)
	at org.apache.lucene.util.TestRuleSetupTeardownChained$1.evaluate(TestRuleSetupTeardownChained.java:50)
	at org.apache.lucene.util.TestRuleFieldCacheSanity$1.evaluate(TestRuleFieldCacheSanity.java:51)
	at org.apache.lucene.util.AbstractBeforeAfterRule$1.evaluate(AbstractBeforeAfterRule.java:45)
	at com.carrotsearch.randomizedtesting.rules.SystemPropertiesInvariantRule$1.evaluate(SystemPropertiesInvariantRule.java:55)
	at org.apache.lucene.util.TestRuleThreadAndTestName$1.evaluate(TestRuleThreadAndTestName.java:48)
	at org.apache.lucene.util.TestRuleIgnoreAfterMaxFailures$1.evaluate(TestRuleIgnoreAfterMaxFailures.java:70)
	at org.apache.lucene.util.TestRuleMarkFailure$1.evaluate(TestRuleMarkFailure.java:48)
	at com.carrotsearch.randomizedtesting.rules.StatementAdapter.evaluate(StatementAdapter.java:36)
	at com.carrotsearch.randomizedtesting.ThreadLeakControl$StatementRunner.run(ThreadLeakControl.java:358)
	at com.carrotsearch.randomizedtesting.ThreadLeakControl.forkTimeoutingTask(ThreadLeakControl.java:782)
	at com.carrotsearch.randomizedtesting.ThreadLeakControl$3.evaluate(ThreadLeakControl.java:442)
	at com.carrotsearch.randomizedtesting.RandomizedRunner.runSingleTest(RandomizedRunner.java:746)
	at com.carrotsearch.randomizedtesting.RandomizedRunner$3.evaluate(RandomizedRunner.java:648)
	at com.carrotsearch.randomizedtesting.RandomizedRunner$4.evaluate(RandomizedRunner.java:682)
	at com.carrotsearch.randomizedtesting.RandomizedRunner$5.evaluate(RandomizedRunner.java:693)
	at com.carrotsearch.randomizedtesting.rules.StatementAdapter.evaluate(StatementAdapter.java:36)
	at com.carrotsearch.randomizedtesting.rules.SystemPropertiesRestoreRule$1.evaluate(SystemPropertiesRestoreRule.java:53)
	at org.apache.lucene.util.AbstractBeforeAfterRule$1.evaluate(AbstractBeforeAfterRule.java:45)
	at org.apache.lucene.util.TestRuleStoreClassName$1.evaluate(TestRuleStoreClassName.java:42)
	at com.carrotsearch.randomizedtesting.rules.SystemPropertiesInvariantRule$1.evaluate(SystemPropertiesInvariantRule.java:55)
	at com.carrotsearch.randomizedtesting.rules.NoShadowingOrOverridesOnMethodsRule$1.evaluate(NoShadowingOrOverridesOnMethodsRule.java:39)
	at com.carrotsearch.randomizedtesting.rules.NoShadowingOrOverridesOnMethodsRule$1.evaluate(NoShadowingOrOverridesOnMethodsRule.java:39)
	at com.carrotsearch.randomizedtesting.rules.StatementAdapter.evaluate(StatementAdapter.java:36)
	at org.apache.lucene.util.TestRuleAssertionsRequired$1.evaluate(TestRuleAssertionsRequired.java:43)
	at org.apache.lucene.util.TestRuleMarkFailure$1.evaluate(TestRuleMarkFailure.java:48)
	at org.apache.lucene.util.TestRuleIgnoreAfterMaxFailures$1.evaluate(TestRuleIgnoreAfterMaxFailures.java:70)
	at org.apache.lucene.util.TestRuleIgnoreTestSuites$1.evaluate(TestRuleIgnoreTestSuites.java:55)
	at com.carrotsearch.randomizedtesting.rules.StatementAdapter.evaluate(StatementAdapter.java:36)
	at com.carrotsearch.randomizedtesting.ThreadLeakControl$StatementRunner.run(ThreadLeakControl.java:358)
	at java.lang.Thread.run(Thread.java:722)




Build Log:
[...truncated 8911 lines...]
[junit4:junit4] Suite: org.apache.solr.cloud.BasicDistributedZkTest
[junit4:junit4]   2> 4 T665 oas.SolrTestCaseJ4.setUp ###Starting testDistribSearch
[junit4:junit4]   2> Creating dataDir: /usr/home/hudson/hudson-slave/workspace/Lucene-Solr-Tests-4.x-java7/solr/build/solr-core/test/J0/./solrtest-BasicDistributedZkTest-1349280729293
[junit4:junit4]   2> 5 T665 oasc.ZkTestServer.run STARTING ZK TEST SERVER
[junit4:junit4]   2> 9 T666 oazs.ZooKeeperServer.setTickTime tickTime set to 1000
[junit4:junit4]   2> 9 T666 oazs.NIOServerCnxn$Factory.<init> binding to port 0.0.0.0/0.0.0.0:0
[junit4:junit4]   2> 10 T666 oazsp.FileTxnSnapLog.save Snapshotting: 0
[junit4:junit4]   2> 107 T665 oasc.ZkTestServer.run start zk server on port:33808
[junit4:junit4]   2> 107 T665 oaz.ZooKeeper.<init> Initiating client connection, connectString=127.0.0.1:33808 sessionTimeout=10000 watcher=org.apache.solr.common.cloud.ConnectionManager@1967e2c
[junit4:junit4]   2> 108 T671 oaz.ClientCnxn$SendThread.startConnect Opening socket connection to server /127.0.0.1:33808
[junit4:junit4]   2> 108 T665 oascc.ConnectionManager.waitForConnected Waiting for client to connect to ZooKeeper
[junit4:junit4]   2> 109 T671 oaz.ClientCnxn$SendThread.primeConnection Socket connection established to localhost/127.0.0.1:33808, initiating session
[junit4:junit4]   2> 109 T667 oazs.NIOServerCnxn$Factory.run Accepted socket connection from /140.211.11.196:33809
[junit4:junit4]   2> 110 T667 oazs.NIOServerCnxn.readConnectRequest Client attempting to establish new session at /140.211.11.196:33809
[junit4:junit4]   2> 110 T669 oazsp.FileTxnLog.append Creating new log file: log.1
[junit4:junit4]   2> 113 T669 oazs.NIOServerCnxn.finishSessionInit Established session 0x13a276608d30000 with negotiated timeout 10000 for client /140.211.11.196:33809
[junit4:junit4]   2> 114 T671 oaz.ClientCnxn$SendThread.readConnectResult Session establishment complete on server localhost/127.0.0.1:33808, sessionid = 0x13a276608d30000, negotiated timeout = 10000
[junit4:junit4]   2> 114 T672 oascc.ConnectionManager.process Watcher org.apache.solr.common.cloud.ConnectionManager@1967e2c name:ZooKeeperConnection Watcher:127.0.0.1:33808 got event WatchedEvent state:SyncConnected type:None path:null path:null type:None
[junit4:junit4]   2> 114 T665 oascc.ConnectionManager.waitForConnected Client is connected to ZooKeeper
[junit4:junit4]   2> 114 T665 oascc.SolrZkClient.makePath makePath: /solr
[junit4:junit4]   2> 117 T670 oazs.PrepRequestProcessor.pRequest Processed session termination for sessionid: 0x13a276608d30000
[junit4:junit4]   2> 128 T672 oaz.ClientCnxn$EventThread.run EventThread shut down
[junit4:junit4]   2> 128 T665 oaz.ZooKeeper.close Session: 0x13a276608d30000 closed
[junit4:junit4]   2> 128 T667 oazs.NIOServerCnxn.closeSock Closed socket connection for client /140.211.11.196:33809 which had sessionid 0x13a276608d30000
[junit4:junit4]   2> 129 T665 oaz.ZooKeeper.<init> Initiating client connection, connectString=127.0.0.1:33808/solr sessionTimeout=10000 watcher=org.apache.solr.common.cloud.ConnectionManager@714bed16
[junit4:junit4]   2> 129 T673 oaz.ClientCnxn$SendThread.startConnect Opening socket connection to server /127.0.0.1:33808
[junit4:junit4]   2> 129 T665 oascc.ConnectionManager.waitForConnected Waiting for client to connect to ZooKeeper
[junit4:junit4]   2> 130 T673 oaz.ClientCnxn$SendThread.primeConnection Socket connection established to localhost/127.0.0.1:33808, initiating session
[junit4:junit4]   2> 131 T667 oazs.NIOServerCnxn$Factory.run Accepted socket connection from /140.211.11.196:33810
[junit4:junit4]   2> 131 T667 oazs.NIOServerCnxn.readConnectRequest Client attempting to establish new session at /140.211.11.196:33810
[junit4:junit4]   2> 133 T669 oazs.NIOServerCnxn.finishSessionInit Established session 0x13a276608d30001 with negotiated timeout 10000 for client /140.211.11.196:33810
[junit4:junit4]   2> 133 T673 oaz.ClientCnxn$SendThread.readConnectResult Session establishment complete on server localhost/127.0.0.1:33808, sessionid = 0x13a276608d30001, negotiated timeout = 10000
[junit4:junit4]   2> 133 T674 oascc.ConnectionManager.process Watcher org.apache.solr.common.cloud.ConnectionManager@714bed16 name:ZooKeeperConnection Watcher:127.0.0.1:33808/solr got event WatchedEvent state:SyncConnected type:None path:null path:null type:None
[junit4:junit4]   2> 133 T665 oascc.ConnectionManager.waitForConnected Client is connected to ZooKeeper
[junit4:junit4]   2> 134 T665 oascc.SolrZkClient.makePath makePath: /collections/collection1
[junit4:junit4]   2> 143 T665 oascc.SolrZkClient.makePath makePath: /collections/collection1/shards
[junit4:junit4]   2> 146 T665 oascc.SolrZkClient.makePath makePath: /collections/control_collection
[junit4:junit4]   2> 149 T665 oascc.SolrZkClient.makePath makePath: /collections/control_collection/shards
[junit4:junit4]   2> 157 T665 oasc.AbstractZkTestCase.putConfig put /usr/home/hudson/hudson-slave/workspace/Lucene-Solr-Tests-4.x-java7/solr/build/solr-core/test-files/solr/collection1/conf/solrconfig.xml to /configs/conf1/solrconfig.xml
[junit4:junit4]   2> 158 T665 oascc.SolrZkClient.makePath makePath: /configs/conf1/solrconfig.xml
[junit4:junit4]   2> 165 T665 oasc.AbstractZkTestCase.putConfig put /usr/home/hudson/hudson-slave/workspace/Lucene-Solr-Tests-4.x-java7/solr/build/solr-core/test-files/solr/collection1/conf/schema.xml to /configs/conf1/schema.xml
[junit4:junit4]   2> 166 T665 oascc.SolrZkClient.makePath makePath: /configs/conf1/schema.xml
[junit4:junit4]   2> 270 T665 oasc.AbstractZkTestCase.putConfig put /usr/home/hudson/hudson-slave/workspace/Lucene-Solr-Tests-4.x-java7/solr/build/solr-core/test-files/solr/collection1/conf/solrconfig.xml to /configs/conf1/solrconfig.xml
[junit4:junit4]   2> 272 T665 oascc.SolrZkClient.makePath makePath: /configs/conf1/solrconfig.xml
[junit4:junit4]   2> 275 T665 oasc.AbstractZkTestCase.putConfig put /usr/home/hudson/hudson-slave/workspace/Lucene-Solr-Tests-4.x-java7/solr/build/solr-core/test-files/solr/collection1/conf/stopwords.txt to /configs/conf1/stopwords.txt
[junit4:junit4]   2> 276 T665 oascc.SolrZkClient.makePath makePath: /configs/conf1/stopwords.txt
[junit4:junit4]   2> 280 T665 oasc.AbstractZkTestCase.putConfig put /usr/home/hudson/hudson-slave/workspace/Lucene-Solr-Tests-4.x-java7/solr/build/solr-core/test-files/solr/collection1/conf/protwords.txt to /configs/conf1/protwords.txt
[junit4:junit4]   2> 280 T665 oascc.SolrZkClient.makePath makePath: /configs/conf1/protwords.txt
[junit4:junit4]   2> 289 T665 oasc.AbstractZkTestCase.putConfig put /usr/home/hudson/hudson-slave/workspace/Lucene-Solr-Tests-4.x-java7/solr/build/solr-core/test-files/solr/collection1/conf/currency.xml to /configs/conf1/currency.xml
[junit4:junit4]   2> 289 T665 oascc.SolrZkClient.makePath makePath: /configs/conf1/currency.xml
[junit4:junit4]   2> 293 T665 oasc.AbstractZkTestCase.putConfig put /usr/home/hudson/hudson-slave/workspace/Lucene-Solr-Tests-4.x-java7/solr/build/solr-core/test-files/solr/collection1/conf/open-exchange-rates.json to /configs/conf1/open-exchange-rates.json
[junit4:junit4]   2> 294 T665 oascc.SolrZkClient.makePath makePath: /configs/conf1/open-exchange-rates.json
[junit4:junit4]   2> 297 T665 oasc.AbstractZkTestCase.putConfig put /usr/home/hudson/hudson-slave/workspace/Lucene-Solr-Tests-4.x-java7/solr/build/solr-core/test-files/solr/collection1/conf/mapping-ISOLatin1Accent.txt to /configs/conf1/mapping-ISOLatin1Accent.txt
[junit4:junit4]   2> 298 T665 oascc.SolrZkClient.makePath makePath: /configs/conf1/mapping-ISOLatin1Accent.txt
[junit4:junit4]   2> 309 T665 oasc.AbstractZkTestCase.putConfig put /usr/home/hudson/hudson-slave/workspace/Lucene-Solr-Tests-4.x-java7/solr/build/solr-core/test-files/solr/collection1/conf/old_synonyms.txt to /configs/conf1/old_synonyms.txt
[junit4:junit4]   2> 310 T665 oascc.SolrZkClient.makePath makePath: /configs/conf1/old_synonyms.txt
[junit4:junit4]   2> 320 T665 oasc.AbstractZkTestCase.putConfig put /usr/home/hudson/hudson-slave/workspace/Lucene-Solr-Tests-4.x-java7/solr/build/solr-core/test-files/solr/collection1/conf/synonyms.txt to /configs/conf1/synonyms.txt
[junit4:junit4]   2> 321 T665 oascc.SolrZkClient.makePath makePath: /configs/conf1/synonyms.txt
[junit4:junit4]   2> 325 T670 oazs.PrepRequestProcessor.pRequest Processed session termination for sessionid: 0x13a276608d30001
[junit4:junit4]   2> 335 T674 oaz.ClientCnxn$EventThread.run EventThread shut down
[junit4:junit4]   2> 335 T665 oaz.ZooKeeper.close Session: 0x13a276608d30001 closed
[junit4:junit4]   2> 335 T667 oazs.NIOServerCnxn.closeSock Closed socket connection for client /140.211.11.196:33810 which had sessionid 0x13a276608d30001
[junit4:junit4]   2> 337 T665 oejs.Server.doStart jetty-8.1.2.v20120308
[junit4:junit4]   2> 340 T665 oejs.AbstractConnector.doStart Started SocketConnector@0.0.0.0:33811
[junit4:junit4]   2> 341 T665 oasc.SolrResourceLoader.locateSolrHome JNDI not configured for solr (NoInitialContextEx)
[junit4:junit4]   2> 341 T665 oasc.SolrResourceLoader.locateSolrHome using system property solr.solr.home: /usr/home/hudson/hudson-slave/workspace/Lucene-Solr-Tests-4.x-java7/solr/build/solr-core/test-files/solr
[junit4:junit4]   2> 341 T665 oasc.SolrResourceLoader.<init> new SolrResourceLoader for deduced Solr Home: '/usr/home/hudson/hudson-slave/workspace/Lucene-Solr-Tests-4.x-java7/solr/build/solr-core/test-files/solr/'
[junit4:junit4]   2> 385 T665 oass.SolrDispatchFilter.init SolrDispatchFilter.init()
[junit4:junit4]   2> 385 T665 oasc.SolrResourceLoader.locateSolrHome JNDI not configured for solr (NoInitialContextEx)
[junit4:junit4]   2> 386 T665 oasc.SolrResourceLoader.locateSolrHome using system property solr.solr.home: /usr/home/hudson/hudson-slave/workspace/Lucene-Solr-Tests-4.x-java7/solr/build/solr-core/test-files/solr
[junit4:junit4]   2> 386 T665 oasc.CoreContainer$Initializer.initialize looking for solr.xml: /usr/home/hudson/hudson-slave/workspace/Lucene-Solr-Tests-4.x-java7/solr/build/solr-core/test-files/solr/solr.xml
[junit4:junit4]   2> 386 T665 oasc.CoreContainer.<init> New CoreContainer 1575587489
[junit4:junit4]   2> 387 T665 oasc.CoreContainer.load Loading CoreContainer using Solr Home: '/usr/home/hudson/hudson-slave/workspace/Lucene-Solr-Tests-4.x-java7/solr/build/solr-core/test-files/solr/'
[junit4:junit4]   2> 387 T665 oasc.SolrResourceLoader.<init> new SolrResourceLoader for directory: '/usr/home/hudson/hudson-slave/workspace/Lucene-Solr-Tests-4.x-java7/solr/build/solr-core/test-files/solr/'
[junit4:junit4]   2> 411 T665 oasc.CoreContainer.load Registering Log Listener
[junit4:junit4]   2> 423 T665 oasc.CoreContainer.initZooKeeper Zookeeper client=127.0.0.1:33808/solr
[junit4:junit4]   2> 423 T665 oaz.ZooKeeper.<init> Initiating client connection, connectString=127.0.0.1:33808/solr sessionTimeout=5000 watcher=org.apache.solr.common.cloud.ConnectionManager@4516f6ec
[junit4:junit4]   2> 424 T684 oaz.ClientCnxn$SendThread.startConnect Opening socket connection to server /127.0.0.1:33808
[junit4:junit4]   2> 424 T665 oascc.ConnectionManager.waitForConnected Waiting for client to connect to ZooKeeper
[junit4:junit4]   2> 426 T684 oaz.ClientCnxn$SendThread.primeConnection Socket connection established to localhost/127.0.0.1:33808, initiating session
[junit4:junit4]   2> 426 T667 oazs.NIOServerCnxn$Factory.run Accepted socket connection from /140.211.11.196:33812
[junit4:junit4]   2> 427 T667 oazs.NIOServerCnxn.readConnectRequest Client attempting to establish new session at /140.211.11.196:33812
[junit4:junit4]   2> 430 T669 oazs.NIOServerCnxn.finishSessionInit Established session 0x13a276608d30002 with negotiated timeout 5000 for client /140.211.11.196:33812
[junit4:junit4]   2> 430 T684 oaz.ClientCnxn$SendThread.readConnectResult Session establishment complete on server localhost/127.0.0.1:33808, sessionid = 0x13a276608d30002, negotiated timeout = 5000
[junit4:junit4]   2> 430 T685 oascc.ConnectionManager.process Watcher org.apache.solr.common.cloud.ConnectionManager@4516f6ec name:ZooKeeperConnection Watcher:127.0.0.1:33808/solr got event WatchedEvent state:SyncConnected type:None path:null path:null type:None
[junit4:junit4]   2> 430 T665 oascc.ConnectionManager.waitForConnected Client is connected to ZooKeeper
[junit4:junit4]   2> 432 T670 oazs.PrepRequestProcessor.pRequest Got user-level KeeperException when processing sessionid:0x13a276608d30002 type:create cxid:0x2 zxid:0xfffffffffffffffe txntype:unknown reqpath:n/a Error Path:/solr/overseer Error:KeeperErrorCode = NodeExists for /solr/overseer
[junit4:junit4]   2> 440 T665 oascc.SolrZkClient.makePath makePath: /live_nodes
[junit4:junit4]   2> 443 T665 oasc.ZkController.createEphemeralLiveNode Register node as live in ZooKeeper:/live_nodes/127.0.0.1:33811_solr
[junit4:junit4]   2> 443 T670 oazs.PrepRequestProcessor.pRequest Got user-level KeeperException when processing sessionid:0x13a276608d30002 type:delete cxid:0x7 zxid:0xfffffffffffffffe txntype:unknown reqpath:n/a Error Path:/solr/live_nodes/127.0.0.1:33811_solr Error:KeeperErrorCode = NoNode for /solr/live_nodes/127.0.0.1:33811_solr
[junit4:junit4]   2> 444 T665 oascc.SolrZkClient.makePath makePath: /live_nodes/127.0.0.1:33811_solr
[junit4:junit4]   2> 447 T665 oashc.HttpShardHandlerFactory.getParameter Setting socketTimeout to: 0
[junit4:junit4]   2> 448 T665 oashc.HttpShardHandlerFactory.getParameter Setting urlScheme to: http://
[junit4:junit4]   2> 448 T665 oashc.HttpShardHandlerFactory.getParameter Setting connTimeout to: 0
[junit4:junit4]   2> 448 T665 oashc.HttpShardHandlerFactory.getParameter Setting maxConnectionsPerHost to: 20
[junit4:junit4]   2> 448 T665 oashc.HttpShardHandlerFactory.getParameter Setting corePoolSize to: 0
[junit4:junit4]   2> 449 T665 oashc.HttpShardHandlerFactory.getParameter Setting maximumPoolSize to: 2147483647
[junit4:junit4]   2> 449 T665 oashc.HttpShardHandlerFactory.getParameter Setting maxThreadIdleTime to: 5
[junit4:junit4]   2> 449 T665 oashc.HttpShardHandlerFactory.getParameter Setting sizeOfQueue to: -1
[junit4:junit4]   2> 450 T665 oashc.HttpShardHandlerFactory.getParameter Setting fairnessPolicy to: false
[junit4:junit4]   2> 450 T665 oascsi.HttpClientUtil.createClient Creating new http client, config:maxConnectionsPerHost=20&maxConnections=10000&socketTimeout=0&connTimeout=0&retry=false
[junit4:junit4]   2> 462 T665 oascc.SolrZkClient.makePath makePath: /overseer_elect/election
[junit4:junit4]   2> 497 T670 oazs.PrepRequestProcessor.pRequest Got user-level KeeperException when processing sessionid:0x13a276608d30002 type:delete cxid:0x15 zxid:0xfffffffffffffffe txntype:unknown reqpath:n/a Error Path:/solr/overseer_elect/leader Error:KeeperErrorCode = NoNode for /solr/overseer_elect/leader
[junit4:junit4]   2> 498 T665 oascc.SolrZkClient.makePath makePath: /overseer_elect/leader
[junit4:junit4]   2> 501 T665 oasc.Overseer.start Overseer (id=88426461875339266-127.0.0.1:33811_solr-n_0000000000) starting
[junit4:junit4]   2> 502 T670 oazs.PrepRequestProcessor.pRequest Got user-level KeeperException when processing sessionid:0x13a276608d30002 type:create cxid:0x1a zxid:0xfffffffffffffffe txntype:unknown reqpath:n/a Error Path:/solr/overseer Error:KeeperErrorCode = NodeExists for /solr/overseer
[junit4:junit4]   2> 510 T670 oazs.PrepRequestProcessor.pRequest Got user-level KeeperException when processing sessionid:0x13a276608d30002 type:create cxid:0x1b zxid:0xfffffffffffffffe txntype:unknown reqpath:n/a Error Path:/solr/overseer Error:KeeperErrorCode = NodeExists for /solr/overseer
[junit4:junit4]   2> 511 T670 oazs.PrepRequestProcessor.pRequest Got user-level KeeperException when processing sessionid:0x13a276608d30002 type:create cxid:0x1c zxid:0xfffffffffffffffe txntype:unknown reqpath:n/a Error Path:/solr/overseer Error:KeeperErrorCode = NodeExists for /solr/overseer
[junit4:junit4]   2> 518 T670 oazs.PrepRequestProcessor.pRequest Got user-level KeeperException when processing sessionid:0x13a276608d30002 type:create cxid:0x1d zxid:0xfffffffffffffffe txntype:unknown reqpath:n/a Error Path:/solr/overseer Error:KeeperErrorCode = NodeExists for /solr/overseer
[junit4:junit4]   2> 519 T687 oasc.OverseerCollectionProcessor.run Process current queue of collection creations
[junit4:junit4]   2> 520 T665 oascc.SolrZkClient.makePath makePath: /clusterstate.json
[junit4:junit4]   2> 523 T665 oascc.ZkStateReader.createClusterStateWatchersAndUpdate Updating cluster state from ZooKeeper... 
[junit4:junit4]   2> 526 T686 oasc.Overseer$ClusterStateUpdater.run Starting to work on the main queue
[junit4:junit4]   2> 531 T665 oasc.CoreContainer.create Creating SolrCore 'collection1' using instanceDir: /usr/home/hudson/hudson-slave/workspace/Lucene-Solr-Tests-4.x-java7/solr/build/solr-core/test-files/solr/collection1
[junit4:junit4]   2> 532 T665 oasc.ZkController.createCollectionZkNode Check for collection zkNode:control_collection
[junit4:junit4]   2> 533 T665 oasc.ZkController.createCollectionZkNode Collection zkNode exists
[junit4:junit4]   2> 533 T665 oasc.ZkController.readConfigName Load collection config from:/collections/control_collection
[junit4:junit4]   2> 535 T665 oasc.SolrResourceLoader.<init> new SolrResourceLoader for directory: '/usr/home/hudson/hudson-slave/workspace/Lucene-Solr-Tests-4.x-java7/solr/build/solr-core/test-files/solr/collection1/'
[junit4:junit4]   2> 536 T665 oasc.SolrResourceLoader.replaceClassLoader Adding 'file:/usr/home/hudson/hudson-slave/workspace/Lucene-Solr-Tests-4.x-java7/solr/build/solr-core/test-files/solr/collection1/lib/README' to classloader
[junit4:junit4]   2> 536 T665 oasc.SolrResourceLoader.replaceClassLoader Adding 'file:/usr/home/hudson/hudson-slave/workspace/Lucene-Solr-Tests-4.x-java7/solr/build/solr-core/test-files/solr/collection1/lib/classes/' to classloader
[junit4:junit4]   2> 573 T665 oasc.SolrConfig.<init> Using Lucene MatchVersion: LUCENE_41
[junit4:junit4]   2> 625 T665 oasc.SolrConfig.<init> Loaded SolrConfig: solrconfig.xml
[junit4:junit4]   2> 727 T665 oass.IndexSchema.readSchema Reading Solr Schema
[junit4:junit4]   2> 732 T665 oass.IndexSchema.readSchema Schema name=test
[junit4:junit4]   2> 1172 T665 oass.OpenExchangeRatesOrgProvider.init Initialized with rates=open-exchange-rates.json, refreshInterval=1440.
[junit4:junit4]   2> 1180 T665 oass.IndexSchema.readSchema default search field in schema is text
[junit4:junit4]   2> 1183 T665 oass.IndexSchema.readSchema unique key field: id
[junit4:junit4]   2> 1197 T665 oass.FileExchangeRateProvider.reload Reloading exchange rates from file currency.xml
[junit4:junit4]   2> 1202 T665 oass.FileExchangeRateProvider.reload Reloading exchange rates from file currency.xml
[junit4:junit4]   2> 1206 T665 oass.OpenExchangeRatesOrgProvider.reload Reloading exchange rates from open-exchange-rates.json
[junit4:junit4]   2> 1207 T665 oass.OpenExchangeRatesOrgProvider.reload Reloading exchange rates from open-exchange-rates.json
[junit4:junit4]   2> 1209 T665 oasc.SolrCore.<init> [collection1] Opening new SolrCore at /usr/home/hudson/hudson-slave/workspace/Lucene-Solr-Tests-4.x-java7/solr/build/solr-core/test-files/solr/collection1/, dataDir=./org.apache.solr.cloud.BasicDistributedZkTest-1349280729293/control/data/
[junit4:junit4]   2> 1210 T665 oasc.JmxMonitoredMap.<init> JMX monitoring is enabled. Adding Solr mbeans to JMX Server: com.sun.jmx.mbeanserver.JmxMBeanServer@2e6a317
[junit4:junit4]   2> 1233 T665 oasc.SolrCore.getNewIndexDir New index directory detected: old=null new=./org.apache.solr.cloud.BasicDistributedZkTest-1349280729293/control/data/index/
[junit4:junit4]   2> 1234 T665 oasc.SolrCore.initIndex WARNING [collection1] Solr index directory './org.apache.solr.cloud.BasicDistributedZkTest-1349280729293/control/data/index' doesn't exist. Creating new index...
[junit4:junit4]   2> 1235 T665 oasc.CachingDirectoryFactory.get return new directory for /usr/home/hudson/hudson-slave/workspace/Lucene-Solr-Tests-4.x-java7/solr/build/solr-core/test/J0/./org.apache.solr.cloud.BasicDistributedZkTest-1349280729293/control/data/index forceNew:false
[junit4:junit4]   2> 1246 T665 oasc.SolrDeletionPolicy.onCommit SolrDeletionPolicy.onCommit: commits:num=1
[junit4:junit4]   2> 		commit{dir=NRTCachingDirectory(org.apache.lucene.store.NIOFSDirectory@/usr/home/hudson/hudson-slave/workspace/Lucene-Solr-Tests-4.x-java7/solr/build/solr-core/test/J0/org.apache.solr.cloud.BasicDistributedZkTest-1349280729293/control/data/index lockFactory=org.apache.lucene.store.NativeFSLockFactory@e3f23ed; maxCacheMB=48.0 maxMergeSizeMB=4.0),segFN=segments_1,generation=1,filenames=[segments_1]
[junit4:junit4]   2> 1247 T665 oasc.SolrDeletionPolicy.updateCommits newest commit = 1
[junit4:junit4]   2> 1247 T665 oasc.SolrCore.initWriters created xml: solr.XMLResponseWriter
[junit4:junit4]   2> 1249 T665 oasup.UpdateRequestProcessorChain.init inserting DistributedUpdateProcessorFactory into updateRequestProcessorChain "dedupe"
[junit4:junit4]   2> 1250 T665 oasup.UpdateRequestProcessorChain.init inserting DistributedUpdateProcessorFactory into updateRequestProcessorChain "dedupe-allfields"
[junit4:junit4]   2> 1250 T665 oasup.UpdateRequestProcessorChain.init inserting DistributedUpdateProcessorFactory into updateRequestProcessorChain "stored_sig"
[junit4:junit4]   2> 1250 T665 oasup.UpdateRequestProcessorChain.init inserting DistributedUpdateProcessorFactory into updateRequestProcessorChain "uniq-fields"
[junit4:junit4]   2> 1251 T665 oasup.UpdateRequestProcessorChain.init inserting DistributedUpdateProcessorFactory into updateRequestProcessorChain "distrib-dup-test-chain-implicit"
[junit4:junit4]   2> 1251 T665 oasc.RequestHandlers.initHandlersFromConfig adding lazy requestHandler: solr.ReplicationHandler
[junit4:junit4]   2> 1252 T665 oasc.RequestHandlers.initHandlersFromConfig created /replication: solr.ReplicationHandler
[junit4:junit4]   2> 1252 T665 oasc.RequestHandlers.initHandlersFromConfig created standard: solr.StandardRequestHandler
[junit4:junit4]   2> 1253 T665 oasc.RequestHandlers.initHandlersFromConfig created /get: solr.RealTimeGetHandler
[junit4:junit4]   2> 1253 T665 oasc.RequestHandlers.initHandlersFromConfig created dismax: solr.SearchHandler
[junit4:junit4]   2> 1254 T665 oasc.RequestHandlers.initHandlersFromConfig created mock: org.apache.solr.core.MockQuerySenderListenerReqHandler
[junit4:junit4]   2> 1254 T665 oasc.RequestHandlers.initHandlersFromConfig created /admin/: org.apache.solr.handler.admin.AdminHandlers
[junit4:junit4]   2> 1254 T665 oasc.RequestHandlers.initHandlersFromConfig created defaults: solr.StandardRequestHandler
[junit4:junit4]   2> 1255 T665 oasc.RequestHandlers.initHandlersFromConfig adding lazy requestHandler: solr.StandardRequestHandler
[junit4:junit4]   2> 1255 T665 oasc.RequestHandlers.initHandlersFromConfig created lazy: solr.StandardRequestHandler
[junit4:junit4]   2> 1256 T665 oasc.RequestHandlers.initHandlersFromConfig created /update: solr.UpdateRequestHandler
[junit4:junit4]   2> 1256 T665 oasc.RequestHandlers.initHandlersFromConfig created /terms: org.apache.solr.handler.component.SearchHandler
[junit4:junit4]   2> 1257 T665 oasc.RequestHandlers.initHandlersFromConfig created spellCheckCompRH: org.apache.solr.handler.component.SearchHandler
[junit4:junit4]   2> 1257 T665 oasc.RequestHandlers.initHandlersFromConfig created spellCheckCompRH_Direct: org.apache.solr.handler.component.SearchHandler
[junit4:junit4]   2> 1257 T665 oasc.RequestHandlers.initHandlersFromConfig created spellCheckWithWordbreak: org.apache.solr.handler.component.SearchHandler
[junit4:junit4]   2> 1258 T665 oasc.RequestHandlers.initHandlersFromConfig created spellCheckWithWordbreak_Direct: org.apache.solr.handler.component.SearchHandler
[junit4:junit4]   2> 1258 T665 oasc.RequestHandlers.initHandlersFromConfig created spellCheckCompRH1: org.apache.solr.handler.component.SearchHandler
[junit4:junit4]   2> 1259 T665 oasc.RequestHandlers.initHandlersFromConfig created tvrh: org.apache.solr.handler.component.SearchHandler
[junit4:junit4]   2> 1259 T665 oasc.RequestHandlers.initHandlersFromConfig created /mlt: solr.MoreLikeThisHandler
[junit4:junit4]   2> 1260 T665 oasc.RequestHandlers.initHandlersFromConfig created /debug/dump: solr.DumpRequestHandler
[junit4:junit4]   2> 1268 T665 oashl.XMLLoader.init xsltCacheLifetimeSeconds=60
[junit4:junit4]   2> 1272 T665 oasc.SolrCore.initDeprecatedSupport WARNING solrconfig.xml uses deprecated <admin/gettableFiles>, Please update your config to use the ShowFileRequestHandler.
[junit4:junit4]   2> 1273 T665 oasc.SolrCore.initDeprecatedSupport WARNING adding ShowFileRequestHandler with hidden files: [SCHEMA.XML, OLD_SYNONYMS.TXT, STOPWORDS.TXT, PROTWORDS.TXT, OPEN-EXCHANGE-RATES.JSON, SYNONYMS.TXT, CURRENCY.XML, MAPPING-ISOLATIN1ACCENT.TXT]
[junit4:junit4]   2> 1276 T665 oass.SolrIndexSearcher.<init> Opening Searcher@58c99850 main
[junit4:junit4]   2> 1277 T665 oasu.CommitTracker.<init> Hard AutoCommit: disabled
[junit4:junit4]   2> 1277 T665 oasu.CommitTracker.<init> Soft AutoCommit: disabled
[junit4:junit4]   2> 1278 T665 oashc.SpellCheckComponent.inform Initializing spell checkers
[junit4:junit4]   2> 1284 T665 oass.DirectSolrSpellChecker.init init: {name=direct,classname=DirectSolrSpellChecker,field=lowerfilt,minQueryLength=3}
[junit4:junit4]   2> 1334 T688 oasc.SolrCore.registerSearcher [collection1] Registered new searcher Searcher@58c99850 main{StandardDirectoryReader(segments_1:1)}
[junit4:junit4]   2> 1337 T670 oazs.PrepRequestProcessor.pRequest Got user-level KeeperException when processing sessionid:0x13a276608d30002 type:create cxid:0x53 zxid:0xfffffffffffffffe txntype:unknown reqpath:n/a Error Path:/solr/overseer/queue Error:KeeperErrorCode = NoNode for /solr/overseer/queue
[junit4:junit4]   2> 1346 T665 oasc.CoreContainer.register registering core: collection1
[junit4:junit4]   2> 1346 T665 oasc.ZkController.register Register shard - core:collection1 address:http://127.0.0.1:33811/solr shardId:control_shard
[junit4:junit4]   2> 1356 T665 oascsi.HttpClientUtil.createClient Creating new http client, config:maxConnections=10000&maxConnectionsPerHost=20&connTimeout=30000&socketTimeout=30000&retry=false
[junit4:junit4]   2> 1371 T665 oascc.SolrZkClient.makePath makePath: /collections/control_collection/leader_elect/control_shard/election
[junit4:junit4]   2> 1386 T670 oazs.PrepRequestProcessor.pRequest Got user-level KeeperException when processing sessionid:0x13a276608d30002 type:delete cxid:0x62 zxid:0xfffffffffffffffe txntype:unknown reqpath:n/a Error Path:/solr/collections/control_collection/leaders Error:KeeperErrorCode = NoNode for /solr/collections/control_collection/leaders
[junit4:junit4]   2> 1387 T665 oasc.ShardLeaderElectionContext.runLeaderProcess Running the leader process.
[junit4:junit4]   2> 1388 T670 oazs.PrepRequestProcessor.pRequest Got user-level KeeperException when processing sessionid:0x13a276608d30002 type:create cxid:0x63 zxid:0xfffffffffffffffe txntype:unknown reqpath:n/a Error Path:/solr/overseer Error:KeeperErrorCode = NodeExists for /solr/overseer
[junit4:junit4]   2> 1532 T686 oascc.ZkStateReader.updateClusterState Updating cloud state from ZooKeeper... 
[junit4:junit4]   2> 1544 T670 oazs.PrepRequestProcessor.pRequest Got user-level KeeperException when processing sessionid:0x13a276608d30002 type:create cxid:0x6a zxid:0xfffffffffffffffe txntype:unknown reqpath:n/a Error Path:/solr/overseer/queue-work Error:KeeperErrorCode = NoNode for /solr/overseer/queue-work
[junit4:junit4]   2> 1578 T685 oascc.ZkStateReader$2.process A cluster state change has occurred - updating...
[junit4:junit4]   2> 1897 T665 oasc.ShardLeaderElectionContext.waitForReplicasToComeUp Enough replicas found to continue.
[junit4:junit4]   2> 1898 T665 oasc.ShardLeaderElectionContext.runLeaderProcess I may be the new leader - try and sync
[junit4:junit4]   2> 1899 T665 oasc.SyncStrategy.sync Sync replicas to http://127.0.0.1:33811/solr/collection1/
[junit4:junit4]   2> 1900 T665 oasc.SyncStrategy.syncReplicas Sync Success - now sync replicas to me
[junit4:junit4]   2> 1900 T665 oasc.SyncStrategy.syncToMe http://127.0.0.1:33811/solr/collection1/ has no replicas
[junit4:junit4]   2> 1901 T665 oasc.ShardLeaderElectionContext.runLeaderProcess I am the new leader: http://127.0.0.1:33811/solr/collection1/
[junit4:junit4]   2> 1901 T665 oascc.SolrZkClient.makePath makePath: /collections/control_collection/leaders/control_shard
[junit4:junit4]   2> 1907 T670 oazs.PrepRequestProcessor.pRequest Got user-level KeeperException when processing sessionid:0x13a276608d30002 type:create cxid:0x88 zxid:0xfffffffffffffffe txntype:unknown reqpath:n/a Error Path:/solr/overseer Error:KeeperErrorCode = NodeExists for /solr/overseer
[junit4:junit4]   2> 2086 T686 oascc.ZkStateReader.updateClusterState Updating cloud state from ZooKeeper... 
[junit4:junit4]   2> 2099 T685 oascc.ZkStateReader$2.process A cluster state change has occurred - updating...
[junit4:junit4]   2> 2121 T665 oasc.ZkController.register We are http://127.0.0.1:33811/solr/collection1/ and leader is http://127.0.0.1:33811/solr/collection1/
[junit4:junit4]   2> 2121 T665 oasc.ZkController.register No LogReplay needed for core=collection1 baseURL=http://127.0.0.1:33811/solr
[junit4:junit4]   2> 2122 T665 oasc.ZkController.checkRecovery I am the leader, no recovery necessary
[junit4:junit4]   2> 2124 T665 oascc.ZkStateReader.updateClusterState Updating cloud state from ZooKeeper... 
[junit4:junit4]   2> 2125 T665 oass.SolrDispatchFilter.init user.dir=/usr/home/hudson/hudson-slave/workspace/Lucene-Solr-Tests-4.x-java7/solr/build/solr-core/test/J0
[junit4:junit4]   2> 2126 T665 oass.SolrDispatchFilter.init SolrDispatchFilter.init() done
[junit4:junit4]   2> 2126 T665 oascsi.HttpClientUtil.createClient Creating new http client, config:maxConnections=128&maxConnectionsPerHost=32&followRedirects=false
[junit4:junit4]   2> 2323 T665 oejs.Server.doStart jetty-8.1.2.v20120308
[junit4:junit4]   2> 2326 T665 oejs.AbstractConnector.doStart Started SocketConnector@0.0.0.0:33814
[junit4:junit4]   2> 2326 T665 oasc.SolrResourceLoader.locateSolrHome JNDI not configured for solr (NoInitialContextEx)
[junit4:junit4]   2> 2327 T665 oasc.SolrResourceLoader.locateSolrHome using system property solr.solr.home: /usr/home/hudson/hudson-slave/workspace/Lucene-Solr-Tests-4.x-java7/solr/build/solr-core/test/J0/./solrtest-jetty1-1349280731428
[junit4:junit4]   2> 2327 T665 oasc.SolrResourceLoader.<init> new SolrResourceLoader for deduced Solr Home: '/usr/home/hudson/hudson-slave/workspace/Lucene-Solr-Tests-4.x-java7/solr/build/solr-core/test/J0/./solrtest-jetty1-1349280731428/'
[junit4:junit4]   2> 2371 T665 oass.SolrDispatchFilter.init SolrDispatchFilter.init()
[junit4:junit4]   2> 2372 T665 oasc.SolrResourceLoader.locateSolrHome JNDI not configured for solr (NoInitialContextEx)
[junit4:junit4]   2> 2373 T665 oasc.SolrResourceLoader.locateSolrHome using system property solr.solr.home: /usr/home/hudson/hudson-slave/workspace/Lucene-Solr-Tests-4.x-java7/solr/build/solr-core/test/J0/./solrtest-jetty1-1349280731428
[junit4:junit4]   2> 2373 T665 oasc.CoreContainer$Initializer.initialize looking for solr.xml: /usr/home/hudson/hudson-slave/workspace/Lucene-Solr-Tests-4.x-java7/solr/build/solr-core/test/J0/./solrtest-jetty1-1349280731428/solr.xml
[junit4:junit4]   2> 2374 T665 oasc.CoreContainer.<init> New CoreContainer 577398170
[junit4:junit4]   2> 2375 T665 oasc.CoreContainer.load Loading CoreContainer using Solr Home: '/usr/home/hudson/hudson-slave/workspace/Lucene-Solr-Tests-4.x-java7/solr/build/solr-core/test/J0/./solrtest-jetty1-1349280731428/'
[junit4:junit4]   2> 2375 T665 oasc.SolrResourceLoader.<init> new SolrResourceLoader for directory: '/usr/home/hudson/hudson-slave/workspace/Lucene-Solr-Tests-4.x-java7/solr/build/solr-core/test/J0/./solrtest-jetty1-1349280731428/'
[junit4:junit4]   2> 2409 T665 oasc.CoreContainer.load Registering Log Listener
[junit4:junit4]   2> 2426 T665 oasc.CoreContainer.initZooKeeper Zookeeper client=127.0.0.1:33808/solr
[junit4:junit4]   2> 2427 T665 oaz.ZooKeeper.<init> Initiating client connection, connectString=127.0.0.1:33808/solr sessionTimeout=5000 watcher=org.apache.solr.common.cloud.ConnectionManager@23e32228
[junit4:junit4]   2> 2428 T698 oaz.ClientCnxn$SendThread.startConnect Opening socket connection to server /127.0.0.1:33808
[junit4:junit4]   2> 2428 T665 oascc.ConnectionManager.waitForConnected Waiting for client to connect to ZooKeeper
[junit4:junit4]   2> 2430 T698 oaz.ClientCnxn$SendThread.primeConnection Socket connection established to localhost/127.0.0.1:33808, initiating session
[junit4:junit4]   2> 2430 T667 oazs.NIOServerCnxn$Factory.run Accepted socket connection from /140.211.11.196:33815
[junit4:junit4]   2> 2430 T667 oazs.NIOServerCnxn.readConnectRequest Client attempting to establish new session at /140.211.11.196:33815
[junit4:junit4]   2> 2433 T669 oazs.NIOServerCnxn.finishSessionInit Established session 0x13a276608d30003 with negotiated timeout 5000 for client /140.211.11.196:33815
[junit4:junit4]   2> 2433 T698 oaz.ClientCnxn$SendThread.readConnectResult Session establishment complete on server localhost/127.0.0.1:33808, sessionid = 0x13a276608d30003, negotiated timeout = 5000
[junit4:junit4]   2> 2433 T699 oascc.ConnectionManager.process Watcher org.apache.solr.common.cloud.ConnectionManager@23e32228 name:ZooKeeperConnection Watcher:127.0.0.1:33808/solr got event WatchedEvent state:SyncConnected type:None path:null path:null type:None
[junit4:junit4]   2> 2433 T665 oascc.ConnectionManager.waitForConnected Client is connected to ZooKeeper
[junit4:junit4]   2> 2434 T670 oazs.PrepRequestProcessor.pRequest Got user-level KeeperException when processing sessionid:0x13a276608d30003 type:create cxid:0x1 zxid:0xfffffffffffffffe txntype:unknown reqpath:n/a Error Path:/solr/overseer Error:KeeperErrorCode = NodeExists for /solr/overseer
[junit4:junit4]   2> 2435 T670 oazs.PrepRequestProcessor.pRequest Got user-level KeeperException when processing sessionid:0x13a276608d30003 type:create cxid:0x2 zxid:0xfffffffffffffffe txntype:unknown reqpath:n/a Error Path:/solr/overseer Error:KeeperErrorCode = NodeExists for /solr/overseer
[junit4:junit4]   2> 2437 T665 oasc.ZkController.createEphemeralLiveNode Register node as live in ZooKeeper:/live_nodes/127.0.0.1:33814_solr
[junit4:junit4]   2> 2438 T670 oazs.PrepRequestProcessor.pRequest Got user-level KeeperException when processing sessionid:0x13a276608d30003 type:delete cxid:0x4 zxid:0xfffffffffffffffe txntype:unknown reqpath:n/a Error Path:/solr/live_nodes/127.0.0.1:33814_solr Error:KeeperErrorCode = NoNode for /solr/live_nodes/127.0.0.1:33814_solr
[junit4:junit4]   2> 2439 T665 oascc.SolrZkClient.makePath makePath: /live_nodes/127.0.0.1:33814_solr
[junit4:junit4]   2> 2442 T685 oascc.ZkStateReader$3.process Updating live nodes
[junit4:junit4]   2> 2443 T665 oashc.HttpShardHandlerFactory.getParameter Setting socketTimeout to: 0
[junit4:junit4]   2> 2443 T665 oashc.HttpShardHandlerFactory.getParameter Setting urlScheme to: http://
[junit4:junit4]   2> 2444 T665 oashc.HttpShardHandlerFactory.getParameter Setting connTimeout to: 0
[junit4:junit4]   2> 2444 T665 oashc.HttpShardHandlerFactory.getParameter Setting maxConnectionsPerHost to: 20
[junit4:junit4]   2> 2444 T665 oashc.HttpShardHandlerFactory.getParameter Setting corePoolSize to: 0
[junit4:junit4]   2> 2445 T665 oashc.HttpShardHandlerFactory.getParameter Setting maximumPoolSize to: 2147483647
[junit4:junit4]   2> 2445 T665 oashc.HttpShardHandlerFactory.getParameter Setting maxThreadIdleTime to: 5
[junit4:junit4]   2> 2446 T665 oashc.HttpShardHandlerFactory.getParameter Setting sizeOfQueue to: -1
[junit4:junit4]   2> 2446 T665 oashc.HttpShardHandlerFactory.getParameter Setting fairnessPolicy to: false
[junit4:junit4]   2> 2447 T665 oascsi.HttpClientUtil.createClient Creating new http client, config:maxConnectionsPerHost=20&maxConnections=10000&socketTimeout=0&connTimeout=0&retry=false
[junit4:junit4]   2> 2473 T665 oascc.ZkStateReader.createClusterStateWatchersAndUpdate Updating cluster state from ZooKeeper... 
[junit4:junit4]   2> 2480 T665 oasc.CoreContainer.create Creating SolrCore 'collection1' using instanceDir: /usr/home/hudson/hudson-slave/workspace/Lucene-Solr-Tests-4.x-java7/solr/build/solr-core/test/J0/./solrtest-jetty1-1349280731428/collection1
[junit4:junit4]   2> 2481 T665 oasc.ZkController.createCollectionZkNode Check for collection zkNode:collection1
[junit4:junit4]   2> 2482 T665 oasc.ZkController.createCollectionZkNode Collection zkNode exists
[junit4:junit4]   2> 2482 T665 oasc.ZkController.readConfigName Load collection config from:/collections/collection1
[junit4:junit4]   2> 2484 T665 oasc.SolrResourceLoader.<init> new SolrResourceLoader for directory: '/usr/home/hudson/hudson-slave/workspace/Lucene-Solr-Tests-4.x-java7/solr/build/solr-core/test/J0/./solrtest-jetty1-1349280731428/collection1/'
[junit4:junit4]   2> 2485 T665 oasc.SolrResourceLoader.replaceClassLoader Adding 'file:/usr/home/hudson/hudson-slave/workspace/Lucene-Solr-Tests-4.x-java7/solr/build/solr-core/test/J0/solrtest-jetty1-1349280731428/collection1/lib/classes/' to classloader
[junit4:junit4]   2> 2486 T665 oasc.SolrResourceLoader.replaceClassLoader Adding 'file:/usr/home/hudson/hudson-slave/workspace/Lucene-Solr-Tests-4.x-java7/solr/build/solr-core/test/J0/solrtest-jetty1-1349280731428/collection1/lib/README' to classloader
[junit4:junit4]   2> 2540 T665 oasc.SolrConfig.<init> Using Lucene MatchVersion: LUCENE_41
[junit4:junit4]   2> 2605 T686 oascc.ZkStateReader.updateClusterState Updating cloud state from ZooKeeper... 
[junit4:junit4]   2> 2636 T665 oasc.SolrConfig.<init> Loaded SolrConfig: solrconfig.xml
[junit4:junit4]   2> 2661 T685 oascc.ZkStateReader$2.process A cluster state change has occurred - updating...
[junit4:junit4]   2> 2742 T699 oascc.ZkStateReader$2.process A cluster state change has occurred - updating...
[junit4:junit4]   2> 2742 T665 oass.IndexSchema.readSchema Reading Solr Schema
[junit4:junit4]   2> 2750 T665 oass.IndexSchema.readSchema Schema name=test
[junit4:junit4]   2> 3438 T665 oass.OpenExchangeRatesOrgProvider.init Initialized with rates=open-exchange-rates.json, refreshInterval=1440.
[junit4:junit4]   2> 3454 T665 oass.IndexSchema.readSchema default search field in schema is text
[junit4:junit4]   2> 3460 T665 oass.IndexSchema.readSchema unique key field: id
[junit4:junit4]   2> 3476 T665 oass.FileExchangeRateProvider.reload Reloading exchange rates from file currency.xml
[junit4:junit4]   2> 3483 T665 oass.FileExchangeRateProvider.reload Reloading exchange rates from file currency.xml
[junit4:junit4]   2> 3488 T665 oass.OpenExchangeRatesOrgProvider.reload Reloading exchange rates from open-exchange-rates.json
[junit4:junit4]   2> 3490 T665 oass.OpenExchangeRatesOrgProvider.reload Reloading exchange rates from open-exchange-rates.json
[junit4:junit4]   2> 3492 T665 oasc.SolrCore.<init> [collection1] Opening new SolrCore at /usr/home/hudson/hudson-slave/workspace/Lucene-Solr-Tests-4.x-java7/solr/build/solr-core/test/J0/./solrtest-jetty1-1349280731428/collection1/, dataDir=./org.apache.solr.cloud.BasicDistributedZkTest-1349280729293/jetty1/
[junit4:junit4]   2> 3492 T665 oasc.JmxMonitoredMap.<init> JMX monitoring is enabled. Adding Solr mbeans to JMX Server: com.sun.jmx.mbeanserver.JmxMBeanServer@2e6a317
[junit4:junit4]   2> 3494 T665 oasc.SolrCore.getNewIndexDir New index directory detected: old=null new=./org.apache.solr.cloud.BasicDistributedZkTest-1349280729293/jetty1/index/
[junit4:junit4]   2> 3495 T665 oasc.SolrCore.initIndex WARNING [collection1] Solr index directory './org.apache.solr.cloud.BasicDistributedZkTest-1349280729293/jetty1/index' doesn't exist. Creating new index...
[junit4:junit4]   2> 3496 T665 oasc.CachingDirectoryFactory.get return new directory for /usr/home/hudson/hudson-slave/workspace/Lucene-Solr-Tests-4.x-java7/solr/build/solr-core/test/J0/./org.apache.solr.cloud.BasicDistributedZkTest-1349280729293/jetty1/index forceNew:false
[junit4:junit4]   2> 3516 T665 oasc.SolrDeletionPolicy.onCommit SolrDeletionPolicy.onCommit: commits:num=1
[junit4:junit4]   2> 		commit{dir=NRTCachingDirectory(org.apache.lucene.store.NIOFSDirectory@/usr/home/hudson/hudson-slave/workspace/Lucene-Solr-Tests-4.x-java7/solr/build/solr-core/test/J0/org.apache.solr.cloud.BasicDistributedZkTest-1349280729293/jetty1/index lockFactory=org.apache.lucene.store.NativeFSLockFactory@7c9ef10; maxCacheMB=48.0 maxMergeSizeMB=4.0),segFN=segments_1,generation=1,filenames=[segments_1]
[junit4:junit4]   2> 3516 T665 oasc.SolrDeletionPolicy.updateCommits newest commit = 1
[junit4:junit4]   2> 3518 T665 oasc.SolrCore.initWriters created xml: solr.XMLResponseWriter
[junit4:junit4]   2> 3520 T665 oasup.UpdateRequestProcessorChain.init inserting DistributedUpdateProcessorFactory into updateRequestProcessorChain "dedupe"
[junit4:junit4]   2> 3521 T665 oasup.UpdateRequestProcessorChain.init inserting DistributedUpdateProcessorFactory into updateRequestProcessorChain "dedupe-allfields"
[junit4:junit4]   2> 3522 T665 oasup.UpdateRequestProcessorChain.init inserting DistributedUpdateProcessorFactory into updateRequestProcessorChain "stored_sig"
[junit4:junit4]   2> 3522 T665 oasup.UpdateRequestProcessorChain.init inserting DistributedUpdateProcessorFactory into updateRequestProcessorChain "uniq-fields"
[junit4:junit4]   2> 3523 T665 oasup.UpdateRequestProcessorChain.init inserting DistributedUpdateProcessorFactory into updateRequestProcessorChain "distrib-dup-test-chain-implicit"
[junit4:junit4]   2> 3524 T665 oasc.RequestHandlers.initHandlersFromConfig adding lazy requestHandler: solr.ReplicationHandler
[junit4:junit4]   2> 3524 T665 oasc.RequestHandlers.initHandlersFromConfig created /replication: solr.ReplicationHandler
[junit4:junit4]   2> 3525 T665 oasc.RequestHandlers.initHandlersFromConfig created standard: solr.StandardRequestHandler
[junit4:junit4]   2> 3526 T665 oasc.RequestHandlers.initHandlersFromConfig created /get: solr.RealTimeGetHandler
[junit4:junit4]   2> 3527 T665 oasc.RequestHandlers.initHandlersFromConfig created dismax: solr.SearchHandler
[junit4:junit4]   2> 3528 T665 oasc.RequestHandlers.initHandlersFromConfig created mock: org.apache.solr.core.MockQuerySenderListenerReqHandler
[junit4:junit4]   2> 3528 T665 oasc.RequestHandlers.initHandlersFromConfig created /admin/: org.apache.solr.handler.admin.AdminHandlers
[junit4:junit4]   2> 3529 T665 oasc.RequestHandlers.initHandlersFromConfig created defaults: solr.StandardRequestHandler
[junit4:junit4]   2> 3530 T665 oasc.RequestHandlers.initHandlersFromConfig adding lazy requestHandler: solr.StandardRequestHandler
[junit4:junit4]   2> 3530 T665 oasc.RequestHandlers.initHandlersFromConfig created lazy: solr.StandardRequestHandler
[junit4:junit4]   2> 3531 T665 oasc.RequestHandlers.initHandlersFromConfig created /update: solr.UpdateRequestHandler
[junit4:junit4]   2> 3532 T665 oasc.RequestHandlers.initHandlersFromConfig created /terms: org.apache.solr.handler.component.SearchHandler
[junit4:junit4]   2> 3533 T665 oasc.RequestHandlers.initHandlersFromConfig created spellCheckCompRH: org.apache.solr.handler.component.SearchHandler
[junit4:junit4]   2> 3533 T665 oasc.RequestHandlers.initHandlersFromConfig created spellCheckCompRH_Direct: org.apache.solr.handler.component.SearchHandler
[junit4:junit4]   2> 3534 T665 oasc.RequestHandlers.initHandlersFromConfig created spellCheckWithWordbreak: org.apache.solr.handler.component.SearchHandler
[junit4:junit4]   2> 3535 T665 oasc.RequestHandlers.initHandlersFromConfig created spellCheckWithWordbreak_Direct: org.apache.solr.handler.component.SearchHandler
[junit4:junit4]   2> 3536 T665 oasc.RequestHandlers.initHandlersFromConfig created spellCheckCompRH1: org.apache.solr.handler.component.SearchHandler
[junit4:junit4]   2> 3536 T665 oasc.RequestHandlers.initHandlersFromConfig created tvrh: org.apache.solr.handler.component.SearchHandler
[junit4:junit4]   2> 3537 T665 oasc.RequestHandlers.initHandlersFromConfig created /mlt: solr.MoreLikeThisHandler
[junit4:junit4]   2> 3538 T665 oasc.RequestHandlers.initHandlersFromConfig created /debug/dump: solr.DumpRequestHandler
[junit4:junit4]   2> 3553 T665 oashl.XMLLoader.init xsltCacheLifetimeSeconds=60
[junit4:junit4]   2> 3559 T665 oasc.SolrCore.initDeprecatedSupport WARNING solrconfig.xml uses deprecated <admin/gettableFiles>, Please update your config to use the ShowFileRequestHandler.
[junit4:junit4]   2> 3560 T665 oasc.SolrCore.initDeprecatedSupport WARNING adding ShowFileRequestHandler with hidden files: [SCHEMA.XML, OLD_SYNONYMS.TXT, STOPWORDS.TXT, PROTWORDS.TXT, OPEN-EXCHANGE-RATES.JSON, SYNONYMS.TXT, CURRENCY.XML, MAPPING-ISOLATIN1ACCENT.TXT]
[junit4:junit4]   2> 3565 T665 oass.SolrIndexSearcher.<init> Opening Searcher@12bcd38f main
[junit4:junit4]   2> 3566 T665 oasu.CommitTracker.<init> Hard AutoCommit: disabled
[junit4:junit4]   2> 3567 T665 oasu.CommitTracker.<init> Soft AutoCommit: disabled
[junit4:junit4]   2> 3567 T665 oashc.SpellCheckComponent.inform Initializing spell checkers
[junit4:junit4]   2> 3582 T665 oass.DirectSolrSpellChecker.init init: {name=direct,classname=DirectSolrSpellChecker,field=lowerfilt,minQueryLength=3}
[junit4:junit4]   2> 3630 T700 oasc.SolrCore.registerSearcher [collection1] Registered new searcher Searcher@12bcd38f main{StandardDirectoryReader(segments_1:1)}
[junit4:junit4]   2> 3669 T686 oascc.ZkStateReader.updateClusterState Updating cloud state from ZooKeeper... 
[junit4:junit4]   2> 3691 T685 oascc.ZkStateReader$2.process A cluster state change has occurred - updating...
[junit4:junit4]   2> 3691 T699 oascc.ZkStateReader$2.process A cluster state change has occurred - updating...
[junit4:junit4]   2> 4139 T665 oasc.CoreContainer.register registering core: collection1
[junit4:junit4]   2> 4139 T665 oasc.ZkController.register Register shard - core:collection1 address:http://127.0.0.1:33814/solr shardId:shard1
[junit4:junit4]   2> 4141 T665 oascc.SolrZkClient.makePath makePath: /collections/collection1/leader_elect/shard1/election
[junit4:junit4]   2> 4168 T670 oazs.PrepRequestProcessor.pRequest Got user-level KeeperException when processing sessionid:0x13a276608d30003 type:delete cxid:0x43 zxid:0xfffffffffffffffe txntype:unknown reqpath:n/a Error Path:/solr/collections/collection1/leaders Error:KeeperErrorCode = NoNode for /solr/collections/collection1/leaders
[junit4:junit4]   2> 4178 T665 oasc.ShardLeaderElectionContext.runLeaderProcess Running the leader process.
[junit4:junit4]   2> 4179 T670 oazs.PrepRequestProcessor.pRequest Got user-level KeeperException when processing sessionid:0x13a276608d30003 type:create cxid:0x44 zxid:0xfffffffffffffffe txntype:unknown reqpath:n/a Error Path:/solr/overseer Error:KeeperErrorCode = NodeExists for /solr/overseer
[junit4:junit4]   2> 4188 T665 oasc.ShardLeaderElectionContext.waitForReplicasToComeUp Enough replicas found to continue.
[junit4:junit4]   2> 4188 T665 oasc.ShardLeaderElectionContext.runLeaderProcess I may be the new leader - try and sync
[junit4:junit4]   2> 4188 T665 oasc.SyncStrategy.sync Sync replicas to http://127.0.0.1:33814/solr/collection1/
[junit4:junit4]   2> 4189 T665 oasc.SyncStrategy.syncReplicas Sync Success - now sync replicas to me
[junit4:junit4]   2> 4189 T665 oasc.SyncStrategy.syncToMe http://127.0.0.1:33814/solr/collection1/ has no replicas
[junit4:junit4]   2> 4190 T665 oasc.ShardLeaderElectionContext.runLeaderProcess I am the new leader: http://127.0.0.1:33814/solr/collection1/
[junit4:junit4]   2> 4190 T665 oascc.SolrZkClient.makePath makePath: /collections/collection1/leaders/shard1
[junit4:junit4]   2> 4195 T670 oazs.PrepRequestProcessor.pRequest Got user-level KeeperException when processing sessionid:0x13a276608d30003 type:create cxid:0x4e zxid:0xfffffffffffffffe txntype:unknown reqpath:n/a Error Path:/solr/overseer Error:KeeperErrorCode = NodeExists for /solr/overseer
[junit4:junit4]   2> 4206 T686 oascc.ZkStateReader.updateClusterState Updating cloud state from ZooKeeper... 
[junit4:junit4]   2> 4220 T685 oascc.ZkStateReader$2.process A cluster state change has occurred - updating...
[junit4:junit4]   2> 4220 T699 oascc.ZkStateReader$2.process A cluster state change has occurred - updating...
[junit4:junit4]   2> 4257 T665 oasc.ZkController.register We are http://127.0.0.1:33814/solr/collection1/ and leader is http://127.0.0.1:33814/solr/collection1/
[junit4:junit4]   2> 4257 T665 oasc.ZkController.register No LogReplay needed for core=collection1 baseURL=http://127.0.0.1:33814/solr
[junit4:junit4]   2> 4258 T665 oasc.ZkController.checkRecovery I am the leader, no recovery necessary
[junit4:junit4]   2> 4260 T665 oascc.ZkStateReader.updateClusterState Updating cloud state from ZooKeeper... 
[junit4:junit4]   2> 4261 T665 oass.SolrDispatchFilter.init user.dir=/usr/home/hudson/hudson-slave/workspace/Lucene-Solr-Tests-4.x-java7/solr/build/solr-core/test/J0
[junit4:junit4]   2> 4262 T665 oass.SolrDispatchFilter.init SolrDispatchFilter.init() done
[junit4:junit4]   2> 4262 T665 oascsi.HttpClientUtil.createClient Creating new http client, config:maxConnections=128&maxConnectionsPerHost=32&followRedirects=false
[junit4:junit4]   2> 4472 T665 oejs.Server.doStart jetty-8.1.2.v20120308
[junit4:junit4]   2> 4475 T665 oejs.AbstractConnector.doStart Started SocketConnector@0.0.0.0:33823
[junit4:junit4]   2> 4476 T665 oasc.SolrResourceLoader.locateSolrHome JNDI not configured for solr (NoInitialContextEx)
[junit4:junit4]   2> 4477 T665 oasc.SolrResourceLoader.locateSolrHome using system property solr.solr.home: /usr/home/hudson/hudson-slave/workspace/Lucene-Solr-Tests-4.x-java7/solr/build/solr-core/test/J0/./solrtest-jetty2-1349280733569
[junit4:junit4]   2> 4477 T665 oasc.SolrResourceLoader.<init> new SolrResourceLoader for deduced Solr Home: '/usr/home/hudson/hudson-slave/workspace/Lucene-Solr-Tests-4.x-java7/solr/build/solr-core/test/J0/./solrtest-jetty2-1349280733569/'
[junit4:junit4]   2> 4534 T665 oass.SolrDispatchFilter.init SolrDispatchFilter.init()
[junit4:junit4]   2> 4534 T665 oasc.SolrResourceLoader.locateSolrHome JNDI not configured for solr (NoInitialContextEx)
[junit4:junit4]   2> 4535 T665 oasc.SolrResourceLoader.locateSolrHome using system property solr.solr.home: /usr/home/hudson/hudson-slave/workspace/Lucene-Solr-Tests-4.x-java7/solr/build/solr-core/test/J0/./solrtest-jetty2-1349280733569
[junit4:junit4]   2> 4535 T665 oasc.CoreContainer$Initializer.initialize looking for solr.xml: /usr/home/hudson/hudson-slave/workspace/Lucene-Solr-Tests-4.x-java7/solr/build/solr-core/test/J0/./solrtest-jetty2-1349280733569/solr.xml
[junit4:junit4]   2> 4536 T665 oasc.CoreContainer.<init> New CoreContainer 231394049
[junit4:junit4]   2> 4536 T665 oasc.CoreContainer.load Loading CoreContainer using Solr Home: '/usr/home/hudson/hudson-slave/workspace/Lucene-Solr-Tests-4.x-java7/solr/build/solr-core/test/J0/./solrtest-jetty2-1349280733569/'
[junit4:junit4]   2> 4537 T665 oasc.SolrResourceLoader.<init> new SolrResourceLoader for directory: '/usr/home/hudson/hudson-slave/workspace/Lucene-Solr-Tests-4.x-java7/solr/build/solr-core/test/J0/./solrtest-jetty2-1349280733569/'
[junit4:junit4]   2> 4570 T665 oasc.CoreContainer.load Registering Log Listener
[junit4:junit4]   2> 4587 T665 oasc.CoreContainer.initZooKeeper Zookeeper client=127.0.0.1:33808/solr
[junit4:junit4]   2> 4588 T665 oaz.ZooKeeper.<init> Initiating client connection, connectString=127.0.0.1:33808/solr sessionTimeout=5000 watcher=org.apache.solr.common.cloud.ConnectionManager@3ef6c747
[junit4:junit4]   2> 4589 T710 oaz.ClientCnxn$SendThread.startConnect Opening socket connection to server /127.0.0.1:33808
[junit4:junit4]   2> 4589 T665 oascc.ConnectionManager.waitForConnected Waiting for client to connect to ZooKeeper
[junit4:junit4]   2> 4590 T667 oazs.NIOServerCnxn$Factory.run Accepted socket connection from /140.211.11.196:33824
[junit4:junit4]   2> 4591 T710 oaz.ClientCnxn$SendThread.primeConnection Socket connection established to localhost/127.0.0.1:33808, initiating session
[junit4:junit4]   2> 4591 T667 oazs.NIOServerCnxn.readConnectRequest Client attempting to establish new session at /140.211.11.196:33824
[junit4:junit4]   2> 4593 T669 oazs.NIOServerCnxn.finishSessionInit Established session 0x13a276608d30004 with negotiated timeout 5000 for client /140.211.11.196:33824
[junit4:junit4]   2> 4593 T710 oaz.ClientCnxn$SendThread.readConnectResult Session establishment complete on server localhost/127.0.0.1:33808, sessionid = 0x13a276608d30004, negotiated timeout = 5000
[junit4:junit4]   2> 4594 T711 oascc.ConnectionManager.process Watcher org.apache.solr.common.cloud.ConnectionManager@3ef6c747 name:ZooKeeperConnection Watcher:127.0.0.1:33808/solr got event WatchedEvent state:SyncConnected type:None path:null path:null type:None
[junit4:junit4]   2> 4594 T665 oascc.ConnectionManager.waitForConnected Client is connected to ZooKeeper
[junit4:junit4]   2> 4595 T670 oazs.PrepRequestProcessor.pRequest Got user-level KeeperException when processing sessionid:0x13a276608d30004 type:create cxid:0x1 zxid:0xfffffffffffffffe txntype:unknown reqpath:n/a Error Path:/solr/overseer Error:KeeperErrorCode = NodeExists for /solr/overseer
[junit4:junit4]   2> 4596 T670 oazs.PrepRequestProcessor.pRequest Got user-level KeeperException when processing sessionid:0x13a276608d30004 type:create cxid:0x2 zxid:0xfffffffffffffffe txntype:unknown reqpath:n/a Error Path:/solr/overseer Error:KeeperErrorCode = NodeExists for /solr/overseer
[junit4:junit4]   2> 4606 T665 oasc.ZkController.createEphemeralLiveNode Register node as live in ZooKeeper:/live_nodes/127.0.0.1:33823_solr
[junit4:junit4]   2> 4607 T670 oazs.PrepRequestProcessor.pRequest Got user-level KeeperException when processing sessionid:0x13a276608d30004 type:delete cxid:0x4 zxid:0xfffffffffffffffe txntype:unknown reqpath:n/a Error Path:/solr/live_nodes/127.0.0.1:33823_solr Error:KeeperErrorCode = NoNode for /solr/live_nodes/127.0.0.1:33823_solr
[junit4:junit4]   2> 4608 T665 oascc.SolrZkClient.makePath makePath: /live_nodes/127.0.0.1:33823_solr
[junit4:junit4]   2> 4611 T699 oascc.ZkStateReader$3.process Updating live nodes
[junit4:junit4]   2> 4611 T685 oascc.ZkStateReader$3.process Updating live nodes
[junit4:junit4]   2> 4613 T665 oashc.HttpShardHandlerFactory.getParameter Setting socketTimeout to: 0
[junit4:junit4]   2> 4613 T665 oashc.HttpShardHandlerFactory.getParameter Setting urlScheme to: http://
[junit4:junit4]   2> 4614 T665 oashc.HttpShardHandlerFactory.getParameter Setting connTimeout to: 0
[junit4:junit4]   2> 4614 T665 oashc.HttpShardHandlerFactory.getParameter Setting maxConnectionsPerHost to: 20
[junit4:junit4]   2> 4615 T665 oashc.HttpShardHandlerFactory.getParameter Setting corePoolSize to: 0
[junit4:junit4]   2> 4615 T665 oashc.HttpShardHandlerFactory.getParameter Setting maximumPoolSize to: 2147483647
[junit4:junit4]   2> 4616 T665 oashc.HttpShardHandlerFactory.getParameter Setting maxThreadIdleTime to: 5
[junit4:junit4]   2> 4616 T665 oashc.HttpShardHandlerFactory.getParameter Setting sizeOfQueue to: -1
[junit4:junit4]   2> 4617 T665 oashc.HttpShardHandlerFactory.getParameter Setting fairnessPolicy to: false
[junit4:junit4]   2> 4617 T665 oascsi.HttpClientUtil.createClient Creating new http client, config:maxConnectionsPerHost=20&maxConnections=10000&socketTimeout=0&connTimeout=0&retry=false
[junit4:junit4]   2> 4637 T665 oascc.ZkStateReader.createClusterStateWatchersAndUpdate Updating cluster state from ZooKeeper... 
[junit4:junit4]   2> 4645 T665 oasc.CoreContainer.create Creating SolrCore 'collection1' using instanceDir: /usr/home/hudson/hudson-slave/workspace/Lucene-Solr-Tests-4.x-java7/solr/build/solr-core/test/J0/./solrtest-jetty2-1349280733569/collection1
[junit4:junit4]   2> 4646 T665 oasc.ZkController.createCollectionZkNode Check for collection zkNode:collection1
[junit4:junit4]   2> 4647 T665 oasc.ZkController.createCollectionZkNode Collection zkNode exists
[junit4:junit4]   2> 4647 T665 oasc.ZkController.readConfigName Load collection config from:/collections/collection1
[junit4:junit4]   2> 4649 T665 oasc.SolrResourceLoader.<init> new SolrResourceLoader for directory: '/usr/home/hudson/hudson-slave/workspace/Lucene-Solr-Tests-4.x-java7/solr/build/solr-core/test/J0/./solrtest-jetty2-1349280733569/collection1/'
[junit4:junit4]   2> 4651 T665 oasc.SolrResourceLoader.replaceClassLoader Adding 'file:/usr/home/hudson/hudson-slave/workspace/Lucene-Solr-Tests-4.x-java7/solr/build/solr-core/test/J0/solrtest-jetty2-1349280733569/collection1/lib/classes/' to classloader
[junit4:junit4]   2> 4652 T665 oasc.SolrResourceLoader.replaceClassLoader Adding 'file:/usr/home/hudson/hudson-slave/workspace/Lucene-Solr-Tests-4.x-java7/solr/build/solr-core/test/J0/solrtest-jetty2-1349280733569/collection1/lib/README' to classloader
[junit4:junit4]   2> 4705 T665 oasc.SolrConfig.<init> Using Lucene MatchVersion: LUCENE_41
[junit4:junit4]   2> 4727 T686 oascc.ZkStateReader.updateClusterState Updating cloud state from ZooKeeper... 
[junit4:junit4]   2> 4740 T711 oascc.ZkStateReader$2.process A cluster state change has occurred - updating...
[junit4:junit4]   2> 4740 T699 oascc.ZkStateReader$2.process A cluster state change has occurred - updating...
[junit4:junit4]   2> 4740 T685 oascc.ZkStateReader$2.process A cluster state change has occurred - updating...
[junit4:junit4]   2> 4785 T665 oasc.SolrConfig.<init> Loaded SolrConfig: solrconfig.xml
[junit4:junit4]   2> 4887 T665 oass.IndexSchema.readSchema Reading Solr Schema
[junit4:junit4]   2> 4894 T665 oass.IndexSchema.readSchema Schema name=test
[junit4:junit4]   2> 5535 T665 oass.OpenExchangeRatesOrgProvider.init Initialized with rates=open-exchange-rates.json, refreshInterval=1440.
[junit4:junit4]   2> 5548 T665 oass.IndexSchema.readSchema default search field in schema is text
[junit4:junit4]   2> 5552 T665 oass.IndexSchema.readSchema unique key field: id
[junit4:junit4]   2> 5571 T665 oass.FileExchangeRateProvider.reload Reloading exchange rates from file currency.xml
[junit4:junit4]   2> 5578 T665 oass.FileExchangeRateProvider.reload Reloading exchange rates from file currency.xml
[junit4:junit4]   2> 5584 T665 oass.OpenExchangeRatesOrgProvider.reload Reloading exchange rates from open-exchange-rates.json
[junit4:junit4]   2> 5586 T665 oass.OpenExchangeRatesOrgProvider.reload Reloading exchange rates from open-exchange-rates.json
[junit4:junit4]   2> 5588 T665 oasc.SolrCore.<init> [collection1] Opening new SolrCore at /usr/home/hudson/hudson-slave/workspace/Lucene-Solr-Tests-4.x-java7/solr/build/solr-core/test/J0/./solrtest-jetty2-1349280733569/collection1/, dataDir=./org.apache.solr.cloud.BasicDistributedZkTest-1349280729293/jetty2/
[junit4:junit4]   2> 5589 T665 oasc.JmxMonitoredMap.<init> JMX monitoring is enabled. Adding Solr mbeans to JMX Server: com.sun.jmx.mbeanserver.JmxMBeanServer@2e6a317
[junit4:junit4]   2> 5590 T665 oasc.SolrCore.getNewIndexDir New index directory detected: old=null new=./org.apache.solr.cloud.BasicDistributedZkTest-1349280729293/jetty2/index/
[junit4:junit4]   2> 5591 T665 oasc.SolrCore.initIndex WARNING [collection1] Solr index directory './org.apache.solr.cloud.BasicDistributedZkTest-1349280729293/jetty2/index' doesn't exist. Creating new index...
[junit4:junit4]   2> 5592 T665 oasc.CachingDirectoryFactory.get return new directory for /usr/home/hudson/hudson-slave/workspace/Lucene-Solr-Tests-4.x-java7/solr/build/solr-core/test/J0/./org.apache.solr.cloud.BasicDistributedZkTest-1349280729293/jetty2/index forceNew:false
[junit4:junit4]   2> 5600 T665 oasc.SolrDeletionPolicy.onCommit SolrDeletionPolicy.onCommit: commits:num=1
[junit4:junit4]   2> 		commit{dir=NRTCachingDirectory(org.apache.lucene.store.NIOFSDirectory@/usr/home/hudson/hudson-slave/workspace/Lucene-Solr-Tests-4.x-java7/solr/build/solr-core/test/J0/org.apache.solr.cloud.BasicDistributedZkTest-1349280729293/jetty2/index lockFactory=org.apache.lucene.store.NativeFSLockFactory@11d83d0b; maxCacheMB=48.0 maxMergeSizeMB=4.0),segFN=segments_1,generation=1,filenames=[segments_1]
[junit4:junit4]   2> 5601 T665 oasc.SolrDeletionPolicy.updateCommits newest commit = 1
[junit4:junit4]   2> 5602 T665 oasc.SolrCore.initWriters created xml: solr.XMLResponseWriter
[junit4:junit4]   2> 5605 T665 oasup.UpdateRequestProcessorChain.init inserting DistributedUpdateProcessorFactory into updateRequestProcessorChain "dedupe"
[junit4:junit4]   2> 5605 T665 oasup.UpdateRequestProcessorChain.init inserting DistributedUpdateProcessorFactory into updateRequestProcessorChain "dedupe-allfields"
[junit4:junit4]   2> 5606 T665 oasup.UpdateRequestProcessorChain.init inserting DistributedUpdateProcessorFactory into updateRequestProcessorChain "stored_sig"
[junit4:junit4]   2> 5607 T665 oasup.UpdateRequestProcessorChain.init inserting DistributedUpdateProcessorFactory into updateRequestProcessorChain "uniq-fields"
[junit4:junit4]   2> 5607 T665 oasup.UpdateRequestProcessorChain.init inserting DistributedUpdateProcessorFactory into updateRequestProcessorChain "distrib-dup-test-chain-implicit"
[junit4:junit4]   2> 5608 T665 oasc.RequestHandlers.initHandlersFromConfig adding lazy requestHandler: solr.ReplicationHandler
[junit4:junit4]   2> 5609 T665 oasc.RequestHandlers.initHandlersFromConfig created /replication: solr.ReplicationHandler
[junit4:junit4]   2> 5609 T665 oasc.RequestHandlers.initHandlersFromConfig created standard: solr.StandardRequestHandler
[junit4:junit4]   2> 5610 T665 oasc.RequestHandlers.initHandlersFromConfig created /get: solr.RealTimeGetHandler
[junit4:junit4]   2> 5611 T665 oasc.RequestHandlers.initHandlersFromConfig created dismax: solr.SearchHandler
[junit4:junit4]   2> 5612 T665 oasc.RequestHandlers.initHandlersFromConfig created mock: org.apache.solr.core.MockQuerySenderListenerReqHandler
[junit4:junit4]   2> 5613 T665 oasc.RequestHandlers.initHandlersFromConfig created /admin/: org.apache.solr.handler.admin.AdminHandlers
[junit4:junit4]   2> 5613 T665 oasc.RequestHandlers.initHandlersFromConfig created defaults: solr.StandardRequestHandler
[junit4:junit4]   2> 5614 T665 oasc.RequestHandlers.initHandlersFromConfig adding lazy requestHandler: solr.StandardRequestHandler
[junit4:junit4]   2> 5615 T665 oasc.RequestHandlers.initHandlersFromConfig created lazy: solr.StandardRequestHandler
[junit4:junit4]   2> 5615 T665 oasc.RequestHandlers.initHandlersFromConfig created /update: solr.UpdateRequestHandler
[junit4:junit4]   2> 5616 T665 oasc.RequestHandlers.initHandlersFromConfig created /terms: org.apache.solr.handler.component.SearchHandler
[junit4:junit4]   2> 5617 T665 oasc.RequestHandlers.initHandlersFromConfig created spellCheckCompRH: org.apache.solr.handler.component.SearchHandler
[junit4:junit4]   2> 5618 T665 oasc.RequestHandlers.initHandlersFromConfig created spellCheckCompRH_Direct: org.apache.solr.handler.component.SearchHandler
[junit4:junit4]   2> 5618 T665 oasc.RequestHandlers.initHandlersFromConfig created spellCheckWithWordbreak: org.apache.solr.handler.component.SearchHandler
[junit4:junit4]   2> 5619 T665 oasc.RequestHandlers.initHandlersFromConfig created spellCheckWithWordbreak_Direct: org.apache.solr.handler.component.SearchHandler
[junit4:junit4]   2> 5620 T665 oasc.RequestHandlers.initHandlersFromConfig created spellCheckCompRH1: org.apache.solr.handler.component.SearchHandler
[junit4:junit4]   2> 5621 T665 oasc.RequestHandlers.initHandlersFromConfig created tvrh: org.apache.solr.handler.component.SearchHandler
[junit4:junit4]   2> 5622 T665 oasc.RequestHandlers.initHandlersFromConfig created /mlt: solr.MoreLikeThisHandler
[junit4:junit4]   2> 5622 T665 oasc.RequestHandlers.initHandlersFromConfig created /debug/dump: solr.DumpRequestHandler
[junit4:junit4]   2> 5635 T665 oashl.XMLLoader.init xsltCacheLifetimeSeconds=60
[junit4:junit4]   2> 5640 T665 oasc.SolrCore.initDeprecatedSupport WARNING solrconfig.xml uses deprecated <admin/gettableFiles>, Please update your config to use the ShowFileRequestHandler.
[junit4:junit4]   2> 5642 T665 oasc.SolrCore.initDeprecatedSupport WARNING adding ShowFileRequestHandler with hidden files: [SCHEMA.XML, OLD_SYNONYMS.TXT, STOPWORDS.TXT, PROTWORDS.TXT, OPEN-EXCHANGE-RATES.JSON, SYNONYMS.TXT, CURRENCY.XML, MAPPING-ISOLATIN1ACCENT.TXT]
[junit4:junit4]   2> 5647 T665 oass.SolrIndexSearcher.<init> Opening Searcher@5591f06b main
[junit4:junit4]   2> 5648 T665 oasu.CommitTracker.<init> Hard AutoCommit: disabled
[junit4:junit4]   2> 5649 T665 oasu.CommitTracker.<init> Soft AutoCommit: disabled
[junit4:junit4]   2> 5650 T665 oashc.SpellCheckComponent.inform Initializing spell checkers
[junit4:junit4]   2> 5658 T665 oass.DirectSolrSpellChecker.init init: {name=direct,classname=DirectSolrSpellChecker,field=lowerfilt,minQueryLength=3}
[junit4:junit4]   2> 5713 T712 oasc.SolrCore.registerSearcher [collection1] Registered new searcher Searcher@5591f06b main{StandardDirectoryReader(segments_1:1)}
[junit4:junit4]   2> 5751 T686 oascc.ZkStateReader.updateClusterState Updating cloud state from ZooKeeper... 
[junit4:junit4]   2> 5759 T711 oascc.ZkStateReader$2.process A cluster state change has occurred - updating...
[junit4:junit4]   2> 5759 T699 oascc.ZkStateReader$2.process A cluster state change has occurred - updating...
[junit4:junit4]   2> 5760 T685 oascc.ZkStateReader$2.process A cluster state change has occurred - updating...
[junit4:junit4]   2> 6222 T665 oasc.CoreContainer.register registering core: collection1
[junit4:junit4]   2> 6222 T665 oasc.ZkController.register Register shard - core:collection1 address:http://127.0.0.1:33823/solr shardId:shard2
[junit4:junit4]   2> 6223 T665 oascc.SolrZkClient.makePath makePath: /collections/collection1/leader_elect/shard2/election
[junit4:junit4]   2> 6239 T670 oazs.PrepRequestProcessor.pRequest Got user-level KeeperException when processing sessionid:0x13a276608d30004 type:delete cxid:0x42 zxid:0xfffffffffffffffe txntype:unknown reqpath:n/a Error Path:/solr/collections/collection1/leaders/shard2 Error:KeeperErrorCode = NoNode for /solr/collections/collection1/leaders/shard2
[junit4:junit4]   2> 6245 T665 oasc.ShardLeaderElectionContext.runLeaderProcess Running the leader process.
[junit4:junit4]   2> 6245 T670 oazs.PrepRequestProcessor.pRequest Got user-level KeeperException when processing sessionid:0x13a276608d30004 type:create cxid:0x43 zxid:0xfffffffffffffffe txntype:unknown reqpath:n/a Error Path:/solr/overseer Error:KeeperErrorCode = NodeExists for /solr/overseer
[junit4:junit4]   2> 6248 T665 oasc.ShardLeaderElectionContext.waitForReplicasToComeUp Enough replicas found to continue.
[junit4:junit4]   2> 6248 T665 oasc.ShardLeaderElectionContext.runLeaderProcess I may be the new leader - try and sync
[junit4:junit4]   2> 6248 T665 oasc.SyncStrategy.sync Sync replicas to http://127.0.0.1:33823/solr/collection1/
[junit4:junit4]   2> 6249 T665 oasc.SyncStrategy.syncReplicas Sync Success - now sync replicas to me
[junit4:junit4]   2> 6249 T665 oasc.SyncStrategy.syncToMe http://127.0.0.1:33823/solr/collection1/ has no replicas
[junit4:junit4]   2> 6249 T665 oasc.ShardLeaderElectionContext.runLeaderProcess I am the new leader: http://127.0.0.1:33823/solr/collection1/
[junit4:junit4]   2> 6250 T665 oascc.SolrZkClient.makePath makePath: /collections/collection1/leaders/shard2
[junit4:junit4]   2> 6253 T670 oazs.PrepRequestProcessor.pRequest Got user-level KeeperException when processing sessionid:0x13a276608d30004 type:create cxid:0x4c zxid:0xfffffffffffffffe txntype:unknown reqpath:n/a Error Path:/solr/overseer Error:KeeperErrorCode = NodeExists for /solr/overseer
[junit4:junit4]   2> 6277 T686 oascc.ZkStateReader.updateClusterState Updating cloud state from ZooKeeper... 
[junit4:junit4]   2> 6293 T711 oascc.ZkStateReader$2.process A cluster state change has occurred - updating...
[junit4:junit4]   2> 6293 T685 oascc.ZkStateReader$2.process A cluster state change has occurred - updating...
[junit4:junit4]   2> 6293 T699 oascc.ZkStateReader$2.process A cluster state change has occurred - updating...
[junit4:junit4]   2> 6313 T665 oasc.ZkController.register We are http://127.0.0.1:33823/solr/collection1/ and leader is http://127.0.0.1:33823/solr/collection1/
[junit4:junit4]   2> 6313 T665 oasc.ZkController.register No LogReplay needed for core=collection1 baseURL=http://127.0.0.1:33823/solr
[junit4:junit4]   2> 6314 T665 oasc.ZkController.checkRecovery I am the leader, no recovery necessary
[junit4:junit4]   2> 6316 T665 oascc.ZkStateReader.updateClusterState Updating cloud state from ZooKeeper... 
[junit4:junit4]   2> 6317 T665 oass.SolrDispatchFilter.init user.dir=/usr/home/hudson/hudson-slave/workspace/Lucene-Solr-Tests-4.x-java7/solr/build/solr-core/test/J0
[junit4:junit4]   2> 6317 T665 oass.SolrDispatchFilter.init SolrDispatchFilter.init() done
[junit4:junit4]   2> 6317 T665 oascsi.HttpClientUtil.createClient Creating new http client, config:maxConnections=128&maxConnectionsPerHost=32&followRedirects=false
[junit4:junit4]   2> 6441 T665 oejs.Server.doStart jetty-8.1.2.v20120308
[junit4:junit4]   2> 6444 T665 oejs.AbstractConnector.doStart Started SocketConnector@0.0.0.0:33825
[junit4:junit4]   2> 6444 T665 oasc.SolrResourceLoader.locateSolrHome JNDI not configured for solr (NoInitialContextEx)
[junit4:junit4]   2> 6445 T665 oasc.SolrResourceLoader.locateSolrHome using system property solr.solr.home: /usr/home/hudson/hudson-slave/workspace/Lucene-Solr-Tests-4.x-java7/solr/build/solr-core/test/J0/./solrtest-jetty3-1349280735617
[junit4:junit4]   2> 6445 T665 oasc.SolrResourceLoader.<init> new SolrResourceLoader for deduced Solr Home: '/usr/home/hudson/hudson-slave/workspace/Lucene-Solr-Tests-4.x-java7/solr/build/solr-core/test/J0/./solrtest-jetty3-1349280735617/'
[junit4:junit4]   2> 6476 T665 oass.SolrDispatchFilter.init SolrDispatchFilter.init()
[junit4:junit4]   2> 6477 T665 oasc.SolrResourceLoader.locateSolrHome JNDI not configured for solr (NoInitialContextEx)
[junit4:junit4]   2> 6477 T665 oasc.SolrResourceLoader.locateSolrHome using system property solr.solr.home: /usr/home/hudson/hudson-slave/workspace/Lucene-Solr-Tests-4.x-java7/solr/build/solr-core/test/J0/./solrtest-jetty3-1349280735617
[junit4:junit4]   2> 6477 T665 oasc.CoreContainer$Initializer.initialize looking for solr.xml: /usr/home/hudson/hudson-slave/workspace/Lucene-Solr-Tests-4.x-java7/solr/build/solr-core/test/J0/./solrtest-jetty3-1349280735617/solr.xml
[junit4:junit4]   2> 6478 T665 oasc.CoreContainer.<init> New CoreContainer 928750456
[junit4:junit4]   2> 6478 T665 oasc.CoreContainer.load Loading CoreContainer using Solr Home: '/usr/home/hudson/hudson-slave/workspace/Lucene-Solr-Tests-4.x-java7/solr/build/solr-core/test/J0/./solrtest-jetty3-1349280735617/'
[junit4:junit4]   2> 6479 T665 oasc.SolrResourceLoader.<init> new SolrResourceLoader for directory: '/usr/home/hudson/hudson-slave/workspace/Lucene-Solr-Tests-4.x-java7/solr/build/solr-core/test/J0/./solrtest-jetty3-1349280735617/'
[junit4:junit4]   2> 6514 T665 oasc.CoreContainer.load Registering Log Listener
[junit4:junit4]   2> 6531 T665 oasc.CoreContainer.initZooKeeper Zookeeper client=127.0.0.1:33808/solr
[junit4:junit4]   2> 6532 T665 oaz.ZooKeeper.<init> Initiating client connection, connectString=127.0.0.1:33808/solr sessionTimeout=5000 watcher=org.apache.solr.common.cloud.ConnectionManager@d399a48
[junit4:junit4]   2> 6533 T722 oaz.ClientCnxn$SendThread.startConnect Opening socket connection to server /127.0.0.1:33808
[junit4:junit4]   2> 6533 T665 oascc.ConnectionManager.waitForConnected Waiting for client to connect to ZooKeeper
[junit4:junit4]   2> 6535 T722 oaz.ClientCnxn$SendThread.primeConnection Socket connection established to localhost/127.0.0.1:33808, initiating session
[junit4:junit4]   2> 6535 T667 oazs.NIOServerCnxn$Factory.run Accepted socket connection from /140.211.11.196:33826
[junit4:junit4]   2> 6535 T667 oazs.NIOServerCnxn.readConnectRequest Client attempting to establish new session at /140.211.11.196:33826
[junit4:junit4]   2> 6537 T669 oazs.NIOServerCnxn.finishSessionInit Established session 0x13a276608d30005 with negotiated timeout 5000 for client /140.211.11.196:33826
[junit4:junit4]   2> 6537 T722 oaz.ClientCnxn$SendThread.readConnectResult Session establishment complete on server localhost/127.0.0.1:33808, sessionid = 0x13a276608d30005, negotiated timeout = 5000
[junit4:junit4]   2> 6537 T723 oascc.ConnectionManager.process Watcher org.apache.solr.common.cloud.ConnectionManager@d399a48 name:ZooKeeperConnection Watcher:127.0.0.1:33808/solr got event WatchedEvent state:SyncConnected type:None path:null path:null type:None
[junit4:junit4]   2> 6537 T665 oascc.ConnectionManager.waitForConnected Client is connected to ZooKeeper
[junit4:junit4]   2> 6538 T670 oazs.PrepRequestProcessor.pRequest Got user-level KeeperException when processing sessionid:0x13a276608d30005 type:create cxid:0x1 zxid:0xfffffffffffffffe txntype:unknown reqpath:n/a Error Path:/solr/overseer Error:KeeperErrorCode = NodeExists for /solr/overseer
[junit4:junit4]   2> 6539 T670 oazs.PrepRequestProcessor.pRequest Got user-level KeeperException when processing sessionid:0x13a276608d30005 type:create cxid:0x2 zxid:0xfffffffffffffffe txntype:unknown reqpath:n/a Error Path:/solr/overseer Error:KeeperErrorCode = NodeExists for /solr/overseer
[junit4:junit4]   2> 6547 T665 oasc.ZkController.createEphemeralLiveNode Register node as live in ZooKeeper:/live_nodes/127.0.0.1:33825_solr
[junit4:junit4]   2> 6548 T670 oazs.PrepRequestProcessor.pRequest Got user-level KeeperException when processing sessionid:0x13a276608d30005 type:delete cxid:0x4 zxid:0xfffffffffffffffe txntype:unknown reqpath:n/a Error Path:/solr/live_nodes/127.0.0.1:33825_solr Error:KeeperErrorCode = NoNode for /solr/live_nodes/127.0.0.1:33825_solr
[junit4:junit4]   2> 6549 T665 oascc.SolrZkClient.makePath makePath: /live_nodes/127.0.0.1:33825_solr
[junit4:junit4]   2> 6551 T711 oascc.ZkStateReader$3.process Updating live nodes
[junit4:junit4]   2> 6551 T699 oascc.ZkStateReader$3.process Updating live nodes
[junit4:junit4]   2> 6551 T685 oascc.ZkStateReader$3.process Updating live nodes
[junit4:junit4]   2> 6552 T665 oashc.HttpShardHandlerFactory.getParameter Setting socketTimeout to: 0
[junit4:junit4]   2> 6552 T665 oashc.HttpShardHandlerFactory.getParameter Setting urlScheme to: http://
[junit4:junit4]   2> 6553 T665 oashc.HttpShardHandlerFactory.getParameter Setting connTimeout to: 0
[junit4:junit4]   2> 6553 T665 oashc.HttpShardHandlerFactory.getParameter Setting maxConnectionsPerHost to: 20
[junit4:junit4]   2> 6553 T665 oashc.HttpShardHandlerFactory.getParameter Setting corePoolSize to: 0
[junit4:junit4]   2> 6553 T665 oashc.HttpShardHandlerFactory.getParameter Setting maximumPoolSize to: 2147483647
[junit4:junit4]   2> 6554 T665 oashc.HttpShardHandlerFactory.getParameter Setting maxThreadIdleTime to: 5
[junit4:junit4]   2> 6554 T665 oashc.HttpShardHandlerFactory.getParameter Setting sizeOfQueue to: -1
[junit4:junit4]   2> 6554 T665 oashc.HttpShardHandlerFactory.getParameter Setting fairnessPolicy to: false
[junit4:junit4]   2> 6555 T665 oascsi.HttpClientUtil.createClient Creating new http client, config:maxConnectionsPerHost=20&maxConnections=10000&socketTimeout=0&connTimeout=0&retry=false
[junit4:junit4]   2> 6569 T665 oascc.ZkStateReader.createClusterStateWatchersAndUpdate Updating cluster state from ZooKeeper... 
[junit4:junit4]   2> 6575 T665 oasc.CoreContainer.create Creating SolrCore 'collection1' using instanceDir: /usr/home/hudson/hudson-slave/workspace/Lucene-Solr-Tests-4.x-java7/solr/build/solr-core/test/J0/./solrtest-jetty3-1349280735617/collection1
[junit4:junit4]   2> 6576 T665 oasc.ZkController.createCollectionZkNode Check for collection zkNode:collection1
[junit4:junit4]   2> 6577 T665 oasc.ZkController.createCollectionZkNode Collection zkNode exists
[junit4:junit4]   2> 6577 T665 oasc.ZkController.readConfigName Load collection config from:/collections/collection1
[junit4:junit4]   2> 6578 T665 oasc.SolrResourceLoader.<init> new SolrResourceLoader for directory: '/usr/home/hudson/hudson-slave/workspace/Lucene-Solr-Tests-4.x-java7/solr/build/solr-core/test/J0/./solrtest-jetty3-1349280735617/collection1/'
[junit4:junit4]   2> 6579 T665 oasc.SolrResourceLoader.replaceClassLoader Adding 'file:/usr/home/hudson/hudson-slave/workspace/Lucene-Solr-Tests-4.x-java7/solr/build/solr-core/test/J0/solrtest-jetty3-1349280735617/collection1/lib/classes/' to classloader
[junit4:junit4]   2> 6580 T665 oasc.SolrResourceLoader.replaceClassLoader Adding 'file:/usr/home/hudson/hudson-slave/workspace/Lucene-Solr-Tests-4.x-java7/solr/build/solr-core/test/J0/solrtest-jetty3-1349280735617/collection1/lib/README' to classloader
[junit4:junit4]   2> 6616 T665 oasc.SolrConfig.<init> Using Lucene MatchVersion: LUCENE_41
[junit4:junit4]   2> 6669 T665 oasc.SolrConfig.<init> Loaded SolrConfig: solrconfig.xml
[junit4:junit4]   2> 6770 T665 oass.IndexSchema.readSchema Reading Solr Schema
[junit4:junit4]   2> 6775 T665 oass.IndexSchema.readSchema Schema name=test
[junit4:junit4]   2> 6805 T686 oascc.ZkStateReader.updateClusterState Updating cloud state from ZooKeeper... 
[junit4:junit4]   2> 6820 T723 oascc.ZkStateReader$2.process A cluster state change has occurred - updating...
[junit4:junit4]   2> 6820 T685 oascc.ZkStateReader$2.process A cluster state change has occurred - updating...
[junit4:junit4]   2> 6820 T699 oascc.ZkStateReader$2.process A cluster state change has occurred - updating...
[junit4:junit4]   2> 6820 T711 oascc.ZkStateReader$2.process A cluster state change has occurred - updating...
[junit4:junit4]   2> 7236 T665 oass.OpenExchangeRatesOrgProvider.init Initialized with rates=open-exchange-rates.json, refreshInterval=1440.
[junit4:junit4]   2> 7245 T665 oass.IndexSchema.readSchema default search field in schema is text
[junit4:junit4]   2> 7249 T665 oass.IndexSchema.readSchema unique key field: id
[junit4:junit4]   2> 7263 T665 oass.FileExchangeRateProvider.reload Reloading exchange rates from file currency.xml
[junit4:junit4]   2> 7267 T665 oass.FileExchangeRateProvider.reload Reloading exchange rates from file currency.xml
[junit4:junit4]   2> 7271 T665 oass.OpenExchangeRatesOrgProvider.reload Reloading exchange rates from open-exchange-rates.json
[junit4:junit4]   2> 7273 T665 oass.OpenExchangeRatesOrgProvider.reload Reloading exchange rates from open-exchange-rates.json
[junit4:junit4]   2> 7274 T665 oasc.SolrCore.<init> [collection1] Opening new SolrCore at /usr/home/hudson/hudson-slave/workspace/Lucene-Solr-Tests-4.x-java7/solr/build/solr-core/test/J0/./solrtest-jetty3-1349280735617/collection1/, dataDir=./org.apache.solr.cloud.BasicDistributedZkTest-1349280729293/jetty3/
[junit4:junit4]   2> 7275 T665 oasc.JmxMonitoredMap.<init> JMX monitoring is enabled. Adding Solr mbeans to JMX Server: com.sun.jmx.mbeanserver.JmxMBeanServer@2e6a317
[junit4:junit4]   2> 7276 T665 oasc.SolrCore.getNewIndexDir New index directory detected: old=null new=./org.apache.solr.cloud.BasicDistributedZkTest-1349280729293/jetty3/index/
[junit4:junit4]   2> 7277 T665 oasc.SolrCore.initIndex WARNING [collection1] Solr index directory './org.apache.solr.cloud.BasicDistributedZkTest-1349280729293/jetty3/index' doesn't exist. Creating new index...
[junit4:junit4]   2> 7277 T665 oasc.CachingDirectoryFactory.get return new directory for /usr/home/hudson/hudson-slave/workspace/Lucene-Solr-Tests-4.x-java7/solr/build/solr-core/test/J0/./org.apache.solr.cloud.BasicDistributedZkTest-1349280729293/jetty3/index forceNew:false
[junit4:junit4]   2> 7283 T665 oasc.SolrDeletionPolicy.onCommit SolrDeletionPolicy.onCommit: commits:num=1
[junit4:junit4]   2> 		commit{dir=NRTCachingDirectory(org.apache.lucene.store.NIOFSDirectory@/usr/home/hudson/hudson-slave/workspace/Lucene-Solr-Tests-4.x-java7/solr/build/solr-core/test/J0/org.apache.solr.cloud.BasicDistributedZkTest-1349280729293/jetty3/index lockFactory=org.apache.lucene.store.NativeFSLockFactory@5749b5a9; maxCacheMB=48.0 maxMergeSizeMB=4.0),segFN=segments_1,generation=1,filenames=[segments_1]
[junit4:junit4]   2> 7284 T665 oasc.SolrDeletionPolicy.updateCommits newest commit = 1
[junit4:junit4]   2> 7284 T665 oasc.SolrCore.initWriters created xml: solr.XMLResponseWriter
[junit4:junit4]   2> 7287 T665 oasup.UpdateRequestProcessorChain.init inserting DistributedUpdateProcessorFactory into updateRequestProcessorChain "dedupe"
[junit4:junit4]   2> 7287 T665 oasup.UpdateRequestProcessorChain.init inserting DistributedUpdateProcessorFactory into updateRequestProcessorChain "dedupe-allfields"
[junit4:junit4]   2> 7288 T665 oasup.UpdateRequestProcessorChain.init inserting DistributedUpdateProcessorFactory into updateRequestProcessorChain "stored_sig"
[junit4:junit4]   2> 7288 T665 oasup.UpdateRequestProcessorChain.init inserting DistributedUpdateProcessorFactory into updateRequestProcessorChain "uniq-fields"
[junit4:junit4]   2> 7289 T665 oasup.UpdateRequestProcessorChain.init inserting DistributedUpdateProcessorFactory into updateRequestProcessorChain "distrib-dup-test-chain-implicit"
[junit4:junit4]   2> 7289 T665 oasc.RequestHandlers.initHandlersFromConfig adding lazy requestHandler: solr.ReplicationHandler
[junit4:junit4]   2> 7289 T665 oasc.RequestHandlers.initHandlersFromConfig created /replication: solr.ReplicationHandler
[junit4:junit4]   2> 7290 T665 oasc.RequestHandlers.initHandlersFromConfig created standard: solr.StandardRequestHandler
[junit4:junit4]   2> 7291 T665 oasc.RequestHandlers.initHandlersFromConfig created /get: solr.RealTimeGetHandler
[junit4:junit4]   2> 7291 T665 oasc.RequestHandlers.initHandlersFromConfig created dismax: solr.SearchHandler
[junit4:junit4]   2> 7292 T665 oasc.RequestHandlers.initHandlersFromConfig created mock: org.apache.solr.core.MockQuerySenderListenerReqHandler
[junit4:junit4]   2> 7292 T665 oasc.RequestHandlers.initHandlersFromConfig created /admin/: org.apache.solr.handler.admin.AdminHandlers
[junit4:junit4]   2> 7293 T665 oasc.RequestHandlers.initHandlersFromConfig created defaults: solr.StandardRequestHandler
[junit4:junit4]   2> 7293 T665 oasc.RequestHandlers.initHandlersFromConfig adding lazy requestHandler: solr.StandardRequestHandler
[junit4:junit4]   2> 7293 T665 oasc.RequestHandlers.initHandlersFromConfig created lazy: solr.StandardRequestHandler
[junit4:junit4]   2> 7294 T665 oasc.RequestHandlers.initHandlersFromConfig created /update: solr.UpdateRequestHandler
[junit4:junit4]   2> 7294 T665 oasc.RequestHandlers.initHandlersFromConfig created /terms: org.apache.solr.handler.component.SearchHandler
[junit4:junit4]   2> 7295 T665 oasc.RequestHandlers.initHandlersFromConfig created spellCheckCompRH: org.apache.solr.handler.component.SearchHandler
[junit4:junit4]   2> 7296 T665 oasc.RequestHandlers.initHandlersFromConfig created spellCheckCompRH_Direct: org.apache.solr.handler.component.SearchHandler
[junit4:junit4]   2> 7296 T665 oasc.RequestHandlers.initHandlersFromConfig created spellCheckWithWordbreak: org.apache.solr.handler.component.SearchHandler
[junit4:junit4]   2> 7297 T665 oasc.RequestHandlers.initHandlersFromConfig created spellCheckWithWordbreak_Direct: org.apache.solr.handler.component.SearchHandler
[junit4:junit4]   2> 7297 T665 oasc.RequestHandlers.initHandlersFromConfig created spellCheckCompRH1: org.apache.solr.handler.component.SearchHandler
[junit4:junit4]   2> 7298 T665 oasc.RequestHandlers.initHandlersFromConfig created tvrh: org.apache.solr.handler.component.SearchHandler
[junit4:junit4]   2> 7298 T665 oasc.RequestHandlers.initHandlersFromConfig created /mlt: solr.MoreLikeThisHandler
[junit4:junit4]   2> 7299 T665 oasc.RequestHandlers.initHandlersFromConfig created /debug/dump: solr.DumpRequestHandler
[junit4:junit4]   2> 7309 T665 oashl.XMLLoader.init xsltCacheLifetimeSeconds=60
[junit4:junit4]   2> 7313 T665 oasc.SolrCore.initDeprecatedSupport WARNING solrconfig.xml uses deprecated <admin/gettableFiles>, Please update your config to use the ShowFileRequestHandler.
[junit4:junit4]   2> 7314 T665 oasc.SolrCore.initDeprecatedSupport WARNING adding ShowFileRequestHandler with hidden files: [SCHEMA.XML, OLD_SYNONYMS.TXT, STOPWORDS.TXT, PROTWORDS.TXT, OPEN-EXCHANGE-RATES.JSON, SYNONYMS.TXT, CURRENCY.XML, MAPPING-ISOLATIN1ACCENT.TXT]
[junit4:junit4]   2> 7318 T665 oass.SolrIndexSearcher.<init> Opening Searcher@362cc9af main
[junit4:junit4]   2> 7319 T665 oasu.CommitTracker.<init> Hard AutoCommit: disabled
[junit4:junit4]   2> 7319 T665 oasu.CommitTracker.<init> Soft AutoCommit: disabled
[junit4:junit4]   2> 7320 T665 oashc.SpellCheckComponent.inform Initializing spell checkers
[junit4:junit4]   2> 7326 T665 oass.DirectSolrSpellChecker.init init: {name=direct,classname=DirectSolrSpellChecker,field=lowerfilt,minQueryLength=3}
[junit4:junit4]   2> 7398 T724 oasc.SolrCore.registerSearcher [collection1] Registered new searcher Searcher@362cc9af main{StandardDirectoryReader(segments_1:1)}
[junit4:junit4]   2> 7830 T686 oascc.ZkStateReader.updateClusterState Updating cloud state from ZooKeeper... 
[junit4:junit4]   2> 7858 T699 oascc.ZkStateReader$2.process A cluster state change has occurred - updating...
[junit4:junit4]   2> 7858 T711 oascc.ZkStateReader$2.process A cluster state change has occurred - updating...
[junit4:junit4]   2> 7858 T685 oascc.ZkStateReader$2.process A cluster state change has occurred - updating...
[junit4:junit4]   2> 7858 T723 oascc.ZkStateReader$2.process A cluster state change has occurred - updating...
[junit4:junit4]   2> 7905 T665 oasc.CoreContainer.register registering core: collection1
[junit4:junit4]   2> 7905 T665 oasc.ZkController.register Register shard - core:collection1 address:http://127.0.0.1:33825/solr shardId:shard1
[junit4:junit4]   2> 7909 T665 oasc.ZkController.register We are http://127.0.0.1:33825/solr/collection1/ and leader is http://127.0.0.1:33814/solr/collection1/
[junit4:junit4]   2> 7910 T665 oasc.ZkController.register No LogReplay needed for core=collection1 baseURL=http://127.0.0.1:33825/solr
[junit4:junit4]   2> 7910 T665 oasc.ZkController.checkRecovery Core needs to recover:collection1
[junit4:junit4]   2> 7911 T665 oasu.DefaultSolrCoreState.doRecovery Running recovery - first canceling any ongoing recovery
[junit4:junit4]   2> ASYNC  NEW_CORE C69 name=collection1 org.apache.solr.core.SolrCore@310e74cd url=http://127.0.0.1:33825/solr/collection1 node=127.0.0.1:33825_solr
[junit4:junit4]   2> 7919 T725 C69 P33825 oasc.RecoveryStrategy.run Starting recovery process.  core=collection1 recoveringAfterStartup=true
[junit4:junit4]   2> 7919 T665 oascc.ZkStateReader.updateClusterState Updating cloud state from ZooKeeper... 
[junit4:junit4]   2> 7920 T725 C69 P33825 oasc.RecoveryStrategy.doRecovery ###### startupVersions=[]
[junit4:junit4]   2> 7921 T665 oass.SolrDispatchFilter.init user.dir=/usr/home/hudson/hudson-slave/workspace/Lucene-Solr-Tests-4.x-java7/solr/build/solr-core/test/J0
[junit4:junit4]   2> 7921 T665 oass.SolrDispatchFilter.init SolrDispatchFilter.init() done
[junit4:junit4]   2> 7922 T725 C69 P33825 oasc.RecoveryStrategy.doRecovery Attempting to PeerSync from http://127.0.0.1:33814/solr/collection1/ core=collection1 - recoveringAfterStartup=true
[junit4:junit4]   2> 7922 T665 oascsi.HttpClientUtil.createClient Creating new http client, config:maxConnections=128&maxConnectionsPerHost=32&followRedirects=false
[junit4:junit4]   2> 7932 T725 C69 P33825 oascsi.HttpClientUtil.createClient Creating new http client, config:maxConnectionsPerHost=20&maxConnections=10000&connTimeout=30000&socketTimeout=30000&retry=false
[junit4:junit4]   2> 7944 T665 oaz.ZooKeeper.<init> Initiating client connection, connectString=127.0.0.1:33808/solr sessionTimeout=10000 watcher=org.apache.solr.common.cloud.ConnectionManager@11ca6949
[junit4:junit4]   2> 7945 T726 oaz.ClientCnxn$SendThread.startConnect Opening socket connection to server /127.0.0.1:33808
[junit4:junit4]   2> 7945 T665 oascc.ConnectionManager.waitForConnected Waiting for client to connect to ZooKeeper
[junit4:junit4]   2> 7946 T726 oaz.ClientCnxn$SendThread.primeConnection Socket connection established to localhost/127.0.0.1:33808, initiating session
[junit4:junit4]   2> 7946 T667 oazs.NIOServerCnxn$Factory.run Accepted socket connection from /140.211.11.196:33829
[junit4:junit4]   2> 7946 T667 oazs.NIOServerCnxn.readConnectRequest Client attempting to establish new session at /140.211.11.196:33829
[junit4:junit4]   2> 7948 T669 oazs.NIOServerCnxn.finishSessionInit Established session 0x13a276608d30006 with negotiated timeout 10000 for client /140.211.11.196:33829
[junit4:junit4]   2> 7948 T726 oaz.ClientCnxn$SendThread.readConnectResult Session establishment complete on server localhost/127.0.0.1:33808, sessionid = 0x13a276608d30006, negotiated timeout = 10000
[junit4:junit4]   2> 7948 T727 oascc.ConnectionManager.process Watcher org.apache.solr.common.cloud.ConnectionManager@11ca6949 name:ZooKeeperConnection Watcher:127.0.0.1:33808/solr got event WatchedEvent state:SyncConnected type:None path:null path:null type:None
[junit4:junit4]   2> 7948 T665 oascc.ConnectionManager.waitForConnected Client is connected to ZooKeeper
[junit4:junit4]   2> 7949 T665 oascc.ZkStateReader.createClusterStateWatchersAndUpdate Updating cluster state from ZooKeeper... 
[junit4:junit4]   2> 7952 T665 oasc.ChaosMonkey.monkeyLog monkey: init - expire sessions:true cause connection loss:true
[junit4:junit4]   2> 7953 T665 oascsi.HttpClientUtil.createClient Creating new http client, config:
[junit4:junit4]   2> 7955 T725 C69 P33825 oasu.PeerSync.sync PeerSync: core=collection1 url=http://127.0.0.1:33825/solr START replicas=[http://127.0.0.1:33814/solr/collection1/] nUpdates=100
[junit4:junit4]   2> 7963 T665 oascc.ZkStateReader.updateClusterState Updating cloud state from ZooKeeper... 
[junit4:junit4]   2> 7964 T665 oasc.AbstractDistribZkTestBase.waitForRecoveriesToFinish Wait for recoveries to finish - collection: collection1 failOnTimeout:true timeout (sec):1800
[junit4:junit4]   2> 7964 T665 oascc.ZkStateReader.updateClusterState Updating cloud state from ZooKeeper... 
[junit4:junit4]   2> 7967 T725 C69 P33825 oasu.PeerSync.sync WARNING no frame of reference to tell of we've missed updates
[junit4:junit4]   2> 7968 T725 C69 P33825 oasc.RecoveryStrategy.doRecovery PeerSync Recovery was not successful - trying replication. core=collection1
[junit4:junit4]   2> 7968 T725 C69 P33825 oasc.RecoveryStrategy.doRecovery Starting Replication Recovery. core=collection1
[junit4:junit4]   2> 7968 T725 C69 P33825 oascsi.HttpClientUtil.createClient Creating new http client, config:maxConnections=128&maxConnectionsPerHost=32&followRedirects=false
[junit4:junit4]   2> ASYNC  NEW_CORE C70 name=collection1 org.apache.solr.core.SolrCore@22bd31a9 url=http://127.0.0.1:33814/solr/collection1 node=127.0.0.1:33814_solr
[junit4:junit4]   2> 7980 T691 C70 P33814 REQ /get {distrib=false&qt=/get&wt=javabin&version=2&getVersions=100} status=0 QTime=1 
[junit4:junit4]   2> 8369 T686 oascc.ZkStateReader.updateClusterState Updating cloud state from ZooKeeper... 
[junit4:junit4]   2> 8393 T711 oascc.ZkStateReader$2.process A cluster state change has occurred - updating...
[junit4:junit4]   2> 8393 T727 oascc.ZkStateReader$2.process A cluster state change has occurred - updating...
[junit4:junit4]   2> 8394 T685 oascc.ZkStateReader$2.process A cluster state change has occurred - updating...
[junit4:junit4]   2> 8394 T699 oascc.ZkStateReader$2.process A cluster state change has occurred - updating...
[junit4:junit4]   2> 8394 T723 oascc.ZkStateReader$2.process A cluster state change has occurred - updating...
[junit4:junit4]   2> 8966 T665 oascc.ZkStateReader.updateClusterState Updating cloud state from ZooKeeper... 
[junit4:junit4]   2> 9968 T665 oascc.ZkStateReader.updateClusterState Updating cloud state from ZooKeeper... 
[junit4:junit4]   2> 10970 T665 oascc.ZkStateReader.updateClusterState Updating cloud state from ZooKeeper... 
[junit4:junit4]   2>  C69_STATE=coll:collection1 core:collection1 props:{shard=shard1, roles=null, state=recovering, core=collection1, collection=collection1, node_name=127.0.0.1:33825_solr, base_url=http://127.0.0.1:33825/solr}
[junit4:junit4]   2> 11001 T725 C69 P33825 oasc.RecoveryStrategy.doRecovery Begin buffering updates. core=collection1
[junit4:junit4]   2> 11001 T725 C69 P33825 oasu.UpdateLog.bufferUpdates Starting to buffer updates. FSUpdateLog{state=ACTIVE, tlog=null}
[junit4:junit4]   2> 11001 T725 C69 P33825 oasc.RecoveryStrategy.replicate Attempting to replicate from http://127.0.0.1:33814/solr/collection1/. core=collection1
[junit4:junit4]   2> 11001 T725 C69 P33825 oascsi.HttpClientUtil.createClient Creating new http client, config:maxConnections=128&maxConnectionsPerHost=32&followRedirects=false
[junit4:junit4]   2> 11011 T693 C70 P33814 oasu.DirectUpdateHandler2.commit start commit{flags=0,_version_=0,optimize=false,openSearcher=true,waitSearcher=true,expungeDeletes=false,softCommit=false}
[junit4:junit4]   2> 11016 T693 C70 P33814 oasc.SolrDeletionPolicy.onInit SolrDeletionPolicy.onInit: commits:num=1
[junit4:junit4]   2> 		commit{dir=NRTCachingDirectory(org.apache.lucene.store.NIOFSDirectory@/usr/home/hudson/hudson-slave/workspace/Lucene-Solr-Tests-4.x-java7/solr/build/solr-core/test/J0/org.apache.solr.cloud.BasicDistributedZkTest-1349280729293/jetty1/index lockFactory=org.apache.lucene.store.NativeFSLockFactory@7c9ef10; maxCacheMB=48.0 maxMergeSizeMB=4.0),segFN=segments_1,generation=1,filenames=[segments_1]
[junit4:junit4]   2> 11017 T693 C70 P33814 oasc.SolrDeletionPolicy.updateCommits newest commit = 1
[junit4:junit4]   2> 11018 T693 C70 P33814 oass.SolrIndexSearcher.<init> Opening Searcher@5edc952 main
[junit4:junit4]   2> 11019 T693 C70 P33814 oasu.DirectUpdateHandler2.commit end_commit_flush
[junit4:junit4]   2> 11020 T700 oasc.SolrCore.registerSearcher [collection1] Registered new searcher Searcher@5edc952 main{StandardDirectoryReader(segments_1:1)}
[junit4:junit4]   2> 11021 T693 C70 P33814 /update {waitSearcher=true&commit=true&commit_end_point=true&wt=javabin&softCommit=false&version=2} {commit=} 0 10
[junit4:junit4]   2> 11022 T725 C69 P33825 oash.ReplicationHandler.inform Commits will be reserved for  10000
[junit4:junit4]   2> 11022 T725 C69 P33825 oascsi.HttpClientUtil.createClient Creating new http client, config:connTimeout=5000&socketTimeout=20000&allowCompression=false&maxConnections=10000&maxConnectionsPerHost=10000
[junit4:junit4]   2> 11036 T725 C69 P33825 oash.SnapPuller.<init>  No value set for 'pollInterval'. Timer Task not started.
[junit4:junit4]   2> 11038 T694 C70 P33814 oash.ReplicationHandler.inform Commits will be reserved for  10000
[junit4:junit4]   2> 11039 T694 C70 P33814 REQ /replication {command=indexversion&wt=javabin&qt=/replication&version=2} status=0 QTime=1 
[junit4:junit4]   2> 11044 T725 C69 P33825 oasc.SolrDeletionPolicy.onInit SolrDeletionPolicy.onInit: commits:num=1
[junit4:junit4]   2> 		commit{dir=NRTCachingDirectory(org.apache.lucene.store.NIOFSDirectory@/usr/home/hudson/hudson-slave/workspace/Lucene-Solr-Tests-4.x-java7/solr/build/solr-core/test/J0/org.apache.solr.cloud.BasicDistributedZkTest-1349280729293/jetty3/index lockFactory=org.apache.lucene.store.NativeFSLockFactory@5749b5a9; maxCacheMB=48.0 maxMergeSizeMB=4.0),segFN=segments_1,generation=1,filenames=[segments_1]
[junit4:junit4]   2> 11044 T725 C69 P33825 oasc.SolrDeletionPolicy.updateCommits newest commit = 1
[junit4:junit4]   2> 11045 T725 C69 P33825 oasu.DirectUpdateHandler2.commit start commit{flags=0,_version_=0,optimize=false,openSearcher=true,waitSearcher=true,expungeDeletes=false,softCommit=false}
[junit4:junit4]   2> 11067 T725 C69 P33825 oasc.SolrDeletionPolicy.onCommit SolrDeletionPolicy.onCommit: commits:num=2
[junit4:junit4]   2> 		commit{dir=NRTCachingDirectory(org.apache.lucene.store.NIOFSDirectory@/usr/home/hudson/hudson-slave/workspace/Lucene-Solr-Tests-4.x-java7/solr/build/solr-core/test/J0/org.apache.solr.cloud.BasicDistributedZkTest-1349280729293/jetty3/index lockFactory=org.apache.lucene.store.NativeFSLockFactory@5749b5a9; maxCacheMB=48.0 maxMergeSizeMB=4.0),segFN=segments_1,generation=1,filenames=[segments_1]
[junit4:junit4]   2> 		commit{dir=NRTCachingDirectory(org.apache.lucene.store.NIOFSDirectory@/usr/home/hudson/hudson-slave/workspace/Lucene-Solr-Tests-4.x-java7/solr/build/solr-core/test/J0/org.apache.solr.cloud.BasicDistributedZkTest-1349280729293/jetty3/index lockFactory=org.apache.lucene.store.NativeFSLockFactory@5749b5a9; maxCacheMB=48.0 maxMergeSizeMB=4.0),segFN=segments_2,generation=2,filenames=[segments_2]
[junit4:junit4]   2> 11067 T725 C69 P33825 oasc.SolrDeletionPolicy.updateCommits newest commit = 2
[junit4:junit4]   2> 11071 T725 C69 P33825 oass.SolrIndexSearcher.<init> Opening Searcher@102ad108 main
[junit4:junit4]   2> 11071 T725 C69 P33825 oasu.DirectUpdateHandler2.commit end_commit_flush
[junit4:junit4]   2> 11072 T724 oasc.SolrCore.registerSearcher [collection1] Registered new searcher Searcher@102ad108 main{StandardDirectoryReader(segments_2:2)}
[junit4:junit4]   2> 11073 T725 C69 P33825 oasc.RecoveryStrategy.replay No replay needed. core=collection1
[junit4:junit4]   2> 11073 T725 C69 P33825 oasc.RecoveryStrategy.doRecovery Replication Recovery was successful - registering as Active. core=collection1
[junit4:junit4]   2> 11075 T725 C69 P33825 oasc.RecoveryStrategy.doRecovery Finished recovery process. core=collection1
[junit4:junit4]   2> 11412 T686 oascc.ZkStateReader.updateClusterState Updating cloud state from ZooKeeper... 
[junit4:junit4]   2> 11427 T711 oascc.ZkStateReader$2.process A cluster state change has occurred - updating...
[junit4:junit4]   2> 11427 T727 oascc.ZkStateReader$2.process A cluster state change has occurred - updating...
[junit4:junit4]   2> 11427 T699 oascc.ZkStateReader$2.process A cluster state change has occurred - updating...
[junit4:junit4]   2> 11427 T685 oascc.ZkStateReader$2.process A cluster state change has occurred - updating...
[junit4:junit4]   2> 11427 T723 oascc.ZkStateReader$2.process A cluster state change has occurred - updating...
[junit4:junit4]   2> 11972 T665 oascc.ZkStateReader.updateClusterState Updating cloud state from ZooKeeper... 
[junit4:junit4]   2> ASYNC  NEW_CORE C71 name=collection1 org.apache.solr.core.SolrCore@61c04453 url=http://127.0.0.1:33811/solr/collection1 node=127.0.0.1:33811_solr
[junit4:junit4]   2> 11990 T677 C71 P33811 oasc.SolrDeletionPolicy.onInit SolrDeletionPolicy.onInit: commits:num=1
[junit4:junit4]   2> 		commit{dir=NRTCachingDirectory(org.apache.lucene.store.NIOFSDirectory@/usr/home/hudson/hudson-slave/workspace/Lucene-Solr-Tests-4.x-java7/solr/build/solr-core/test/J0/org.apache.solr.cloud.BasicDistributedZkTest-1349280729293/control/data/index lockFactory=org.apache.lucene.store.NativeFSLockFactory@e3f23ed; maxCacheMB=48.0 maxMergeSizeMB=4.0),segFN=segments_1,generation=1,filenames=[segments_1]
[junit4:junit4]   2> 11991 T677 C71 P33811 oasc.SolrDeletionPolicy.updateCommits newest commit = 1
[junit4:junit4]   2> 11993 T677 C71 P33811 oass.SolrIndexSearcher.<init> Opening Searcher@38618524 realtime
[junit4:junit4]   2> 11994 T677 C71 P33811 /update {wt=javabin&version=2} {deleteByQuery=*:* (-1414823402562125824)} 0 9
[junit4:junit4]   2> 11995 T665 oaz.ZooKeeper.<init> Initiating client connection, connectString=127.0.0.1:33808/solr sessionTimeout=10000 watcher=org.apache.solr.common.cloud.ConnectionManager@a6c1b67
[junit4:junit4]   2> 11996 T729 oaz.ClientCnxn$SendThread.startConnect Opening socket connection to server /127.0.0.1:33808
[junit4:junit4]   2> 11996 T665 oascc.ConnectionManager.waitForConnected Waiting for client to connect to ZooKeeper
[junit4:junit4]   2> 11997 T729 oaz.ClientCnxn$SendThread.primeConnection Socket connection established to localhost/127.0.0.1:33808, initiating session
[junit4:junit4]   2> 11997 T667 oazs.NIOServerCnxn$Factory.run Accepted socket connection from /140.211.11.196:33847
[junit4:junit4]   2> 11998 T667 oazs.NIOServerCnxn.readConnectRequest Client attempting to establish new session at /140.211.11.196:33847
[junit4:junit4]   2> 12008 T669 oazs.NIOServerCnxn.finishSessionInit Established session 0x13a276608d30007 with negotiated timeout 10000 for client /140.211.11.196:33847
[junit4:junit4]   2> 12008 T729 oaz.ClientCnxn$SendThread.readConnectResult Session establishment complete on server localhost/127.0.0.1:33808, sessionid = 0x13a276608d30007, negotiated timeout = 10000
[junit4:junit4]   2> 12009 T730 oascc.ConnectionManager.process Watcher org.apache.solr.common.cloud.ConnectionManager@a6c1b67 name:ZooKeeperConnection Watcher:127.0.0.1:33808/solr got event WatchedEvent state:SyncConnected type:None path:null path:null type:None
[junit4:junit4]   2> 12009 T665 oascc.ConnectionManager.waitForConnected Client is connected to ZooKeeper
[junit4:junit4]   2> 12011 T665 oascc.ZkStateReader.createClusterStateWatchersAndUpdate Updating cluster state from ZooKeeper... 
[junit4:junit4]   2> ASYNC  NEW_CORE C72 name=collection1 org.apache.solr.core.SolrCore@1a7f6d42 url=http://127.0.0.1:33823/solr/collection1 node=127.0.0.1:33823_solr
[junit4:junit4]   2> 12037 T703 C72 P33823 oasc.SolrDeletionPolicy.onInit SolrDeletionPolicy.onInit: commits:num=1
[junit4:junit4]   2> 		commit{dir=NRTCachingDirectory(org.apache.lucene.store.NIOFSDirectory@/usr/home/hudson/hudson-slave/workspace/Lucene-Solr-Tests-4.x-java7/solr/build/solr-core/test/J0/org.apache.solr.cloud.BasicDistributedZkTest-1349280729293/jetty2/index lockFactory=org.apache.lucene.store.NativeFSLockFactory@11d83d0b; maxCacheMB=48.0 maxMergeSizeMB=4.0),segFN=segments_1,generation=1,filenames=[segments_1]
[junit4:junit4]   2> 12038 T703 C72 P33823 oasc.SolrDeletionPolicy.updateCommits newest commit = 1
[junit4:junit4]   2> 12039 T703 C72 P33823 oass.SolrIndexSearcher.<init> Opening Searcher@241e3359 realtime
[junit4:junit4]   2> 12044 T695 C70 P33814 oass.SolrIndexSearcher.<init> Opening Searcher@60eb44bf realtime
[junit4:junit4]   2>  C69_STATE=coll:collection1 core:collection1 props:{shard=shard1, roles=null, state=active, core=collection1, collection=collection1, node_name=127.0.0.1:33825_solr, base_url=http://127.0.0.1:33825/solr}
[junit4:junit4]   2> 12057 T715 C69 P33825 oass.SolrIndexSearcher.<init> Opening Searcher@591765b3 realtime
[junit4:junit4]   2> 12058 T715 C69 P33825 REQ /update {update.distrib=FROMLEADER&_version_=-1414823402620846080&update.from=http://127.0.0.1:33814/solr/collection1/&wt=javabin&version=2} status=0 QTime=3 
[junit4:junit4]   2> 12059 T695 C70 P33814 REQ /update {update.distrib=TOLEADER&wt=javabin&version=2} status=0 QTime=17 
[junit4:junit4]   2> 12060 T703 C72 P33823 /update {wt=javabin&version=2} {deleteByQuery=*:* (-1414823402611408896)} 0 28
[junit4:junit4]   2> 12068 T677 C71 P33811 /update {wt=javabin&version=2} {add=[1 (1414823402644963328)]} 0 4
[junit4:junit4]   2> 12081 T715 C69 P33825 REQ /update {distrib.from=http://127.0.0.1:33814/solr/collection1/&update.distrib=FROMLEADER&wt=javabin&version=2} status=0 QTime=4 
[junit4:junit4]   2> 12082 T696 C70 P33814 /update {wt=javabin&version=2} {add=[1 (1414823402651254784)]} 0 11
[junit4:junit4]   2> 12088 T677 C71 P33811 /update {wt=javabin&version=2} {add=[2 (1414823402668032000)]} 0 2
[junit4:junit4]   2> 12102 T704 C72 P33823 REQ /update {distrib.from=http://127.0.0.1:33814/solr/collection1/&update.distrib=TOLEADER&wt=javabin&version=2} status=0 QTime=3 
[junit4:junit4]   2> 12104 T696 C70 P33814 /update {wt=javabin&version=2} {add=[2]} 0 13
[junit4:junit4]   2> 12109 T677 C71 P33811 /update {wt=javabin&version=2} {add=[3 (1414823402690052096)]} 0 2
[junit4:junit4]   2> 12117 T704 C72 P33823 REQ /update {distrib.from=http://127.0.0.1:33814/solr/collection1/&update.distrib=TOLEADER&wt=javabin&version=2} status=0 QTime=2 
[junit4:junit4]   2> 12118 T696 C70 P33814 /update {wt=javabin&version=2} {add=[3]} 0 6
[junit4:junit4]   2> 12123 T677 C71 P33811 /update {wt=javabin&version=2} {add=[4 (1414823402704732160)]} 0 2
[junit4:junit4]   2> 12132 T715 C69 P33825 REQ /update {distrib.from=http://127.0.0.1:33814/solr/collection1/&update.distrib=FROMLEADER&wt=javabin&version=2} status=0 QTime=2 
[junit4:junit4]   2> 12133 T696 C70 P33814 /update {wt=javabin&version=2} {add=[4 (1414823402709975040)]} 0 7
[junit4:junit4]   2> 12139 T677 C71 P33811 /update {wt=javabin&version=2} {add=[5 (1414823402721509376)]} 0 2
[junit4:junit4]   2> 12145 T703 C72 P33823 /update {wt=javabin&version=2} {add=[5 (1414823402727800832)]} 0 2
[junit4:junit4]   2> 12151 T677 C71 P33811 /update {wt=javabin&version=2} {add=[6 (1414823402734092288)]} 0 2
[junit4:junit4]   2> 12156 T703 C72 P33823 /update {wt=javabin&version=2} {add=[6 (1414823402739335168)]} 0 2
[junit4:junit4]   2> 12162 T677 C71 P33811 /update {wt=javabin&version=2} {add=[7 (1414823402745626624)]} 0 2
[junit4:junit4]   2> 12170 T704 C72 P33823 REQ /update {distrib.from=http://127.0.0.1:33814/solr/collection1/&update.distrib=TOLEADER&wt=javabin&version=2} status=0 QTime=2 
[junit4:junit4]   2> 12171 T696 C70 P33814 /update {wt=javabin&version=2} {add=[7]} 0 6
[junit4:junit4]   2> 12176 T677 C71 P33811 /update {wt=javabin&version=2} {add=[8 (1414823402760306688)]} 0 2
[junit4:junit4]   2> 12185 T715 C69 P33825 REQ /update {distrib.from=http://127.0.0.1:33814/solr/collection1/&update.distrib=FROMLEADER&wt=javabin&version=2} status=0 QTime=3 
[junit4:junit4]   2> 12186 T696 C70 P33814 /update {wt=javabin&version=2} {add=[8 (1414823402765549568)]} 0 7
[junit4:junit4]   2> 12191 T677 C71 P33811 /update {wt=javabin&version=2} {add=[9 (1414823402776035328)]} 0 2
[junit4:junit4]   2> 12199 T704 C72 P33823 REQ /update {distrib.from=http://127.0.0.1:33814/solr/collection1/&update.distrib=TOLEADER&wt=javabin&version=2} status=0 QTime=2 
[junit4:junit4]   2> 12200 T696 C70 P33814 /update {wt=javabin&version=2} {add=[9]} 0 6
[junit4:junit4]   2> 12224 T677 C71 P33811 /update {wt=javabin&version=2} {add=[10 (1414823402790715392)]} 0 21
[junit4:junit4]   2> 12237 T715 C69 P33825 REQ /update {distrib.from=http://127.0.0.1:33814/solr/collection1/&update.distrib=FROMLEADER&wt=javabin&version=2} status=0 QTime=2 
[junit4:junit4]   2> 12238 T695 C70 P33814 REQ /update {distrib.from=http://127.0.0.1:33823/solr/collection1/&update.distrib=TOLEADER&wt=javabin&version=2} status=0 QTime=8 
[junit4:junit4]   2> 12239 T703 C72 P33823 /update {wt=javabin&version=2} {add=[10]} 0 11
[junit4:junit4]   2> 12245 T677 C71 P33811 /update {wt=javabin&version=2} {add=[11 (1414823402831609856)]} 0 3
[junit4:junit4]   2> 12256 T715 C69 P33825 REQ /update {distrib.from=http://127.0.0.1:33814/solr/collection1/&update.distrib=FROMLEADER&wt=javabin&version=2} status=0 QTime=2 
[junit4:junit4]   2> 12258 T696 C70 P33814 /update {wt=javabin&version=2} {add=[11 (1414823402837901312)]} 0 10
[junit4:junit4]   2> 12263 T677 C71 P33811 /update {wt=javabin&version=2} {add=[12 (1414823402851532800)]} 0 2
[junit4:junit4]   2> 12273 T715 C69 P33825 REQ /update {distrib.from=http://127.0.0.1:33814/solr/collection1/&update.distrib=FROMLEADER&wt=javabin&version=2} status=0 QTime=2 
[junit4:junit4]   2> 12274 T696 C70 P33814 /update {wt=javabin&version=2} {add=[12 (1414823402856775680)]} 0 8
[junit4:junit4]   2> 12280 T677 C71 P33811 /update {wt=javabin&version=2} {add=[13 (1414823402869358592)]} 0 2
[junit4:junit4]   2> 12289 T715 C69 P33825 REQ /update {distrib.from=http://127.0.0.1:33814/solr/collection1/&update.distrib=FROMLEADER&wt=javabin&version=2} status=0 QTime=2 
[junit4:junit4]   2> 12290 T696 C70 P33814 /update {wt=javabin&version=2} {add=[13 (1414823402874601472)]} 0 7
[junit4:junit4]   2> 12295 T677 C71 P33811 /update {wt=javabin&version=2} {add=[14 (1414823402885087232)]} 0 2
[junit4:junit4]   2> 12308 T715 C69 P33825 REQ /update {distrib.from=http://127.0.0.1:33814/solr/collection1/&update.distrib=FROMLEADER&wt=javabin&version=2} status=0 QTime=2 
[junit4:junit4]   2> 12309 T695 C70 P33814 REQ /update {distrib.from=http://127.0.0.1:33823/solr/collection1/&update.distrib=TOLEADER&wt=javabin&version=2} status=0 QTime=8 
[junit4:junit4]   2> 12310 T703 C72 P33823 /update {wt=javabin&version=2} {add=[14]} 0 12
[junit4:junit4]   2> 12315 T677 C71 P33811 /update {wt=javabin&version=2} {add=[15 (1414823402906058752)]} 0 2
[junit4:junit4]   2> 12327 T715 C69 P33825 REQ /update {distrib.from=http://127.0.0.1:33814/solr/collection1/&update.distrib=FROMLEADER&wt=javabin&version=2} status=0 QTime=2 
[junit4:junit4]   2> 12328 T695 C70 P33814 REQ /update {distrib.from=http://127.0.0.1:33823/solr/collection1/&update.distrib=TOLEADER&wt=javabin&version=2} status=0 QTime=7 
[junit4:junit4]   2> 12329 T703 C72 P33823 /update {wt=javabin&version=2} {add=[15]} 0 11
[junit4:junit4]   2> 12336 T677 C71 P33811 /update {wt=javabin&version=2} {add=[16 (1414823402927030272)]} 0 3
[junit4:junit4]   2> 12372 T715 C69 P33825 REQ /update {distrib.from=http://127.0.0.1:33814/solr/collection1/&update.distrib=FROMLEADER&wt=javabin&version=2} status=0 QTime=14 
[junit4:junit4]   2> 12373 T696 C70 P33814 /update {wt=javabin&version=2} {add=[16 (1414823402933321728)]} 0 34
[junit4:junit4]   2> 12381 T677 C71 P33811 /update {wt=javabin&version=2} {add=[17 (1414823402974216192)]} 0 4
[junit4:junit4]   2> 12392 T704 C72 P33823 REQ /update {distrib.from=http://127.0.0.1:33814/solr/collection1/&update.distrib=TOLEADER&wt=javabin&version=2} status=0 QTime=4 
[junit4:junit4]   2> 12393 T696 C70 P33814 /update {wt=javabin&version=2} {add=[17]} 0 9
[junit4:junit4]   2> 12398 T677 C71 P33811 /update {wt=javabin&version=2} {add=[100 (1414823402993090560)]} 0 2
[junit4:junit4]   2> 12410 T715 C69 P33825 REQ /update {distrib.from=http://127.0.0.1:33814/solr/collection1/&update.distrib=FROMLEADER&wt=javabin&version=2} status=0 QTime=4 
[junit4:junit4]   2> 12411 T696 C70 P33814 /update {wt=javabin&version=2} {add=[100 (1414823402998333440)]} 0 10
[junit4:junit4]   2> 12416 T677 C71 P33811 /update {wt=javabin&version=2} {add=[101 (1414823403011964928)]} 0 2
[junit4:junit4]   2> 12425 T715 C69 P33825 REQ /update {distrib.from=http://127.0.0.1:33814/solr/collection1/&update.distrib=FROMLEADER&wt=javabin&version=2} status=0 QTime=2 
[junit4:junit4]   2> 12426 T696 C70 P33814 /update {wt=javabin&version=2} {add=[101 (1414823403017207808)]} 0 7
[junit4:junit4]   2> 12455 T677 C71 P33811 /update {wt=javabin&version=2} {add=[102 (1414823403027693568)]} 0 26
[junit4:junit4]   2> 12469 T715 C69 P33825 REQ /update {distrib.from=http://127.0.0.1:33814/solr/collection1/&update.distrib=FROMLEADER&wt=javabin&version=2} status=0 QTime=2 
[junit4:junit4]   2> 12470 T695 C70 P33814 REQ /update {distrib.from=http://127.0.0.1:33823/solr/collection1/&update.distrib=TOLEADER&wt=javabin&version=2} status=0 QTime=8 
[junit4:junit4]   2> 12471 T703 C72 P33823 /update {wt=javabin&version=2} {add=[102]} 0 12
[junit4:junit4]   2> 12478 T677 C71 P33811 /update {wt=javabin&version=2} {add=[103 (1414823403075928064)]} 0 3
[junit4:junit4]   2> 12484 T703 C72 P33823 /update {wt=javabin&version=2} {add=[103 (1414823403083268096)]} 0 2
[junit4:junit4]   2> 12489 T677 C71 P33811 /update {wt=javabin&version=2} {add=[104 (1414823403088510976)]} 0 2
[junit4:junit4]   2> 12494 T703 C72 P33823 /update {wt=javabin&version=2} {add=[104 (1414823403093753856)]} 0 2
[junit4:junit4]   2> 12499 T677 C71 P33811 /update {wt=javabin&version=2} {add=[105 (1414823403098996736)]} 0 2
[junit4:junit4]   2> 12519 T703 C72 P33823 /update {wt=javabin&version=2} {add=[105 (1414823403104239616)]} 0 17
[junit4:junit4]   2> 12526 T677 C71 P33811 /update {wt=javabin&version=2} {add=[106 (1414823403126259712)]} 0 2
[junit4:junit4]   2> 12535 T704 C72 P33823 REQ /update {distrib.from=http://127.0.0.1:33814/solr/collection1/&update.distrib=TOLEADER&wt=javabin&version=2} status=0 QTime=2 
[junit4:junit4]   2> 12536 T696 C70 P33814 /update {wt=javabin&version=2} {add=[106]} 0 7
[junit4:junit4]   2> 12542 T677 C71 P33811 /update {wt=javabin&version=2} {add=[107 (1414823403143036928)]} 0 3
[junit4:junit4]   2> 12551 T715 C69 P33825 REQ /update {distrib.from=http://127.0.0.1:33814/solr/collection1/&update.distrib=FROMLEADER&wt=javabin&version=2} status=0 QTime=2 
[junit4:junit4]   2> 12552 T696 C70 P33814 /update {wt=javabin&version=2} {add=[107 (1414823403149328384)]} 0 7
[junit4:junit4]   2> 12557 T677 C71 P33811 /update {wt=javabin&version=2} {add=[108 (1414823403159814144)]} 0 2
[junit4:junit4]   2> 12566 T715 C69 P33825 REQ /update {distrib.from=http://127.0.0.1:33814/solr/collection1/&update.distrib=FROMLEADER&wt=javabin&version=2} status=0 QTime=2 
[junit4:junit4]   2> 12566 T696 C70 P33814 /update {wt=javabin&version=2} {add=[108 (1414823403165057024)]} 0 6
[junit4:junit4]   2> 12572 T677 C71 P33811 /update {wt=javabin&version=2} {add=[109 (1414823403175542784)]} 0 2
[junit4:junit4]   2> 12584 T715 C69 P33825 REQ /update {distrib.from=http://127.0.0.1:33814/solr/collection1/&update.distrib=FROMLEADER&wt=javabin&version=2} status=0 QTime=2 
[junit4:junit4]   2> 12585 T695 C70 P33814 REQ /update {distrib.from=http://127.0.0.1:33823/solr/collection1/&update.distrib=TOLEADER&wt=javabin&version=2} status=0 QTime=7 
[junit4:junit4]   2> 12586 T703 C72 P33823 /update {wt=javabin&version=2} {add=[109]} 0 10
[junit4:junit4]   2> 12591 T677 C71 P33811 /update {wt=javabin&version=2} {add=[110 (1414823403195465728)]} 0 2
[junit4:junit4]   2> 12603 T715 C69 P33825 REQ /update {distrib.from=http://127.0.0.1:33814/solr/collection1/&update.distrib=FROMLEADER&wt=javabin&version=2} status=0 QTime=2 
[junit4:junit4]   2> 12605 T696 C70 P33814 /update {wt=javabin&version=2} {add=[110 (1414823403200708608)]} 0 11
[junit4:junit4]   2> 12611 T677 C71 P33811 /update {wt=javabin&version=2} {add=[111 (1414823403216437248)]} 0 2
[junit4:junit4]   2> 12620 T715 C69 P33825 REQ /update {distrib.from=http://127.0.0.1:33814/solr/collection1/&update.distrib=FROMLEADER&wt=javabin&version=2} status=0 QTime=2 
[junit4:junit4]   2> 12621 T696 C70 P33814 /update {wt=javabin&version=2} {add=[111 (1414823403221680128)]} 0 7
[junit4:junit4]   2> 12640 T677 C71 P33811 /update {wt=javabin&version=2} {add=[112 (1414823403232165888)]} 0 15
[junit4:junit4]   2> 12648 T704 C72 P33823 REQ /update {distrib.from=http://127.0.0.1:33814/solr/collection1/&update.distrib=TOLEADER&wt=javabin&version=2} status=0 QTime=2 
[junit4:junit4]   2> 12649 T696 C70 P33814 /update {wt=javabin&version=2} {add=[112]} 0 6
[junit4:junit4]   2> 12655 T677 C71 P33811 /update {wt=javabin&version=2} {add=[113 (1414823403261526016)]} 0 3
[junit4:junit4]   2> 12668 T715 C69 P33825 REQ /update {distrib.from=http://127.0.0.1:33814/solr/collection1/&update.distrib=FROMLEADER&wt=javabin&version=2} status=0 QTime=2 
[junit4:junit4]   2> 12669 T695 C70 P33814 REQ /update {distrib.from=http://127.0.0.1:33823/solr/collection1/&update.distrib=TOLEADER&wt=javabin&version=2} status=0 QTime=7 
[junit4:junit4]   2> 12670 T703 C72 P33823 /update {wt=javabin&version=2} {add=[113]} 0 10
[junit4:junit4]   2> 12675 T677 C71 P33811 /update {wt=javabin&version=2} {add=[114 (1414823403283546112)]} 0 2
[junit4:junit4]   2> 12710 T715 C69 P33825 REQ /update {distrib.from=http://127.0.0.1:33814/solr/collection1/&update.distrib=FROMLEADER&wt=javabin&version=2} status=0 QTime=15 
[junit4:junit4]   2> 12711 T696 C70 P33814 /update {wt=javabin&version=2} {add=[114 (1414823403288788992)]} 0 33
[junit4:junit4]   2> 12716 T677 C71 P33811 /update {wt=javabin&version=2} {add=[115 (1414823403326537728)]} 0 2
[junit4:junit4]   2> 12722 T703 C72 P33823 /update {wt=javabin&version=2} {add=[115 (1414823403332829184)]} 0 2
[junit4:junit4]   2> 12726 T677 C71 P33811 /update {wt=javabin&version=2} {add=[116 (1414823403337023488)]} 0 1
[junit4:junit4]   2> 12731 T703 C72 P33823 /update {wt=javabin&version=2} {add=[116 (1414823403342266368)]} 0 2
[junit4:junit4]   2> 12736 T677 C71 P33811 /update {wt=javabin&version=2} {add=[117 (1414823403347509248)]} 0 2
[junit4:junit4]   2> 12740 T703 C72 P33823 /update {wt=javabin&version=2} {add=[117 (1414823403351703552)]} 0 2
[junit4:junit4]   2> 12745 T677 C71 P33811 /update {wt=javabin&version=2} {add=[118 (1414823403356946432)]} 0 2
[junit4:junit4]   2> 12755 T715 C69 P33825 REQ /update {distrib.from=http://127.0.0.1:33814/solr/collection1/&update.distrib=FROMLEADER&wt=javabin&version=2} status=0 QTime=3 
[junit4:junit4]   2> 12755 T696 C70 P33814 /update {wt=javabin&version=2} {add=[118 (1414823403361140736)]} 0 8
[junit4:junit4]   2> 12761 T677 C71 P33811 /update {wt=javabin&version=2} {add=[119 (1414823403373723648)]} 0 2
[junit4:junit4]   2> 12769 T704 C72 P33823 REQ /update {distrib.from=http://127.0.0.1:33814/solr/collection1/&update.distrib=TOLEADER&wt=javabin&version=2} status=0 QTime=2 
[junit4:junit4]   2> 12769 T696 C70 P33814 /update {wt=javabin&version=2} {add=[119]} 0 5
[junit4:junit4]   2> 12775 T677 C71 P33811 /update {wt=javabin&version=2} {add=[120 (1414823403388403712)]} 0 2
[junit4:junit4]   2> 12779 T703 C72 P33823 /update {wt=javabin&version=2} {add=[120 (1414823403393646592)]} 0 1
[junit4:junit4]   2> 12785 T677 C71 P33811 /update {wt=javabin&version=2} {add=[121 (1414823403398889472)]} 0 2
[junit4:junit4]   2> 12793 T704 C72 P33823 REQ /update {distrib.from=http://127.0.0.1:33814/solr/collection1/&update.distrib=TOLEADER&wt=javabin&version=2} status=0 QTime=2 
[junit4:junit4]   2> 12793 T696 C70 P33814 /update {wt=javabin&version=2} {add=[121]} 0 5
[junit4:junit4]   2> 12810 T677 C71 P33811 /update {wt=javabin&version=2} {add=[122 (1414823403413569536)]} 0 13
[junit4:junit4]   2> 12822 T715 C69 P33825 REQ /update {distrib.from=http://127.0.0.1:33814/solr/collection1/&update.distrib=FROMLEADER&wt=javabin&version=2} status=0 QTime=2 
[junit4:junit4]   2> 12823 T695 C70 P33814 REQ /update {distrib.from=http://127.0.0.1:33823/solr/collection1/&update.distrib=TOLEADER&wt=javabin&version=2} status=0 QTime=7 
[junit4:junit4]   2> 12823 T703 C72 P33823 /update {wt=javabin&version=2} {add=[122]} 0 10
[junit4:junit4]   2> 12830 T677 C71 P33811 /update {wt=javabin&version=2} {add=[123 (1414823403445026816)]} 0 3
[junit4:junit4]   2> 12842 T715 C69 P33825 REQ /update {distrib.from=http://127.0.0.1:33814/solr/collection1/&update.distrib=FROMLEADER&wt=javabin&version=2} status=0 QTime=2 
[junit4:junit4]   2> 12844 T695 C70 P33814 REQ /update {distrib.from=http://127.0.0.1:33823/solr/collection1/&update.distrib=TOLEADER&wt=javabin&version=2} status=0 QTime=8 
[junit4:junit4]   2> 12844 T703 C72 P33823 /update {wt=javabin&version=2} {add=[123]} 0 11
[junit4:junit4]   2> 12850 T677 C71 P33811 /update {wt=javabin&version=2} {add=[124 (1414823403467046912)]} 0 2
[junit4:junit4]   2> 12863 T715 C69 P33825 REQ /update {distrib.from=http://127.0.0.1:33814/solr/collection1/&update.distrib=FROMLEADER&wt=javabin&version=2} status=0 QTime=3 
[junit4:junit4]   2> 12864 T695 C70 P33814 REQ /update {distrib.from=http://127.0.0.1:33823/solr/collection1/&update.distrib=TOLEADER&wt=javabin&version=2} status=0 QTime=8 
[junit4:junit4]   2> 12865 T703 C72 P33823 /update {wt=javabin&version=2} {add=[124]} 0 12
[junit4:junit4]   2> 12870 T677 C71 P33811 /update {wt=javabin&version=2} {add=[125 (1414823403488018432)]} 0 2
[junit4:junit4]   2> 12880 T715 C69 P33825 REQ /update {distrib.from=http://127.0.0.1:33814/solr/collection1/&update.distrib=FROMLEADER&wt=javabin&version=2} status=0 QTime=2 
[junit4:junit4]   2> 12881 T696 C70 P33814 /update {wt=javabin&version=2} {add=[125 (1414823403493261312)]} 0 7
[junit4:junit4]   2> 12897 T677 C71 P33811 /update {wt=javabin&version=2} {add=[126 (1414823403516329984)]} 0 1
[junit4:junit4]   2> 12903 T703 C72 P33823 /update {wt=javabin&version=2} {add=[126 (1414823403522621440)]} 0 2
[junit4:junit4]   2> 12907 T677 C71 P33811 /update {wt=javabin&version=2} {add=[127 (1414823403526815744)]} 0 1
[junit4:junit4]   2> 12923 T703 C72 P33823 /update {wt=javabin&version=2} {add=[127 (1414823403532058624)]} 0 13
[junit4:junit4]   2> 12929 T677 C71 P33811 /update {wt=javabin&version=2} {add=[128 (1414823403549884416)]} 0 2
[junit4:junit4]   2> 12938 T704 C72 P33823 REQ /update {distrib.from=http://127.0.0.1:33814/solr/collection1/&update.distrib=TOLEADER&wt=javabin&version=2} status=0 QTime=3 
[junit4:junit4]   2> 12939 T696 C70 P33814 /update {wt=javabin&version=2} {add=[128]} 0 7
[junit4:junit4]   2> 12944 T677 C71 P33811 /update {wt=javabin&version=2} {add=[129 (1414823403565613056)]} 0 2
[junit4:junit4]   2> 12953 T715 C69 P33825 REQ /update {distrib.from=http://127.0.0.1:33814/solr/collection1/&update.distrib=FROMLEADER&wt=javabin&version=2} status=0 QTime=2 
[junit4:junit4]   2> 12954 T696 C70 P33814 /update {wt=javabin&version=2} {add=[129 (1414823403570855936)]} 0 7
[junit4:junit4]   2> 12959 T677 C71 P33811 /update {wt=javabin&version=2} {add=[130 (1414823403581341696)]} 0 2
[junit4:junit4]   2> 12967 T704 C72 P33823 REQ /update {distrib.from=http://127.0.0.1:33814/solr/collection1/&update.distrib=TOLEADER&wt=javabin&version=2} status=0 QTime=2 
[junit4:junit4]   2> 12968 T696 C70 P33814 /update {wt=javabin&version=2} {add=[130]} 0 6
[junit4:junit4]   2> 12973 T677 C71 P33811 /update {wt=javabin&version=2} {add=[131 (1414823403596021760)]} 0 2
[junit4:junit4]   2> 12981 T704 C72 P33823 REQ /update {distrib.from=http://127.0.0.1:33814/solr/collection1/&update.distrib=TOLEADER&wt=javabin&version=2} status=0 QTime=2 
[junit4:junit4]   2> 12981 T696 C70 P33814 /update {wt=javabin&version=2} {add=[131]} 0 5
[junit4:junit4]   2> 12998 T677 C71 P33811 /update {wt=javabin&version=2} {add=[132 (1414823403610701824)]} 0 13
[junit4:junit4]   2> 13011 T715 C69 P33825 REQ /update {distrib.from=http://127.0.0.1:33814/solr/collection1/&update.distrib=FROMLEADER&wt=javabin&version=2} status=0 QTime=2 
[junit4:junit4]   2> 13011 T695 C70 P33814 REQ /update {distrib.from=http://127.0.0.1:33823/solr/collection1/&update.distrib=TOLEADER&wt=javabin&version=2} status=0 QTime=6 
[junit4:junit4]   2> 13012 T703 C72 P33823 /update {wt=javabin&version=2} {add=[132]} 0 10
[junit4:junit4]   2> 13018 T677 C71 P33811 /update {wt=javabin&version=2} {add=[133 (1414823403642159104)]} 0 3
[junit4:junit4]   2> 13027 T715 C69 P33825 REQ /update {distrib.from=http://127.0.0.1:33814/solr/collection1/&update.distrib=FROMLEADER&wt=javabin&version=2} status=0 QTime=2 
[junit4:junit4]   2> 13027 T696 C70 P33814 /update {wt=javabin&version=2} {add=[133 (1414823403648450560)]} 0 6
[junit4:junit4]   2> 13032 T677 C71 P33811 /update {wt=javabin&version=2} {add=[134 (1414823403656839168)]} 0 1
[junit4:junit4]   2> 13036 T703 C72 P33823 /update {wt=javabin&version=2} {add=[134 (1414823403662082048)]} 0 2
[junit4:junit4]   2> 13041 T677 C71 P33811 /update {wt=javabin&version=2} {add=[135 (1414823403667324928)]} 0 2
[junit4:junit4]   2> 13048 T715 C69 P33825 REQ /update {distrib.from=http://127.0.0.1:33814/solr/collection1/&update.distrib=FROMLEADER&wt=javabin&version=2} status=0 QTime=1 
[junit4:junit4]   2> 13049 T696 C70 P33814 /update {wt=javabin&version=2} {add=[135 (1414823403671519232)]} 0 6
[junit4:junit4]   2> 13053 T677 C71 P33811 /update {wt=javabin&version=2} {add=[136 (1414823403679907840)]} 0 1
[junit4:junit4]   2> 13058 T703 C72 P33823 /update {wt=javabin&version=2} {add=[136 (1414823403685150720)]} 0 2
[junit4:junit4]   2> 13062 T677 C71 P33811 /update {wt=javabin&version=2} {add=[137 (1414823403690393600)]} 0 1
[junit4:junit4]   2> 13067 T703 C72 P33823 /update {wt=javabin&version=2} {add=[137 (1414823403694587904)]} 0 2
[junit4:junit4]   2> 13073 T677 C71 P33811 /update {wt=javabin&version=2} {add=[138 (1414823403700879360)]} 0 2
[junit4:junit4]   2> 13114 T715 C69 P33825 REQ /update {distrib.from=http://127.0.0.1:33814/solr/collection1/&update.distrib=FROMLEADER&wt=javabin&version=2} status=0 QTime=14 
[junit4:junit4]   2> 13115 T695 C70 P33814 REQ /update {distrib.from=http://127.0.0.1:33823/solr/collection1/&update.distrib=TOLEADER&wt=javabin&version=2} status=0 QTime=36 
[junit4:junit4]   2> 13116 T703 C72 P33823 /update {wt=javabin&version=2} {add=[138]} 0 40
[junit4:junit4]   2> 13121 T677 C71 P33811 /update {wt=javabin&version=2} {add=[139 (1414823403751211008)]} 0 2
[junit4:junit4]   2> 13129 T704 C72 P33823 REQ /update {distrib.from=http://127.0.0.1:33814/solr/collection1/&update.distrib=TOLEADER&wt=javabin&version=2} status=0 QTime=2 
[junit4:junit4]   2> 13130 T696 C70 P33814 /update {wt=javabin&version=2} {add=[139]} 0 5
[junit4:junit4]   2> 13135 T677 C71 P33811 /update {wt=javabin&version=2} {add=[140 (1414823403765891072)]} 0 2
[junit4:junit4]   2> 13143 T704 C72 P33823 REQ /update {distrib.from=http://127.0.0.1:33814/solr/collection1/&update.distrib=TOLEADER&wt=javabin&version=2} status=0 QTime=2 
[junit4:junit4]   2> 13143 T696 C70 P33814 /update {wt=javabin&version=2} {add=[140]} 0 5
[junit4:junit4]   2> 13149 T677 C71 P33811 /update {wt=javabin&version=2} {add=[141 (1414823403780571136)]} 0 2
[junit4:junit4]   2> 13154 T703 C72 P33823 /update {wt=javabin&version=2} {add=[141 (1414823403785814016)]} 0 2
[junit4:junit4]   2> 13171 T677 C71 P33811 /update {wt=javabin&version=2} {add=[142 (1414823403791056896)]} 0 14
[junit4:junit4]   2> 13187 T703 C72 P33823 /update {wt=javabin&version=2} {add=[142 (1414823403808882688)]} 0 13
[junit4:junit4]   2> 13193 T677 C71 P33811 /update {wt=javabin&version=2} {add=[143 (1414823403825659904)]} 0 3
[junit4:junit4]   2> 13202 T704 C72 P33823 REQ /update {distrib.from=http://127.0.0.1:33814/solr/collection1/&update.distrib=TOLEADER&wt=javabin&version=2} status=0 QTime=3 
[junit4:junit4]   2> 13203 T696 C70 P33814 /update {wt=javabin&version=2} {add=[143]} 0 7
[junit4:junit4]   2> 13208 T677 C71 P33811 /update {wt=javabin&version=2} {add=[144 (1414823403842437120)]} 0 2
[junit4:junit4]   2> 13213 T703 C72 P33823 /update {wt=javabin&version=2} {add=[144 (1414823403847680000)]} 0 2
[junit4:junit4]   2> 13218 T677 C71 P33811 /update {wt=javabin&version=2} {add=[145 (1414823403852922880)]} 0 2
[junit4:junit4]   2> 13226 T704 C72 P33823 REQ /update {distrib.from=http://127.0.0.1:33814/solr/collection1/&update.distrib=TOLEADER&wt=javabin&version=2} status=0 QTime=2 
[junit4:junit4]   2> 13226 T696 C70 P33814 /update {wt=javabin&version=2} {add=[145]} 0 5
[junit4:junit4]   2> 13232 T677 C71 P33811 /update {wt=javabin&version=2} {add=[146 (1414823403867602944)]} 0 2
[junit4:junit4]   2> 13243 T715 C69 P33825 REQ /update {distrib.from=http://127.0.0.1:33814/solr/collection1/&update.distrib=FROMLEADER&wt=javabin&version=2} status=0 QTime=3 
[junit4:junit4]   2> 13244 T696 C70 P33814 /update {wt=javabin&version=2} {add=[146 (1414823403872845824)]} 0 9
[junit4:junit4]   2> 13249 T677 C71 P33811 /update {wt=javabin&version=2} {add=[147 (1414823403885428736)]} 0 2
[junit4:junit4]   2> 13257 T704 C72 P33823 REQ /update {distrib.from=http://127.0.0.1:33814/solr/collection1/&update.distrib=TOLEADER&wt=javabin&version=2} status=0 QTime=2 
[junit4:junit4]   2> 13258 T696 C70 P33814 /update {wt=javabin&version=2} {add=[147]} 0 6
[junit4:junit4]   2> 13263 T677 C71 P33811 /update {wt=javabin&version=2} {add=[148 (1414823403900108800)]} 0 2
[junit4:junit4]   2> 13275 T715 C69 P33825 REQ /update {distrib.from=http://127.0.0.1:33814/solr/collection1/&update.distrib=FROMLEADER&wt=javabin&version=2} status=0 QTime=2 
[junit4:junit4]   2> 13277 T695 C70 P33814 REQ /update {distrib.from=http://127.0.0.1:33823/solr/collection1/&update.distrib=TOLEADER&wt=javabin&version=2} status=0 QTime=7 
[junit4:junit4]   2> 13278 T703 C72 P33823 /update {wt=javabin&version=2} {add=[148]} 0 12
[junit4:junit4]   2> 13283 T677 C71 P33811 /update {wt=javabin&version=2} {add=[149 (1414823403921080320)]} 0 2
[junit4:junit4]   2> 13288 T703 C72 P33823 /update {wt=javabin&version=2} {add=[149 (1414823403926323200)]} 0 2
[junit4:junit4]   2> 13291 T677 C71 P33811 oasu.DirectUpdateHandler2.commit start commit{flags=0,_version_=0,optimize=false,openSearcher=true,waitSearcher=true,expungeDeletes=false,softCommit=false}
[junit4:junit4]   2> 13867 T677 C71 P33811 oasc.SolrDeletionPolicy.onCommit SolrDeletionPolicy.onCommit: commits:num=2
[junit4:junit4]   2> 		commit{dir=NRTCachingDirectory(org.apache.lucene.store.NIOFSDirectory@/usr/home/hudson/hudson-slave/workspace/Lucene-Solr-Tests-4.x-java7/solr/build/solr-core/test/J0/org.apache.solr.cloud.BasicDistributedZkTest-1349280729293/control/data/index lockFactory=org.apache.lucene.store.NativeFSLockFactory@e3f23ed; maxCacheMB=48.0 maxMergeSizeMB=4.0),segFN=segments_1,generation=1,filenames=[segments_1]
[junit4:junit4]   2> 		commit{dir=NRTCachingDirectory(org.apache.lucene.store.NIOFSDirectory@/usr/home/hudson/hudson-slave/workspace/Lucene-Solr-Tests-4.x-java7/solr/build/solr-core/test/J0/org.apache.solr.cloud.BasicDistributedZkTest-1349280729293/control/data/index lockFactory=org.apache.lucene.store.NativeFSLockFactory@e3f23ed; maxCacheMB=48.0 maxMergeSizeMB=4.0),segFN=segments_2,generation=2,filenames=[_5_nrm.cfe, _3_MockRandom_0.prx, _3_MockVariableIntBlock_0.frq, _0_MockRandom_0.prx, _3.fdt, _5_Lucene40WithOrds_0.tib, _4_MockVariableIntBlock_0.tii, _1_MockRandom_0.pos, _0_Lucene40WithOrds_0.tii, _5_Lucene40WithOrds_0.tii, _0_Lucene40WithOrds_0.frq, _1_Lucene40WithOrds_0.tib, _0_SimpleText_0.pst, _5_MockVariableIntBlock_0.tii, _1_Lucene40WithOrds_0.tii, _0_Lucene40WithOrds_0.tib, _6_MockVariableIntBlock_0.tii, _6_MockRandom_0.skp, _1_Lucene40WithOrds_0.frq, _6_MockVariableIntBlock_0.tib, _1_MockVariableIntBlock_0.tii, _1_MockRandom_0.tip, _4_MockVariableIntBlock_0.doc, _2.fdt, _1_MockRandom_0.sd, _1_MockRandom_0.tim, _2.fdx, _1_MockVariableIntBlock_0.tib, _1.fdx, _0_MockRandom_0.frq, _4_MockRandom_0.prx, _4_MockVariableIntBlock_0.tib, _5_nrm.cfs, _1.fdt, _4_MockRandom_0.sd, _0_MockVariableIntBlock_0.frq, _1_MockRandom_0.doc, _3.si, _6.fdt, _2_MockVariableIntBlock_0.skp, _5_Lucene40WithOrds_0.prx, _1_SimpleText_0.pst, _1_MockVariableIntBlock_0.skp, _2.si, _4_Lucene40WithOrds_0.tib, _6_MockRandom_0.tip, _4_Lucene40WithOrds_0.tii, _2_MockVariableIntBlock_0.pyl, _0_MockVariableIntBlock_0.doc, _6_MockRandom_0.tim, _6.fdx, _1_Lucene40WithOrds_0.prx, _1_MockVariableIntBlock_0.pyl, _3_MockRandom_0.frq, _3.fnm, _2_MockRandom_0.tiv, _2_MockVariableIntBlock_0.doc, _3_MockVariableIntBlock_0.tii, _0_MockVariableIntBlock_0.pyl, _2_nrm.cfe, _6_MockRandom_0.pyl, _1_MockVariableIntBlock_0.doc, _0_MockVariableIntBlock_0.pos, _6_MockRandom_0.doc, _2_MockRandom_0.tib, _2_nrm.cfs, _2_MockRandom_0.prx, _2_MockVariableIntBlock_0.tii, _5_MockVariableIntBlock_0.tib, _2_Lucene40WithOrds_0.frq, _2_MockVariableIntBlock_0.tib, _1_MockVariableIntBlock_0.pos, _4_MockVariableIntBlock_0.frq, _5_MockVariableIntBlock_0.frq, _2.fnm, _3.fdx, _2_MockRandom_0.sd, _1.si, _3_MockVariableIntBlock_0.pyl, _6.si, _6.fnm, _0_Lucene40WithOrds_0.prx, _3_Lucene40WithOrds_0.prx, _3_MockVariableIntBlock_0.pos, _6_MockRandom_0.frq, _3_nrm.cfe, _5.fdt, _4_MockRandom_0.tii, _5_MockVariableIntBlock_0.pyl, _3_Lucene40WithOrds_0.tii, _6_Lucene40WithOrds_0.prx, _4_nrm.cfe, _4.fnm, _4_MockRandom_0.tib, _0_MockVariableIntBlock_0.skp, _1.fnm, _3_Lucene40WithOrds_0.tib, _4.fdx, _5_MockRandom_0.sd, _6_MockVariableIntBlock_0.frq, _6_MockVariableIntBlock_0.doc, _2_MockVariableIntBlock_0.pos, _6_Lucene40WithOrds_0.frq, _5_MockVariableIntBlock_0.pos, _0.fnm, _3_MockVariableIntBlock_0.doc, _6_Lucene40WithOrds_0.tii, _5.si, _5_Lucene40WithOrds_0.frq, _3_nrm.cfs, _6_MockRandom_0.sd, _4_MockVariableIntBlock_0.pyl, _3_MockRandom_0.tip, _4_Lucene40WithOrds_0.prx, _6_Lucene40WithOrds_0.tib, _3_MockRandom_0.tim, _4_nrm.cfs, _3_MockVariableIntBlock_0.tib, _1_MockRandom_0.frq, _5_MockVariableIntBlock_0.doc, _5_MockRandom_0.frq, _6_MockVariableIntBlock_0.pyl, _4_Lucene40WithOrds_0.frq, _2_MockVariableIntBlock_0.frq, _6_MockRandom_0.pos, _5_MockRandom_0.tip, _6_nrm.cfs, _4_MockVariableIntBlock_0.skp, _5_MockRandom_0.tim, _2_Lucene40WithOrds_0.prx, _0_MockVariableIntBlock_0.tib, _5_MockVariableIntBlock_0.skp, _6_MockVariableIntBlock_0.pos, _4_MockVariableIntBlock_0.pos, _0.si, _0_MockVariableIntBlock_0.tii, _1_nrm.cfs, _0_MockRandom_0.tib, _5.fnm, _6_nrm.cfe, _4.si, _4.fdt, _1_MockRandom_0.skp, _0_nrm.cfs, _3_Lucene40WithOrds_0.frq, _6_MockVariableIntBlock_0.skp, _1_nrm.cfe, _3_MockRandom_0.sd, _1_MockVariableIntBlock_0.frq, _2_Lucene40WithOrds_0.tii, _5_MockRandom_0.prx, _0_MockRandom_0.sd, _1_MockRandom_0.pyl, _4_MockRandom_0.frq, _0_nrm.cfe, _5.fdx, segments_2, _0_MockRandom_0.tii, _2_MockRandom_0.frq, _0.fdx, _2_Lucene40WithOrds_0.tib, _3_MockVariableIntBlock_0.skp, _0.fdt]
[junit4:junit4]   2> 13868 T677 C71 P33811 oasc.SolrDeletionPolicy.updateCommits newest commit = 2
[junit4:junit4]   2> 13882 T677 C71 P33811 oass.SolrIndexSearcher.<init> Opening Searcher@6ee8aa76 main
[junit4:junit4]   2> 13883 T677 C71 P33811 oasu.DirectUpdateHandler2.commit end_commit_flush
[junit4:junit4]   2> 13884 T688 oasc.SolrCore.registerSearcher [collection1] Registered new searcher Searcher@6ee8aa76 main{StandardDirectoryReader(segments_2:15:nrt _0(4.1):C10 _1(4.1):C10 _2(4.1):C10 _3(4.1):C10 _4(4.1):C10 _5(4.1):C10 _6(4.1):C7)}
[junit4:junit4]   2> 13885 T677 C71 P33811 /update {waitSearcher=true&wt=javabin&commit=true&softCommit=false&version=2} {commit=} 0 594
[junit4:junit4]   2> 13889 T703 C72 P33823 oasu.DirectUpdateHandler2.commit start commit{flags=0,_version_=0,optimize=false,openSearcher=true,waitSearcher=true,expungeDeletes=false,softCommit=false}
[junit4:junit4]   2> 14219 T703 C72 P33823 oasc.SolrDeletionPolicy.onCommit SolrDeletionPolicy.onCommit: commits:num=2
[junit4:junit4]   2> 		commit{dir=NRTCachingDirectory(org.apache.lucene.store.NIOFSDirectory@/usr/home/hudson/hudson-slave/workspace/Lucene-Solr-Tests-4.x-java7/solr/build/solr-core/test/J0/org.apache.solr.cloud.BasicDistributedZkTest-1349280729293/jetty2/index lockFactory=org.apache.lucene.store.NativeFSLockFactory@11d83d0b; maxCacheMB=48.0 maxMergeSizeMB=4.0),segFN=segments_1,generation=1,filenames=[segments_1]
[junit4:junit4]   2> 		commit{dir=NRTCachingDirectory(org.apache.lucene.store.NIOFSDirectory@/usr/home/hudson/hudson-slave/workspace/Lucene-Solr-Tests-4.x-java7/solr/build/solr-core/test/J0/org.apache.solr.cloud.BasicDistributedZkTest-1349280729293/jetty2/index lockFactory=org.apache.lucene.store.NativeFSLockFactory@11d83d0b; maxCacheMB=48.0 maxMergeSizeMB=4.0),segFN=segments_2,generation=2,filenames=[_3_nrm.cfe, _3_MockRandom_0.prx, _3_MockVariableIntBlock_0.frq, _3_Lucene40WithOrds_0.tii, _3.fdt, _0_MockVariableIntBlock_0.skp, _1.fnm, _3_Lucene40WithOrds_0.tib, _0_Lucene40WithOrds_0.tii, _0_Lucene40WithOrds_0.frq, _1_Lucene40WithOrds_0.tib, _0_SimpleText_0.pst, _1_Lucene40WithOrds_0.tii, _0_Lucene40WithOrds_0.tib, _2_MockVariableIntBlock_0.pos, _1_Lucene40WithOrds_0.frq, _0.fnm, _1_MockVariableIntBlock_0.tii, _1_MockRandom_0.tip, _3_MockVariableIntBlock_0.doc, _2.fdt, _1_MockRandom_0.sd, _1_MockRandom_0.tim, _2.fdx, _0_MockRandom_0.skp, _1_MockVariableIntBlock_0.tib, _3_nrm.cfs, _1.fdx, _0_MockRandom_0.frq, _3_MockRandom_0.tip, _1.fdt, _3_MockRandom_0.tim, _0_MockRandom_0.doc, _0_MockVariableIntBlock_0.frq, _0_MockRandom_0.pos, _3_MockVariableIntBlock_0.tib, _3.si, _2_MockVariableIntBlock_0.skp, _1_MockRandom_0.frq, _2.si, _1_MockVariableIntBlock_0.skp, _2_MockRandom_0.tip, _2_MockVariableIntBlock_0.pyl, _0_MockVariableIntBlock_0.doc, _2_MockRandom_0.tim, _1_Lucene40WithOrds_0.prx, _2_MockVariableIntBlock_0.frq, _1_MockVariableIntBlock_0.pyl, _3_MockRandom_0.frq, _3.fnm, _3_MockVariableIntBlock_0.tii, _2_MockVariableIntBlock_0.doc, _0_MockVariableIntBlock_0.pyl, _2_nrm.cfe, _2_Lucene40WithOrds_0.prx, _0_MockVariableIntBlock_0.tib, _1_MockVariableIntBlock_0.doc, _0_MockVariableIntBlock_0.pos, _2_nrm.cfs, _0.si, _0_MockVariableIntBlock_0.tii, _2_MockRandom_0.prx, _2_MockVariableIntBlock_0.tii, _0_MockRandom_0.tib, _1_nrm.cfs, _2_Lucene40WithOrds_0.frq, _2_MockVariableIntBlock_0.tib, _1_MockVariableIntBlock_0.pos, _3_Lucene40WithOrds_0.frq, _0_nrm.cfs, _3_MockRandom_0.sd, _2.fnm, _1_nrm.cfe, _3.fdx, _2_Lucene40WithOrds_0.tii, _2_MockRandom_0.sd, _1_MockVariableIntBlock_0.frq, _0_MockRandom_0.sd, _1_MockRandom_0.prx, _0_MockRandom_0.tiv, _1.si, _0_nrm.cfe, _3_MockVariableIntBlock_0.pyl, _2_MockRandom_0.frq, segments_2, _2_Lucene40WithOrds_0.tib, _0.fdx, _0_Lucene40WithOrds_0.prx, _3_Lucene40WithOrds_0.prx, _0_MockRandom_0.pyl, _3_MockVariableIntBlock_0.skp, _0.fdt, _3_MockVariableIntBlock_0.pos]
[junit4:junit4]   2> 14220 T703 C72 P33823 oasc.SolrDeletionPolicy.updateCommits newest commit = 2
[junit4:junit4]   2> 14233 T703 C72 P33823 oass.SolrIndexSearcher.<init> Opening Searcher@17c2dd5a main
[junit4:junit4]   2> 14233 T703 C72 P33823 oasu.DirectUpdateHandler2.commit end_commit_flush
[junit4:junit4]   2> 14235 T712 oasc.SolrCore.registerSearcher [collection1] Registered new searcher Searcher@17c2dd5a main{StandardDirectoryReader(segments_2:9:nrt _0(4.1):C10 _1(4.1):C10 _2(4.1):C10 _3(4.1):C5)}
[junit4:junit4]   2> 14236 T703 C72 P33823 oasu.SolrCmdDistributor.distribCommit Distrib commit to:[StdNode: http://127.0.0.1:33814/solr/collection1/, StdNode: http://127.0.0.1:33825/solr/collection1/]
[junit4:junit4]   2> 14238 T715 C69 P33825 oasu.DirectUpdateHandler2.commit start commit{flags=0,_version_=0,optimize=false,openSearcher=true,waitSearcher=true,expungeDeletes=false,softCommit=false}
[junit4:junit4]   2> 14239 T695 C70 P33814 oasu.DirectUpdateHandler2.commit start commit{flags=0,_version_=0,optimize=false,openSearcher=true,waitSearcher=true,expungeDeletes=false,softCommit=false}
[junit4:junit4]   2> 14867 T715 C69 P33825 oasc.SolrDeletionPolicy.onCommit SolrDeletionPolicy.onCommit: commits:num=2
[junit4:junit4]   2> 		commit{dir=NRTCachingDirectory(org.apache.lucene.store.NIOFSDirectory@/usr/home/hudson/hudson-slave/workspace/Lucene-Solr-Tests-4.x-java7/solr/build/solr-core/test/J0/org.apache.solr.cloud.BasicDistributedZkTest-1349280729293/jetty3/index lockFactory=org.apache.lucene.store.NativeFSLockFactory@5749b5a9; maxCacheMB=48.0 maxMergeSizeMB=4.0),segFN=segments_2,generation=2,filenames=[segments_2]
[junit4:junit4]   2> 		commit{dir=NRTCachingDirectory(org.apache.lucene.store.NIOFSDirectory@/usr/home/hudson/hudson-slave/workspace/Lucene-Solr-Tests-4.x-java7/solr/build/solr-core/test/J0/org.apache.solr.cloud.BasicDistributedZkTest-1349280729293/jetty3/index lockFactory=org.apache.lucene.store.NativeFSLockFactory@5749b5a9; maxCacheMB=48.0 maxMergeSizeMB=4.0),segFN=segments_3,generation=3,filenames=[_3_MockVariableIntBlock_0.frq, _0_MockRandom_0.prx, _3.fdt, _1_MockRandom_0.pos, _0_Lucene40WithOrds_0.tii, _0_Lucene40WithOrds_0.frq, _1_Lucene40WithOrds_0.tib, _0_SimpleText_0.pst, _3_MockRandom_0.skp, _1_Lucene40WithOrds_0.tii, _0_Lucene40WithOrds_0.tib, _1_Lucene40WithOrds_0.frq, _1_MockVariableIntBlock_0.tii, _1_MockRandom_0.tip, _2.fdt, _1_MockRandom_0.tim, _1_MockRandom_0.sd, _2.fdx, _1_MockVariableIntBlock_0.tib, _1.fdx, _0_MockRandom_0.frq, _1.fdt, _0_MockVariableIntBlock_0.frq, _1_MockRandom_0.doc, _3.si, _2_MockVariableIntBlock_0.skp, _1_MockVariableIntBlock_0.skp, _2.si, _2_MockVariableIntBlock_0.pyl, _2_MockRandom_0.tip, _0_MockVariableIntBlock_0.doc, _2_MockRandom_0.tim, _1_Lucene40WithOrds_0.prx, _1_MockVariableIntBlock_0.pyl, _3_MockRandom_0.frq, _3.fnm, _2_MockVariableIntBlock_0.doc, _3_MockVariableIntBlock_0.tii, _0_MockVariableIntBlock_0.pyl, _2_nrm.cfe, _1_MockVariableIntBlock_0.doc, _2_MockRandom_0.pyl, _0_MockVariableIntBlock_0.pos, _2_nrm.cfs, _2_MockVariableIntBlock_0.tii, _2_Lucene40WithOrds_0.frq, _2_MockVariableIntBlock_0.tib, _1_MockVariableIntBlock_0.pos, _2.fnm, _3.fdx, _2_MockRandom_0.sd, _2_MockRandom_0.skp, _1.si, _3_MockVariableIntBlock_0.pyl, _3_MockRandom_0.pyl, _0_Lucene40WithOrds_0.prx, _3_Lucene40WithOrds_0.prx, _3_MockRandom_0.pos, _2_MockRandom_0.doc, _3_MockVariableIntBlock_0.pos, _3_nrm.cfe, _3_Lucene40WithOrds_0.tii, _0_MockVariableIntBlock_0.skp, _1.fnm, _3_Lucene40WithOrds_0.tib, _2_MockVariableIntBlock_0.pos, _0.fnm, _3_MockVariableIntBlock_0.doc, _3_MockRandom_0.tii, _3_MockRandom_0.tib, _3_nrm.cfs, _3_MockVariableIntBlock_0.tib, _1_MockRandom_0.frq, _3_MockRandom_0.doc, _2_MockVariableIntBlock_0.frq, _2_Lucene40WithOrds_0.prx, _0_MockVariableIntBlock_0.tib, _2_MockRandom_0.pos, _0.si, _0_MockVariableIntBlock_0.tii, _1_nrm.cfs, _1_MockRandom_0.skp, _0_nrm.cfs, _3_Lucene40WithOrds_0.frq, _1_nrm.cfe, _3_MockRandom_0.sd, _1_MockVariableIntBlock_0.frq, _2_Lucene40WithOrds_0.tii, _0_MockRandom_0.tip, _0_MockRandom_0.sd, _1_MockRandom_0.pyl, _0_nrm.cfe, _2_MockRandom_0.frq, _0.fdx, _2_Lucene40WithOrds_0.tib, _3_MockVariableIntBlock_0.skp, _0_MockRandom_0.tim, segments_3, _0.fdt]
[junit4:junit4]   2> 14869 T715 C69 P33825 oasc.SolrDeletionPolicy.updateCommits newest commit = 3
[junit4:junit4]   2> 14882 T715 C69 P33825 oass.SolrIndexSearcher.<init> Opening Searcher@430ee3f5 main
[junit4:junit4]   2> 14883 T715 C69 P33825 oasu.DirectUpdateHandler2.commit end_commit_flush
[junit4:junit4]   2> 14885 T724 oasc.SolrCore.registerSearcher [collection1] Registered new searcher Searcher@430ee3f5 main{StandardDirectoryReader(segments_3:10:nrt _0(4.1):C10 _1(4.1):C10 _2(4.1):C10 _3(4.1):C2)}
[junit4:junit4]   2> 14885 T715 C69 P33825 /update {waitSearcher=true&commit=true&commit_end_point=true&expungeDeletes=false&wt=javabin&softCommit=false&version=2} {commit=} 0 647
[junit4:junit4]   2> 14888 T695 C70 P33814 oasc.SolrDeletionPolicy.onCommit SolrDeletionPolicy.onCommit: commits:num=2
[junit4:junit4]   2> 		commit{dir=NRTCachingDirectory(org.apache.lucene.store.NIOFSDirectory@/usr/home/hudson/hudson-slave/workspace/Lucene-Solr-Tests-4.x-java7/solr/build/solr-core/test/J0/org.apache.solr.cloud.BasicDistributedZkTest-1349280729293/jetty1/index lockFactory=org.apache.lucene.store.NativeFSLockFactory@7c9ef10; maxCacheMB=48.0 maxMergeSizeMB=4.0),segFN=segments_1,generation=1,filenames=[segments_1]
[junit4:junit4]   2> 		commit{dir=NRTCachingDirectory(org.apache.lucene.store.NIOFSDirectory@/usr/home/hudson/hudson-slave/workspace/Lucene-Solr-Tests-4.x-java7/solr/build/solr-core/test/J0/org.apache.solr.cloud.BasicDistributedZkTest-1349280729293/jetty1/index lockFactory=org.apache.lucene.store.NativeFSLockFactory@7c9ef10; maxCacheMB=48.0 maxMergeSizeMB=4.0),segFN=segments_2,generation=2,filenames=[_3_MockVariableIntBlock_0.frq, _0_MockRandom_0.prx, _3.fdt, _1_MockRandom_0.pos, _0_Lucene40WithOrds_0.tii, _0_Lucene40WithOrds_0.frq, _1_Lucene40WithOrds_0.tib, _0_SimpleText_0.pst, _3_MockRandom_0.skp, _1_Lucene40WithOrds_0.tii, _0_Lucene40WithOrds_0.tib, _1_Lucene40WithOrds_0.frq, _1_MockVariableIntBlock_0.tii, _1_MockRandom_0.tip, _2.fdt, _1_MockRandom_0.tim, _1_MockRandom_0.sd, _2.fdx, _1_MockVariableIntBlock_0.tib, _1.fdx, _0_MockRandom_0.frq, _1.fdt, _0_MockVariableIntBlock_0.frq, _1_MockRandom_0.doc, _3.si, _2_MockVariableIntBlock_0.skp, _1_MockVariableIntBlock_0.skp, _2.si, _2_MockVariableIntBlock_0.pyl, _2_MockRandom_0.tip, _0_MockVariableIntBlock_0.doc, _2_MockRandom_0.tim, _1_Lucene40WithOrds_0.prx, _1_MockVariableIntBlock_0.pyl, _3_MockRandom_0.frq, _3.fnm, _2_MockVariableIntBlock_0.doc, _3_MockVariableIntBlock_0.tii, _0_MockVariableIntBlock_0.pyl, _2_nrm.cfe, _1_MockVariableIntBlock_0.doc, _2_MockRandom_0.pyl, _0_MockVariableIntBlock_0.pos, _2_nrm.cfs, _2_MockVariableIntBlock_0.tii, _2_Lucene40WithOrds_0.frq, _2_MockVariableIntBlock_0.tib, _1_MockVariableIntBlock_0.pos, _2.fnm, _3.fdx, _2_MockRandom_0.sd, _2_MockRandom_0.skp, _1.si, _3_MockVariableIntBlock_0.pyl, _3_MockRandom_0.pyl, _0_Lucene40WithOrds_0.prx, _3_Lucene40WithOrds_0.prx, _3_MockRandom_0.pos, _2_MockRandom_0.doc, _3_MockVariableIntBlock_0.pos, _3_nrm.cfe, _3_Lucene40WithOrds_0.tii, _0_MockVariableIntBlock_0.skp, _1.fnm, _3_Lucene40WithOrds_0.tib, _2_MockVariableIntBlock_0.pos, _0.fnm, _3_MockVariableIntBlock_0.doc, _3_nrm.cfs, _3_MockRandom_0.tip, _3_MockRandom_0.tim, _3_MockVariableIntBlock_0.tib, _1_MockRandom_0.frq, _3_MockRandom_0.doc, _2_MockVariableIntBlock_0.frq, _2_Lucene40WithOrds_0.prx, _0_MockVariableIntBlock_0.tib, _2_MockRandom_0.pos, _0.si, _0_MockVariableIntBlock_0.tii, _1_nrm.cfs, _0_MockRandom_0.tib, _1_MockRandom_0.skp, _0_nrm.cfs, _3_Lucene40WithOrds_0.frq, _1_nrm.cfe, _3_MockRandom_0.sd, _1_MockVariableIntBlock_0.frq, _2_Lucene40WithOrds_0.tii, _0_MockRandom_0.sd, _1_MockRandom_0.pyl, _0_MockRandom_0.tiv, _0_nrm.cfe, segments_2, _2_MockRandom_0.frq, _0.fdx, _2_Lucene40WithOrds_0.tib, _3_MockVariableIntBlock_0.skp, _0.fdt]
[junit4:junit4]   2> 14889 T695 C70 P33814 oasc.SolrDeletionPolicy.updateCommits newest commit = 2
[junit4:junit4]   2> 14901 T695 C70 P33814 oass.SolrIndexSearcher.<init> Opening Searcher@71d5542b main
[junit4:junit4]   2> 14902 T695 C70 P33814 oasu.DirectUpdateHandler2.commit end_commit_flush
[junit4:junit4]   2> 14903 T700 oasc.SolrCore.registerSearcher [collection1] Registered new searcher Searcher@71d5542b main{StandardDirectoryReader(segments_2:9:nrt _0(4.1):C10 _1(4.1):C10 _2(4.1):C10 _3(4.1):C2)}
[junit4:junit4]   2> 14903 T695 C70 P33814 /update {waitSearcher=true&commit=true&commit_end_point=true&expungeDeletes=false&wt=javabin&softCommit=false&version=2} {commit=} 0 664
[junit4:junit4]   2> 14904 T703 C72 P33823 /update {waitSearcher=true&wt=javabin&commit=true&softCommit=false&version=2} {commit=} 0 1015
[junit4:junit4]   2> 14910 T677 C71 P33811 REQ /select {distrib=false&sort=n_ti1+desc&wt=javabin&q=*:*&version=2} hits=67 status=0 QTime=2 
[junit4:junit4]   2> 14914 T665 oascsi.HttpClientUtil.createClient Creating new http client, config:
[junit4:junit4]   2> 14926 T665 oaz.ZooKeeper.<init> Initiating client connection, connectString=127.0.0.1:33808/solr sessionTimeout=10000 watcher=org.apache.solr.common.cloud.ConnectionManager@196d85d4
[junit4:junit4]   2> 14927 T734 oaz.ClientCnxn$SendThread.startConnect Opening socket connection to server /127.0.0.1:33808
[junit4:junit4]   2> 14927 T665 oascc.ConnectionManager.waitForConnected Waiting for client to connect to ZooKeeper
[junit4:junit4]   2> 14929 T734 oaz.ClientCnxn$SendThread.primeConnection Socket connection established to localhost/127.0.0.1:33808, initiating session
[junit4:junit4]   2> 14929 T667 oazs.NIOServerCnxn$Factory.run Accepted socket connection from /140.211.11.196:33855
[junit4:junit4]   2> 14929 T667 oazs.NIOServerCnxn.readConnectRequest Client attempting to establish new session at /140.211.11.196:33855
[junit4:junit4]   2> 14931 T669 oazs.NIOServerCnxn.finishSessionInit Established session 0x13a276608d30008 with negotiated timeout 10000 for client /140.211.11.196:33855
[junit4:junit4]   2> 14931 T734 oaz.ClientCnxn$SendThread.readConnectResult Session establishment complete on server localhost/127.0.0.1:33808, sessionid = 0x13a276608d30008, negotiated timeout = 10000
[junit4:junit4]   2> 14931 T735 oascc.ConnectionManager.process Watcher org.apache.solr.common.cloud.ConnectionManager@196d85d4 name:ZooKeeperConnection Watcher:127.0.0.1:33808/solr got event WatchedEvent state:SyncConnected type:None path:null path:null type:None
[junit4:junit4]   2> 14932 T665 oascc.ConnectionManager.waitForConnected Client is connected to ZooKeeper
[junit4:junit4]   2> 14933 T665 oascc.ZkStateReader.createClusterStateWatchersAndUpdate Updating cluster state from ZooKeeper... 
[junit4:junit4]   2> 14948 T706 C72 P33823 REQ /select {sort=n_ti1+desc&distrib=false&wt=javabin&rows=10&version=2&fl=id&shard.url=127.0.0.1:33823/solr/collection1/&NOW=1349280744230&start=0&q=*:*&isShard=true&fsv=true} hits=35 status=0 QTime=1 
[junit4:junit4]   2> 14949 T697 C70 P33814 REQ /select {sort=n_ti1+desc&distrib=false&wt=javabin&rows=10&version=2&fl=id&shard.url=127.0.0.1:33814/solr/collection1/|127.0.0.1:33825/solr/collection1/&NOW=1349280744230&start=0&q=*:*&isShard=true&fsv=true} hits=32 status=0 QTime=1 
[junit4:junit4]   2> 14995 T697 C70 P33814 REQ /select {shard.url=127.0.0.1:33814/solr/collection1/|127.0.0.1:33825/solr/collection1/&NOW=1349280744230&q=*:*&ids=10,148,118&distrib=false&isShard=true&wt=javabin&version=2} status=0 QTime=0 
[junit4:junit4]   2> 14995 T706 C72 P33823 REQ /select {shard.url=127.0.0.1:33823/solr/collection1/&NOW=1349280744230&q=*:*&ids=2,145,147,121,137,105,131&distrib=false&isShard=true&wt=javabin&version=2} status=0 QTime=0 
[junit4:junit4]   2> 14998 T705 C72 P33823 REQ /select {sort=n_ti1+desc&wt=javabin&q=*:*&version=2} hits=67 status=0 QTime=56 
[junit4:junit4]   2> 15010 T677 C71 P33811 REQ /select {distrib=false&sort=n_ti1+asc&wt=javabin&q=*:*&version=2} hits=67 status=0 QTime=1 
[junit4:junit4]   2> 15019 T716 C69 P33825 REQ /select {sort=n_ti1+asc&distrib=false&wt=javabin&rows=10&version=2&fl=id&shard.url=127.0.0.1:33814/solr/collection1/|127.0.0.1:33825/solr/collection1/&NOW=1349280744302&start=0&q=*:*&isShard=true&fsv=true} hits=32 status=0 QTime=1 
[junit4:junit4]   2> 15019 T707 C72 P33823 REQ /select {sort=n_ti1+asc&distrib=false&wt=javabin&rows=10&version=2&fl=id&shard.url=127.0.0.1:33823/solr/collection1/&NOW=1349280744302&start=0&q=*:*&isShard=true&fsv=true} hits=35 status=0 QTime=1 
[junit4:junit4]   2> 15025 T716 C69 P33825 REQ /select {shard.url=127.0.0.1:33814/solr/collection1/|127.0.0.1:33825/solr/collection1/&NOW=1349280744302&q=*:*&ids=114,132,108,111,12&distrib=false&isShard=true&wt=javabin&version=2} status=0 QTime=0 
[junit4:junit4]   2> 15026 T707 C72 P33823 REQ /select {shard.url=127.0.0.1:33823/solr/collection1/&NOW=1349280744302&q=*:*&ids=143,106,120,103,142&distrib=false&isShard=true&wt=javabin&version=2} status=0 QTime=1 
[junit4:junit4]   2> 15028 T692 C70 P33814 REQ /select {sort=n_ti1+asc&wt=javabin&q=*:*&version=2} hits=67 status=0 QTime=14 
[junit4:junit4]   2> 15034 T677 C71 P33811 REQ /select {distrib=false&sort=n_f1+desc&wt=javabin&q=*:*&version=2} hits=67 status=0 QTime=2 
[junit4:junit4]   2> 15042 T693 C70 P33814 REQ /select {sort=n_f1+desc&distrib=false&collection=collection1&wt=javabin&rows=10&version=2&NOW=1349280744326&shard.url=127.0.0.1:33814/solr/collection1/|127.0.0.1:33825/solr/collection1/&fl=id&start=0&q=*:*&isShard=true&fsv=true} hits=32 status=0 QTime=1 
[junit4:junit4]   2> 15044 T707 C72 P33823 REQ /select {sort=n_f1+desc&distrib=false&collection=collection1&wt=javabin&rows=10&version=2&NOW=1349280744326&shard.url=127.0.0.1:33823/solr/collection1/&fl=id&start=0&q=*:*&isShard=true&fsv=true} hits=35 status=0 QTime=2 
[junit4:junit4]   2> 15049 T693 C70 P33814 REQ /select {shard.url=127.0.0.1:33814/solr/collection1/|127.0.0.1:33825/solr/collection1/&NOW=1349280744326&q=*:*&ids=107,4,15,129&distrib=false&collection=collection1&isShard=true&wt=javabin&version=2} status=0 QTime=0 
[junit4:junit4]   2> 15050 T707 C72 P33823 REQ /select {shard.url=127.0.0.1:33823/solr/collection1/&NOW=1349280744326&q=*:*&ids=116,134,3,145,136,17&distrib=false&collection=collection1&isShard=true&wt=javabin&version=2} status=0 QTime=1 
[junit4:junit4]   2> 15053 T692 C70 P33814 REQ /select {collection=collection1&sort=n_f1+desc&wt=javabin&q=*:*&version=2} hits=67 status=0 QTime=15 
[junit4:junit4]   2> 15060 T677 C71 P33811 REQ /select {distrib=false&sort=n_f1+asc&wt=javabin&q=*:*&version=2} hits=67 status=0 QTime=1 
[junit4:junit4]   2> 15067 T708 C72 P33823 REQ /select {sort=n_f1+asc&distrib=false&wt=javabin&rows=10&version=2&fl=id&shard.url=127.0.0.1:33823/solr/collection1/&NOW=1349280744352&start=0&q=*:*&isShard=true&fsv=true} hits=35 status=0 QTime=0 
[junit4:junit4]   2> 15068 T742 C70 P33814 REQ /select {sort=n_f1+asc&distrib=false&wt=javabin&rows=10&version=2&fl=id&shard.url=127.0.0.1:33814/solr/collection1/|127.0.0.1:33825/solr/collection1/&NOW=1349280744352&start=0&q=*:*&isShard=true&fsv=true} hits=32 status=0 QTime=1 
[junit4:junit4]   2> 15073 T742 C70 P33814 REQ /select {shard.url=127.0.0.1:33814/solr/collection1/|127.0.0.1:33825/solr/collection1/&NOW=1349280744352&q=*:*&ids=10,122,8&distrib=false&isShard=true&wt=javabin&version=2} status=0 QTime=0 
[junit4:junit4]   2> 15074 T708 C72 P33823 REQ /select {shard.url=127.0.0.1:33823/solr/collection1/&NOW=1349280744352&q=*:*&ids=117,128,112,139,149,9,140&distrib=false&isShard=true&wt=javabin&version=2} status=0 QTime=1 
[junit4:junit4]   2> 15076 T717 C69 P33825 REQ /select {sort=n_f1+asc&wt=javabin&q=*:*&version=2} hits=67 status=0 QTime=12 
[junit4:junit4]   2> 15084 T677 C71 P33811 REQ /select {distrib=false&sort=n_tf1+desc&wt=javabin&q=*:*&version=2} hits=67 status=0 QTime=2 
[junit4:junit4]   2> 15091 T718 C69 P33825 REQ /select {sort=n_tf1+desc&distrib=false&wt=javabin&rows=10&version=2&fl=id&shard.url=127.0.0.1:33814/solr/collection1/|127.0.0.1:33825/solr/collection1/&NOW=1349280744376&start=0&q=*:*&isShard=true&fsv=true} hits=32 status=0 QTime=1 
[junit4:junit4]   2> 15093 T708 C72 P33823 REQ /select {sort=n_tf1+desc&distrib=false&wt=javabin&rows=10&version=2&fl=id&shard.url=127.0.0.1:33823/solr/collection1/&NOW=1349280744376&start=0&q=*:*&isShard=true&fsv=true} hits=35 status=0 QTime=1 
[junit4:junit4]   2> 15097 T718 C69 P33825 REQ /select {shard.url=127.0.0.1:33814/solr/collection1/|127.0.0.1:33825/solr/collection1/&NOW=1349280744376&q=*:*&ids=138,108,123,129&distrib=false&isShard=true&wt=javabin&version=2} status=0 QTime=0 
[junit4:junit4]   2> 15098 T708 C72 P33823 REQ /select {shard.url=127.0.0.1:33823/solr/collection1/&NOW=1349280744376&q=*:*&ids=134,3,115,5,103,131&distrib=false&isShard=true&wt=javabin&version=2} status=0 QTime=0 
[junit4:junit4]   2> 15101 T717 C69 P33825 REQ /select {sort=n_tf1+desc&wt=javabin&q=*:*&version=2} hits=67 status=0 QTime=12 
[junit4:junit4]   2> 15107 T677 C71 P33811 REQ /select {distrib=false&sort=n_tf1+asc&wt=javabin&q=*:*&version=2} hits=67 status=0 QTime=1 
[junit4:junit4]   2> 15116 T693 C70 P33814 REQ /select {sort=n_tf1+asc&distrib=false&wt=javabin&rows=10&version=2&fl=id&shard.url=127.0.0.1:33814/solr/collection1/|127.0.0.1:33825/solr/collection1/&NOW=1349280744399&start=0&q=*:*&isShard=true&fsv=true} hits=32 status=0 QTime=1 
[junit4:junit4]   2> 15116 T707 C72 P33823 REQ /select {sort=n_tf1+asc&distrib=false&wt=javabin&rows=10&version=2&fl=id&shard.url=127.0.0.1:33823/solr/collection1/&NOW=1349280744399&start=0&q=*:*&isShard=true&fsv=true} hits=35 status=0 QTime=1 
[junit4:junit4]   2> 15121 T693 C70 P33814 REQ /select {shard.url=127.0.0.1:33814/solr/collection1/|127.0.0.1:33825/solr/collection1/&NOW=1349280744399&q=*:*&ids=132,111,118&distrib=false&isShard=true&wt=javabin&version=2} status=0 QTime=0 
[junit4:junit4]   2> 15122 T707 C72 P33823 REQ /select {shard.url=127.0.0.1:33823/solr/collection1/&NOW=1349280744399&q=*:*&ids=2,136,149,9,120,142,119&distrib=false&isShard=true&wt=javabin&version=2} status=0 QTime=1 
[junit4:junit4]   2> 15125 T692 C70 P33814 REQ /select {sort=n_tf1+asc&wt=javabin&q=*:*&version=2} hits=67 status=0 QTime=14 
[junit4:junit4]   2> 15132 T677 C71 P33811 REQ /select {distrib=false&sort=n_d1+desc&wt=javabin&q=*:*&version=2} hits=67 status=0 QTime=1 
[junit4:junit4]   2> 15141 T719 C69 P33825 REQ /select {sort=n_d1+desc&distrib=false&wt=javabin&rows=10&version=2&fl=id&shard.url=127.0.0.1:33814/solr/collection1/|127.0.0.1:33825/solr/collection1/&NOW=1349280744425&start=0&q=*:*&isShard=true&fsv=true} hits=32 status=0 QTime=1 
[junit4:junit4]   2> 15141 T706 C72 P33823 REQ /select {sort=n_d1+desc&distrib=false&wt=javabin&rows=10&version=2&fl=id&shard.url=127.0.0.1:33823/solr/collection1/&NOW=1349280744425&start=0&q=*:*&isShard=true&fsv=true} hits=35 status=0 QTime=1 
[junit4:junit4]   2> 15146 T719 C69 P33825 REQ /select {shard.url=127.0.0.1:33814/solr/collection1/|127.0.0.1:33825/solr/collection1/&NOW=1349280744425&q=*:*&ids=1,122,4&distrib=false&isShard=true&wt=javabin&version=2} status=0 QTime=0 
[junit4:junit4]   2> 15146 T706 C72 P33823 REQ /select {shard.url=127.0.0.1:33823/solr/collection1/&NOW=1349280744425&q=*:*&ids=143,144,115,6,103,130,142&distrib=false&isShard=true&wt=javabin&version=2} status=0 QTime=0 
[junit4:junit4]   2> 15149 T705 C72 P33823 REQ /select {sort=n_d1+desc&wt=javabin&q=*:*&version=2} hits=67 status=0 QTime=12 
[junit4:junit4]   2> 15156 T677 C71 P33811 REQ /select {distrib=false&sort=n_d1+asc&wt=javabin&q=*:*&version=2} hits=67 status=0 QTime=1 
[junit4:junit4]   2> 15164 T716 C69 P33825 REQ /select {sort=n_d1+asc&distrib=false&wt=javabin&rows=10&version=2&fl=id&shard.url=127.0.0.1:33814/solr/collection1/|127.0.0.1:33825/solr/collection1/&NOW=1349280744448&start=0&q=*:*&isShard=true&fsv=true} hits=32 status=0 QTime=0 
[junit4:junit4]   2> 15164 T707 C72 P33823 REQ /select {sort=n_d1+asc&distrib=false&wt=javabin&rows=10&version=2&fl=id&shard.url=127.0.0.1:33823/solr/collection1/&NOW=1349280744448&start=0&q=*:*&isShard=true&fsv=true} hits=35 status=0 QTime=0 
[junit4:junit4]   2> 15170 T716 C69 P33825 REQ /select {shard.url=127.0.0.1:33814/solr/collection1/|127.0.0.1:33825/solr/collection1/&NOW=1349280744448&q=*:*&ids=124,102,100,12&distrib=false&isShard=true&wt=javabin&version=2} status=0 QTime=1 
[junit4:junit4]   2> 15170 T707 C72 P33823 REQ /select {shard.url=127.0.0.1:33823/solr/collection1/&NOW=1349280744448&q=*:*&ids=126,145,127,147,104,140&distrib=false&isShard=true&wt=javabin&version=2} status=0 QTime=1 
[junit4:junit4]   2> 15173 T696 C70 P33814 REQ /select {sort=n_d1+asc&wt=javabin&q=*:*&version=2} hits=67 status=0 QTime=13 
[junit4:junit4]   2> 15181 T677 C71 P33811 REQ /select {distrib=false&sort=n_td1+desc&wt=javabin&q=*:*&version=2} hits=67 status=0 QTime=2 
[junit4:junit4]   2> 15191 T716 C69 P33825 REQ /select {sort=n_td1+desc&distrib=false&wt=javabin&rows=10&version=2&fl=id&shard.url=127.0.0.1:33814/solr/collection1/|127.0.0.1:33825/solr/collection1/&NOW=1349280744474&start=0&q=*:*&isShard=true&fsv=true} hits=32 status=0 QTime=1 
[junit4:junit4]   2> 15191 T707 C72 P33823 REQ /select {sort=n_td1+desc&distrib=false&wt=javabin&rows=10&version=2&fl=id&shard.url=127.0.0.1:33823/solr/collection1/&NOW=1349280744474&start=0&q=*:*&isShard=true&fsv=true} hits=35 status=0 QTime=1 
[junit4:junit4]   2> 15196 T716 C69 P33825 REQ /select {shard.url=127.0.0.1:33814/solr/collection1/|127.0.0.1:33825/solr/collection1/&NOW=1349280744474&q=*:*&ids=132,10,111,4,118,100&distrib=false&isShard=true&wt=javabin&version=2} status=0 QTime=0 
[junit4:junit4]   2> 15197 T707 C72 P33823 REQ /select {shard.url=127.0.0.1:33823/solr/collection1/&NOW=1349280744474&q=*:*&ids=112,147,9,131&distrib=false&isShard=true&wt=javabin&version=2} status=0 QTime=1 
[junit4:junit4]   2> 15200 T696 C70 P33814 REQ /select {sort=n_td1+desc&wt=javabin&q=*:*&version=2} hits=67 status=0 QTime=14 
[junit4:junit4]   2> 15206 T677 C71 P33811 REQ /select {distrib=false&sort=n_td1+asc&wt=javabin&q=*:*&version=2} hits=67 status=0 QTime=1 
[junit4:junit4]   2> 15213 T718 C69 P33825 REQ /select {sort=n_td1+asc&distrib=false&collection=collection1&wt=javabin&rows=10&version=2&NOW=1349280744497&shard.url=127.0.0.1:33814/solr/collection1/|127.0.0.1:33825/solr/collection1/&fl=id&start=0&q=*:*&isShard=true&fsv=true} hits=32 status=0 QTime=0 
[junit4:junit4]   2> 15213 T708 C72 P33823 REQ /select {sort=n_td1+asc&distrib=false&collection=collection1&wt=javabin&rows=10&version=2&NOW=1349280744497&shard.url=127.0.0.1:33823/solr/collection1/&fl=id&start=0&q=*:*&isShard=true&fsv=true} hits=35 status=0 QTime=0 
[junit4:junit4]   2> 15218 T718 C69 P33825 REQ /select {shard.url=127.0.0.1:33814/solr/collection1/|127.0.0.1:33825/solr/collection1/&NOW=1349280744497&q=*:*&ids=114,107,11&distrib=false&collection=collection1&isShard=true&wt=javabin&version=2} status=0 QTime=0 
[junit4:junit4]   2> 15218 T708 C72 P33823 REQ /select {shard.url=127.0.0.1:33823/solr/collection1/&NOW=1349280744497&q=*:*&ids=134,117,127,6,136,137,17&distrib=false&collection=collection1&isShard=true&wt=javabin&version=2} status=0 QTime=0 
[junit4:junit4]   2> 15221 T720 C69 P33825 REQ /select {collection=collection1&sort=n_td1+asc&wt=javabin&q=*:*&version=2} hits=67 status=0 QTime=12 
[junit4:junit4]   2> 15227 T677 C71 P33811 REQ /select {distrib=false&sort=n_l1+desc&wt=javabin&q=*:*&version=2} hits=67 status=0 QTime=1 
[junit4:junit4]   2> 15237 T693 C70 P33814 REQ /select {sort=n_l1+desc&distrib=false&collection=collection1&wt=javabin&rows=10&version=2&fl=id&shard.url=127.0.0.1:33814/solr/collection1/|127.0.0.1:33825/solr/collection1/&NOW=1349280744520&start=0&q=*:*&isShard=true&fsv=true} hits=32 status=0 QTime=1 
[junit4:junit4]   2> 15237 T707 C72 P33823 REQ /select {sort=n_l1+desc&distrib=false&collection=collection1&wt=javabin&rows=10&version=2&fl=id&shard.url=127.0.0.1:33823/solr/collection1/&NOW=1349280744520&start=0&q=*:*&isShard=true&fsv=true} hits=35 status=0 QTime=1 
[junit4:junit4]   2> 15242 T693 C70 P33814 REQ /select {shard.url=127.0.0.1:33814/solr/collection1/|127.0.0.1:33825/solr/collection1/&NOW=1349280744520&q=*:*&ids=102,12&distrib=false&collection=collection1&isShard=true&wt=javabin&version=2} status=0 QTime=0 
[junit4:junit4]   2> 15243 T707 C72 P33823 REQ /select {shard.url=127.0.0.1:33823/solr/collection1/&NOW=1349280744520&q=*:*&ids=3,2,127,139,149,103,142,119&distrib=false&collection=collection1&isShard=true&wt=javabin&version=2} status=0 QTime=1 
[junit4:junit4]   2> 15245 T692 C70 P33814 REQ /select {collection=collection1&sort=n_l1+desc&wt=javabin&q=*:*&version=2} hits=67 status=0 QTime=13 
[junit4:junit4]   2> 15252 T677 C71 P33811 REQ /select {distrib=false&sort=n_l1+asc&wt=javabin&q=*:*&version=2} hits=67 status=0 QTime=1 
[junit4:junit4]   2> 15260 T706 C72 P33823 REQ /select {sort=n_l1+asc&distrib=false&wt=javabin&rows=10&version=2&fl=id&shard.url=127.0.0.1:33823/solr/collection1/&NOW=1349280744544&start=0&q=*:*&isShard=true&fsv=true} hits=35 status=0 QTime=0 
[junit4:junit4]   2> 15260 T697 C70 P33814 REQ /select {sort=n_l1+asc&distrib=false&wt=javabin&rows=10&version=2&fl=id&shard.url=127.0.0.1:33814/solr/collection1/|127.0.0.1:33825/solr/collection1/&NOW=1349280744544&start=0&q=*:*&isShard=true&fsv=true} hits=32 status=0 QTime=0 
[junit4:junit4]   2> 15265 T697 C70 P33814 REQ /select {shard.url=127.0.0.1:33814/solr/collection1/|127.0.0.1:33825/solr/collection1/&NOW=1349280744544&q=*:*&ids=109,113,124,16,11&distrib=false&isShard=true&wt=javabin&version=2} status=0 QTime=1 
[junit4:junit4]   2> 15265 T706 C72 P33823 REQ /select {shard.url=127.0.0.1:33823/solr/collection1/&NOW=1349280744544&q=*:*&ids=143,128,121,136,137&distrib=false&isShard=true&wt=javabin&version=2} status=0 QTime=1 
[junit4:junit4]   2> 15267 T705 C72 P33823 REQ /select {sort=n_l1+asc&wt=javabin&q=*:*&version=2} hits=67 status=0 QTime=11 
[junit4:junit4]   2> 15273 T677 C71 P33811 REQ /select {distrib=false&sort=n_tl1+desc&wt=javabin&q=*:*&version=2} hits=67 status=0 QTime=1 
[junit4:junit4]   2> 15282 T716 C69 P33825 REQ /select {sort=n_tl1+desc&distrib=false&wt=javabin&rows=10&version=2&fl=id&shard.url=127.0.0.1:33814/solr/collection1/|127.0.0.1:33825/solr/collection1/&NOW=1349280744565&start=0&q=*:*&isShard=true&fsv=true} hits=32 status=0 QTime=1 
[junit4:junit4]   2> 15282 T707 C72 P33823 REQ /select {sort=n_tl1+desc&distrib=false&wt=javabin&rows=10&version=2&fl=id&shard.url=127.0.0.1:33823/solr/collection1/&NOW=1349280744565&start=0&q=*:*&isShard=true&fsv=true} hits=35 status=0 QTime=1 
[junit4:junit4]   2> 15287 T716 C69 P33825 REQ /select {shard.url=127.0.0.1:33814/solr/collection1/|127.0.0.1:33825/solr/collection1/&NOW=1349280744565&q=*:*&ids=10,133,148,118,12&distrib=false&isShard=true&wt=javabin&version=2} status=0 QTime=1 
[junit4:junit4]   2> 15289 T707 C72 P33823 REQ /select {shard.url=127.0.0.1:33823/solr/collection1/&NOW=1349280744565&q=*:*&ids=112,139,6,105,119&distrib=false&isShard=true&wt=javabin&version=2} status=0 QTime=1 
[junit4:junit4]   2> 15291 T696 C70 P33814 REQ /select {sort=n_tl1+desc&wt=javabin&q=*:*&version=2} hits=67 status=0 QTime=14 
[junit4:junit4]   2> 15297 T677 C71 P33811 REQ /select {distrib=false&sort=n_tl1+asc&wt=javabin&q=*:*&version=2} hits=67 status=0 QTime=1 
[junit4:junit4]   2> 15305 T708 C72 P33823 REQ /select {sort=n_tl1+asc&distrib=false&collection=collection1&wt=javabin&rows=10&version=2&fl=id&shard.url=127.0.0.1:33823/solr/collection1/&NOW=1349280744589&start=0&q=*:*&isShard=true&fsv=true} hits=35 status=0 QTime=1 
[junit4:junit4]   2> 15306 T742 C70 P33814 REQ /select {sort=n_tl1+asc&distrib=false&collection=collection1&wt=javabin&rows=10&version=2&NOW=1349280744589&shard.url=127.0.0.1:33814/solr/collection1/|127.0.0.1:33825/solr/collection1/&fl=id&start=0&q=*:*&isShard=true&fsv=true} hits=32 status=0 QTime=1 
[junit4:junit4]   2> 15310 T708 C72 P33823 REQ /select {shard.url=127.0.0.1:33823/solr/collection1/&NOW=1349280744589&q=*:*&ids=134,144,2,126,141&distrib=false&collection=collection1&isShard=true&wt=javabin&version=2} status=0 QTime=1 
[junit4:junit4]   2> 15310 T742 C70 P33814 REQ /select {shard.url=127.0.0.1:33814/solr/collection1/|127.0.0.1:33825/solr/collection1/&NOW=1349280744589&q=*:*&ids=110,108,124,16,11&distrib=false&collection=collection1&isShard=true&wt=javabin&version=2} status=0 QTime=0 
[junit4:junit4]   2> 15312 T720 C69 P33825 REQ /select {collection=collection1&sort=n_tl1+asc&wt=javabin&q=*:*&version=2} hits=67 status=0 QTime=11 
[junit4:junit4]   2> 15319 T677 C71 P33811 REQ /select {distrib=false&sort=n_dt1+desc&wt=javabin&q=*:*&version=2} hits=67 status=0 QTime=1 
[junit4:junit4]   2> 15327 T708 C72 P33823 REQ /select {sort=n_dt1+desc&distrib=false&wt=javabin&rows=10&version=2&fl=id&shard.url=127.0.0.1:33823/solr/collection1/&NOW=1349280744611&start=0&q=*:*&isShard=true&fsv=true} hits=35 status=0 QTime=1 
[junit4:junit4]   2> 15328 T718 C69 P33825 REQ /select {sort=n_dt1+desc&distrib=false&wt=javabin&rows=10&version=2&fl=id&shard.url=127.0.0.1:33814/solr/collection1/|127.0.0.1:33825/solr/collection1/&NOW=1349280744611&start=0&q=*:*&isShard=true&fsv=true} hits=32 status=0 QTime=1 
[junit4:junit4]   2> 15333 T708 C72 P33823 REQ /select {shard.url=127.0.0.1:33823/solr/collection1/&NOW=1349280744611&q=*:*&ids=117,127,139,136,131,142,141&distrib=false&isShard=true&wt=javabin&version=2} status=0 QTime=1 
[junit4:junit4]   2> 15333 T718 C69 P33825 REQ /select {shard.url=127.0.0.1:33814/solr/collection1/|127.0.0.1:33825/solr/collection1/&NOW=1349280744611&q=*:*&ids=125,113,110&distrib=false&isShard=true&wt=javabin&version=2} status=0 QTime=0 
[junit4:junit4]   2> 15336 T717 C69 P33825 REQ /select {sort=n_dt1+desc&wt=javabin&q=*:*&version=2} hits=67 status=0 QTime=13 
[junit4:junit4]   2> 15343 T677 C71 P33811 REQ /select {distrib=false&sort=n_dt1+asc&wt=javabin&q=*:*&version=2} hits=67 status=0 QTime=1 
[junit4:junit4]   2> 15352 T707 C72 P33823 REQ /select {sort=n_dt1+asc&distrib=false&wt=javabin&rows=10&version=2&fl=id&shard.url=127.0.0.1:33823/solr/collection1/&NOW=1349280744636&start=0&q=*:*&isShard=true&fsv=true} hits=35 status=0 QTime=1 
[junit4:junit4]   2> 15352 T693 C70 P33814 REQ /select {sort=n_dt1+asc&distrib=false&wt=javabin&rows=10&version=2&fl=id&shard.url=127.0.0.1:33814/solr/collection1/|127.0.0.1:33825/solr/collection1/&NOW=1349280744636&start=0&q=*:*&isShard=true&fsv=true} hits=32 status=0 QTime=1 
[junit4:junit4]   2> 15357 T707 C72 P33823 REQ /select {shard.url=127.0.0.1:33823/solr/collection1/&NOW=1349280744636&q=*:*&ids=128,7,112,104&distrib=false&isShard=true&wt=javabin&version=2} status=0 QTime=1 
[junit4:junit4]   2> 15357 T693 C70 P33814 REQ /select {shard.url=127.0.0.1:33814/solr/collection1/|127.0.0.1:33825/solr/collection1/&NOW=1349280744636&q=*:*&ids=114,133,109,108,11,118&distrib=false&isShard=true&wt=javabin&version=2} status=0 QTime=0 
[junit4:junit4]   2> 15359 T692 C70 P33814 REQ /select {sort=n_dt1+asc&wt=javabin&q=*:*&version=2} hits=67 status=0 QTime=11 
[junit4:junit4]   2> 15369 T677 C71 P33811 REQ /select {distrib=false&sort=n_tdt1+desc&wt=javabin&q=*:*&version=2} hits=67 status=0 QTime=1 
[junit4:junit4]   2> 15378 T706 C72 P33823 REQ /select {sort=n_tdt1+desc&distrib=false&collection=collection1&wt=javabin&rows=10&version=2&NOW=1349280744662&shard.url=127.0.0.1:33823/solr/collection1/&fl=id&start=0&q=*:*&isShard=true&fsv=true} hits=35 status=0 QTime=0 
[junit4:junit4]   2> 15378 T697 C70 P33814 REQ /select {sort=n_tdt1+desc&distrib=false&collection=collection1&wt=javabin&rows=10&version=2&NOW=1349280744662&shard.url=127.0.0.1:33814/solr/collection1/|127.0.0.1:33825/solr/collection1/&fl=id&start=0&q=*:*&isShard=true&fsv=true} hits=32 status=0 QTime=1 
[junit4:junit4]   2> 15383 T697 C70 P33814 REQ /select {shard.url=127.0.0.1:33814/solr/collection1/|127.0.0.1:33825/solr/collection1/&NOW=1349280744662&q=*:*&ids=111,102,129,12&distrib=false&collection=collection1&isShard=true&wt=javabin&version=2} status=0 QTime=1 
[junit4:junit4]   2> 15383 T706 C72 P33823 REQ /select {shard.url=127.0.0.1:33823/solr/collection1/&NOW=1349280744662&q=*:*&ids=2,126,115,5,136,131&distrib=false&collection=collection1&isShard=true&wt=javabin&version=2} status=0 QTime=0 
[junit4:junit4]   2> 15386 T703 C72 P33823 REQ /select {collection=collection1&sort=n_tdt1+desc&wt=javabin&q=*:*&version=2} hits=67 status=0 QTime=12 
[junit4:junit4]   2> 15396 T677 C71 P33811 REQ /select {distrib=false&sort=n_tdt1+asc&wt=javabin&q=*:*&version=2} hits=67 status=0 QTime=1 
[junit4:junit4]   2> 15404 T693 C70 P33814 REQ /select {sort=n_tdt1+asc&distrib=false&wt=javabin&rows=10&version=2&fl=id&shard.url=127.0.0.1:33814/solr/collection1/|127.0.0.1:33825/solr/collection1/&NOW=1349280744688&start=0&q=*:*&isShard=true&fsv=true} hits=32 status=0 QTime=1 
[junit4:junit4]   2> 15404 T707 C72 P33823 REQ /select {sort=n_tdt1+asc&distrib=false&wt=javabin&rows=10&version=2&fl=id&shard.url=127.0.0.1:33823/solr/collection1/&NOW=1349280744688&start=0&q=*:*&isShard=true&fsv=true} hits=35 status=0 QTime=1 
[junit4:junit4]   2> 15409 T693 C70 P33814 REQ /select {shard.url=127.0.0.1:33814/solr/collection1/|127.0.0.1:33825/solr/collection1/&NOW=1349280744688&q=*:*&ids=135,114,110,124,100&distrib=false&isShard=true&wt=javabin&version=2} status=0 QTime=1 
[junit4:junit4]   2> 15409 T707 C72 P33823 REQ /select {shard.url=127.0.0.1:33823/solr/collection1/&NOW=1349280744688&q=*:*&ids=143,127,121,137,142&distrib=false&isShard=true&wt=javabin&version=2} status=0 QTime=1 
[junit4:junit4]   2> 15411 T696 C70 P33814 REQ /select {sort=n_tdt1+asc&wt=javabin&q=*:*&version=2} hits=67 status=0 QTime=11 
[junit4:junit4]   2> 15464 T677 C71 P33811 REQ /select {distrib=false&sort=a_si+desc&wt=javabin&q=*:*&version=2} hits=67 status=0 QTime=44 
[junit4:junit4]   2> 15473 T719 C69 P33825 REQ /select {sort=a_si+desc&distrib=false&wt=javabin&rows=10&version=2&fl=id&shard.url=127.0.0.1:33814/solr/collection1/|127.0.0.1:33825/solr/collection1/&NOW=1349280744757&start=0&q=*:*&isShard=true&fsv=true} hits=32 status=0 QTime=1 
[junit4:junit4]   2> 15473 T706 C72 P33823 REQ /select {sort=a_si+desc&distrib=false&wt=javabin&rows=10&version=2&fl=id&shard.url=127.0.0.1:33823/solr/collection1/&NOW=1349280744757&start=0&q=*:*&isShard=true&fsv=true} hits=35 status=0 QTime=1 
[junit4:junit4]   2> 15478 T719 C69 P33825 REQ /select {shard.url=127.0.0.1:33814/solr/collection1/|127.0.0.1:33825/solr/collection1/&NOW=1349280744757&q=*:*&ids=10,1,8,13,12&distrib=false&isShard=true&wt=javabin&version=2} status=0 QTime=1 
[junit4:junit4]   2> 15478 T706 C72 P33823 REQ /select {shard.url=127.0.0.1:33823/solr/collection1/&NOW=1349280744757&q=*:*&ids=3,2,7,5,9&distrib=false&isShard=true&wt=javabin&version=2} status=0 QTime=0 
[junit4:junit4]   2> 15480 T705 C72 P33823 REQ /select {sort=a_si+desc&wt=javabin&q=*:*&version=2} hits=67 status=0 QTime=11 
[junit4:junit4]   2> 15515 T677 C71 P33811 REQ /select {distrib=false&sort=a_si+asc&wt=javabin&q=*:*&version=2} hits=67 status=0 QTime=25 
[junit4:junit4]   2> 15523 T706 C72 P33823 REQ /select {sort=a_si+asc&distrib=false&wt=javabin&rows=10&version=2&fl=id&shard.url=127.0.0.1:33823/solr/collection1/&NOW=1349280744807&start=0&q=*:*&isShard=true&fsv=true} hits=35 status=0 QTime=0 
[junit4:junit4]   2> 15523 T719 C69 P33825 REQ /select {sort=a_si+asc&distrib=false&wt=javabin&rows=10&version=2&fl=id&shard.url=127.0.0.1:33814/solr/collection1/|127.0.0.1:33825/solr/collection1/&NOW=1349280744807&start=0&q=*:*&isShard=true&fsv=true} hits=32 status=0 QTime=0 
[junit4:junit4]   2> 15536 T719 C69 P33825 REQ /select {shard.url=127.0.0.1:33814/solr/collection1/|127.0.0.1:33825/solr/collection1/&NOW=1349280744807&q=*:*&ids=1,4,13,11,12&distrib=false&isShard=true&wt=javabin&version=2} status=0 QTime=1 
[junit4:junit4]   2> 15536 T706 C72 P33823 REQ /select {shard.url=127.0.0.1:33823/solr/collection1/&NOW=1349280744807&q=*:*&ids=3,2,7,6,9&distrib=false&isShard=true&wt=javabin&version=2} status=0 QTime=0 
[junit4:junit4]   2> 15538 T705 C72 P33823 REQ /select {sort=a_si+asc&wt=javabin&q=*:*&version=2} hits=67 status=0 QTime=19 
[junit4:junit4]   2> 15549 T677 C71 P33811 REQ /select {sort=a_si+desc&fl=*,score&q=*:*&distrib=false&wt=javabin&version=2} hits=67 status=0 QTime=1 
[junit4:junit4]   2> 15557 T708 C72 P33823 REQ /select {sort=a_si+desc&distrib=false&collection=collection1&wt=javabin&rows=10&version=2&fl=id,score&shard.url=127.0.0.1:33823/solr/collection1/&NOW=1349280744841&start=0&q=*:*&isShard=true&fsv=true} hits=35 status=0 QTime=1 
[junit4:junit4]   2> 15557 T742 C70 P33814 REQ /select {sort=a_si+desc&distrib=false&collection=collection1&wt=javabin&rows=10&version=2&fl=id,score&shard.url=127.0.0.1:33814/solr/collection1/|127.0.0.1:33825/solr/collection1/&NOW=1349280744841&start=0&q=*:*&isShard=true&fsv=true} hits=32 status=0 QTime=1 
[junit4:junit4]   2> 15562 T708 C72 P33823 REQ /select {fl=*,score&shard.url=127.0.0.1:33823/solr/collection1/&NOW=1349280744841&q=*:*&ids=3,2,7,5,9&distrib=false&collection=collection1&isShard=true&wt=javabin&version=2} status=0 QTime=1 
[junit4:junit4]   2> 15562 T742 C70 P33814 REQ /select {fl=*,score&shard.url=127.0.0.1:33814/solr/collection1/|127.0.0.1:33825/solr/collection1/&NOW=1349280744841&q=*:*&ids=10,1,8,13,12&distrib=false&collection=collection1&isShard=true&wt=javabin&version=2} status=0 QTime=1 
[junit4:junit4]   2> 15564 T717 C69 P33825 REQ /select {sort=a_si+desc&fl=*,score&q=*:*&collection=collection1&wt=javabin&version=2} hits=67 status=0 QTime=11 
[junit4:junit4]   2> 15576 T677 C71 P33811 REQ /select {sort=n_tl1+asc&fl=*,score&q=*:*&distrib=false&wt=javabin&version=2} hits=67 status=0 QTime=1 
[junit4:junit4]   2> 15585 T708 C72 P33823 REQ /select {sort=n_tl1+asc&distrib=false&wt=javabin&rows=10&version=2&fl=id,score&shard.url=127.0.0.1:33823/solr/collection1/&NOW=1349280744868&start=0&q=*:*&isShard=true&fsv=true} hits=35 status=0 QTime=1 
[junit4:junit4]   2> 15585 T742 C70 P33814 REQ /select {sort=n_tl1+asc&distrib=false&wt=javabin&rows=10&version=2&fl=id,score&shard.url=127.0.0.1:33814/solr/collection1/|127.0.0.1:33825/solr/collection1/&NOW=1349280744868&start=0&q=*:*&isShard=true&fsv=true} hits=32 status=0 QTime=0 
[junit4:junit4]   2> 15590 T742 C70 P33814 REQ /select {fl=*,score&shard.url=127.0.0.1:33814/solr/collection1/|127.0.0.1:33825/solr/collection1/&NOW=1349280744868&q=*:*&ids=110,108,124,16,11&distrib=false&isShard=true&wt=javabin&version=2} status=0 QTime=1 
[junit4:junit4]   2> 15590 T708 C72 P33823 REQ /select {fl=*,score&shard.url=127.0.0.1:33823/solr/collection1/&NOW=1349280744868&q=*:*&ids=134,144,2,126,141&distrib=false&isShard=true&wt=javabin&version=2} status=0 QTime=1 
[junit4:junit4]   2> 15591 T720 C69 P33825 REQ /select {sort=n_tl1+asc&fl=*,score&wt=javabin&q=*:*&version=2} hits=67 status=0 QTime=11 
[junit4:junit4]   2> 15602 T677 C71 P33811 REQ /select {distrib=false&sort=n_tl1+desc&wt=javabin&q=*:*&version=2} hits=67 status=0 QTime=1 
[junit4:junit4]   2> 15610 T719 C69 P33825 REQ /select {sort=n_tl1+desc&distrib=false&collection=collection1&wt=javabin&rows=10&version=2&NOW=1349280744894&shard.url=127.0.0.1:33814/solr/collection1/|127.0.0.1:33825/solr/collection1/&fl=id&start=0&q=*:*&isShard=true&fsv=true} hits=32 status=0 QTime=0 
[junit4:junit4]   2> 15610 T706 C72 P33823 REQ /select {sort=n_tl1+desc&distrib=false&collection=collection1&wt=javabin&rows=10&version=2&fl=id&shard.url=127.0.0.1:33823/solr/collection1/&NOW=1349280744894&start=0&q=*:*&isShard=true&fsv=true} hits=35 status=0 QTime=0 
[junit4:junit4]   2> 15615 T706 C72 P33823 REQ /select {shard.url=127.0.0.1:33823/solr/collection1/&NOW=1349280744894&q=*:*&ids=112,139,6,105,119&distrib=false&collection=collection1&isShard=true&wt=javabin&version=2} status=0 QTime=1 
[junit4:junit4]   2> 15615 T719 C69 P33825 REQ /select {shard.url=127.0.0.1:33814/solr/collection1/|127.0.0.1:33825/solr/collection1/&NOW=1349280744894&q=*:*&ids=10,133,148,118,12&distrib=false&collection=collection1&isShard=true&wt=javabin&version=2} status=0 QTime=1 
[junit4:junit4]   2> 15616 T705 C72 P33823 REQ /select {collection=collection1&sort=n_tl1+desc&wt=javabin&q=*:*&version=2} hits=67 status=0 QTime=10 
[junit4:junit4]   2> 15671 T677 C71 P33811 REQ /select {distrib=false&wt=javabin&q={!func}a_si&version=2} hits=67 status=0 QTime=45 
[junit4:junit4]   2> 15680 T693 C70 P33814 REQ /select {fl=id,score&shard.url=127.0.0.1:33814/solr/collection1/|127.0.0.1:33825/solr/collection1/&NOW=1349280744964&start=0&q={!func}a_si&distrib=false&isShard=true&wt=javabin&fsv=true&rows=10&version=2} hits=32 status=0 QTime=1 
[junit4:junit4]   2> 15680 T707 C72 P33823 REQ /select {fl=id,score&shard.url=127.0.0.1:33823/solr/collection1/&NOW=1349280744964&start=0&q={!func}a_si&distrib=false&isShard=true&wt=javabin&fsv=true&rows=10&version=2} hits=35 status=0 QTime=0 
[junit4:junit4]   2> 15689 T693 C70 P33814 REQ /select {shard.url=127.0.0.1:33814/solr/collection1/|127.0.0.1:33825/solr/collection1/&NOW=1349280744964&q={!func}a_si&ids=10,1,8,13,12&distrib=false&isShard=true&wt=javabin&version=2} status=0 QTime=1 
[junit4:junit4]   2> 15689 T707 C72 P33823 REQ /select {shard.url=127.0.0.1:33823/solr/collection1/&NOW=1349280744964&q={!func}a_si&ids=3,2,7,5,9&distrib=false&isShard=true&wt=javabin&version=2} status=0 QTime=1 
[junit4:junit4]   2> 15690 T696 C70 P33814 REQ /select {wt=javabin&q={!func}a_si&version=2} hits=67 status=0 QTime=14 
[junit4:junit4]   2> 15700 T677 C71 P33811 REQ /select {distrib=false&fl=*,score&wt=javabin&q={!func}a_si&version=2} hits=67 status=0 QTime=1 
[junit4:junit4]   2> 15708 T708 C72 P33823 REQ /select {distrib=false&collection=collection1&wt=javabin&rows=10&version=2&fl=id,score&shard.url=127.0.0.1:33823/solr/collection1/&NOW=1349280744992&start=0&q={!func}a_si&isShard=true&fsv=true} hits=35 status=0 QTime=0 
[junit4:junit4]   2> 15708 T742 C70 P33814 REQ /select {distrib=false&collection=collection1&wt=javabin&rows=10&version=2&fl=id,score&shard.url=127.0.0.1:33814/solr/collection1/|127.0.0.1:33825/solr/collection1/&NOW=1349280744992&start=0&q={!func}a_si&isShard=true&fsv=true} hits=32 status=0 QTime=0 
[junit4:junit4]   2> 15713 T742 C70 P33814 REQ /select {fl=*,score&shard.url=127.0.0.1:33814/solr/collection1/|127.0.0.1:33825/solr/collection1/&NOW=1349280744992&q={!func}a_si&ids=10,1,8,13,12&distrib=false&collection=collection1&isShard=true&wt=javabin&version=2} status=0 QTime=1 
[junit4:junit4]   2> 15713 T708 C72 P33823 REQ /select {fl=*,score&shard.url=127.0.0.1:33823/solr/collection1/&NOW=1349280744992&q={!func}a_si&ids=3,2,7,5,9&distrib=false&collection=collection1&isShard=true&wt=javabin&version=2} status=0 QTime=1 
[junit4:junit4]   2> 15714 T720 C69 P33825 REQ /select {collection=collection1&fl=*,score&wt=javabin&q={!func}a_si&version=2} hits=67 status=0 QTime=10 
[junit4:junit4]   2> 15727 T677 C71 P33811 REQ /select {distrib=false&wt=javabin&q=quick&version=2} hits=2 status=0 QTime=3 
[junit4:junit4]   2> 15735 T707 C72 P33823 REQ /select {distrib=false&collection=collection1&wt=javabin&rows=10&version=2&fl=id,score&shard.url=127.0.0.1:33823/solr/collection1/&NOW=1349280745018&start=0&q=quick&isShard=true&fsv=true} hits=1 status=0 QTime=2 
[junit4:junit4]   2> 15736 T716 C69 P33825 REQ /select {distrib=false&collection=collection1&wt=javabin&rows=10&version=2&fl=id,score&shard.url=127.0.0.1:33814/solr/collection1/|127.0.0.1:33825/solr/collection1/&NOW=1349280745018&start=0&q=quick&isShard=true&fsv=true} hits=1 status=0 QTime=2 
[junit4:junit4]   2> 15740 T707 C72 P33823 REQ /select {shard.url=127.0.0.1:33823/solr/collection1/&NOW=1349280745018&q=quick&ids=5&distrib=false&collection=collection1&isShard=true&wt=javabin&version=2} status=0 QTime=1 
[junit4:junit4]   2> 15740 T716 C69 P33825 REQ /select {shard.url=127.0.0.1:33814/solr/collection1/|127.0.0.1:33825/solr/collection1/&NOW=1349280745018&q=quick&ids=4&distrib=false&collection=collection1&isShard=true&wt=javabin&version=2} status=0 QTime=1 
[junit4:junit4]   2> 15741 T696 C70 P33814 REQ /select {collection=collection1&wt=javabin&q=quick&version=2} hits=2 status=0 QTime=11 
[junit4:junit4]   2> 15745 T677 C71 P33811 REQ /select {fl=id&start=0&q=all&distrib=false&wt=javabin&version=2} hits=2 status=0 QTime=1 
[junit4:junit4]   2> 15752 T706 C72 P33823 REQ /select {fl=id,score&shard.url=127.0.0.1:33823/solr/collection1/&NOW=1349280745036&start=0&q=all&distrib=false&isShard=true&wt=javabin&fsv=true&rows=10&version=2} hits=0 status=0 QTime=1 
[junit4:junit4]   2> 15752 T719 C69 P33825 REQ /select {fl=id,score&shard.url=127.0.0.1:33814/solr/collection1/|127.0.0.1:33825/solr/collection1/&NOW=1349280745036&start=0&q=all&distrib=false&isShard=true&wt=javabin&fsv=true&rows=10&version=2} hits=2 status=0 QTime=1 
[junit4:junit4]   2> 15757 T719 C69 P33825 REQ /select {fl=id&shard.url=127.0.0.1:33814/solr/collection1/|127.0.0.1:33825/solr/collection1/&NOW=1349280745036&start=0&q=all&ids=1,8&distrib=false&isShard=true&wt=javabin&version=2} status=0 QTime=1 
[junit4:junit4]   2> 15758 T703 C72 P33823 REQ /select {fl=id&wt=javabin&start=0&q=all&version=2} hits=2 status=0 QTime=10 
[junit4:junit4]   2> 15761 T677 C71 P33811 REQ /select {fl=foofoofoo&start=0&q=all&distrib=false&wt=javabin&version=2} hits=2 status=0 QTime=0 
[junit4:junit4]   2> 15768 T706 C72 P33823 REQ /select {fl=id,score&shard.url=127.0.0.1:33823/solr/collection1/&NOW=1349280745052&start=0&q=all&distrib=false&isShard=true&wt=javabin&fsv=true&rows=10&version=2} hits=0 status=0 QTime=1 
[junit4:junit4]   2> 15769 T697 C70 P33814 REQ /select {fl=id,score&shard.url=127.0.0.1:33814/solr/collection1/|127.0.0.1:33825/solr/collection1/&NOW=1349280745052&start=0&q=all&distrib=false&isShard=true&wt=javabin&fsv=true&rows=10&version=2} hits=2 status=0 QTime=2 
[junit4:junit4]   2> 15774 T697 C70 P33814 REQ /select {fl=foofoofoo&fl=id&shard.url=127.0.0.1:33814/solr/collection1/|127.0.0.1:33825/solr/collection1/&NOW=1349280745052&start=0&q=all&ids=1,8&distrib=false&isShard=true&wt=javabin&version=2} status=0 QTime=1 
[junit4:junit4]   2> 15775 T703 C72 P33823 REQ /select {fl=foofoofoo&wt=javabin&start=0&q=all&version=2} hits=2 status=0 QTime=11 
[junit4:junit4]   2> 15778 T677 C71 P33811 REQ /select {fl=id&start=100&q=all&distrib=false&wt=javabin&version=2} hits=2 status=0 QTime=0 
[junit4:junit4]   2> 15785 T697 C70 P33814 REQ /select {fl=id,score&shard.url=127.0.0.1:33814/solr/collection1/|127.0.0.1:33825/solr/collection1/&NOW=1349280745069&start=0&q=all&distrib=false&isShard=true&wt=javabin&fsv=true&rows=110&version=2} hits=2 status=0 QTime=1 
[junit4:junit4]   2> 15785 T706 C72 P33823 REQ /select {fl=id,score&shard.url=127.0.0.1:33823/solr/collection1/&NOW=1349280745069&start=0&q=all&distrib=false&isShard=true&wt=javabin&fsv=true&rows=110&version=2} hits=0 status=0 QTime=1 
[junit4:junit4]   2> 15786 T705 C72 P33823 REQ /select {fl=id&wt=javabin&start=100&q=all&version=2} hits=2 status=0 QTime=5 
[junit4:junit4]   2> 15790 T677 C71 P33811 REQ /select {distrib=false&fl=*,score&wt=javabin&q=quick&version=2} hits=2 status=0 QTime=1 
[junit4:junit4]   2> 15797 T707 C72 P33823 REQ /select {fl=id,score&shard.url=127.0.0.1:33823/solr/collection1/&NOW=1349280745081&start=0&q=quick&distrib=false&isShard=true&wt=javabin&fsv=true&rows=10&version=2} hits=1 status=0 QTime=1 
[junit4:junit4]   2> 15797 T693 C70 P33814 REQ /select {fl=id,score&shard.url=127.0.0.1:33814/solr/collection1/|127.0.0.1:33825/solr/collection1/&NOW=1349280745081&start=0&q=quick&distrib=false&isShard=true&wt=javabin&fsv=true&rows=10&version=2} hits=1 status=0 QTime=1 
[junit4:junit4]   2> 15802 T707 C72 P33823 REQ /select {fl=*,score&shard.url=127.0.0.1:33823/solr/collection1/&NOW=1349280745081&q=quick&ids=5&distrib=false&isShard=true&wt=javabin&version=2} status=0 QTime=1 
[junit4:junit4]   2> 15802 T693 C70 P33814 REQ /select {fl=*,score&shard.url=127.0.0.1:33814/solr/collection1/|127.0.0.1:33825/solr/collection1/&NOW=1349280745081&q=quick&ids=4&distrib=false&isShard=true&wt=javabin&version=2} status=0 QTime=1 
[junit4:junit4]   2> 15803 T696 C70 P33814 REQ /select {fl=*,score&wt=javabin&q=quick&version=2} hits=2 status=0 QTime=10 
[junit4:junit4]   2> 15807 T677 C71 P33811 REQ /select {fl=*,score&start=1&q=all&distrib=false&wt=javabin&version=2} hits=2 status=0 QTime=1 
[junit4:junit4]   2> 15814 T716 C69 P33825 REQ /select {distrib=false&collection=collection1&wt=javabin&rows=11&version=2&fl=id,score&shard.url=127.0.0.1:33814/solr/collection1/|127.0.0.1:33825/solr/collection1/&NOW=1349280745098&start=0&q=all&isShard=true&fsv=true} hits=2 status=0 QTime=1 
[junit4:junit4]   2> 15

[...truncated too long message...]

6s J0 | BasicDistributedZkTest.testDistribSearch <<<
[junit4:junit4]    > Throwable #1: java.lang.AssertionError: some core start times did not change on reload
[junit4:junit4]    > 	at __randomizedtesting.SeedInfo.seed([3D47748569CBFB94:BCA1FA9D1E949BA8]:0)
[junit4:junit4]    > 	at org.junit.Assert.fail(Assert.java:93)
[junit4:junit4]    > 	at org.junit.Assert.assertTrue(Assert.java:43)
[junit4:junit4]    > 	at org.apache.solr.cloud.BasicDistributedZkTest.testCollectionsAPI(BasicDistributedZkTest.java:442)
[junit4:junit4]    > 	at org.apache.solr.cloud.BasicDistributedZkTest.doTest(BasicDistributedZkTest.java:331)
[junit4:junit4]    > 	at org.apache.solr.BaseDistributedSearchTestCase.testDistribSearch(BaseDistributedSearchTestCase.java:695)
[junit4:junit4]    > 	at sun.reflect.NativeMethodAccessorImpl.invoke0(Native Method)
[junit4:junit4]    > 	at sun.reflect.NativeMethodAccessorImpl.invoke(NativeMethodAccessorImpl.java:57)
[junit4:junit4]    > 	at sun.reflect.DelegatingMethodAccessorImpl.invoke(DelegatingMethodAccessorImpl.java:43)
[junit4:junit4]    > 	at java.lang.reflect.Method.invoke(Method.java:601)
[junit4:junit4]    > 	at com.carrotsearch.randomizedtesting.RandomizedRunner.invoke(RandomizedRunner.java:1559)
[junit4:junit4]    > 	at com.carrotsearch.randomizedtesting.RandomizedRunner.access$600(RandomizedRunner.java:79)
[junit4:junit4]    > 	at com.carrotsearch.randomizedtesting.RandomizedRunner$6.evaluate(RandomizedRunner.java:737)
[junit4:junit4]    > 	at com.carrotsearch.randomizedtesting.RandomizedRunner$7.evaluate(RandomizedRunner.java:773)
[junit4:junit4]    > 	at com.carrotsearch.randomizedtesting.RandomizedRunner$8.evaluate(RandomizedRunner.java:787)
[junit4:junit4]    > 	at com.carrotsearch.randomizedtesting.rules.SystemPropertiesRestoreRule$1.evaluate(SystemPropertiesRestoreRule.java:53)
[junit4:junit4]    > 	at org.apache.lucene.util.TestRuleSetupTeardownChained$1.evaluate(TestRuleSetupTeardownChained.java:50)
[junit4:junit4]    > 	at org.apache.lucene.util.TestRuleFieldCacheSanity$1.evaluate(TestRuleFieldCacheSanity.java:51)
[junit4:junit4]    > 	at org.apache.lucene.util.AbstractBeforeAfterRule$1.evaluate(AbstractBeforeAfterRule.java:45)
[junit4:junit4]    > 	at com.carrotsearch.randomizedtesting.rules.SystemPropertiesInvariantRule$1.evaluate(SystemPropertiesInvariantRule.java:55)
[junit4:junit4]    > 	at org.apache.lucene.util.TestRuleThreadAndTestName$1.evaluate(TestRuleThreadAndTestName.java:48)
[junit4:junit4]    > 	at org.apache.lucene.util.TestRuleIgnoreAfterMaxFailures$1.evaluate(TestRuleIgnoreAfterMaxFailures.java:70)
[junit4:junit4]    > 	at org.apache.lucene.util.TestRuleMarkFailure$1.evaluate(TestRuleMarkFailure.java:48)
[junit4:junit4]    > 	at com.carrotsearch.randomizedtesting.rules.StatementAdapter.evaluate(StatementAdapter.java:36)
[junit4:junit4]    > 	at com.carrotsearch.randomizedtesting.ThreadLeakControl$StatementRunner.run(ThreadLeakControl.java:358)
[junit4:junit4]    > 	at com.carrotsearch.randomizedtesting.ThreadLeakControl.forkTimeoutingTask(ThreadLeakControl.java:782)
[junit4:junit4]    > 	at com.carrotsearch.randomizedtesting.ThreadLeakControl$3.evaluate(ThreadLeakControl.java:442)
[junit4:junit4]    > 	at com.carrotsearch.randomizedtesting.RandomizedRunner.runSingleTest(RandomizedRunner.java:746)
[junit4:junit4]    > 	at com.carrotsearch.randomizedtesting.RandomizedRunner$3.evaluate(RandomizedRunner.java:648)
[junit4:junit4]    > 	at com.carrotsearch.randomizedtesting.RandomizedRunner$4.evaluate(RandomizedRunner.java:682)
[junit4:junit4]    > 	at com.carrotsearch.randomizedtesting.RandomizedRunner$5.evaluate(RandomizedRunner.java:693)
[junit4:junit4]    > 	at com.carrotsearch.randomizedtesting.rules.StatementAdapter.evaluate(StatementAdapter.java:36)
[junit4:junit4]    > 	at com.carrotsearch.randomizedtesting.rules.SystemPropertiesRestoreRule$1.evaluate(SystemPropertiesRestoreRule.java:53)
[junit4:junit4]    > 	at org.apache.lucene.util.AbstractBeforeAfterRule$1.evaluate(AbstractBeforeAfterRule.java:45)
[junit4:junit4]    > 	at org.apache.lucene.util.TestRuleStoreClassName$1.evaluate(TestRuleStoreClassName.java:42)
[junit4:junit4]    > 	at com.carrotsearch.randomizedtesting.rules.SystemPropertiesInvariantRule$1.evaluate(SystemPropertiesInvariantRule.java:55)
[junit4:junit4]    > 	at com.carrotsearch.randomizedtesting.rules.NoShadowingOrOverridesOnMethodsRule$1.evaluate(NoShadowingOrOverridesOnMethodsRule.java:39)
[junit4:junit4]    > 	at com.carrotsearch.randomizedtesting.rules.NoShadowingOrOverridesOnMethodsRule$1.evaluate(NoShadowingOrOverridesOnMethodsRule.java:39)
[junit4:junit4]    > 	at com.carrotsearch.randomizedtesting.rules.StatementAdapter.evaluate(StatementAdapter.java:36)
[junit4:junit4]    > 	at org.apache.lucene.util.TestRuleAssertionsRequired$1.evaluate(TestRuleAssertionsRequired.java:43)
[junit4:junit4]    > 	at org.apache.lucene.util.TestRuleMarkFailure$1.evaluate(TestRuleMarkFailure.java:48)
[junit4:junit4]    > 	at org.apache.lucene.util.TestRuleIgnoreAfterMaxFailures$1.evaluate(TestRuleIgnoreAfterMaxFailures.java:70)
[junit4:junit4]    > 	at org.apache.lucene.util.TestRuleIgnoreTestSuites$1.evaluate(TestRuleIgnoreTestSuites.java:55)
[junit4:junit4]    > 	at com.carrotsearch.randomizedtesting.rules.StatementAdapter.evaluate(StatementAdapter.java:36)
[junit4:junit4]    > 	at com.carrotsearch.randomizedtesting.ThreadLeakControl$StatementRunner.run(ThreadLeakControl.java:358)
[junit4:junit4]    > 	at java.lang.Thread.run(Thread.java:722)
[junit4:junit4]   2> 995674 T665 oas.SolrTestCaseJ4.deleteCore ###deleteCore
[junit4:junit4]   2> NOTE: test params are: codec=Lucene40: {n_f1=PostingsFormat(name=MockRandom), foo_b=PostingsFormat(name=SimpleText), cat=MockVariableIntBlock(baseBlockSize=108), foo_d=PostingsFormat(name=Lucene40WithOrds), foo_f=PostingsFormat(name=SimpleText), n_tl1=PostingsFormat(name=MockRandom), n_d1=MockVariableIntBlock(baseBlockSize=108), rnd_b=PostingsFormat(name=Lucene40WithOrds), intDefault=PostingsFormat(name=MockRandom), n_td1=PostingsFormat(name=MockRandom), timestamp=MockVariableIntBlock(baseBlockSize=108), id=PostingsFormat(name=Lucene40WithOrds), range_facet_sl=PostingsFormat(name=Lucene40WithOrds), range_facet_si=MockVariableIntBlock(baseBlockSize=108), oddField_s=PostingsFormat(name=Lucene40WithOrds), sequence_i=PostingsFormat(name=Lucene40WithOrds), name=PostingsFormat(name=Lucene40WithOrds), foo_i=PostingsFormat(name=MockRandom), regex_dup_B_s=MockVariableIntBlock(baseBlockSize=108), multiDefault=MockVariableIntBlock(baseBlockSize=108), n_tf1=MockVariableIntBlock(baseBlockSize=108), n_dt1=PostingsFormat(name=MockRandom), genre_s=PostingsFormat(name=Lucene40WithOrds), author_t=PostingsFormat(name=MockRandom), n_ti1=PostingsFormat(name=Lucene40WithOrds), range_facet_l=MockVariableIntBlock(baseBlockSize=108), text=PostingsFormat(name=SimpleText), _version_=PostingsFormat(name=MockRandom), val_i=PostingsFormat(name=Lucene40WithOrds), SubjectTerms_mfacet=PostingsFormat(name=MockRandom), series_t=PostingsFormat(name=MockRandom), a_t=MockVariableIntBlock(baseBlockSize=108), n_tdt1=PostingsFormat(name=MockRandom), regex_dup_A_s=PostingsFormat(name=SimpleText), price=PostingsFormat(name=SimpleText), other_tl1=PostingsFormat(name=MockRandom), n_l1=MockVariableIntBlock(baseBlockSize=108), a_si=PostingsFormat(name=MockRandom), inStock=PostingsFormat(name=SimpleText)}, sim=RandomSimilarityProvider(queryNorm=false,coord=yes): {}, locale=ar_OM, timezone=America/Dawson_Creek
[junit4:junit4]   2> NOTE: FreeBSD 9.0-RELEASE amd64/Oracle Corporation 1.7.0_06 (64-bit)/cpus=16,threads=1,free=198641552,total=421527552
[junit4:junit4]   2> NOTE: All tests run in this JVM: [TestLMDirichletSimilarityFactory, TestLFUCache, NoCacheHeaderTest, TestExtendedDismaxParser, SOLR749Test, TestPerFieldSimilarity, JSONWriterTest, CoreContainerCoreInitFailuresTest, SpellCheckCollatorTest, TestJmxMonitoredMap, TestFaceting, TestBinaryResponseWriter, TestNumberUtils, TestDefaultSimilarityFactory, IndexBasedSpellCheckerTest, SolrCoreCheckLockOnStartupTest, PreAnalyzedFieldTest, TestWordDelimiterFilterFactory, TestLuceneMatchVersion, TestReload, DirectSolrConnectionTest, TermsComponentTest, TestLMJelinekMercerSimilarityFactory, CSVRequestHandlerTest, DirectUpdateHandlerOptimizeTest, SolrRequestParserTest, TestIndexingPerformance, TestFastOutputStream, MBeansHandlerTest, UniqFieldsUpdateProcessorFactoryTest, TestFastLRUCache, PluginInfoTest, ZkControllerTest, UpdateRequestProcessorFactoryTest, CircularListTest, RequestHandlersTest, FileBasedSpellCheckerTest, TestElisionMultitermQuery, JsonLoaderTest, DateFieldTest, TestFiltering, ResponseLogComponentTest, HighlighterConfigTest, MinimalSchemaTest, BinaryUpdateRequestHandlerTest, SystemInfoHandlerTest, TestStressReorder, TestJoin, NotRequiredUniqueKeyTest, SolrCmdDistributorTest, SuggesterWFSTTest, FastVectorHighlighterTest, TestFastWriter, BasicDistributedZkTest]
[junit4:junit4] Completed on J0 in 996.04s, 1 test, 1 failure <<< FAILURES!

[...truncated 36 lines...]
BUILD FAILED
/usr/home/hudson/hudson-slave/workspace/Lucene-Solr-Tests-4.x-java7/build.xml:38: The following error occurred while executing this line:
/usr/home/hudson/hudson-slave/workspace/Lucene-Solr-Tests-4.x-java7/solr/build.xml:180: The following error occurred while executing this line:
/usr/home/hudson/hudson-slave/workspace/Lucene-Solr-Tests-4.x-java7/lucene/module-build.xml:61: The following error occurred while executing this line:
/usr/home/hudson/hudson-slave/workspace/Lucene-Solr-Tests-4.x-java7/lucene/common-build.xml:1143: The following error occurred while executing this line:
/usr/home/hudson/hudson-slave/workspace/Lucene-Solr-Tests-4.x-java7/lucene/common-build.xml:816: There were test failures: 231 suites, 959 tests, 1 failure, 21 ignored (3 assumptions)

Total time: 37 minutes 3 seconds
Build step 'Invoke Ant' marked build as failure
Recording test results
Email was triggered for: Failure
Sending email for trigger: Failure



Mime
View raw message