lucene-dev mailing list archives

Site index · List index
Message view « Date » · « Thread »
Top « Date » · « Thread »
From Policeman Jenkins Server <jenk...@sd-datasolutions.de>
Subject [JENKINS] Lucene-Solr-trunk-Windows (32bit/jdk1.6.0_35) - Build # 1190 - Failure!
Date Tue, 16 Oct 2012 12:03:25 GMT
Build: http://jenkins.sd-datasolutions.de/job/Lucene-Solr-trunk-Windows/1190/
Java: 32bit/jdk1.6.0_35 -server -XX:+UseConcMarkSweepGC

1 tests failed.
REGRESSION:  org.apache.solr.spelling.suggest.SuggesterWFSTTest.testSuggestions

Error Message:
Exception during query

Stack Trace:
java.lang.RuntimeException: Exception during query
	at __randomizedtesting.SeedInfo.seed([C2CAEB4B6FD73F78:6416D2BEA1E36886]:0)
	at org.apache.solr.SolrTestCaseJ4.assertQ(SolrTestCaseJ4.java:512)
	at org.apache.solr.SolrTestCaseJ4.assertQ(SolrTestCaseJ4.java:479)
	at org.apache.solr.spelling.suggest.SuggesterTest.testSuggestions(SuggesterTest.java:71)
	at sun.reflect.NativeMethodAccessorImpl.invoke0(Native Method)
	at sun.reflect.NativeMethodAccessorImpl.invoke(NativeMethodAccessorImpl.java:39)
	at sun.reflect.DelegatingMethodAccessorImpl.invoke(DelegatingMethodAccessorImpl.java:25)
	at java.lang.reflect.Method.invoke(Method.java:597)
	at com.carrotsearch.randomizedtesting.RandomizedRunner.invoke(RandomizedRunner.java:1559)
	at com.carrotsearch.randomizedtesting.RandomizedRunner.access$600(RandomizedRunner.java:79)
	at com.carrotsearch.randomizedtesting.RandomizedRunner$6.evaluate(RandomizedRunner.java:737)
	at com.carrotsearch.randomizedtesting.RandomizedRunner$7.evaluate(RandomizedRunner.java:773)
	at com.carrotsearch.randomizedtesting.RandomizedRunner$8.evaluate(RandomizedRunner.java:787)
	at com.carrotsearch.randomizedtesting.rules.SystemPropertiesRestoreRule$1.evaluate(SystemPropertiesRestoreRule.java:53)
	at org.apache.lucene.util.TestRuleSetupTeardownChained$1.evaluate(TestRuleSetupTeardownChained.java:50)
	at org.apache.lucene.util.TestRuleFieldCacheSanity$1.evaluate(TestRuleFieldCacheSanity.java:51)
	at org.apache.lucene.util.AbstractBeforeAfterRule$1.evaluate(AbstractBeforeAfterRule.java:45)
	at com.carrotsearch.randomizedtesting.rules.SystemPropertiesInvariantRule$1.evaluate(SystemPropertiesInvariantRule.java:55)
	at org.apache.lucene.util.TestRuleThreadAndTestName$1.evaluate(TestRuleThreadAndTestName.java:48)
	at org.apache.lucene.util.TestRuleIgnoreAfterMaxFailures$1.evaluate(TestRuleIgnoreAfterMaxFailures.java:70)
	at org.apache.lucene.util.TestRuleMarkFailure$1.evaluate(TestRuleMarkFailure.java:48)
	at com.carrotsearch.randomizedtesting.rules.StatementAdapter.evaluate(StatementAdapter.java:36)
	at com.carrotsearch.randomizedtesting.ThreadLeakControl$StatementRunner.run(ThreadLeakControl.java:358)
	at com.carrotsearch.randomizedtesting.ThreadLeakControl.forkTimeoutingTask(ThreadLeakControl.java:782)
	at com.carrotsearch.randomizedtesting.ThreadLeakControl$3.evaluate(ThreadLeakControl.java:442)
	at com.carrotsearch.randomizedtesting.RandomizedRunner.runSingleTest(RandomizedRunner.java:746)
	at com.carrotsearch.randomizedtesting.RandomizedRunner$3.evaluate(RandomizedRunner.java:648)
	at com.carrotsearch.randomizedtesting.RandomizedRunner$4.evaluate(RandomizedRunner.java:682)
	at com.carrotsearch.randomizedtesting.RandomizedRunner$5.evaluate(RandomizedRunner.java:693)
	at com.carrotsearch.randomizedtesting.rules.StatementAdapter.evaluate(StatementAdapter.java:36)
	at com.carrotsearch.randomizedtesting.rules.SystemPropertiesRestoreRule$1.evaluate(SystemPropertiesRestoreRule.java:53)
	at org.apache.lucene.util.AbstractBeforeAfterRule$1.evaluate(AbstractBeforeAfterRule.java:45)
	at org.apache.lucene.util.TestRuleStoreClassName$1.evaluate(TestRuleStoreClassName.java:42)
	at com.carrotsearch.randomizedtesting.rules.SystemPropertiesInvariantRule$1.evaluate(SystemPropertiesInvariantRule.java:55)
	at com.carrotsearch.randomizedtesting.rules.NoShadowingOrOverridesOnMethodsRule$1.evaluate(NoShadowingOrOverridesOnMethodsRule.java:39)
	at com.carrotsearch.randomizedtesting.rules.NoShadowingOrOverridesOnMethodsRule$1.evaluate(NoShadowingOrOverridesOnMethodsRule.java:39)
	at com.carrotsearch.randomizedtesting.rules.StatementAdapter.evaluate(StatementAdapter.java:36)
	at org.apache.lucene.util.TestRuleAssertionsRequired$1.evaluate(TestRuleAssertionsRequired.java:43)
	at org.apache.lucene.util.TestRuleMarkFailure$1.evaluate(TestRuleMarkFailure.java:48)
	at org.apache.lucene.util.TestRuleIgnoreAfterMaxFailures$1.evaluate(TestRuleIgnoreAfterMaxFailures.java:70)
	at org.apache.lucene.util.TestRuleIgnoreTestSuites$1.evaluate(TestRuleIgnoreTestSuites.java:55)
	at com.carrotsearch.randomizedtesting.rules.StatementAdapter.evaluate(StatementAdapter.java:36)
	at com.carrotsearch.randomizedtesting.ThreadLeakControl$StatementRunner.run(ThreadLeakControl.java:358)
	at java.lang.Thread.run(Thread.java:662)
Caused by: java.lang.NullPointerException
	at org.apache.lucene.search.suggest.fst.WFSTCompletionLookup.lookupPrefix(WFSTCompletionLookup.java:193)
	at org.apache.lucene.search.suggest.fst.WFSTCompletionLookup.lookup(WFSTCompletionLookup.java:153)
	at org.apache.solr.spelling.suggest.Suggester.getSuggestions(Suggester.java:190)
	at org.apache.solr.handler.component.SpellCheckComponent.process(SpellCheckComponent.java:172)
	at org.apache.solr.handler.component.SearchHandler.handleRequestBody(SearchHandler.java:206)
	at org.apache.solr.handler.RequestHandlerBase.handleRequest(RequestHandlerBase.java:129)
	at org.apache.solr.core.SolrCore.execute(SolrCore.java:1750)
	at org.apache.solr.util.TestHarness.query(TestHarness.java:364)
	at org.apache.solr.util.TestHarness.query(TestHarness.java:346)
	at org.apache.solr.SolrTestCaseJ4.assertQ(SolrTestCaseJ4.java:486)
	... 42 more




Build Log:
[...truncated 8071 lines...]
[junit4:junit4] Suite: org.apache.solr.spelling.suggest.SuggesterWFSTTest
[junit4:junit4]   2> 2 T2075 oas.SolrTestCaseJ4.initCore ####initCore
[junit4:junit4]   2> Creating dataDir: C:\Users\JenkinsSlave\workspace\Lucene-Solr-trunk-Windows\solr\build\solr-core\test\J0\.\solrtest-SuggesterWFSTTest-1350388447588
[junit4:junit4]   2> 3 T2075 oasc.SolrResourceLoader.<init> new SolrResourceLoader for directory: 'C:\Users\JenkinsSlave\workspace\Lucene-Solr-trunk-Windows\solr\build\solr-core\test-files\solr\collection1\'
[junit4:junit4]   2> 6 T2075 oasc.SolrResourceLoader.replaceClassLoader Adding 'file:/C:/Users/JenkinsSlave/workspace/Lucene-Solr-trunk-Windows/solr/build/solr-core/test-files/solr/collection1/lib/classes/' to classloader
[junit4:junit4]   2> 7 T2075 oasc.SolrResourceLoader.replaceClassLoader Adding 'file:/C:/Users/JenkinsSlave/workspace/Lucene-Solr-trunk-Windows/solr/build/solr-core/test-files/solr/collection1/lib/README' to classloader
[junit4:junit4]   2> 87 T2075 oasc.SolrConfig.<init> Using Lucene MatchVersion: LUCENE_50
[junit4:junit4]   2> 159 T2075 oasc.SolrConfig.<init> Loaded SolrConfig: solrconfig-spellchecker.xml
[junit4:junit4]   2> 159 T2075 oass.IndexSchema.readSchema Reading Solr Schema
[junit4:junit4]   2> 163 T2075 oass.IndexSchema.readSchema Schema name=Solr SpellCheck Test
[junit4:junit4]   2> 211 T2075 oass.IndexSchema.readSchema default search field in schema is text
[junit4:junit4]   2> 214 T2075 oass.IndexSchema.readSchema query parser default operator is OR
[junit4:junit4]   2> 215 T2075 oass.IndexSchema.readSchema unique key field: id
[junit4:junit4]   2> 219 T2075 oasc.SolrResourceLoader.locateSolrHome JNDI not configured for solr (NoInitialContextEx)
[junit4:junit4]   2> 220 T2075 oasc.SolrResourceLoader.locateSolrHome using system property solr.solr.home: C:\Users\JenkinsSlave\workspace\Lucene-Solr-trunk-Windows\solr\build\solr-core\test-files\solr
[junit4:junit4]   2> 220 T2075 oasc.SolrResourceLoader.<init> new SolrResourceLoader for directory: 'C:\Users\JenkinsSlave\workspace\Lucene-Solr-trunk-Windows\solr\build\solr-core\test-files\solr\'
[junit4:junit4]   2> 231 T2075 oasc.CoreContainer.<init> New CoreContainer 27285124
[junit4:junit4]   2> 231 T2075 oasc.SolrCore.<init> [collection1] Opening new SolrCore at C:\Users\JenkinsSlave\workspace\Lucene-Solr-trunk-Windows\solr\build\solr-core\test-files\solr\collection1\, dataDir=C:\Users\JenkinsSlave\workspace\Lucene-Solr-trunk-Windows\solr\build\solr-core\test\J0\.\solrtest-SuggesterWFSTTest-1350388447588\
[junit4:junit4]   2> 232 T2075 oasc.SolrCore.<init> JMX monitoring not detected for core: collection1
[junit4:junit4]   2> 233 T2075 oasc.SolrCore.getNewIndexDir New index directory detected: old=null new=C:\Users\JenkinsSlave\workspace\Lucene-Solr-trunk-Windows\solr\build\solr-core\test\J0\.\solrtest-SuggesterWFSTTest-1350388447588\index/
[junit4:junit4]   2> 234 T2075 oasc.SolrCore.initIndex WARNING [collection1] Solr index directory 'C:\Users\JenkinsSlave\workspace\Lucene-Solr-trunk-Windows\solr\build\solr-core\test\J0\.\solrtest-SuggesterWFSTTest-1350388447588\index' doesn't exist. Creating new index...
[junit4:junit4]   2> 234 T2075 oasc.CachingDirectoryFactory.get return new directory for C:\Users\JenkinsSlave\workspace\Lucene-Solr-trunk-Windows\solr\build\solr-core\test\J0\.\solrtest-SuggesterWFSTTest-1350388447588\index forceNew:false
[junit4:junit4]   2> 239 T2075 oasc.SolrDeletionPolicy.onCommit SolrDeletionPolicy.onCommit: commits:num=1
[junit4:junit4]   2> 		commit{dir=MockDirWrapper(org.apache.lucene.store.MMapDirectory@C:\Users\JenkinsSlave\workspace\Lucene-Solr-trunk-Windows\solr\build\solr-core\test\J0\solrtest-SuggesterWFSTTest-1350388447588\index lockFactory=org.apache.lucene.store.NativeFSLockFactory@1e2f526),segFN=segments_1,generation=1,filenames=[segments_1]
[junit4:junit4]   2> 239 T2075 oasc.SolrDeletionPolicy.updateCommits newest commit = 1
[junit4:junit4]   2> 241 T2075 oasc.RequestHandlers.initHandlersFromConfig created standard: solr.StandardRequestHandler
[junit4:junit4]   2> 242 T2075 oasc.RequestHandlers.initHandlersFromConfig created /suggest: org.apache.solr.handler.component.SearchHandler
[junit4:junit4]   2> 242 T2075 oasc.RequestHandlers.initHandlersFromConfig created /suggest_tst: org.apache.solr.handler.component.SearchHandler
[junit4:junit4]   2> 242 T2075 oasc.RequestHandlers.initHandlersFromConfig created /suggest_fst: org.apache.solr.handler.component.SearchHandler
[junit4:junit4]   2> 243 T2075 oasc.RequestHandlers.initHandlersFromConfig created /suggest_wfst: org.apache.solr.handler.component.SearchHandler
[junit4:junit4]   2> 255 T2075 oass.SolrIndexSearcher.<init> Opening Searcher@1e67c7 main
[junit4:junit4]   2> 255 T2075 oass.SolrIndexSearcher.getIndexDir WARNING WARNING: Directory impl does not support setting indexDir: org.apache.lucene.store.MockDirectoryWrapper
[junit4:junit4]   2> 256 T2075 oasu.CommitTracker.<init> Hard AutoCommit: disabled
[junit4:junit4]   2> 256 T2075 oasu.CommitTracker.<init> Soft AutoCommit: disabled
[junit4:junit4]   2> 256 T2075 oashc.SpellCheckComponent.inform Initializing spell checkers
[junit4:junit4]   2> 257 T2075 oasss.Suggester.init init: {name=suggest,classname=org.apache.solr.spelling.suggest.Suggester,lookupImpl=org.apache.solr.spelling.suggest.jaspell.JaspellLookup,field=suggest,storeDir=suggest,buildOnCommit=true,threshold=0.0}
[junit4:junit4]   2> 258 T2075 oasssj.JaspellLookupFactory.create init: {name=suggest,classname=org.apache.solr.spelling.suggest.Suggester,lookupImpl=org.apache.solr.spelling.suggest.jaspell.JaspellLookup,field=suggest,storeDir=suggest,buildOnCommit=true,threshold=0.0}
[junit4:junit4]   2> 259 T2075 oashc.SpellCheckComponent.inform Registering newSearcher listener for spellchecker: suggest
[junit4:junit4]   2> 260 T2075 oashc.SpellCheckComponent.inform No queryConverter defined, using default converter
[junit4:junit4]   2> 261 T2075 oashc.SpellCheckComponent.inform Initializing spell checkers
[junit4:junit4]   2> 261 T2075 oasss.Suggester.init init: {name=suggest_tst,classname=org.apache.solr.spelling.suggest.Suggester,lookupImpl=org.apache.solr.spelling.suggest.tst.TSTLookup,field=suggest,storeDir=suggest_tst,buildOnCommit=true,threshold=0.0}
[junit4:junit4]   2> 263 T2075 oashc.SpellCheckComponent.inform Registering newSearcher listener for spellchecker: suggest_tst
[junit4:junit4]   2> 263 T2075 oashc.SpellCheckComponent.inform No queryConverter defined, using default converter
[junit4:junit4]   2> 263 T2075 oashc.SpellCheckComponent.inform Initializing spell checkers
[junit4:junit4]   2> 263 T2075 oasss.Suggester.init init: {name=suggest_fst,classname=org.apache.solr.spelling.suggest.Suggester,lookupImpl=org.apache.solr.spelling.suggest.fst.FSTLookup,field=suggest,storeDir=suggest_fst,buildOnCommit=true,weightBuckets=5,exactMatchFirst=true}
[junit4:junit4]   2> 265 T2075 oashc.SpellCheckComponent.inform Registering newSearcher listener for spellchecker: suggest_fst
[junit4:junit4]   2> 265 T2075 oashc.SpellCheckComponent.inform No queryConverter defined, using default converter
[junit4:junit4]   2> 265 T2075 oashc.SpellCheckComponent.inform Initializing spell checkers
[junit4:junit4]   2> 265 T2075 oasss.Suggester.init init: {name=suggest_wfst,classname=org.apache.solr.spelling.suggest.Suggester,lookupImpl=org.apache.solr.spelling.suggest.fst.WFSTLookupFactory,field=suggest,storeDir=suggest_wfst,buildOnCommit=true,exactMatchFirst=true}
[junit4:junit4]   2> 268 T2075 oashc.SpellCheckComponent.inform Registering newSearcher listener for spellchecker: suggest_wfst
[junit4:junit4]   2> 269 T2075 oashc.SpellCheckComponent.inform No queryConverter defined, using default converter
[junit4:junit4]   2> 269 T2075 oashc.HttpShardHandlerFactory.getParameter Setting socketTimeout to: 0
[junit4:junit4]   2> 269 T2075 oashc.HttpShardHandlerFactory.getParameter Setting urlScheme to: http://
[junit4:junit4]   2> 269 T2075 oashc.HttpShardHandlerFactory.getParameter Setting connTimeout to: 0
[junit4:junit4]   2> 270 T2075 oashc.HttpShardHandlerFactory.getParameter Setting maxConnectionsPerHost to: 20
[junit4:junit4]   2> 270 T2075 oashc.HttpShardHandlerFactory.getParameter Setting corePoolSize to: 0
[junit4:junit4]   2> 270 T2075 oashc.HttpShardHandlerFactory.getParameter Setting maximumPoolSize to: 2147483647
[junit4:junit4]   2> 270 T2075 oashc.HttpShardHandlerFactory.getParameter Setting maxThreadIdleTime to: 5
[junit4:junit4]   2> 270 T2075 oashc.HttpShardHandlerFactory.getParameter Setting sizeOfQueue to: -1
[junit4:junit4]   2> 271 T2075 oashc.HttpShardHandlerFactory.getParameter Setting fairnessPolicy to: false
[junit4:junit4]   2> 271 T2075 oascsi.HttpClientUtil.createClient Creating new http client, config:maxConnectionsPerHost=20&maxConnections=10000&socketTimeout=0&connTimeout=0&retry=false
[junit4:junit4]   2> 280 T2075 oasc.CoreContainer.register registering core: collection1
[junit4:junit4]   2> 287 T2075 oas.SolrTestCaseJ4.initCore ####initCore end
[junit4:junit4]   2> 292 T2075 oas.SolrTestCaseJ4.setUp ###Starting testSuggestions
[junit4:junit4]   2> ASYNC  NEW_CORE C139 name=collection1 org.apache.solr.core.SolrCore@1324a88
[junit4:junit4]   2> 308 T2075 C139 oasc.SolrDeletionPolicy.onInit SolrDeletionPolicy.onInit: commits:num=1
[junit4:junit4]   2> 		commit{dir=MockDirWrapper(org.apache.lucene.store.MMapDirectory@C:\Users\JenkinsSlave\workspace\Lucene-Solr-trunk-Windows\solr\build\solr-core\test\J0\solrtest-SuggesterWFSTTest-1350388447588\index lockFactory=org.apache.lucene.store.NativeFSLockFactory@1e2f526),segFN=segments_1,generation=1,filenames=[segments_1]
[junit4:junit4]   2> 308 T2075 C139 oasc.SolrDeletionPolicy.updateCommits newest commit = 1
[junit4:junit4]   2> 311 T2075 C139 UPDATE [collection1] webapp=null path=null params={} {add=[1]} 0 7
[junit4:junit4]   2> 334 T2075 C139 UPDATE [collection1] webapp=null path=null params={} {add=[2]} 0 0
[junit4:junit4]   2> 345 T2075 C139 UPDATE [collection1] webapp=null path=null params={} {add=[3]} 0 0
[junit4:junit4]   2> 356 T2075 C139 oasu.DirectUpdateHandler2.commit start commit{flags=0,_version_=0,optimize=false,openSearcher=true,waitSearcher=true,expungeDeletes=false,softCommit=false}
[junit4:junit4]   2> 369 T2075 C139 oasc.SolrDeletionPolicy.onCommit SolrDeletionPolicy.onCommit: commits:num=2
[junit4:junit4]   2> 		commit{dir=MockDirWrapper(org.apache.lucene.store.MMapDirectory@C:\Users\JenkinsSlave\workspace\Lucene-Solr-trunk-Windows\solr\build\solr-core\test\J0\solrtest-SuggesterWFSTTest-1350388447588\index lockFactory=org.apache.lucene.store.NativeFSLockFactory@1e2f526),segFN=segments_1,generation=1,filenames=[segments_1]
[junit4:junit4]   2> 		commit{dir=MockDirWrapper(org.apache.lucene.store.MMapDirectory@C:\Users\JenkinsSlave\workspace\Lucene-Solr-trunk-Windows\solr\build\solr-core\test\J0\solrtest-SuggesterWFSTTest-1350388447588\index lockFactory=org.apache.lucene.store.NativeFSLockFactory@1e2f526),segFN=segments_2,generation=2,filenames=[_0.fnm, _0.pos, _0.tim, _0_nrm.cfe, segments_2, _0.fdx, _0_nrm.cfs, _0.si, _0.doc, _0.tip, _0.fdt]
[junit4:junit4]   2> 370 T2075 C139 oasc.SolrDeletionPolicy.updateCommits newest commit = 2
[junit4:junit4]   2> 372 T2075 C139 oasc.SolrCore.getSearcher WARNING [collection1] PERFORMANCE WARNING: Overlapping onDeckSearchers=2
[junit4:junit4]   2> 391 T2075 C139 oass.SolrIndexSearcher.<init> Opening Searcher@1d12228 main
[junit4:junit4]   2> 391 T2075 C139 oass.SolrIndexSearcher.getIndexDir WARNING WARNING: Directory impl does not support setting indexDir: org.apache.lucene.store.MockDirectoryWrapper
[junit4:junit4]   2> 392 T2075 C139 oasu.DirectUpdateHandler2.commit end_commit_flush
[junit4:junit4]   2> 393 T2076 oasc.SolrCore.registerSearcher [collection1] Registered new searcher Searcher@1e67c7 main{StandardDirectoryReader(segments_1:1)}
[junit4:junit4]   2> 394 T2076 oashc.SpellCheckComponent$SpellCheckerListener.newSearcher Loading spell index for spellchecker: suggest
[junit4:junit4]   2> 394 T2076 oasss.Suggester.reload reload()
[junit4:junit4]   2> 396 T2076 oashc.SpellCheckComponent$SpellCheckerListener.newSearcher SEVERE Exception in reloading spell check index for spellchecker: suggest java.io.FileNotFoundException: C:\Users\JenkinsSlave\workspace\Lucene-Solr-trunk-Windows\solr\build\solr-core\test\J0\.\solrtest-SuggesterWFSTTest-1350388447588\suggest\jaspell.dat (The system cannot find the file specified)
[junit4:junit4]   2> 	at java.io.FileInputStream.open(Native Method)
[junit4:junit4]   2> 	at java.io.FileInputStream.<init>(FileInputStream.java:120)
[junit4:junit4]   2> 	at org.apache.solr.spelling.suggest.Suggester.reload(Suggester.java:161)
[junit4:junit4]   2> 	at org.apache.solr.handler.component.SpellCheckComponent$SpellCheckerListener.newSearcher(SpellCheckComponent.java:673)
[junit4:junit4]   2> 	at org.apache.solr.core.SolrCore$5.call(SolrCore.java:1530)
[junit4:junit4]   2> 	at java.util.concurrent.FutureTask$Sync.innerRun(FutureTask.java:303)
[junit4:junit4]   2> 	at java.util.concurrent.FutureTask.run(FutureTask.java:138)
[junit4:junit4]   2> 	at java.util.concurrent.ThreadPoolExecutor$Worker.runTask(ThreadPoolExecutor.java:886)
[junit4:junit4]   2> 	at java.util.concurrent.ThreadPoolExecutor$Worker.run(ThreadPoolExecutor.java:908)
[junit4:junit4]   2> 	at java.lang.Thread.run(Thread.java:662)
[junit4:junit4]   2> 
[junit4:junit4]   2> 401 T2076 oashc.SpellCheckComponent$SpellCheckerListener.newSearcher Loading spell index for spellchecker: suggest_tst
[junit4:junit4]   2> 401 T2076 oasss.Suggester.reload reload()
[junit4:junit4]   2> 403 T2076 oashc.SpellCheckComponent$SpellCheckerListener.newSearcher SEVERE Exception in reloading spell check index for spellchecker: suggest_tst java.io.FileNotFoundException: C:\Users\JenkinsSlave\workspace\Lucene-Solr-trunk-Windows\solr\build\solr-core\test\J0\.\solrtest-SuggesterWFSTTest-1350388447588\suggest_tst\tst.dat (The system cannot find the file specified)
[junit4:junit4]   2> 	at java.io.FileInputStream.open(Native Method)
[junit4:junit4]   2> 	at java.io.FileInputStream.<init>(FileInputStream.java:120)
[junit4:junit4]   2> 	at org.apache.solr.spelling.suggest.Suggester.reload(Suggester.java:161)
[junit4:junit4]   2> 	at org.apache.solr.handler.component.SpellCheckComponent$SpellCheckerListener.newSearcher(SpellCheckComponent.java:673)
[junit4:junit4]   2> 	at org.apache.solr.core.SolrCore$5.call(SolrCore.java:1530)
[junit4:junit4]   2> 	at java.util.concurrent.FutureTask$Sync.innerRun(FutureTask.java:303)
[junit4:junit4]   2> 	at java.util.concurrent.FutureTask.run(FutureTask.java:138)
[junit4:junit4]   2> 	at java.util.concurrent.ThreadPoolExecutor$Worker.runTask(ThreadPoolExecutor.java:886)
[junit4:junit4]   2> 	at java.util.concurrent.ThreadPoolExecutor$Worker.run(ThreadPoolExecutor.java:908)
[junit4:junit4]   2> 	at java.lang.Thread.run(Thread.java:662)
[junit4:junit4]   2> 
[junit4:junit4]   2> 403 T2076 oashc.SpellCheckComponent$SpellCheckerListener.newSearcher Loading spell index for spellchecker: suggest_fst
[junit4:junit4]   2> 404 T2076 oasss.Suggester.reload reload()
[junit4:junit4]   2> 406 T2076 oashc.SpellCheckComponent$SpellCheckerListener.newSearcher SEVERE Exception in reloading spell check index for spellchecker: suggest_fst java.io.FileNotFoundException: C:\Users\JenkinsSlave\workspace\Lucene-Solr-trunk-Windows\solr\build\solr-core\test\J0\.\solrtest-SuggesterWFSTTest-1350388447588\suggest_fst\fst.bin (The system cannot find the file specified)
[junit4:junit4]   2> 	at java.io.FileInputStream.open(Native Method)
[junit4:junit4]   2> 	at java.io.FileInputStream.<init>(FileInputStream.java:120)
[junit4:junit4]   2> 	at org.apache.solr.spelling.suggest.Suggester.reload(Suggester.java:161)
[junit4:junit4]   2> 	at org.apache.solr.handler.component.SpellCheckComponent$SpellCheckerListener.newSearcher(SpellCheckComponent.java:673)
[junit4:junit4]   2> 	at org.apache.solr.core.SolrCore$5.call(SolrCore.java:1530)
[junit4:junit4]   2> 	at java.util.concurrent.FutureTask$Sync.innerRun(FutureTask.java:303)
[junit4:junit4]   2> 	at java.util.concurrent.FutureTask.run(FutureTask.java:138)
[junit4:junit4]   2> 	at java.util.concurrent.ThreadPoolExecutor$Worker.runTask(ThreadPoolExecutor.java:886)
[junit4:junit4]   2> 	at java.util.concurrent.ThreadPoolExecutor$Worker.run(ThreadPoolExecutor.java:908)
[junit4:junit4]   2> 	at java.lang.Thread.run(Thread.java:662)
[junit4:junit4]   2> 
[junit4:junit4]   2> 406 T2076 oashc.SpellCheckComponent$SpellCheckerListener.newSearcher Loading spell index for spellchecker: suggest_wfst
[junit4:junit4]   2> 406 T2076 oasss.Suggester.reload reload()
[junit4:junit4]   2> 407 T2076 oashc.SpellCheckComponent$SpellCheckerListener.newSearcher SEVERE Exception in reloading spell check index for spellchecker: suggest_wfst java.io.FileNotFoundException: C:\Users\JenkinsSlave\workspace\Lucene-Solr-trunk-Windows\solr\build\solr-core\test\J0\.\solrtest-SuggesterWFSTTest-1350388447588\suggest_wfst\wfst.bin (The system cannot find the file specified)
[junit4:junit4]   2> 	at java.io.FileInputStream.open(Native Method)
[junit4:junit4]   2> 	at java.io.FileInputStream.<init>(FileInputStream.java:120)
[junit4:junit4]   2> 	at org.apache.solr.spelling.suggest.Suggester.reload(Suggester.java:161)
[junit4:junit4]   2> 	at org.apache.solr.handler.component.SpellCheckComponent$SpellCheckerListener.newSearcher(SpellCheckComponent.java:673)
[junit4:junit4]   2> 	at org.apache.solr.core.SolrCore$5.call(SolrCore.java:1530)
[junit4:junit4]   2> 	at java.util.concurrent.FutureTask$Sync.innerRun(FutureTask.java:303)
[junit4:junit4]   2> 	at java.util.concurrent.FutureTask.run(FutureTask.java:138)
[junit4:junit4]   2> 	at java.util.concurrent.ThreadPoolExecutor$Worker.runTask(ThreadPoolExecutor.java:886)
[junit4:junit4]   2> 	at java.util.concurrent.ThreadPoolExecutor$Worker.run(ThreadPoolExecutor.java:908)
[junit4:junit4]   2> 	at java.lang.Thread.run(Thread.java:662)
[junit4:junit4]   2> 
[junit4:junit4]   2> 408 T2076 oasc.SolrCore.registerSearcher [collection1] Registered new searcher Searcher@1d12228 main{StandardDirectoryReader(segments_2:3 _0(5.0):C3)}
[junit4:junit4]   2> 408 T2075 C139 UPDATE [collection1] webapp=null path=null params={} {commit=} 0 52
[junit4:junit4]   2> 415 T2075 C139 oasc.SolrException.log SEVERE java.lang.NullPointerException
[junit4:junit4]   2> 		at org.apache.lucene.search.suggest.fst.WFSTCompletionLookup.lookupPrefix(WFSTCompletionLookup.java:193)
[junit4:junit4]   2> 		at org.apache.lucene.search.suggest.fst.WFSTCompletionLookup.lookup(WFSTCompletionLookup.java:153)
[junit4:junit4]   2> 		at org.apache.solr.spelling.suggest.Suggester.getSuggestions(Suggester.java:190)
[junit4:junit4]   2> 		at org.apache.solr.handler.component.SpellCheckComponent.process(SpellCheckComponent.java:172)
[junit4:junit4]   2> 		at org.apache.solr.handler.component.SearchHandler.handleRequestBody(SearchHandler.java:206)
[junit4:junit4]   2> 		at org.apache.solr.handler.RequestHandlerBase.handleRequest(RequestHandlerBase.java:129)
[junit4:junit4]   2> 		at org.apache.solr.core.SolrCore.execute(SolrCore.java:1750)
[junit4:junit4]   2> 		at org.apache.solr.util.TestHarness.query(TestHarness.java:364)
[junit4:junit4]   2> 		at org.apache.solr.util.TestHarness.query(TestHarness.java:346)
[junit4:junit4]   2> 		at org.apache.solr.SolrTestCaseJ4.assertQ(SolrTestCaseJ4.java:486)
[junit4:junit4]   2> 		at org.apache.solr.SolrTestCaseJ4.assertQ(SolrTestCaseJ4.java:479)
[junit4:junit4]   2> 		at org.apache.solr.spelling.suggest.SuggesterTest.testSuggestions(SuggesterTest.java:71)
[junit4:junit4]   2> 		at sun.reflect.NativeMethodAccessorImpl.invoke0(Native Method)
[junit4:junit4]   2> 		at sun.reflect.NativeMethodAccessorImpl.invoke(NativeMethodAccessorImpl.java:39)
[junit4:junit4]   2> 		at sun.reflect.DelegatingMethodAccessorImpl.invoke(DelegatingMethodAccessorImpl.java:25)
[junit4:junit4]   2> 		at java.lang.reflect.Method.invoke(Method.java:597)
[junit4:junit4]   2> 		at com.carrotsearch.randomizedtesting.RandomizedRunner.invoke(RandomizedRunner.java:1559)
[junit4:junit4]   2> 		at com.carrotsearch.randomizedtesting.RandomizedRunner.access$600(RandomizedRunner.java:79)
[junit4:junit4]   2> 		at com.carrotsearch.randomizedtesting.RandomizedRunner$6.evaluate(RandomizedRunner.java:737)
[junit4:junit4]   2> 		at com.carrotsearch.randomizedtesting.RandomizedRunner$7.evaluate(RandomizedRunner.java:773)
[junit4:junit4]   2> 		at com.carrotsearch.randomizedtesting.RandomizedRunner$8.evaluate(RandomizedRunner.java:787)
[junit4:junit4]   2> 		at com.carrotsearch.randomizedtesting.rules.SystemPropertiesRestoreRule$1.evaluate(SystemPropertiesRestoreRule.java:53)
[junit4:junit4]   2> 		at org.apache.lucene.util.TestRuleSetupTeardownChained$1.evaluate(TestRuleSetupTeardownChained.java:50)
[junit4:junit4]   2> 		at org.apache.lucene.util.TestRuleFieldCacheSanity$1.evaluate(TestRuleFieldCacheSanity.java:51)
[junit4:junit4]   2> 		at org.apache.lucene.util.AbstractBeforeAfterRule$1.evaluate(AbstractBeforeAfterRule.java:45)
[junit4:junit4]   2> 		at com.carrotsearch.randomizedtesting.rules.SystemPropertiesInvariantRule$1.evaluate(SystemPropertiesInvariantRule.java:55)
[junit4:junit4]   2> 		at org.apache.lucene.util.TestRuleThreadAndTestName$1.evaluate(TestRuleThreadAndTestName.java:48)
[junit4:junit4]   2> 		at org.apache.lucene.util.TestRuleIgnoreAfterMaxFailures$1.evaluate(TestRuleIgnoreAfterMaxFailures.java:70)
[junit4:junit4]   2> 		at org.apache.lucene.util.TestRuleMarkFailure$1.evaluate(TestRuleMarkFailure.java:48)
[junit4:junit4]   2> 		at com.carrotsearch.randomizedtesting.rules.StatementAdapter.evaluate(StatementAdapter.java:36)
[junit4:junit4]   2> 		at com.carrotsearch.randomizedtesting.ThreadLeakControl$StatementRunner.run(ThreadLeakControl.java:358)
[junit4:junit4]   2> 		at com.carrotsearch.randomizedtesting.ThreadLeakControl.forkTimeoutingTask(ThreadLeakControl.java:782)
[junit4:junit4]   2> 		at com.carrotsearch.randomizedtesting.ThreadLeakControl$3.evaluate(ThreadLeakControl.java:442)
[junit4:junit4]   2> 		at com.carrotsearch.randomizedtesting.RandomizedRunner.runSingleTest(RandomizedRunner.java:746)
[junit4:junit4]   2> 		at com.carrotsearch.randomizedtesting.RandomizedRunner$3.evaluate(RandomizedRunner.java:648)
[junit4:junit4]   2> 		at com.carrotsearch.randomizedtesting.RandomizedRunner$4.evaluate(RandomizedRunner.java:682)
[junit4:junit4]   2> 		at com.carrotsearch.randomizedtesting.RandomizedRunner$5.evaluate(RandomizedRunner.java:693)
[junit4:junit4]   2> 		at com.carrotsearch.randomizedtesting.rules.StatementAdapter.evaluate(StatementAdapter.java:36)
[junit4:junit4]   2> 		at com.carrotsearch.randomizedtesting.rules.SystemPropertiesRestoreRule$1.evaluate(SystemPropertiesRestoreRule.java:53)
[junit4:junit4]   2> 		at org.apache.lucene.util.AbstractBeforeAfterRule$1.evaluate(AbstractBeforeAfterRule.java:45)
[junit4:junit4]   2> 		at org.apache.lucene.util.TestRuleStoreClassName$1.evaluate(TestRuleStoreClassName.java:42)
[junit4:junit4]   2> 		at com.carrotsearch.randomizedtesting.rules.SystemPropertiesInvariantRule$1.evaluate(SystemPropertiesInvariantRule.java:55)
[junit4:junit4]   2> 		at com.carrotsearch.randomizedtesting.rules.NoShadowingOrOverridesOnMethodsRule$1.evaluate(NoShadowingOrOverridesOnMethodsRule.java:39)
[junit4:junit4]   2> 		at com.carrotsearch.randomizedtesting.rules.NoShadowingOrOverridesOnMethodsRule$1.evaluate(NoShadowingOrOverridesOnMethodsRule.java:39)
[junit4:junit4]   2> 		at com.carrotsearch.randomizedtesting.rules.StatementAdapter.evaluate(StatementAdapter.java:36)
[junit4:junit4]   2> 		at org.apache.lucene.util.TestRuleAssertionsRequired$1.evaluate(TestRuleAssertionsRequired.java:43)
[junit4:junit4]   2> 		at org.apache.lucene.util.TestRuleMarkFailure$1.evaluate(TestRuleMarkFailure.java:48)
[junit4:junit4]   2> 		at org.apache.lucene.util.TestRuleIgnoreAfterMaxFailures$1.evaluate(TestRuleIgnoreAfterMaxFailures.java:70)
[junit4:junit4]   2> 		at org.apache.lucene.util.TestRuleIgnoreTestSuites$1.evaluate(TestRuleIgnoreTestSuites.java:55)
[junit4:junit4]   2> 		at com.carrotsearch.randomizedtesting.rules.StatementAdapter.evaluate(StatementAdapter.java:36)
[junit4:junit4]   2> 		at com.carrotsearch.randomizedtesting.ThreadLeakControl$StatementRunner.run(ThreadLeakControl.java:358)
[junit4:junit4]   2> 		at java.lang.Thread.run(Thread.java:662)
[junit4:junit4]   2> 	
[junit4:junit4]   2> 416 T2075 C139 REQ [collection1] webapp=null path=null params={q=ac&spellcheck.count=2&qt=/suggest_wfst&spellcheck.onlyMorePopular=true} status=500 QTime=2 
[junit4:junit4]   2> 416 T2075 oasc.SolrException.log SEVERE REQUEST FAILED: q=ac&spellcheck.count=2&qt=/suggest_wfst&spellcheck.onlyMorePopular=true:java.lang.NullPointerException
[junit4:junit4]   2> 		at org.apache.lucene.search.suggest.fst.WFSTCompletionLookup.lookupPrefix(WFSTCompletionLookup.java:193)
[junit4:junit4]   2> 		at org.apache.lucene.search.suggest.fst.WFSTCompletionLookup.lookup(WFSTCompletionLookup.java:153)
[junit4:junit4]   2> 		at org.apache.solr.spelling.suggest.Suggester.getSuggestions(Suggester.java:190)
[junit4:junit4]   2> 		at org.apache.solr.handler.component.SpellCheckComponent.process(SpellCheckComponent.java:172)
[junit4:junit4]   2> 		at org.apache.solr.handler.component.SearchHandler.handleRequestBody(SearchHandler.java:206)
[junit4:junit4]   2> 		at org.apache.solr.handler.RequestHandlerBase.handleRequest(RequestHandlerBase.java:129)
[junit4:junit4]   2> 		at org.apache.solr.core.SolrCore.execute(SolrCore.java:1750)
[junit4:junit4]   2> 		at org.apache.solr.util.TestHarness.query(TestHarness.java:364)
[junit4:junit4]   2> 		at org.apache.solr.util.TestHarness.query(TestHarness.java:346)
[junit4:junit4]   2> 		at org.apache.solr.SolrTestCaseJ4.assertQ(SolrTestCaseJ4.java:486)
[junit4:junit4]   2> 		at org.apache.solr.SolrTestCaseJ4.assertQ(SolrTestCaseJ4.java:479)
[junit4:junit4]   2> 		at org.apache.solr.spelling.suggest.SuggesterTest.testSuggestions(SuggesterTest.java:71)
[junit4:junit4]   2> 		at sun.reflect.NativeMethodAccessorImpl.invoke0(Native Method)
[junit4:junit4]   2> 		at sun.reflect.NativeMethodAccessorImpl.invoke(NativeMethodAccessorImpl.java:39)
[junit4:junit4]   2> 		at sun.reflect.DelegatingMethodAccessorImpl.invoke(DelegatingMethodAccessorImpl.java:25)
[junit4:junit4]   2> 		at java.lang.reflect.Method.invoke(Method.java:597)
[junit4:junit4]   2> 		at com.carrotsearch.randomizedtesting.RandomizedRunner.invoke(RandomizedRunner.java:1559)
[junit4:junit4]   2> 		at com.carrotsearch.randomizedtesting.RandomizedRunner.access$600(RandomizedRunner.java:79)
[junit4:junit4]   2> 		at com.carrotsearch.randomizedtesting.RandomizedRunner$6.evaluate(RandomizedRunner.java:737)
[junit4:junit4]   2> 		at com.carrotsearch.randomizedtesting.RandomizedRunner$7.evaluate(RandomizedRunner.java:773)
[junit4:junit4]   2> 		at com.carrotsearch.randomizedtesting.RandomizedRunner$8.evaluate(RandomizedRunner.java:787)
[junit4:junit4]   2> 		at com.carrotsearch.randomizedtesting.rules.SystemPropertiesRestoreRule$1.evaluate(SystemPropertiesRestoreRule.java:53)
[junit4:junit4]   2> 		at org.apache.lucene.util.TestRuleSetupTeardownChained$1.evaluate(TestRuleSetupTeardownChained.java:50)
[junit4:junit4]   2> 		at org.apache.lucene.util.TestRuleFieldCacheSanity$1.evaluate(TestRuleFieldCacheSanity.java:51)
[junit4:junit4]   2> 		at org.apache.lucene.util.AbstractBeforeAfterRule$1.evaluate(AbstractBeforeAfterRule.java:45)
[junit4:junit4]   2> 		at com.carrotsearch.randomizedtesting.rules.SystemPropertiesInvariantRule$1.evaluate(SystemPropertiesInvariantRule.java:55)
[junit4:junit4]   2> 		at org.apache.lucene.util.TestRuleThreadAndTestName$1.evaluate(TestRuleThreadAndTestName.java:48)
[junit4:junit4]   2> 		at org.apache.lucene.util.TestRuleIgnoreAfterMaxFailures$1.evaluate(TestRuleIgnoreAfterMaxFailures.java:70)
[junit4:junit4]   2> 		at org.apache.lucene.util.TestRuleMarkFailure$1.evaluate(TestRuleMarkFailure.java:48)
[junit4:junit4]   2> 		at com.carrotsearch.randomizedtesting.rules.StatementAdapter.evaluate(StatementAdapter.java:36)
[junit4:junit4]   2> 		at com.carrotsearch.randomizedtesting.ThreadLeakControl$StatementRunner.run(ThreadLeakControl.java:358)
[junit4:junit4]   2> 		at com.carrotsearch.randomizedtesting.ThreadLeakControl.forkTimeoutingTask(ThreadLeakControl.java:782)
[junit4:junit4]   2> 		at com.carrotsearch.randomizedtesting.ThreadLeakControl$3.evaluate(ThreadLeakControl.java:442)
[junit4:junit4]   2> 		at com.carrotsearch.randomizedtesting.RandomizedRunner.runSingleTest(RandomizedRunner.java:746)
[junit4:junit4]   2> 		at com.carrotsearch.randomizedtesting.RandomizedRunner$3.evaluate(RandomizedRunner.java:648)
[junit4:junit4]   2> 		at com.carrotsearch.randomizedtesting.RandomizedRunner$4.evaluate(RandomizedRunner.java:682)
[junit4:junit4]   2> 		at com.carrotsearch.randomizedtesting.RandomizedRunner$5.evaluate(RandomizedRunner.java:693)
[junit4:junit4]   2> 		at com.carrotsearch.randomizedtesting.rules.StatementAdapter.evaluate(StatementAdapter.java:36)
[junit4:junit4]   2> 		at com.carrotsearch.randomizedtesting.rules.SystemPropertiesRestoreRule$1.evaluate(SystemPropertiesRestoreRule.java:53)
[junit4:junit4]   2> 		at org.apache.lucene.util.AbstractBeforeAfterRule$1.evaluate(AbstractBeforeAfterRule.java:45)
[junit4:junit4]   2> 		at org.apache.lucene.util.TestRuleStoreClassName$1.evaluate(TestRuleStoreClassName.java:42)
[junit4:junit4]   2> 		at com.carrotsearch.randomizedtesting.rules.SystemPropertiesInvariantRule$1.evaluate(SystemPropertiesInvariantRule.java:55)
[junit4:junit4]   2> 		at com.carrotsearch.randomizedtesting.rules.NoShadowingOrOverridesOnMethodsRule$1.evaluate(NoShadowingOrOverridesOnMethodsRule.java:39)
[junit4:junit4]   2> 		at com.carrotsearch.randomizedtesting.rules.NoShadowingOrOverridesOnMethodsRule$1.evaluate(NoShadowingOrOverridesOnMethodsRule.java:39)
[junit4:junit4]   2> 		at com.carrotsearch.randomizedtesting.rules.StatementAdapter.evaluate(StatementAdapter.java:36)
[junit4:junit4]   2> 		at org.apache.lucene.util.TestRuleAssertionsRequired$1.evaluate(TestRuleAssertionsRequired.java:43)
[junit4:junit4]   2> 		at org.apache.lucene.util.TestRuleMarkFailure$1.evaluate(TestRuleMarkFailure.java:48)
[junit4:junit4]   2> 		at org.apache.lucene.util.TestRuleIgnoreAfterMaxFailures$1.evaluate(TestRuleIgnoreAfterMaxFailures.java:70)
[junit4:junit4]   2> 		at org.apache.lucene.util.TestRuleIgnoreTestSuites$1.evaluate(TestRuleIgnoreTestSuites.java:55)
[junit4:junit4]   2> 		at com.carrotsearch.randomizedtesting.rules.StatementAdapter.evaluate(StatementAdapter.java:36)
[junit4:junit4]   2> 		at com.carrotsearch.randomizedtesting.ThreadLeakControl$StatementRunner.run(ThreadLeakControl.java:358)
[junit4:junit4]   2> 		at java.lang.Thread.run(Thread.java:662)
[junit4:junit4]   2> 	
[junit4:junit4]   2> 417 T2075 oas.SolrTestCaseJ4.tearDown ###Ending testSuggestions
[junit4:junit4]   2> NOTE: reproduce with: ant test  -Dtestcase=SuggesterWFSTTest -Dtests.method=testSuggestions -Dtests.seed=C2CAEB4B6FD73F78 -Dtests.slow=true -Dtests.locale=it_CH -Dtests.timezone=Asia/Qyzylorda -Dtests.file.encoding=ISO-8859-1
[junit4:junit4] ERROR   0.14s | SuggesterWFSTTest.testSuggestions <<<
[junit4:junit4]    > Throwable #1: java.lang.RuntimeException: Exception during query
[junit4:junit4]    > 	at __randomizedtesting.SeedInfo.seed([C2CAEB4B6FD73F78:6416D2BEA1E36886]:0)
[junit4:junit4]    > 	at org.apache.solr.SolrTestCaseJ4.assertQ(SolrTestCaseJ4.java:512)
[junit4:junit4]    > 	at org.apache.solr.SolrTestCaseJ4.assertQ(SolrTestCaseJ4.java:479)
[junit4:junit4]    > 	at org.apache.solr.spelling.suggest.SuggesterTest.testSuggestions(SuggesterTest.java:71)
[junit4:junit4]    > 	at sun.reflect.NativeMethodAccessorImpl.invoke0(Native Method)
[junit4:junit4]    > 	at sun.reflect.NativeMethodAccessorImpl.invoke(NativeMethodAccessorImpl.java:39)
[junit4:junit4]    > 	at sun.reflect.DelegatingMethodAccessorImpl.invoke(DelegatingMethodAccessorImpl.java:25)
[junit4:junit4]    > 	at java.lang.reflect.Method.invoke(Method.java:597)
[junit4:junit4]    > 	at com.carrotsearch.randomizedtesting.RandomizedRunner.invoke(RandomizedRunner.java:1559)
[junit4:junit4]    > 	at com.carrotsearch.randomizedtesting.RandomizedRunner.access$600(RandomizedRunner.java:79)
[junit4:junit4]    > 	at com.carrotsearch.randomizedtesting.RandomizedRunner$6.evaluate(RandomizedRunner.java:737)
[junit4:junit4]    > 	at com.carrotsearch.randomizedtesting.RandomizedRunner$7.evaluate(RandomizedRunner.java:773)
[junit4:junit4]    > 	at com.carrotsearch.randomizedtesting.RandomizedRunner$8.evaluate(RandomizedRunner.java:787)
[junit4:junit4]    > 	at com.carrotsearch.randomizedtesting.rules.SystemPropertiesRestoreRule$1.evaluate(SystemPropertiesRestoreRule.java:53)
[junit4:junit4]    > 	at org.apache.lucene.util.TestRuleSetupTeardownChained$1.evaluate(TestRuleSetupTeardownChained.java:50)
[junit4:junit4]    > 	at org.apache.lucene.util.TestRuleFieldCacheSanity$1.evaluate(TestRuleFieldCacheSanity.java:51)
[junit4:junit4]    > 	at org.apache.lucene.util.AbstractBeforeAfterRule$1.evaluate(AbstractBeforeAfterRule.java:45)
[junit4:junit4]    > 	at com.carrotsearch.randomizedtesting.rules.SystemPropertiesInvariantRule$1.evaluate(SystemPropertiesInvariantRule.java:55)
[junit4:junit4]    > 	at org.apache.lucene.util.TestRuleThreadAndTestName$1.evaluate(TestRuleThreadAndTestName.java:48)
[junit4:junit4]    > 	at org.apache.lucene.util.TestRuleIgnoreAfterMaxFailures$1.evaluate(TestRuleIgnoreAfterMaxFailures.java:70)
[junit4:junit4]    > 	at org.apache.lucene.util.TestRuleMarkFailure$1.evaluate(TestRuleMarkFailure.java:48)
[junit4:junit4]    > 	at com.carrotsearch.randomizedtesting.rules.StatementAdapter.evaluate(StatementAdapter.java:36)
[junit4:junit4]    > 	at com.carrotsearch.randomizedtesting.ThreadLeakControl$StatementRunner.run(ThreadLeakControl.java:358)
[junit4:junit4]    > 	at com.carrotsearch.randomizedtesting.ThreadLeakControl.forkTimeoutingTask(ThreadLeakControl.java:782)
[junit4:junit4]    > 	at com.carrotsearch.randomizedtesting.ThreadLeakControl$3.evaluate(ThreadLeakControl.java:442)
[junit4:junit4]    > 	at com.carrotsearch.randomizedtesting.RandomizedRunner.runSingleTest(RandomizedRunner.java:746)
[junit4:junit4]    > 	at com.carrotsearch.randomizedtesting.RandomizedRunner$3.evaluate(RandomizedRunner.java:648)
[junit4:junit4]    > 	at com.carrotsearch.randomizedtesting.RandomizedRunner$4.evaluate(RandomizedRunner.java:682)
[junit4:junit4]    > 	at com.carrotsearch.randomizedtesting.RandomizedRunner$5.evaluate(RandomizedRunner.java:693)
[junit4:junit4]    > 	at com.carrotsearch.randomizedtesting.rules.StatementAdapter.evaluate(StatementAdapter.java:36)
[junit4:junit4]    > 	at com.carrotsearch.randomizedtesting.rules.SystemPropertiesRestoreRule$1.evaluate(SystemPropertiesRestoreRule.java:53)
[junit4:junit4]    > 	at org.apache.lucene.util.AbstractBeforeAfterRule$1.evaluate(AbstractBeforeAfterRule.java:45)
[junit4:junit4]    > 	at org.apache.lucene.util.TestRuleStoreClassName$1.evaluate(TestRuleStoreClassName.java:42)
[junit4:junit4]    > 	at com.carrotsearch.randomizedtesting.rules.SystemPropertiesInvariantRule$1.evaluate(SystemPropertiesInvariantRule.java:55)
[junit4:junit4]    > 	at com.carrotsearch.randomizedtesting.rules.NoShadowingOrOverridesOnMethodsRule$1.evaluate(NoShadowingOrOverridesOnMethodsRule.java:39)
[junit4:junit4]    > 	at com.carrotsearch.randomizedtesting.rules.NoShadowingOrOverridesOnMethodsRule$1.evaluate(NoShadowingOrOverridesOnMethodsRule.java:39)
[junit4:junit4]    > 	at com.carrotsearch.randomizedtesting.rules.StatementAdapter.evaluate(StatementAdapter.java:36)
[junit4:junit4]    > 	at org.apache.lucene.util.TestRuleAssertionsRequired$1.evaluate(TestRuleAssertionsRequired.java:43)
[junit4:junit4]    > 	at org.apache.lucene.util.TestRuleMarkFailure$1.evaluate(TestRuleMarkFailure.java:48)
[junit4:junit4]    > 	at org.apache.lucene.util.TestRuleIgnoreAfterMaxFailures$1.evaluate(TestRuleIgnoreAfterMaxFailures.java:70)
[junit4:junit4]    > 	at org.apache.lucene.util.TestRuleIgnoreTestSuites$1.evaluate(TestRuleIgnoreTestSuites.java:55)
[junit4:junit4]    > 	at com.carrotsearch.randomizedtesting.rules.StatementAdapter.evaluate(StatementAdapter.java:36)
[junit4:junit4]    > 	at com.carrotsearch.randomizedtesting.ThreadLeakControl$StatementRunner.run(ThreadLeakControl.java:358)
[junit4:junit4]    > 	at java.lang.Thread.run(Thread.java:662)
[junit4:junit4]    > Caused by: java.lang.NullPointerException
[junit4:junit4]    > 	at org.apache.lucene.search.suggest.fst.WFSTCompletionLookup.lookupPrefix(WFSTCompletionLookup.java:193)
[junit4:junit4]    > 	at org.apache.lucene.search.suggest.fst.WFSTCompletionLookup.lookup(WFSTCompletionLookup.java:153)
[junit4:junit4]    > 	at org.apache.solr.spelling.suggest.Suggester.getSuggestions(Suggester.java:190)
[junit4:junit4]    > 	at org.apache.solr.handler.component.SpellCheckComponent.process(SpellCheckComponent.java:172)
[junit4:junit4]    > 	at org.apache.solr.handler.component.SearchHandler.handleRequestBody(SearchHandler.java:206)
[junit4:junit4]    > 	at org.apache.solr.handler.RequestHandlerBase.handleRequest(RequestHandlerBase.java:129)
[junit4:junit4]    > 	at org.apache.solr.core.SolrCore.execute(SolrCore.java:1750)
[junit4:junit4]    > 	at org.apache.solr.util.TestHarness.query(TestHarness.java:364)
[junit4:junit4]    > 	at org.apache.solr.util.TestHarness.query(TestHarness.java:346)
[junit4:junit4]    > 	at org.apache.solr.SolrTestCaseJ4.assertQ(SolrTestCaseJ4.java:486)
[junit4:junit4]    > 	... 42 more
[junit4:junit4]   2> 434 T2075 oas.SolrTestCaseJ4.setUp ###Starting testReload
[junit4:junit4]   2> 440 T2075 C139 UPDATE [collection1] webapp=null path=null params={} {add=[1]} 0 2
[junit4:junit4]   2> 452 T2075 C139 UPDATE [collection1] webapp=null path=null params={} {add=[2]} 0 1
[junit4:junit4]   2> 460 T2075 C139 UPDATE [collection1] webapp=null path=null params={} {add=[3]} 0 1
[junit4:junit4]   2> 466 T2075 C139 oasu.DirectUpdateHandler2.commit start commit{flags=0,_version_=0,optimize=false,openSearcher=true,waitSearcher=true,expungeDeletes=false,softCommit=false}
[junit4:junit4]   2> 483 T2075 C139 oasc.SolrDeletionPolicy.onCommit SolrDeletionPolicy.onCommit: commits:num=2
[junit4:junit4]   2> 		commit{dir=MockDirWrapper(org.apache.lucene.store.MMapDirectory@C:\Users\JenkinsSlave\workspace\Lucene-Solr-trunk-Windows\solr\build\solr-core\test\J0\solrtest-SuggesterWFSTTest-1350388447588\index lockFactory=org.apache.lucene.store.NativeFSLockFactory@1e2f526),segFN=segments_2,generation=2,filenames=[_0.fnm, _0.pos, _0.tim, _0_nrm.cfe, segments_2, _0.fdx, _0_nrm.cfs, _0.si, _0.doc, _0.tip, _0.fdt]
[junit4:junit4]   2> 		commit{dir=MockDirWrapper(org.apache.lucene.store.MMapDirectory@C:\Users\JenkinsSlave\workspace\Lucene-Solr-trunk-Windows\solr\build\solr-core\test\J0\solrtest-SuggesterWFSTTest-1350388447588\index lockFactory=org.apache.lucene.store.NativeFSLockFactory@1e2f526),segFN=segments_3,generation=3,filenames=[_1.doc, _1.fdx, _1_nrm.cfs, _1.fdt, _1.pos, _1.si, _1.tip, _1.fnm, _1.tim, segments_3, _1_nrm.cfe]
[junit4:junit4]   2> 484 T2075 C139 oasc.SolrDeletionPolicy.updateCommits newest commit = 3
[junit4:junit4]   2> 499 T2075 C139 oass.SolrIndexSearcher.<init> Opening Searcher@1e41df5 main
[junit4:junit4]   2> 500 T2075 C139 oass.SolrIndexSearcher.getIndexDir WARNING WARNING: Directory impl does not support setting indexDir: org.apache.lucene.store.MockDirectoryWrapper
[junit4:junit4]   2> 500 T2076 oashc.SpellCheckComponent$SpellCheckerListener.buildSpellIndex Building spell index for spell checker: suggest
[junit4:junit4]   2> 500 T2075 C139 oasu.DirectUpdateHandler2.commit end_commit_flush
[junit4:junit4]   2> 500 T2076 oasss.Suggester.build build()
[junit4:junit4]   2> 503 T2076 oasss.Suggester.build Stored suggest data to: C:\Users\JenkinsSlave\workspace\Lucene-Solr-trunk-Windows\solr\build\solr-core\test\J0\.\solrtest-SuggesterWFSTTest-1350388447588\suggest\jaspell.dat
[junit4:junit4]   2> 503 T2076 oashc.SpellCheckComponent$SpellCheckerListener.buildSpellIndex Building spell index for spell checker: suggest_tst
[junit4:junit4]   2> 503 T2076 oasss.Suggester.build build()
[junit4:junit4]   2> 516 T2076 oasss.Suggester.build Stored suggest data to: C:\Users\JenkinsSlave\workspace\Lucene-Solr-trunk-Windows\solr\build\solr-core\test\J0\.\solrtest-SuggesterWFSTTest-1350388447588\suggest_tst\tst.dat
[junit4:junit4]   2> 517 T2076 oashc.SpellCheckComponent$SpellCheckerListener.buildSpellIndex Building spell index for spell checker: suggest_fst
[junit4:junit4]   2> 517 T2076 oasss.Suggester.build build()
[junit4:junit4]   2> 548 T2076 oasss.Suggester.build Stored suggest data to: C:\Users\JenkinsSlave\workspace\Lucene-Solr-trunk-Windows\solr\build\solr-core\test\J0\.\solrtest-SuggesterWFSTTest-1350388447588\suggest_fst\fst.bin
[junit4:junit4]   2> 548 T2076 oashc.SpellCheckComponent$SpellCheckerListener.buildSpellIndex Building spell index for spell checker: suggest_wfst
[junit4:junit4]   2> 548 T2076 oasss.Suggester.build build()
[junit4:junit4]   2> 559 T2076 oasss.Suggester.build Stored suggest data to: C:\Users\JenkinsSlave\workspace\Lucene-Solr-trunk-Windows\solr\build\solr-core\test\J0\.\solrtest-SuggesterWFSTTest-1350388447588\suggest_wfst\wfst.bin
[junit4:junit4]   2> 559 T2076 oasc.SolrCore.registerSearcher [collection1] Registered new searcher Searcher@1e41df5 main{StandardDirectoryReader(segments_3:7 _1(5.0):C3)}
[junit4:junit4]   2> 563 T2075 C139 UPDATE [collection1] webapp=null path=null params={} {commit=} 0 97
[junit4:junit4]   2> 568 T2075 oas.SolrTestCaseJ4.deleteCore ###deleteCore
[junit4:junit4]   2> 568 T2075 oasc.CoreContainer.shutdown Shutting down CoreContainer instance=27285124
[junit4:junit4]   2> 568 T2075 oasc.SolrCore.close [collection1]  CLOSING SolrCore org.apache.solr.core.SolrCore@1324a88
[junit4:junit4]   2> 569 T2075 oasu.DirectUpdateHandler2.close closing DirectUpdateHandler2{commits=2,autocommits=0,soft autocommits=0,optimizes=0,rollbacks=0,expungeDeletes=0,docsPending=0,adds=0,deletesById=0,deletesByQuery=0,errors=0,cumulative_adds=6,cumulative_deletesById=0,cumulative_deletesByQuery=0,cumulative_errors=0}
[junit4:junit4]   2> 569 T2075 oasc.SolrCore.decrefSolrCoreState Closing SolrCoreState
[junit4:junit4]   2> 569 T2075 oasu.DefaultSolrCoreState.closeIndexWriter SolrCoreState ref count has reached 0 - closing IndexWriter
[junit4:junit4]   2> 569 T2075 oasu.DefaultSolrCoreState.closeIndexWriter closing IndexWriter with IndexWriterCloser
[junit4:junit4]   2> 585 T2075 oasc.SolrCore.closeSearcher [collection1] Closing main searcher on request.
[junit4:junit4]   2> NOTE: per solr.test.leavedatadir, dataDir will not be removed: C:\Users\JenkinsSlave\workspace\Lucene-Solr-trunk-Windows\solr\build\solr-core\test\J0\.\solrtest-SuggesterWFSTTest-1350388447588
[junit4:junit4]   2> 596 T2075 oas.SolrTestCaseJ4.initCore ####initCore
[junit4:junit4]   2> 597 T2075 oasc.SolrResourceLoader.<init> new SolrResourceLoader for directory: 'C:\Users\JenkinsSlave\workspace\Lucene-Solr-trunk-Windows\solr\build\solr-core\test-files\solr\collection1\'
[junit4:junit4]   2> 604 T2075 oasc.SolrResourceLoader.replaceClassLoader Adding 'file:/C:/Users/JenkinsSlave/workspace/Lucene-Solr-trunk-Windows/solr/build/solr-core/test-files/solr/collection1/lib/classes/' to classloader
[junit4:junit4]   2> 605 T2075 oasc.SolrResourceLoader.replaceClassLoader Adding 'file:/C:/Users/JenkinsSlave/workspace/Lucene-Solr-trunk-Windows/solr/build/solr-core/test-files/solr/collection1/lib/README' to classloader
[junit4:junit4]   2> 686 T2075 oasc.SolrConfig.<init> Using Lucene MatchVersion: LUCENE_50
[junit4:junit4]   2> 760 T2075 oasc.SolrConfig.<init> Loaded SolrConfig: solrconfig-spellchecker.xml
[junit4:junit4]   2> 760 T2075 oass.IndexSchema.readSchema Reading Solr Schema
[junit4:junit4]   2> 766 T2075 oass.IndexSchema.readSchema Schema name=test
[junit4:junit4]   2> 1562 T2075 oass.OpenExchangeRatesOrgProvider.init Initialized with rates=open-exchange-rates.json, refreshInterval=1440.
[junit4:junit4]   2> 1580 T2075 oass.IndexSchema.readSchema default search field in schema is text
[junit4:junit4]   2> 1585 T2075 oass.IndexSchema.readSchema unique key field: id
[junit4:junit4]   2> 1596 T2075 oass.FileExchangeRateProvider.reload Reloading exchange rates from file currency.xml
[junit4:junit4]   2> 1604 T2075 oass.FileExchangeRateProvider.reload Reloading exchange rates from file currency.xml
[junit4:junit4]   2> 1610 T2075 oass.OpenExchangeRatesOrgProvider.reload Reloading exchange rates from open-exchange-rates.json
[junit4:junit4]   2> 1611 T2075 oass.OpenExchangeRatesOrgProvider.reload Reloading exchange rates from open-exchange-rates.json
[junit4:junit4]   2> 1612 T2075 oasc.SolrResourceLoader.locateSolrHome JNDI not configured for solr (NoInitialContextEx)
[junit4:junit4]   2> 1613 T2075 oasc.SolrResourceLoader.locateSolrHome using system property solr.solr.home: C:\Users\JenkinsSlave\workspace\Lucene-Solr-trunk-Windows\solr\build\solr-core\test-files\solr
[junit4:junit4]   2> 1613 T2075 oasc.SolrResourceLoader.<init> new SolrResourceLoader for directory: 'C:\Users\JenkinsSlave\workspace\Lucene-Solr-trunk-Windows\solr\build\solr-core\test-files\solr\'
[junit4:junit4]   2> 1625 T2075 oasc.CoreContainer.<init> New CoreContainer 25222774
[junit4:junit4]   2> 1625 T2075 oasc.SolrCore.<init> [collection1] Opening new SolrCore at C:\Users\JenkinsSlave\workspace\Lucene-Solr-trunk-Windows\solr\build\solr-core\test-files\solr\collection1\, dataDir=C:\Users\JenkinsSlave\workspace\Lucene-Solr-trunk-Windows\solr\build\solr-core\test\J0\.\solrtest-SuggesterWFSTTest-1350388447588\
[junit4:junit4]   2> 1625 T2075 oasc.SolrCore.<init> JMX monitoring not detected for core: collection1
[junit4:junit4]   2> 1626 T2075 oasc.SolrCore.getNewIndexDir New index directory detected: old=null new=C:\Users\JenkinsSlave\workspace\Lucene-Solr-trunk-Windows\solr\build\solr-core\test\J0\.\solrtest-SuggesterWFSTTest-1350388447588\index/
[junit4:junit4]   2> 1631 T2075 oasc.RequestHandlers.initHandlersFromConfig created standard: solr.StandardRequestHandler
[junit4:junit4]   2> 1631 T2075 oasc.RequestHandlers.initHandlersFromConfig created /suggest: org.apache.solr.handler.component.SearchHandler
[junit4:junit4]   2> 1631 T2075 oasc.RequestHandlers.initHandlersFromConfig created /suggest_tst: org.apache.solr.handler.component.SearchHandler
[junit4:junit4]   2> 1631 T2075 oasc.RequestHandlers.initHandlersFromConfig created /suggest_fst: org.apache.solr.handler.component.SearchHandler
[junit4:junit4]   2> 1632 T2075 oasc.RequestHandlers.initHandlersFromConfig created /suggest_wfst: org.apache.solr.handler.component.SearchHandler
[junit4:junit4]   2> 1633 T2075 oasc.CachingDirectoryFactory.get return new directory for C:\Users\JenkinsSlave\workspace\Lucene-Solr-trunk-Windows\solr\build\solr-core\test\J0\.\solrtest-SuggesterWFSTTest-1350388447588\index forceNew:false
[junit4:junit4]   2> 1644 T2075 oass.SolrIndexSearcher.<init> Opening Searcher@3f1145 main
[junit4:junit4]   2> 1645 T2075 oass.SolrIndexSearcher.getIndexDir WARNING WARNING: Directory impl does not support setting indexDir: org.apache.lucene.store.MockDirectoryWrapper
[junit4:junit4]   2> 1646 T2075 oasu.CommitTracker.<init> Hard AutoCommit: disabled
[junit4:junit4]   2> 1646 T2075 oasu.CommitTracker.<init> Soft AutoCommit: disabled
[junit4:junit4]   2> 1646 T2075 oashc.SpellCheckComponent.inform Initializing spell checkers
[junit4:junit4]   2> 1647 T2075 oasss.Suggester.init init: {name=suggest,classname=org.apache.solr.spelling.suggest.Suggester,lookupImpl=org.apache.solr.spelling.suggest.jaspell.JaspellLookup,field=suggest,storeDir=suggest,buildOnCommit=true,threshold=0.0}
[junit4:junit4]   2> 1647 T2075 oasssj.JaspellLookupFactory.create init: {name=suggest,classname=org.apache.solr.spelling.suggest.Suggester,lookupImpl=org.apache.solr.spelling.suggest.jaspell.JaspellLookup,field=suggest,storeDir=suggest,buildOnCommit=true,threshold=0.0}
[junit4:junit4]   2> 1652 T2075 oashc.SpellCheckComponent.inform Registering newSearcher listener for spellchecker: suggest
[junit4:junit4]   2> 1653 T2075 oashc.SpellCheckComponent.inform No queryConverter defined, using default converter
[junit4:junit4]   2> 1654 T2075 oashc.SpellCheckComponent.inform Initializing spell checkers
[junit4:junit4]   2> 1654 T2075 oasss.Suggester.init init: {name=suggest_tst,classname=org.apache.solr.spelling.suggest.Suggester,lookupImpl=org.apache.solr.spelling.suggest.tst.TSTLookup,field=suggest,storeDir=suggest_tst,buildOnCommit=true,threshold=0.0}
[junit4:junit4]   2> 1659 T2075 oashc.SpellCheckComponent.inform Registering newSearcher listener for spellchecker: suggest_tst
[junit4:junit4]   2> 1659 T2075 oashc.SpellCheckComponent.inform No queryConverter defined, using default converter
[junit4:junit4]   2> 1659 T2075 oashc.SpellCheckComponent.inform Initializing spell checkers
[junit4:junit4]   2> 1660 T2075 oasss.Suggester.init init: {name=suggest_fst,classname=org.apache.solr.spelling.suggest.Suggester,lookupImpl=org.apache.solr.spelling.suggest.fst.FSTLookup,field=suggest,storeDir=suggest_fst,buildOnCommit=true,weightBuckets=5,exactMatchFirst=true}
[junit4:junit4]   2> 1663 T2075 oashc.SpellCheckComponent.inform Registering newSearcher listener for spellchecker: suggest_fst
[junit4:junit4]   2> 1664 T2075 oashc.SpellCheckComponent.inform No queryConverter defined, using default converter
[junit4:junit4]   2> 1664 T2075 oashc.SpellCheckComponent.inform Initializing spell checkers
[junit4:junit4]   2> 1665 T2075 oasss.Suggester.init init: {name=suggest_wfst,classname=org.apache.solr.spelling.suggest.Suggester,lookupImpl=org.apache.solr.spelling.suggest.fst.WFSTLookupFactory,field=suggest,storeDir=suggest_wfst,buildOnCommit=true,exactMatchFirst=true}
[junit4:junit4]   2> 1668 T2075 oashc.SpellCheckComponent.inform Registering newSearcher listener for spellchecker: suggest_wfst
[junit4:junit4]   2> 1669 T2075 oashc.SpellCheckComponent.inform No queryConverter defined, using default converter
[junit4:junit4]   2> 1670 T2075 oashc.HttpShardHandlerFactory.getParameter Setting socketTimeout to: 0
[junit4:junit4]   2> 1670 T2075 oashc.HttpShardHandlerFactory.getParameter Setting urlScheme to: http://
[junit4:junit4]   2> 1670 T2075 oashc.HttpShardHandlerFactory.getParameter Setting connTimeout to: 0
[junit4:junit4]   2> 1670 T2075 oashc.HttpShardHandlerFactory.getParameter Setting maxConnectionsPerHost to: 20
[junit4:junit4]   2> 1671 T2075 oashc.HttpShardHandlerFactory.getParameter Setting corePoolSize to: 0
[junit4:junit4]   2> 1672 T2075 oashc.HttpShardHandlerFactory.getParameter Setting maximumPoolSize to: 2147483647
[junit4:junit4]   2> 1672 T2075 oashc.HttpShardHandlerFactory.getParameter Setting maxThreadIdleTime to: 5
[junit4:junit4]   2> 1673 T2075 oashc.HttpShardHandlerFactory.getParameter Setting sizeOfQueue to: -1
[junit4:junit4]   2> 1673 T2075 oashc.HttpShardHandlerFactory.getParameter Setting fairnessPolicy to: false
[junit4:junit4]   2> 1673 T2075 oascsi.HttpClientUtil.createClient Creating new http client, config:maxConnectionsPerHost=20&maxConnections=10000&socketTimeout=0&connTimeout=0&retry=false
[junit4:junit4]   2> 1686 T2077 oasc.SolrCore.registerSearcher [collection1] Registered new searcher Searcher@3f1145 main{StandardDirectoryReader(segments_3:7 _1(5.0):C3)}
[junit4:junit4]   2> 1686 T2075 oasc.CoreContainer.register registering core: collection1
[junit4:junit4]   2> 1693 T2075 oas.SolrTestCaseJ4.initCore ####initCore end
[junit4:junit4]   2> ASYNC  NEW_CORE C140 name=collection1 org.apache.solr.core.SolrCore@1df7f17
[junit4:junit4]   2> 1705 T2075 C140 REQ [collection1] webapp=null path=null params={q=ac&spellcheck.count=2&qt=/suggest_wfst&spellcheck.onlyMorePopular=true} status=0 QTime=11 
[junit4:junit4]   2> 1713 T2075 oas.SolrTestCaseJ4.tearDown ###Ending testReload
[junit4:junit4]   2> 1717 T2075 oas.SolrTestCaseJ4.setUp ###Starting testAnalyzer
[junit4:junit4]   2> 1717 T2075 oasss.Suggester.init init: {lookupImpl=org.apache.solr.spelling.suggest.tst.TSTLookupFactory}
[junit4:junit4]   2> 1718 T2075 oas.SolrTestCaseJ4.tearDown ###Ending testAnalyzer
[junit4:junit4]   2> 1721 T2075 oas.SolrTestCaseJ4.setUp ###Starting testRebuild
[junit4:junit4]   2> 1731 T2075 C140 oasc.SolrDeletionPolicy.onInit SolrDeletionPolicy.onInit: commits:num=1
[junit4:junit4]   2> 		commit{dir=MockDirWrapper(org.apache.lucene.store.SimpleFSDirectory@C:\Users\JenkinsSlave\workspace\Lucene-Solr-trunk-Windows\solr\build\solr-core\test\J0\solrtest-SuggesterWFSTTest-1350388447588\index lockFactory=org.apache.lucene.store.NativeFSLockFactory@662d2e),segFN=segments_3,generation=3,filenames=[_1.doc, _1_nrm.cfs, _1.fdx, _1.pos, _1.fdt, _1.si, _1.fnm, _1.tip, _1.tim, segments_3, _1_nrm.cfe]
[junit4:junit4]   2> 1731 T2075 C140 oasc.SolrDeletionPolicy.updateCommits newest commit = 3
[junit4:junit4]   2> 1734 T2075 C140 UPDATE [collection1] webapp=null path=null params={} {add=[1]} 0 9
[junit4:junit4]   2> 1740 T2075 C140 UPDATE [collection1] webapp=null path=null params={} {add=[2]} 0 0
[junit4:junit4]   2> 1748 T2075 C140 UPDATE [collection1] webapp=null path=null params={} {add=[3]} 0 0
[junit4:junit4]   2> 1760 T2075 C140 oasu.DirectUpdateHandler2.commit start commit{flags=0,_version_=0,optimize=false,openSearcher=true,waitSearcher=true,expungeDeletes=false,softCommit=false}
[junit4:junit4]   2> 1784 T2075 C140 oasc.SolrDeletionPolicy.onCommit SolrDeletionPolicy.onCommit: commits:num=2
[junit4:junit4]   2> 		commit{dir=MockDirWrapper(org.apache.lucene.store.SimpleFSDirectory@C:\Users\JenkinsSlave\workspace\Lucene-Solr-trunk-Windows\solr\build\solr-core\test\J0\solrtest-SuggesterWFSTTest-1350388447588\index lockFactory=org.apache.lucene.store.NativeFSLockFactory@662d2e),segFN=segments_3,generation=3,filenames=[_1.doc, _1_nrm.cfs, _1.fdx, _1.pos, _1.fdt, _1.si, _1.fnm, _1.tip, _1.tim, segments_3, _1_nrm.cfe]
[junit4:junit4]   2> 		commit{dir=MockDirWrapper(org.apache.lucene.store.SimpleFSDirectory@C:\Users\JenkinsSlave\workspace\Lucene-Solr-trunk-Windows\solr\build\solr-core\test\J0\solrtest-SuggesterWFSTTest-1350388447588\index lockFactory=org.apache.lucene.store.NativeFSLockFactory@662d2e),segFN=segments_4,generation=4,filenames=[_1.doc, _2.pos, _2.si, _1_nrm.cfs, _2.fdt, _2.fdx, _1.fnm, _2.doc, _2.tim, _2.fnm, _1_nrm.cfe, _2.tip, _1.fdx, _2_nrm.cfe, _1.fdt, _1.pos, _1.si, _2_nrm.cfs, _1.tip, _1.tim, segments_4]
[junit4:junit4]   2> 1784 T2075 C140 oasc.SolrDeletionPolicy.updateCommits newest commit = 4
[junit4:junit4]   2> 1800 T2075 C140 oass.SolrIndexSearcher.<init> Opening Searcher@d96b4b main
[junit4:junit4]   2> 1801 T2075 C140 oass.SolrIndexSearcher.getIndexDir WARNING WARNING: Directory impl does not support setting indexDir: org.apache.lucene.store.MockDirectoryWrapper
[junit4:junit4]   2> 1802 T2077 oashc.SpellCheckComponent$SpellCheckerListener.buildSpellIndex Building spell index for spell checker: suggest
[junit4:junit4]   2> 1802 T2075 C140 oasu.DirectUpdateHandler2.commit end_commit_flush
[junit4:junit4]   2> 1802 T2077 oasss.Suggester.build build()
[junit4:junit4]   2> 1805 T2077 oasss.Suggester.build Stored suggest data to: C:\Users\JenkinsSlave\workspace\Lucene-Solr-trunk-Windows\solr\build\solr-core\test\J0\.\solrtest-SuggesterWFSTTest-1350388447588\suggest\jaspell.dat
[junit4:junit4]   2> 1805 T2077 oashc.SpellCheckComponent$SpellCheckerListener.buildSpellIndex Building spell index for spell checker: suggest_tst
[junit4:junit4]   2> 1806 T2077 oasss.Suggester.build build()
[junit4:junit4]   2> 1820 T2077 oasss.Suggester.build Stored suggest data to: C:\Users\JenkinsSlave\workspace\Lucene-Solr-trunk-Windows\solr\build\solr-core\test\J0\.\solrtest-SuggesterWFSTTest-1350388447588\suggest_tst\tst.dat
[junit4:junit4]   2> 1820 T2077 oashc.SpellCheckComponent$SpellCheckerListener.buildSpellIndex Building spell index for spell checker: suggest_fst
[junit4:junit4]   2> 1820 T2077 oasss.Suggester.build build()
[junit4:junit4]   2> 1841 T2077 oasss.Suggester.build Stored suggest data to: C:\Users\JenkinsSlave\workspace\Lucene-Solr-trunk-Windows\solr\build\solr-core\test\J0\.\solrtest-SuggesterWFSTTest-1350388447588\suggest_fst\fst.bin
[junit4:junit4]   2> 1841 T2077 oashc.SpellCheckComponent$SpellCheckerListener.buildSpellIndex Building spell index for spell checker: suggest_wfst
[junit4:junit4]   2> 1841 T2077 oasss.Suggester.build build()
[junit4:junit4]   2> 1853 T2077 oasss.Suggester.build Stored suggest data to: C:\Users\JenkinsSlave\workspace\Lucene-Solr-trunk-Windows\solr\build\solr-core\test\J0\.\solrtest-SuggesterWFSTTest-1350388447588\suggest_wfst\wfst.bin
[junit4:junit4]   2> 1853 T2077 oasc.SolrCore.registerSearcher [collection1] Registered new searcher Searcher@d96b4b main{StandardDirectoryReader(segments_4:9 _1(5.0):C3 _2(5.0):C3)}
[junit4:junit4]   2> 1854 T2075 C140 UPDATE [collection1] webapp=null path=null params={} {commit=} 0 94
[junit4:junit4]   2> 1859 T2075 C140 REQ [collection1] webapp=null path=null params={q=ac&spellcheck.count=2&qt=/suggest_wfst&spellcheck.onlyMorePopular=true} status=0 QTime=0 
[junit4:junit4]   2> 1869 T2075 C140 UPDATE [collection1] webapp=null path=null params={} {add=[4]} 0 3
[junit4:junit4]   2> 1876 T2075 C140 oasu.DirectUpdateHandler2.commit start commit{flags=0,_version_=0,optimize=false,openSearcher=true,waitSearcher=true,expungeDeletes=false,softCommit=false}
[junit4:junit4]   2> 1897 T2075 C140 oasc.SolrDeletionPolicy.onCommit SolrDeletionPolicy.onCommit: commits:num=2
[junit4:junit4]   2> 		commit{dir=MockDirWrapper(org.apache.lucene.store.SimpleFSDirectory@C:\Users\JenkinsSlave\workspace\Lucene-Solr-trunk-Windows\solr\build\solr-core\test\J0\solrtest-SuggesterWFSTTest-1350388447588\index lockFactory=org.apache.lucene.store.NativeFSLockFactory@662d2e),segFN=segments_4,generation=4,filenames=[_1.doc, _2.pos, _2.si, _1_nrm.cfs, _2.fdt, _2.fdx, _1.fnm, _2.doc, _2.tim, _2.fnm, _1_nrm.cfe, _2.tip, _1.fdx, _2_nrm.cfe, _1.fdt, _1.pos, _1.si, _2_nrm.cfs, _1.tip, _1.tim, segments_4]
[junit4:junit4]   2> 		commit{dir=MockDirWrapper(org.apache.lucene.store.SimpleFSDirectory@C:\Users\JenkinsSlave\workspace\Lucene-Solr-trunk-Windows\solr\build\solr-core\test\J0\solrtest-SuggesterWFSTTest-1350388447588\index lockFactory=org.apache.lucene.store.NativeFSLockFactory@662d2e),segFN=segments_5,generation=5,filenames=[_2.si, _2.pos, _1.doc, _3_nrm.cfe, _3.tim, _3.fdt, _3.pos, _3.fnm, _1.fnm, _2.doc, _2.tim, _2_nrm.cfe, _1.pos, _2_nrm.cfs, _1.tip, _1.tim, _1_nrm.cfs, _3.doc, _2.fdt, _2.fdx, _1_nrm.cfe, _2.fnm, _3.fdx, _1.fdx, _2.tip, _3_nrm.cfs, _1.fdt, _1.si, _3.si, _3.tip, segments_5]
[junit4:junit4]   2> 1898 T2075 C140 oasc.SolrDeletionPolicy.updateCommits newest commit = 5
[junit4:junit4]   2> 1910 T2075 C140 oass.SolrIndexSearcher.<init> Opening Searcher@c6d615 main
[junit4:junit4]   2> 1911 T2075 C140 oass.SolrIndexSearcher.getIndexDir WARNING WARNING: Directory impl does not support setting indexDir: org.apache.lucene.store.MockDirectoryWrapper
[junit4:junit4]   2> 1912 T2077 oashc.SpellCheckComponent$SpellCheckerListener.buildSpellIndex Building spell index for spell checker: suggest
[junit4:junit4]   2> 1911 T2075 C140 oasu.DirectUpdateHandler2.commit end_commit_flush
[junit4:junit4]   2> 1912 T2077 oasss.Suggester.build build()
[junit4:junit4]   2> 1918 T2077 oasss.Suggester.build Stored suggest data to: C:\Users\JenkinsSlave\workspace\Lucene-Solr-trunk-Windows\solr\build\solr-core\test\J0\.\solrtest-SuggesterWFSTTest-1350388447588\suggest\jaspell.dat
[junit4:junit4]   2> 1918 T2077 oashc.SpellCheckComponent$SpellCheckerListener.buildSpellIndex Building spell index for spell checker: suggest_tst
[junit4:junit4]   2> 1918 T2077 oasss.Suggester.build build()
[junit4:junit4]   2> 1932 T2077 oasss.Suggester.build Stored suggest data to: C:\Users\JenkinsSlave\workspace\Lucene-Solr-trunk-Windows\solr\build\solr-core\test\J0\.\solrtest-SuggesterWFSTTest-1350388447588\suggest_tst\tst.dat
[junit4:junit4]   2> 1932 T2077 oashc.SpellCheckComponent$SpellCheckerListener.buildSpellIndex Building spell index for spell checker: suggest_fst
[junit4:junit4]   2> 1933 T2077 oasss.Suggester.build build()
[junit4:junit4]   2> 1961 T2077 oasss.Suggester.build Stored suggest data to: C:\Users\JenkinsSlave\workspace\Lucene-Solr-trunk-Windows\solr\build\solr-core\test\J0\.\solrtest-SuggesterWFSTTest-1350388447588\suggest_fst\fst.bin
[junit4:junit4]   2> 1961 T2077 oashc.SpellCheckComponent$SpellCheckerListener.buildSpellIndex Building spell index for spell checker: suggest_wfst
[junit4:junit4]   2> 1961 T2077 oasss.Suggester.build build()
[junit4:junit4]   2> 1972 T2077 oasss.Suggester.build Stored suggest data to: C:\Users\JenkinsSlave\workspace\Lucene-Solr-trunk-Windows\solr\build\solr-core\test\J0\.\solrtest-SuggesterWFSTTest-1350388447588\suggest_wfst\wfst.bin
[junit4:junit4]   2> 1973 T2077 oasc.SolrCore.registerSearcher [collection1] Registered new searcher Searcher@c6d615 main{StandardDirectoryReader(segments_5:11 _1(5.0):C3 _2(5.0):C3 _3(5.0):C1)}
[junit4:junit4]   2> 1974 T2075 C140 UPDATE [collection1] webapp=null path=null params={} {commit=} 0 98
[junit4:junit4]   2> 1979 T2075 C140 REQ [collection1] webapp=null path=null params={q=ac&spellcheck.count=2&qt=/suggest_wfst&spellcheck.onlyMorePopular=true} status=0 QTime=0 
[junit4:junit4]   2> 1982 T2075 oas.SolrTestCaseJ4.tearDown ###Ending testRebuild
[junit4:junit4]   2> 1982 T2075 oas.SolrTestCaseJ4.deleteCore ###deleteCore
[junit4:junit4]   2> 1983 T2075 oasc.CoreContainer.shutdown Shutting down CoreContainer instance=25222774
[junit4:junit4]   2> 1983 T2075 oasc.SolrCore.close [collection1]  CLOSING SolrCore org.apache.solr.core.SolrCore@1df7f17
[junit4:junit4]   2> 1983 T2075 oasu.DirectUpdateHandler2.close closing DirectUpdateHandler2{commits=2,autocommits=0,soft autocommits=0,optimizes=0,rollbacks=0,expungeDeletes=0,docsPending=0,adds=0,deletesById=0,deletesByQuery=0,errors=0,cumulative_adds=4,cumulative_deletesById=0,cumulative_deletesByQuery=0,cumulative_errors=0}
[junit4:junit4]   2> 1984 T2075 oasc.SolrCore.decrefSolrCoreState Closing SolrCoreState
[junit4:junit4]   2> 1984 T2075 oasu.DefaultSolrCoreState.closeIndexWriter SolrCoreState ref count has reached 0 - closing IndexWriter
[junit4:junit4]   2> 1984 T2075 oasu.DefaultSolrCoreState.closeIndexWriter closing IndexWriter with IndexWriterCloser
[junit4:junit4]   2> 1987 T2075 oasc.SolrCore.closeSearcher [collection1] Closing main searcher on request.
[junit4:junit4]   2> NOTE: test params are: codec=Asserting, sim=DefaultSimilarity, locale=it_CH, timezone=Asia/Qyzylorda
[junit4:junit4]   2> NOTE: Windows 7 6.1 x86/Sun Microsystems Inc. 1.6.0_35 (32-bit)/cpus=2,threads=1,free=86006312,total=145899520
[junit4:junit4]   2> NOTE: All tests run in this JVM: [PrimitiveFieldTypeTest, TestCSVLoader, PingRequestHandlerTest, EchoParamsTest, XsltUpdateRequestHandlerTest, TestXIncludeConfig, TestSolrCoreProperties, TestFastOutputStream, PluginInfoTest, TimeZoneUtilsTest, SolrInfoMBeanTest, HighlighterTest, NoCacheHeaderTest, IndexBasedSpellCheckerTest, OutputWriterTest, TestLFUCache, FileBasedSpellCheckerTest, NotRequiredUniqueKeyTest, TestHashPartitioner, HighlighterConfigTest, BadComponentTest, SolrRequestParserTest, ScriptEngineTest, TestSolr4Spatial, TestBadConfig, TestConfig, ClusterStateTest, ZkCLITest, StatelessScriptUpdateProcessorFactoryTest, TestRealTimeGet, TestFunctionQuery, ClusterStateUpdateTest, TestNumberUtils, TestPluginEnable, SpellingQueryConverterTest, TestQueryUtils, DocumentBuilderTest, TestSolrXMLSerializer, QueryParsingTest, LeaderElectionTest, TestDocumentBuilder, DirectSolrConnectionTest, TestBinaryField, TestSystemIdResolver, LoggingHandlerTest, TestPropInjectDefaults, TestReplicationHandler, DateFieldTest, SolrIndexConfigTest, TermsComponentTest, RAMDirectoryFactoryTest, DirectSolrSpellCheckerTest, QueryEqualityTest, SOLR749Test, TestReload, TestCollationField, TestPropInject, BasicFunctionalityTest, TestRandomFaceting, RecoveryZkTest, PolyFieldTest, DistanceFunctionTest, ZkNodePropsTest, SolrCoreCheckLockOnStartupTest, TestSolrDeletionPolicy1, BasicDistributedZkTest, SpellPossibilityIteratorTest, IndexSchemaTest, TestSolrDeletionPolicy2, QueryElevationComponentTest, TestQuerySenderListener, TestFiltering, TestStressRecovery, MultiTermTest, TestElisionMultitermQuery, BinaryUpdateRequestHandlerTest, TestDistributedSearch, ShowFileRequestHandlerTest, SpellCheckCollatorTest, SuggesterFSTTest, RequiredFieldsTest, TestPerFieldSimilarity, TestQueryTypes, RequestHandlersTest, TestCharFilters, LegacyHTMLStripCharFilterTest, OverseerTest, BasicZkTest, TestLMJelinekMercerSimilarityFactory, TestWriterPerf, TestSolrJ, TestUtils, SyncSliceTest, TermVectorComponentTest, TestCSVResponseWriter, SuggesterTSTTest, PreAnalyzedFieldTest, SpatialFilterTest, CSVRequestHandlerTest, TestIndexingPerformance, SolrCoreTest, BadIndexSchemaTest, AlternateDirectoryTest, TestStressReorder, ResponseLogComponentTest, TestSearchPerf, DocumentAnalysisRequestHandlerTest, SpellCheckComponentTest, PathHierarchyTokenizerFactoryTest, SuggesterWFSTTest]
[junit4:junit4] Completed in 2.09s, 4 tests, 1 error <<< FAILURES!

[...truncated 366 lines...]
BUILD FAILED
C:\Users\JenkinsSlave\workspace\Lucene-Solr-trunk-Windows\build.xml:38: The following error occurred while executing this line:
C:\Users\JenkinsSlave\workspace\Lucene-Solr-trunk-Windows\solr\build.xml:178: The following error occurred while executing this line:
C:\Users\JenkinsSlave\workspace\Lucene-Solr-trunk-Windows\lucene\module-build.xml:61: The following error occurred while executing this line:
C:\Users\JenkinsSlave\workspace\Lucene-Solr-trunk-Windows\lucene\common-build.xml:1143: The following error occurred while executing this line:
C:\Users\JenkinsSlave\workspace\Lucene-Solr-trunk-Windows\lucene\common-build.xml:816: There were test failures: 231 suites, 957 tests, 1 error, 12 ignored (7 assumptions)

Total time: 41 minutes 47 seconds
Build step 'Invoke Ant' marked build as failure
Archiving artifacts
Recording test results
Description set: Java: 32bit/jdk1.6.0_35 -server -XX:+UseConcMarkSweepGC
Email was triggered for: Failure
Sending email for trigger: Failure



Mime
View raw message