lucene-dev mailing list archives

Site index · List index
Message view « Date » · « Thread »
Top « Date » · « Thread »
From Charlie Cron <hudsonsevilt...@gmail.com>
Subject Build failed in Jenkins: fast-io-beasting #6320
Date Tue, 30 Oct 2012 06:22:00 GMT
See <http://sierranevada.servebeer.com/job/fast-io-beasting/6320/>

------------------------------------------
[...truncated 13938 lines...]
[junit4:junit4]   2> 436624 T44 oaz.ClientCnxn$SendThread.run Unable to read additional
data from server sessionid 0x13ab04eb3e50003, likely server has closed socket, closing socket
connection and attempting reconnect
[junit4:junit4]   2> 436624 T10 oazs.NIOServerCnxn.closeSock Closed socket connection for
client /127.0.0.1:56456 which had sessionid 0x13ab04eb3e50005
[junit4:junit4]   2> 436625 T68 oaz.ClientCnxn$SendThread.run Unable to read additional
data from server sessionid 0x13ab04eb3e50005, likely server has closed socket, closing socket
connection and attempting reconnect
[junit4:junit4]   2> 436625 T10 oazs.NIOServerCnxn.closeSock Closed socket connection for
client /127.0.0.1:55890 which had sessionid 0x13ab04eb3e50002
[junit4:junit4]   2> 436626 T30 oaz.ClientCnxn$SendThread.run Unable to read additional
data from server sessionid 0x13ab04eb3e50002, likely server has closed socket, closing socket
connection and attempting reconnect
[junit4:junit4]   2> 436626 T10 oazs.NIOServerCnxn.closeSock Closed socket connection for
client /127.0.0.1:56452 which had sessionid 0x13ab04eb3e50004
[junit4:junit4]   2> 436626 T56 oaz.ClientCnxn$SendThread.run Unable to read additional
data from server sessionid 0x13ab04eb3e50004, likely server has closed socket, closing socket
connection and attempting reconnect
[junit4:junit4]   2> 436627 T10 oazs.NIOServerCnxn.closeSock Closed socket connection for
client /127.0.0.1:56722 which had sessionid 0x13ab04eb3e50006
[junit4:junit4]   2> 436627 T81 oaz.ClientCnxn$SendThread.run Unable to read additional
data from server sessionid 0x13ab04eb3e50006, likely server has closed socket, closing socket
connection and attempting reconnect
[junit4:junit4]   2> 436627 T12 oazs.NIOServerCnxn$Factory.run NIOServerCnxn factory exited
run method
[junit4:junit4]   2> 436628 T10 oazs.FinalRequestProcessor.shutdown shutdown of request
processor complete
[junit4:junit4]   2> 436629 T10 oasc.ChaosMonkey.monkeyLog monkey: stop shard! 55886
[junit4:junit4]   2> 436629 T10 oasc.CoreContainer.shutdown Shutting down CoreContainer
instance=805562662
[junit4:junit4]   2> 436630 T10 oasc.SolrCore.close [collection1]  CLOSING SolrCore org.apache.solr.core.SolrCore@11396ef7
[junit4:junit4]   2> 436638 T13 oazs.SessionTrackerImpl.run SessionTrackerImpl exited loop!
[junit4:junit4]   2> 436644 T10 oasu.DirectUpdateHandler2.close closing DirectUpdateHandler2{commits=0,autocommits=0,soft
autocommits=0,optimizes=0,rollbacks=0,expungeDeletes=0,docsPending=0,adds=0,deletesById=0,deletesByQuery=0,errors=0,cumulative_adds=0,cumulative_deletesById=0,cumulative_deletesByQuery=0,cumulative_errors=0}
[junit4:junit4]   2> 436644 T10 oasc.SolrCore.decrefSolrCoreState Closing SolrCoreState
[junit4:junit4]   2> 436644 T10 oasu.DefaultSolrCoreState.closeIndexWriter SolrCoreState
ref count has reached 0 - closing IndexWriter
[junit4:junit4]   2> 436645 T10 oasu.DefaultSolrCoreState.closeIndexWriter closing IndexWriter
with IndexWriterCloser
[junit4:junit4]   2> 436645 T10 oasc.SolrCore.closeSearcher [collection1] Closing main
searcher on request.
[junit4:junit4]   2> 436647 T32 oasc.Overseer$ClusterStateUpdater.amILeader According to
ZK I (id=88576994759213058-127.0.0.1:55886_solr-n_0000000000) am no longer a leader.
[junit4:junit4]   2> 436724 T45 oascc.ConnectionManager.process Watcher org.apache.solr.common.cloud.ConnectionManager@48423606
name:ZooKeeperConnection Watcher:127.0.0.1:57176/solr got event WatchedEvent state:Disconnected
type:None path:null path:null type:None
[junit4:junit4]   2> 436725 T45 oascc.ConnectionManager.process zkClient has disconnected
[junit4:junit4]   2> 436725 T69 oascc.ConnectionManager.process Watcher org.apache.solr.common.cloud.ConnectionManager@561526e3
name:ZooKeeperConnection Watcher:127.0.0.1:57176/solr got event WatchedEvent state:Disconnected
type:None path:null path:null type:None
[junit4:junit4]   2> 436726 T69 oascc.ConnectionManager.process zkClient has disconnected
[junit4:junit4]   2> 436726 T31 oaz.ClientCnxn$EventThread.run EventThread shut down
[junit4:junit4]   2> 436727 T57 oascc.ConnectionManager.process Watcher org.apache.solr.common.cloud.ConnectionManager@5b25d568
name:ZooKeeperConnection Watcher:127.0.0.1:57176/solr got event WatchedEvent state:Disconnected
type:None path:null path:null type:None
[junit4:junit4]   2> 436727 T10 oaz.ZooKeeper.close Session: 0x13ab04eb3e50002 closed
[junit4:junit4]   2> 436728 T82 oascc.ConnectionManager.process Watcher org.apache.solr.common.cloud.ConnectionManager@2a8d1749
name:ZooKeeperConnection Watcher:127.0.0.1:57176/solr got event WatchedEvent state:Disconnected
type:None path:null path:null type:None
[junit4:junit4]   2> 436728 T82 oascc.ConnectionManager.process zkClient has disconnected
[junit4:junit4]   2> 436727 T57 oascc.ConnectionManager.process zkClient has disconnected
[junit4:junit4]   2> 436749 T10 oejsh.ContextHandler.doStop stopped o.e.j.s.ServletContextHandler{/solr,null}
[junit4:junit4]   2> 436803 T10 oasc.ChaosMonkey.monkeyLog monkey: stop shard! 40350
[junit4:junit4]   2> 436804 T10 oasc.CoreContainer.shutdown Shutting down CoreContainer
instance=284826413
[junit4:junit4]   2> 438027 T44 oaz.ClientCnxn$SendThread.startConnect Opening socket connection
to server localhost.localdomain/127.0.0.1:57176
[junit4:junit4]   2> 438128 T45 oaz.ClientCnxn$EventThread.run EventThread shut down
[junit4:junit4]   2> 438128 T10 oaz.ZooKeeper.close Session: 0x13ab04eb3e50003 closed
[junit4:junit4]   2> 438151 T10 oejsh.ContextHandler.doStop stopped o.e.j.s.ServletContextHandler{/solr,null}
[junit4:junit4]   2> 438203 T10 oasc.ChaosMonkey.monkeyLog monkey: stop shard! 37794
[junit4:junit4]   2> 438203 T10 oasc.CoreContainer.shutdown Shutting down CoreContainer
instance=304483725
[junit4:junit4]   2> 438204 T10 oasc.SolrCore.close [collection1]  CLOSING SolrCore org.apache.solr.core.SolrCore@dc160cb
[junit4:junit4]   2> 438220 T10 oasu.DirectUpdateHandler2.close closing DirectUpdateHandler2{commits=1,autocommits=0,soft
autocommits=0,optimizes=0,rollbacks=0,expungeDeletes=0,docsPending=0,adds=0,deletesById=0,deletesByQuery=0,errors=0,cumulative_adds=0,cumulative_deletesById=0,cumulative_deletesByQuery=0,cumulative_errors=0}
[junit4:junit4]   2> 438221 T10 oasc.SolrCore.decrefSolrCoreState Closing SolrCoreState
[junit4:junit4]   2> 438221 T10 oasu.DefaultSolrCoreState.closeIndexWriter SolrCoreState
ref count has reached 0 - closing IndexWriter
[junit4:junit4]   2> 438221 T10 oasu.DefaultSolrCoreState.closeIndexWriter closing IndexWriter
with IndexWriterCloser
[junit4:junit4]   2> 438223 T10 oasc.SolrCore.closeSearcher [collection1] Closing main
searcher on request.
[junit4:junit4]   2> 438275 T81 oaz.ClientCnxn$SendThread.startConnect Opening socket connection
to server localhost.localdomain/127.0.0.1:57176
[junit4:junit4]   2> 438276 T81 oaz.ClientCnxn$SendThread.run WARNING Session 0x13ab04eb3e50006
for server null, unexpected error, closing socket connection and attempting reconnect java.net.ConnectException:
Connection refused
[junit4:junit4]   2> 	at sun.nio.ch.SocketChannelImpl.checkConnect(Native Method)
[junit4:junit4]   2> 	at sun.nio.ch.SocketChannelImpl.finishConnect(SocketChannelImpl.java:567)
[junit4:junit4]   2> 	at org.apache.zookeeper.ClientCnxn$SendThread.run(ClientCnxn.java:1143)
[junit4:junit4]   2> 
[junit4:junit4]   2> 438315 T68 oaz.ClientCnxn$SendThread.startConnect Opening socket connection
to server localhost.localdomain/127.0.0.1:57176
[junit4:junit4]   2> 438316 T68 oaz.ClientCnxn$SendThread.run WARNING Session 0x13ab04eb3e50005
for server null, unexpected error, closing socket connection and attempting reconnect java.net.ConnectException:
Connection refused
[junit4:junit4]   2> 	at sun.nio.ch.SocketChannelImpl.checkConnect(Native Method)
[junit4:junit4]   2> 	at sun.nio.ch.SocketChannelImpl.finishConnect(SocketChannelImpl.java:567)
[junit4:junit4]   2> 	at org.apache.zookeeper.ClientCnxn$SendThread.run(ClientCnxn.java:1143)
[junit4:junit4]   2> 
[junit4:junit4]   2> 438430 T56 oaz.ClientCnxn$SendThread.startConnect Opening socket connection
to server localhost.localdomain/127.0.0.1:57176
[junit4:junit4]   2> 438531 T57 oaz.ClientCnxn$EventThread.run EventThread shut down
[junit4:junit4]   2> 438531 T10 oaz.ZooKeeper.close Session: 0x13ab04eb3e50004 closed
[junit4:junit4]   2> 438544 T10 oejsh.ContextHandler.doStop stopped o.e.j.s.ServletContextHandler{/solr,null}
[junit4:junit4]   2> 438595 T10 oasc.ChaosMonkey.monkeyLog monkey: stop shard! 43060
[junit4:junit4]   2> 438596 T10 oasc.CoreContainer.shutdown Shutting down CoreContainer
instance=1381876328
[junit4:junit4]   2> 438596 T10 oasc.SolrCore.close [collection1]  CLOSING SolrCore org.apache.solr.core.SolrCore@622209db
[junit4:junit4]   2> 438606 T10 oasu.DirectUpdateHandler2.close closing DirectUpdateHandler2{commits=0,autocommits=0,soft
autocommits=0,optimizes=0,rollbacks=0,expungeDeletes=0,docsPending=0,adds=0,deletesById=0,deletesByQuery=0,errors=0,cumulative_adds=0,cumulative_deletesById=0,cumulative_deletesByQuery=0,cumulative_errors=0}
[junit4:junit4]   2> 438606 T10 oasc.SolrCore.decrefSolrCoreState Closing SolrCoreState
[junit4:junit4]   2> 438606 T10 oasu.DefaultSolrCoreState.closeIndexWriter SolrCoreState
ref count has reached 0 - closing IndexWriter
[junit4:junit4]   2> 438606 T10 oasu.DefaultSolrCoreState.closeIndexWriter closing IndexWriter
with IndexWriterCloser
[junit4:junit4]   2> 438607 T10 oasc.SolrCore.closeSearcher [collection1] Closing main
searcher on request.
[junit4:junit4]   2> 439760 T68 oaz.ClientCnxn$SendThread.startConnect Opening socket connection
to server localhost.localdomain/127.0.0.1:57176
[junit4:junit4]   2> 439861 T69 oaz.ClientCnxn$EventThread.run EventThread shut down
[junit4:junit4]   2> 439861 T10 oaz.ZooKeeper.close Session: 0x13ab04eb3e50005 closed
[junit4:junit4]   2> 439883 T10 oejsh.ContextHandler.doStop stopped o.e.j.s.ServletContextHandler{/solr,null}
[junit4:junit4]   2> 439935 T10 oasc.ChaosMonkey.monkeyLog monkey: stop shard! 42039
[junit4:junit4]   2> 439936 T10 oasc.CoreContainer.shutdown Shutting down CoreContainer
instance=303866371
[junit4:junit4]   2> 439936 T10 oasc.SolrCore.close [collection1]  CLOSING SolrCore org.apache.solr.core.SolrCore@257ccb2f
[junit4:junit4]   2> 439948 T81 oaz.ClientCnxn$SendThread.startConnect Opening socket connection
to server localhost.localdomain/127.0.0.1:57176
[junit4:junit4]   2> 439949 T81 oaz.ClientCnxn$SendThread.run WARNING Session 0x13ab04eb3e50006
for server null, unexpected error, closing socket connection and attempting reconnect java.net.ConnectException:
Connection refused
[junit4:junit4]   2> 	at sun.nio.ch.SocketChannelImpl.checkConnect(Native Method)
[junit4:junit4]   2> 	at sun.nio.ch.SocketChannelImpl.finishConnect(SocketChannelImpl.java:567)
[junit4:junit4]   2> 	at org.apache.zookeeper.ClientCnxn$SendThread.run(ClientCnxn.java:1143)
[junit4:junit4]   2> 
[junit4:junit4]   2> 439955 T10 oasu.DirectUpdateHandler2.close closing DirectUpdateHandler2{commits=1,autocommits=0,soft
autocommits=0,optimizes=0,rollbacks=0,expungeDeletes=0,docsPending=0,adds=0,deletesById=0,deletesByQuery=0,errors=0,cumulative_adds=0,cumulative_deletesById=0,cumulative_deletesByQuery=0,cumulative_errors=0}
[junit4:junit4]   2> 439957 T10 oasc.SolrCore.decrefSolrCoreState Closing SolrCoreState
[junit4:junit4]   2> 439957 T10 oasu.DefaultSolrCoreState.closeIndexWriter SolrCoreState
ref count has reached 0 - closing IndexWriter
[junit4:junit4]   2> 439957 T10 oasu.DefaultSolrCoreState.closeIndexWriter closing IndexWriter
with IndexWriterCloser
[junit4:junit4]   2> 439959 T10 oasc.SolrCore.closeSearcher [collection1] Closing main
searcher on request.
[junit4:junit4]   2> 440049 T82 oaz.ClientCnxn$EventThread.run EventThread shut down
[junit4:junit4]   2> 440049 T10 oaz.ZooKeeper.close Session: 0x13ab04eb3e50006 closed
[junit4:junit4]   2> 440062 T10 oejsh.ContextHandler.doStop stopped o.e.j.s.ServletContextHandler{/solr,null}
[junit4:junit4]   2> 440137 T10 oas.SolrTestCaseJ4.tearDown ###Ending testDistribSearch
[junit4:junit4]   1>     /solr/collections/control_collection/shards (0)
[junit4:junit4]   1>     /solr/collections/control_collection/leader_elect (1)
[junit4:junit4]   1>      /solr/collections/control_collection/leader_elect/control_shard
(1)
[junit4:junit4]   1>       /solr/collections/control_collection/leader_elect/control_shard/election
(1)
[junit4:junit4]   1>        /solr/collections/control_collection/leader_elect/control_shard/election/88576994759213058-127.0.0.1:55886_solr_collection1-n_0000000000
(0)
[junit4:junit4]   1>     /solr/collections/control_collection/leaders (1)
[junit4:junit4]   1>      /solr/collections/control_collection/leaders/control_shard (0)
[junit4:junit4]   1>      DATA:
[junit4:junit4]   1>          {
[junit4:junit4]   1>            "core":"collection1",
[junit4:junit4]   1>            "node_name":"127.0.0.1:55886_solr",
[junit4:junit4]   1>            "base_url":"http://127.0.0.1:55886/solr"}
[junit4:junit4]   1>   /solr/clusterstate.json (0)
[junit4:junit4]   1>   DATA:
[junit4:junit4]   1>       {
[junit4:junit4]   1>         "collection1":{
[junit4:junit4]   1>           "shard1":{
[junit4:junit4]   1>             "range":"80000000-ffffffff",
[junit4:junit4]   1>             "replicas":{
[junit4:junit4]   1>               "127.0.0.1:40350_solr_collection1":{
[junit4:junit4]   1>                 "shard":null,
[junit4:junit4]   1>                 "roles":null,
[junit4:junit4]   1>                 "state":"down",
[junit4:junit4]   1>                 "core":"collection1",
[junit4:junit4]   1>                 "collection":"collection1",
[junit4:junit4]   1>                 "node_name":"127.0.0.1:40350_solr",
[junit4:junit4]   1>                 "base_url":"http://127.0.0.1:40350/solr"},
[junit4:junit4]   1>               "127.0.0.1:43060_solr_collection1":{
[junit4:junit4]   1>                 "shard":"shard1",
[junit4:junit4]   1>                 "roles":null,
[junit4:junit4]   1>                 "state":"active",
[junit4:junit4]   1>                 "core":"collection1",
[junit4:junit4]   1>                 "collection":"collection1",
[junit4:junit4]   1>                 "node_name":"127.0.0.1:43060_solr",
[junit4:junit4]   1>                 "base_url":"http://127.0.0.1:43060/solr",
[junit4:junit4]   1>                 "leader":"true"}}},
[junit4:junit4]   1>           "shard2":{
[junit4:junit4]   1>             "range":"0-7fffffff",
[junit4:junit4]   1>             "replicas":{
[junit4:junit4]   1>               "127.0.0.1:37794_solr_collection1":{
[junit4:junit4]   1>                 "shard":"shard2",
[junit4:junit4]   1>                 "roles":null,
[junit4:junit4]   1>                 "state":"active",
[junit4:junit4]   1>                 "core":"collection1",
[junit4:junit4]   1>                 "collection":"collection1",
[junit4:junit4]   1>                 "node_name":"127.0.0.1:37794_solr",
[junit4:junit4]   1>                 "base_url":"http://127.0.0.1:37794/solr",
[junit4:junit4]   1>                 "leader":"true"},
[junit4:junit4]   1>               "127.0.0.1:42039_solr_collection1":{
[junit4:junit4]   1>                 "shard":"shard2",
[junit4:junit4]   1>                 "roles":null,
[junit4:junit4]   1>                 "state":"active",
[junit4:junit4]   1>                 "core":"collection1",
[junit4:junit4]   1>                 "collection":"collection1",
[junit4:junit4]   1>                 "node_name":"127.0.0.1:42039_solr",
[junit4:junit4]   1>                 "base_url":"http://127.0.0.1:42039/solr"}}}},
[junit4:junit4]   1>         "control_collection":{"control_shard":{"replicas":{"127.0.0.1:55886_solr_collection1":{
[junit4:junit4]   1>                 "shard":"control_shard",
[junit4:junit4]   1>                 "roles":null,
[junit4:junit4]   1>                 "state":"active",
[junit4:junit4]   1>                 "core":"collection1",
[junit4:junit4]   1>                 "collection":"control_collection",
[junit4:junit4]   1>                 "node_name":"127.0.0.1:55886_solr",
[junit4:junit4]   1>                 "base_url":"http://127.0.0.1:55886/solr",
[junit4:junit4]   1>                 "leader":"true"}}}}}
[junit4:junit4]   1>  /zookeeper (1)
[junit4:junit4]   1>  DATA:
[junit4:junit4]   1>      
[junit4:junit4]   1> 
[junit4:junit4]   2> NOTE: reproduce with: ant test  -Dtestcase=BasicDistributedZkTest
-Dtests.method=testDistribSearch -Dtests.seed=1261ABB31E6D1F4B -Dtests.slow=true -Dtests.locale=ar_LY
-Dtests.timezone=Australia/Tasmania -Dtests.file.encoding=UTF-8
[junit4:junit4] FAILURE  440s J0 | BasicDistributedZkTest.testDistribSearch <<<
[junit4:junit4]    > Throwable #1: java.lang.AssertionError: There are still nodes recoverying
- waited for 180 seconds
[junit4:junit4]    > 	at __randomizedtesting.SeedInfo.seed([1261ABB31E6D1F4B:938725AB69327F77]:0)
[junit4:junit4]    > 	at org.junit.Assert.fail(Assert.java:93)
[junit4:junit4]    > 	at org.apache.solr.cloud.AbstractDistribZkTestBase.waitForRecoveriesToFinish(AbstractDistribZkTestBase.java:165)
[junit4:junit4]    > 	at org.apache.solr.cloud.AbstractDistribZkTestBase.waitForRecoveriesToFinish(AbstractDistribZkTestBase.java:115)
[junit4:junit4]    > 	at org.apache.solr.cloud.AbstractDistribZkTestBase.waitForRecoveriesToFinish(AbstractDistribZkTestBase.java:110)
[junit4:junit4]    > 	at org.apache.solr.cloud.AbstractFullDistribZkTestBase.waitForRecoveriesToFinish(AbstractFullDistribZkTestBase.java:553)
[junit4:junit4]    > 	at org.apache.solr.cloud.BasicDistributedZkTest.doTest(BasicDistributedZkTest.java:162)
[junit4:junit4]    > 	at org.apache.solr.BaseDistributedSearchTestCase.testDistribSearch(BaseDistributedSearchTestCase.java:695)
[junit4:junit4]    > 	at sun.reflect.NativeMethodAccessorImpl.invoke0(Native Method)
[junit4:junit4]    > 	at sun.reflect.NativeMethodAccessorImpl.invoke(NativeMethodAccessorImpl.java:39)
[junit4:junit4]    > 	at sun.reflect.DelegatingMethodAccessorImpl.invoke(DelegatingMethodAccessorImpl.java:25)
[junit4:junit4]    > 	at java.lang.reflect.Method.invoke(Method.java:597)
[junit4:junit4]    > 	at com.carrotsearch.randomizedtesting.RandomizedRunner.invoke(RandomizedRunner.java:1559)
[junit4:junit4]    > 	at com.carrotsearch.randomizedtesting.RandomizedRunner.access$600(RandomizedRunner.java:79)
[junit4:junit4]    > 	at com.carrotsearch.randomizedtesting.RandomizedRunner$6.evaluate(RandomizedRunner.java:737)
[junit4:junit4]    > 	at com.carrotsearch.randomizedtesting.RandomizedRunner$7.evaluate(RandomizedRunner.java:773)
[junit4:junit4]    > 	at com.carrotsearch.randomizedtesting.RandomizedRunner$8.evaluate(RandomizedRunner.java:787)
[junit4:junit4]    > 	at com.carrotsearch.randomizedtesting.rules.SystemPropertiesRestoreRule$1.evaluate(SystemPropertiesRestoreRule.java:53)
[junit4:junit4]    > 	at org.apache.lucene.util.TestRuleSetupTeardownChained$1.evaluate(TestRuleSetupTeardownChained.java:50)
[junit4:junit4]    > 	at org.apache.lucene.util.TestRuleFieldCacheSanity$1.evaluate(TestRuleFieldCacheSanity.java:51)
[junit4:junit4]    > 	at org.apache.lucene.util.AbstractBeforeAfterRule$1.evaluate(AbstractBeforeAfterRule.java:45)
[junit4:junit4]    > 	at com.carrotsearch.randomizedtesting.rules.SystemPropertiesInvariantRule$1.evaluate(SystemPropertiesInvariantRule.java:55)
[junit4:junit4]    > 	at org.apache.lucene.util.TestRuleThreadAndTestName$1.evaluate(TestRuleThreadAndTestName.java:48)
[junit4:junit4]    > 	at org.apache.lucene.util.TestRuleIgnoreAfterMaxFailures$1.evaluate(TestRuleIgnoreAfterMaxFailures.java:70)
[junit4:junit4]    > 	at org.apache.lucene.util.TestRuleMarkFailure$1.evaluate(TestRuleMarkFailure.java:48)
[junit4:junit4]    > 	at com.carrotsearch.randomizedtesting.rules.StatementAdapter.evaluate(StatementAdapter.java:36)
[junit4:junit4]    > 	at com.carrotsearch.randomizedtesting.ThreadLeakControl$StatementRunner.run(ThreadLeakControl.java:358)
[junit4:junit4]    > 	at com.carrotsearch.randomizedtesting.ThreadLeakControl.forkTimeoutingTask(ThreadLeakControl.java:782)
[junit4:junit4]    > 	at com.carrotsearch.randomizedtesting.ThreadLeakControl$3.evaluate(ThreadLeakControl.java:442)
[junit4:junit4]    > 	at com.carrotsearch.randomizedtesting.RandomizedRunner.runSingleTest(RandomizedRunner.java:746)
[junit4:junit4]    > 	at com.carrotsearch.randomizedtesting.RandomizedRunner$3.evaluate(RandomizedRunner.java:648)
[junit4:junit4]    > 	at com.carrotsearch.randomizedtesting.RandomizedRunner$4.evaluate(RandomizedRunner.java:682)
[junit4:junit4]    > 	at com.carrotsearch.randomizedtesting.RandomizedRunner$5.evaluate(RandomizedRunner.java:693)
[junit4:junit4]    > 	at com.carrotsearch.randomizedtesting.rules.StatementAdapter.evaluate(StatementAdapter.java:36)
[junit4:junit4]    > 	at com.carrotsearch.randomizedtesting.rules.SystemPropertiesRestoreRule$1.evaluate(SystemPropertiesRestoreRule.java:53)
[junit4:junit4]    > 	at org.apache.lucene.util.AbstractBeforeAfterRule$1.evaluate(AbstractBeforeAfterRule.java:45)
[junit4:junit4]    > 	at org.apache.lucene.util.TestRuleStoreClassName$1.evaluate(TestRuleStoreClassName.java:42)
[junit4:junit4]    > 	at com.carrotsearch.randomizedtesting.rules.SystemPropertiesInvariantRule$1.evaluate(SystemPropertiesInvariantRule.java:55)
[junit4:junit4]    > 	at com.carrotsearch.randomizedtesting.rules.NoShadowingOrOverridesOnMethodsRule$1.evaluate(NoShadowingOrOverridesOnMethodsRule.java:39)
[junit4:junit4]    > 	at com.carrotsearch.randomizedtesting.rules.NoShadowingOrOverridesOnMethodsRule$1.evaluate(NoShadowingOrOverridesOnMethodsRule.java:39)
[junit4:junit4]    > 	at com.carrotsearch.randomizedtesting.rules.StatementAdapter.evaluate(StatementAdapter.java:36)
[junit4:junit4]    > 	at org.apache.lucene.util.TestRuleAssertionsRequired$1.evaluate(TestRuleAssertionsRequired.java:43)
[junit4:junit4]    > 	at org.apache.lucene.util.TestRuleMarkFailure$1.evaluate(TestRuleMarkFailure.java:48)
[junit4:junit4]    > 	at org.apache.lucene.util.TestRuleIgnoreAfterMaxFailures$1.evaluate(TestRuleIgnoreAfterMaxFailures.java:70)
[junit4:junit4]    > 	at org.apache.lucene.util.TestRuleIgnoreTestSuites$1.evaluate(TestRuleIgnoreTestSuites.java:55)
[junit4:junit4]    > 	at com.carrotsearch.randomizedtesting.rules.StatementAdapter.evaluate(StatementAdapter.java:36)
[junit4:junit4]    > 	at com.carrotsearch.randomizedtesting.ThreadLeakControl$StatementRunner.run(ThreadLeakControl.java:358)
[junit4:junit4]    > 	at java.lang.Thread.run(Thread.java:662)
[junit4:junit4]   2> 440162 T10 oas.SolrTestCaseJ4.deleteCore ###deleteCore
[junit4:junit4]   2> NOTE: test params are: codec=Lucene41: {}, sim=RandomSimilarityProvider(queryNorm=false,coord=crazy):
{}, locale=ar_LY, timezone=Australia/Tasmania
[junit4:junit4]   2> NOTE: Linux 3.2.0-24-generic amd64/Sun Microsystems Inc. 1.6.0_27
(64-bit)/cpus=8,threads=1,free=272398664,total=338100224
[junit4:junit4]   2> NOTE: All tests run in this JVM: [BasicDistributedZkTest]
[junit4:junit4] Completed on J0 in 441.51s, 1 test, 1 failure <<< FAILURES!
[junit4:junit4] 
[junit4:junit4] Suite: org.apache.solr.core.CoreContainerCoreInitFailuresTest
[junit4:junit4] Completed on J0 in 0.30s, 2 tests
[junit4:junit4] 
[junit4:junit4] Suite: org.apache.solr.util.SimplePostToolTest
[junit4:junit4] Completed on J0 in 0.92s, 11 tests
[junit4:junit4] 
[junit4:junit4] 
[junit4:junit4] Tests with failures:
[junit4:junit4]   - org.apache.solr.cloud.BasicDistributedZkTest.testDistribSearch
[junit4:junit4] 
[junit4:junit4] 
[junit4:junit4] JVM J0:     0.86 ..   444.67 =   443.81s
[junit4:junit4] JVM J1:     1.10 ..   149.89 =   148.79s
[junit4:junit4] JVM J2:     0.86 ..   116.65 =   115.79s
[junit4:junit4] JVM J3:     1.10 ..   122.11 =   121.02s
[junit4:junit4] JVM J4:     0.86 ..   115.96 =   115.10s
[junit4:junit4] JVM J5:     1.10 ..   124.04 =   122.94s
[junit4:junit4] JVM J6:     1.10 ..   127.87 =   126.78s
[junit4:junit4] JVM J7:     1.10 ..   117.77 =   116.67s
[junit4:junit4] Execution time total: 7 minutes 24 seconds
[junit4:junit4] Tests summary: 233 suites, 965 tests, 1 failure, 7 ignored (2 assumptions)

BUILD FAILED
<http://sierranevada.servebeer.com/job/fast-io-beasting/ws/build.xml>:39: The following
error occurred while executing this line:
<http://sierranevada.servebeer.com/job/fast-io-beasting/ws/solr/build.xml>:178: The
following error occurred while executing this line:
<http://sierranevada.servebeer.com/job/fast-io-beasting/ws/lucene/module-build.xml>:61:
The following error occurred while executing this line:
<http://sierranevada.servebeer.com/job/fast-io-beasting/ws/lucene/common-build.xml>:1159:
The following error occurred while executing this line:
<http://sierranevada.servebeer.com/job/fast-io-beasting/ws/lucene/common-build.xml>:827:
There were test failures: 233 suites, 965 tests, 1 failure, 7 ignored (2 assumptions)

Total time: 12 minutes 26 seconds
Build step 'Invoke Ant' marked build as failure

---------------------------------------------------------------------
To unsubscribe, e-mail: dev-unsubscribe@lucene.apache.org
For additional commands, e-mail: dev-help@lucene.apache.org


Mime
View raw message