lucene-dev mailing list archives

Site index · List index
Message view « Date » · « Thread »
Top « Date » · « Thread »
From Policeman Jenkins Server <jenk...@sd-datasolutions.de>
Subject [JENKINS] Lucene-Solr-4.x-Linux (64bit/ibm-j9-jdk7) - Build # 2050 - Failure!
Date Sun, 28 Oct 2012 21:55:50 GMT
Build: http://jenkins.sd-datasolutions.de/job/Lucene-Solr-4.x-Linux/2050/
Java: 64bit/ibm-j9-jdk7 -Xjit:exclude={org/apache/lucene/util/fst/FST.pack(IIF)Lorg/apache/lucene/util/fst/FST;}

7 tests failed.
REGRESSION:  org.apache.solr.TestDistributedGrouping.testDistribSearch

Error Message:
Server at http://127.0.0.1:54948/solr returned non ok status:500, message:Server Error

Stack Trace:
org.apache.solr.common.SolrException: Server at http://127.0.0.1:54948/solr returned non ok status:500, message:Server Error
	at __randomizedtesting.SeedInfo.seed([3241FF8677497ED3:B3A7719E00161EEF]:0)
	at org.apache.solr.client.solrj.impl.HttpSolrServer.request(HttpSolrServer.java:372)
	at org.apache.solr.client.solrj.impl.HttpSolrServer.request(HttpSolrServer.java:181)
	at org.apache.solr.client.solrj.request.QueryRequest.process(QueryRequest.java:90)
	at org.apache.solr.client.solrj.SolrServer.query(SolrServer.java:301)
	at org.apache.solr.BaseDistributedSearchTestCase.queryServer(BaseDistributedSearchTestCase.java:371)
	at org.apache.solr.BaseDistributedSearchTestCase.query(BaseDistributedSearchTestCase.java:394)
	at org.apache.solr.BaseDistributedSearchTestCase.query(BaseDistributedSearchTestCase.java:376)
	at org.apache.solr.TestDistributedGrouping.doTest(TestDistributedGrouping.java:146)
	at org.apache.solr.BaseDistributedSearchTestCase.testDistribSearch(BaseDistributedSearchTestCase.java:701)
	at sun.reflect.NativeMethodAccessorImpl.invoke0(Native Method)
	at sun.reflect.NativeMethodAccessorImpl.invoke(NativeMethodAccessorImpl.java:88)
	at sun.reflect.DelegatingMethodAccessorImpl.invoke(DelegatingMethodAccessorImpl.java:55)
	at java.lang.reflect.Method.invoke(Method.java:613)
	at com.carrotsearch.randomizedtesting.RandomizedRunner.invoke(RandomizedRunner.java:1559)
	at com.carrotsearch.randomizedtesting.RandomizedRunner.access$600(RandomizedRunner.java:79)
	at com.carrotsearch.randomizedtesting.RandomizedRunner$6.evaluate(RandomizedRunner.java:737)
	at com.carrotsearch.randomizedtesting.RandomizedRunner$7.evaluate(RandomizedRunner.java:773)
	at com.carrotsearch.randomizedtesting.RandomizedRunner$8.evaluate(RandomizedRunner.java:787)
	at com.carrotsearch.randomizedtesting.rules.SystemPropertiesRestoreRule$1.evaluate(SystemPropertiesRestoreRule.java:53)
	at org.apache.lucene.util.TestRuleSetupTeardownChained$1.evaluate(TestRuleSetupTeardownChained.java:50)
	at org.apache.lucene.util.TestRuleFieldCacheSanity$1.evaluate(TestRuleFieldCacheSanity.java:51)
	at org.apache.lucene.util.AbstractBeforeAfterRule$1.evaluate(AbstractBeforeAfterRule.java:45)
	at com.carrotsearch.randomizedtesting.rules.SystemPropertiesInvariantRule$1.evaluate(SystemPropertiesInvariantRule.java:55)
	at org.apache.lucene.util.TestRuleThreadAndTestName$1.evaluate(TestRuleThreadAndTestName.java:48)
	at org.apache.lucene.util.TestRuleIgnoreAfterMaxFailures$1.evaluate(TestRuleIgnoreAfterMaxFailures.java:70)
	at org.apache.lucene.util.TestRuleMarkFailure$1.evaluate(TestRuleMarkFailure.java:48)
	at com.carrotsearch.randomizedtesting.rules.StatementAdapter.evaluate(StatementAdapter.java:36)
	at com.carrotsearch.randomizedtesting.ThreadLeakControl$StatementRunner.run(ThreadLeakControl.java:358)
	at com.carrotsearch.randomizedtesting.ThreadLeakControl.forkTimeoutingTask(ThreadLeakControl.java:782)
	at com.carrotsearch.randomizedtesting.ThreadLeakControl$3.evaluate(ThreadLeakControl.java:442)
	at com.carrotsearch.randomizedtesting.RandomizedRunner.runSingleTest(RandomizedRunner.java:746)
	at com.carrotsearch.randomizedtesting.RandomizedRunner$3.evaluate(RandomizedRunner.java:648)
	at com.carrotsearch.randomizedtesting.RandomizedRunner$4.evaluate(RandomizedRunner.java:682)
	at com.carrotsearch.randomizedtesting.RandomizedRunner$5.evaluate(RandomizedRunner.java:693)
	at com.carrotsearch.randomizedtesting.rules.StatementAdapter.evaluate(StatementAdapter.java:36)
	at com.carrotsearch.randomizedtesting.rules.SystemPropertiesRestoreRule$1.evaluate(SystemPropertiesRestoreRule.java:53)
	at org.apache.lucene.util.AbstractBeforeAfterRule$1.evaluate(AbstractBeforeAfterRule.java:45)
	at org.apache.lucene.util.TestRuleStoreClassName$1.evaluate(TestRuleStoreClassName.java:42)
	at com.carrotsearch.randomizedtesting.rules.SystemPropertiesInvariantRule$1.evaluate(SystemPropertiesInvariantRule.java:55)
	at com.carrotsearch.randomizedtesting.rules.NoShadowingOrOverridesOnMethodsRule$1.evaluate(NoShadowingOrOverridesOnMethodsRule.java:39)
	at com.carrotsearch.randomizedtesting.rules.NoShadowingOrOverridesOnMethodsRule$1.evaluate(NoShadowingOrOverridesOnMethodsRule.java:39)
	at com.carrotsearch.randomizedtesting.rules.StatementAdapter.evaluate(StatementAdapter.java:36)
	at org.apache.lucene.util.TestRuleAssertionsRequired$1.evaluate(TestRuleAssertionsRequired.java:43)
	at org.apache.lucene.util.TestRuleMarkFailure$1.evaluate(TestRuleMarkFailure.java:48)
	at org.apache.lucene.util.TestRuleIgnoreAfterMaxFailures$1.evaluate(TestRuleIgnoreAfterMaxFailures.java:70)
	at org.apache.lucene.util.TestRuleIgnoreTestSuites$1.evaluate(TestRuleIgnoreTestSuites.java:55)
	at com.carrotsearch.randomizedtesting.rules.StatementAdapter.evaluate(StatementAdapter.java:36)
	at com.carrotsearch.randomizedtesting.ThreadLeakControl$StatementRunner.run(ThreadLeakControl.java:358)
	at java.lang.Thread.run(Thread.java:779)


REGRESSION:  org.apache.solr.TestDistributedSearch.testDistribSearch

Error Message:
Server at http://127.0.0.1:60902/solr returned non ok status:500, message:Server Error

Stack Trace:
org.apache.solr.common.SolrException: Server at http://127.0.0.1:60902/solr returned non ok status:500, message:Server Error
	at __randomizedtesting.SeedInfo.seed([3241FF8677497ED3:B3A7719E00161EEF]:0)
	at org.apache.solr.client.solrj.impl.HttpSolrServer.request(HttpSolrServer.java:372)
	at org.apache.solr.client.solrj.impl.HttpSolrServer.request(HttpSolrServer.java:181)
	at org.apache.solr.client.solrj.request.QueryRequest.process(QueryRequest.java:90)
	at org.apache.solr.client.solrj.SolrServer.query(SolrServer.java:301)
	at org.apache.solr.BaseDistributedSearchTestCase.queryServer(BaseDistributedSearchTestCase.java:371)
	at org.apache.solr.BaseDistributedSearchTestCase.query(BaseDistributedSearchTestCase.java:394)
	at org.apache.solr.BaseDistributedSearchTestCase.query(BaseDistributedSearchTestCase.java:376)
	at org.apache.solr.TestDistributedSearch.doTest(TestDistributedSearch.java:134)
	at org.apache.solr.BaseDistributedSearchTestCase.testDistribSearch(BaseDistributedSearchTestCase.java:701)
	at sun.reflect.NativeMethodAccessorImpl.invoke0(Native Method)
	at sun.reflect.NativeMethodAccessorImpl.invoke(NativeMethodAccessorImpl.java:88)
	at sun.reflect.DelegatingMethodAccessorImpl.invoke(DelegatingMethodAccessorImpl.java:55)
	at java.lang.reflect.Method.invoke(Method.java:613)
	at com.carrotsearch.randomizedtesting.RandomizedRunner.invoke(RandomizedRunner.java:1559)
	at com.carrotsearch.randomizedtesting.RandomizedRunner.access$600(RandomizedRunner.java:79)
	at com.carrotsearch.randomizedtesting.RandomizedRunner$6.evaluate(RandomizedRunner.java:737)
	at com.carrotsearch.randomizedtesting.RandomizedRunner$7.evaluate(RandomizedRunner.java:773)
	at com.carrotsearch.randomizedtesting.RandomizedRunner$8.evaluate(RandomizedRunner.java:787)
	at com.carrotsearch.randomizedtesting.rules.SystemPropertiesRestoreRule$1.evaluate(SystemPropertiesRestoreRule.java:53)
	at org.apache.lucene.util.TestRuleSetupTeardownChained$1.evaluate(TestRuleSetupTeardownChained.java:50)
	at org.apache.lucene.util.TestRuleFieldCacheSanity$1.evaluate(TestRuleFieldCacheSanity.java:51)
	at org.apache.lucene.util.AbstractBeforeAfterRule$1.evaluate(AbstractBeforeAfterRule.java:45)
	at com.carrotsearch.randomizedtesting.rules.SystemPropertiesInvariantRule$1.evaluate(SystemPropertiesInvariantRule.java:55)
	at org.apache.lucene.util.TestRuleThreadAndTestName$1.evaluate(TestRuleThreadAndTestName.java:48)
	at org.apache.lucene.util.TestRuleIgnoreAfterMaxFailures$1.evaluate(TestRuleIgnoreAfterMaxFailures.java:70)
	at org.apache.lucene.util.TestRuleMarkFailure$1.evaluate(TestRuleMarkFailure.java:48)
	at com.carrotsearch.randomizedtesting.rules.StatementAdapter.evaluate(StatementAdapter.java:36)
	at com.carrotsearch.randomizedtesting.ThreadLeakControl$StatementRunner.run(ThreadLeakControl.java:358)
	at com.carrotsearch.randomizedtesting.ThreadLeakControl.forkTimeoutingTask(ThreadLeakControl.java:782)
	at com.carrotsearch.randomizedtesting.ThreadLeakControl$3.evaluate(ThreadLeakControl.java:442)
	at com.carrotsearch.randomizedtesting.RandomizedRunner.runSingleTest(RandomizedRunner.java:746)
	at com.carrotsearch.randomizedtesting.RandomizedRunner$3.evaluate(RandomizedRunner.java:648)
	at com.carrotsearch.randomizedtesting.RandomizedRunner$4.evaluate(RandomizedRunner.java:682)
	at com.carrotsearch.randomizedtesting.RandomizedRunner$5.evaluate(RandomizedRunner.java:693)
	at com.carrotsearch.randomizedtesting.rules.StatementAdapter.evaluate(StatementAdapter.java:36)
	at com.carrotsearch.randomizedtesting.rules.SystemPropertiesRestoreRule$1.evaluate(SystemPropertiesRestoreRule.java:53)
	at org.apache.lucene.util.AbstractBeforeAfterRule$1.evaluate(AbstractBeforeAfterRule.java:45)
	at org.apache.lucene.util.TestRuleStoreClassName$1.evaluate(TestRuleStoreClassName.java:42)
	at com.carrotsearch.randomizedtesting.rules.SystemPropertiesInvariantRule$1.evaluate(SystemPropertiesInvariantRule.java:55)
	at com.carrotsearch.randomizedtesting.rules.NoShadowingOrOverridesOnMethodsRule$1.evaluate(NoShadowingOrOverridesOnMethodsRule.java:39)
	at com.carrotsearch.randomizedtesting.rules.NoShadowingOrOverridesOnMethodsRule$1.evaluate(NoShadowingOrOverridesOnMethodsRule.java:39)
	at com.carrotsearch.randomizedtesting.rules.StatementAdapter.evaluate(StatementAdapter.java:36)
	at org.apache.lucene.util.TestRuleAssertionsRequired$1.evaluate(TestRuleAssertionsRequired.java:43)
	at org.apache.lucene.util.TestRuleMarkFailure$1.evaluate(TestRuleMarkFailure.java:48)
	at org.apache.lucene.util.TestRuleIgnoreAfterMaxFailures$1.evaluate(TestRuleIgnoreAfterMaxFailures.java:70)
	at org.apache.lucene.util.TestRuleIgnoreTestSuites$1.evaluate(TestRuleIgnoreTestSuites.java:55)
	at com.carrotsearch.randomizedtesting.rules.StatementAdapter.evaluate(StatementAdapter.java:36)
	at com.carrotsearch.randomizedtesting.ThreadLeakControl$StatementRunner.run(ThreadLeakControl.java:358)
	at java.lang.Thread.run(Thread.java:779)


REGRESSION:  org.apache.solr.cloud.BasicDistributedZk2Test.testDistribSearch

Error Message:
.response[id=2][range_facet_si]==null

Stack Trace:
junit.framework.AssertionFailedError: .response[id=2][range_facet_si]==null
	at __randomizedtesting.SeedInfo.seed([3241FF8677497ED3:B3A7719E00161EEF]:0)
	at junit.framework.Assert.fail(Assert.java:50)
	at org.apache.solr.BaseDistributedSearchTestCase.compareResponses(BaseDistributedSearchTestCase.java:686)
	at org.apache.solr.BaseDistributedSearchTestCase.query(BaseDistributedSearchTestCase.java:396)
	at org.apache.solr.BaseDistributedSearchTestCase.query(BaseDistributedSearchTestCase.java:376)
	at org.apache.solr.cloud.AbstractFullDistribZkTestBase.checkQueries(AbstractFullDistribZkTestBase.java:661)
	at org.apache.solr.cloud.BasicDistributedZk2Test.doTest(BasicDistributedZk2Test.java:77)
	at org.apache.solr.BaseDistributedSearchTestCase.testDistribSearch(BaseDistributedSearchTestCase.java:695)
	at sun.reflect.NativeMethodAccessorImpl.invoke0(Native Method)
	at sun.reflect.NativeMethodAccessorImpl.invoke(NativeMethodAccessorImpl.java:88)
	at sun.reflect.DelegatingMethodAccessorImpl.invoke(DelegatingMethodAccessorImpl.java:55)
	at java.lang.reflect.Method.invoke(Method.java:613)
	at com.carrotsearch.randomizedtesting.RandomizedRunner.invoke(RandomizedRunner.java:1559)
	at com.carrotsearch.randomizedtesting.RandomizedRunner.access$600(RandomizedRunner.java:79)
	at com.carrotsearch.randomizedtesting.RandomizedRunner$6.evaluate(RandomizedRunner.java:737)
	at com.carrotsearch.randomizedtesting.RandomizedRunner$7.evaluate(RandomizedRunner.java:773)
	at com.carrotsearch.randomizedtesting.RandomizedRunner$8.evaluate(RandomizedRunner.java:787)
	at com.carrotsearch.randomizedtesting.rules.SystemPropertiesRestoreRule$1.evaluate(SystemPropertiesRestoreRule.java:53)
	at org.apache.lucene.util.TestRuleSetupTeardownChained$1.evaluate(TestRuleSetupTeardownChained.java:50)
	at org.apache.lucene.util.TestRuleFieldCacheSanity$1.evaluate(TestRuleFieldCacheSanity.java:51)
	at org.apache.lucene.util.AbstractBeforeAfterRule$1.evaluate(AbstractBeforeAfterRule.java:45)
	at com.carrotsearch.randomizedtesting.rules.SystemPropertiesInvariantRule$1.evaluate(SystemPropertiesInvariantRule.java:55)
	at org.apache.lucene.util.TestRuleThreadAndTestName$1.evaluate(TestRuleThreadAndTestName.java:48)
	at org.apache.lucene.util.TestRuleIgnoreAfterMaxFailures$1.evaluate(TestRuleIgnoreAfterMaxFailures.java:70)
	at org.apache.lucene.util.TestRuleMarkFailure$1.evaluate(TestRuleMarkFailure.java:48)
	at com.carrotsearch.randomizedtesting.rules.StatementAdapter.evaluate(StatementAdapter.java:36)
	at com.carrotsearch.randomizedtesting.ThreadLeakControl$StatementRunner.run(ThreadLeakControl.java:358)
	at com.carrotsearch.randomizedtesting.ThreadLeakControl.forkTimeoutingTask(ThreadLeakControl.java:782)
	at com.carrotsearch.randomizedtesting.ThreadLeakControl$3.evaluate(ThreadLeakControl.java:442)
	at com.carrotsearch.randomizedtesting.RandomizedRunner.runSingleTest(RandomizedRunner.java:746)
	at com.carrotsearch.randomizedtesting.RandomizedRunner$3.evaluate(RandomizedRunner.java:648)
	at com.carrotsearch.randomizedtesting.RandomizedRunner$4.evaluate(RandomizedRunner.java:682)
	at com.carrotsearch.randomizedtesting.RandomizedRunner$5.evaluate(RandomizedRunner.java:693)
	at com.carrotsearch.randomizedtesting.rules.StatementAdapter.evaluate(StatementAdapter.java:36)
	at com.carrotsearch.randomizedtesting.rules.SystemPropertiesRestoreRule$1.evaluate(SystemPropertiesRestoreRule.java:53)
	at org.apache.lucene.util.AbstractBeforeAfterRule$1.evaluate(AbstractBeforeAfterRule.java:45)
	at org.apache.lucene.util.TestRuleStoreClassName$1.evaluate(TestRuleStoreClassName.java:42)
	at com.carrotsearch.randomizedtesting.rules.SystemPropertiesInvariantRule$1.evaluate(SystemPropertiesInvariantRule.java:55)
	at com.carrotsearch.randomizedtesting.rules.NoShadowingOrOverridesOnMethodsRule$1.evaluate(NoShadowingOrOverridesOnMethodsRule.java:39)
	at com.carrotsearch.randomizedtesting.rules.NoShadowingOrOverridesOnMethodsRule$1.evaluate(NoShadowingOrOverridesOnMethodsRule.java:39)
	at com.carrotsearch.randomizedtesting.rules.StatementAdapter.evaluate(StatementAdapter.java:36)
	at org.apache.lucene.util.TestRuleAssertionsRequired$1.evaluate(TestRuleAssertionsRequired.java:43)
	at org.apache.lucene.util.TestRuleMarkFailure$1.evaluate(TestRuleMarkFailure.java:48)
	at org.apache.lucene.util.TestRuleIgnoreAfterMaxFailures$1.evaluate(TestRuleIgnoreAfterMaxFailures.java:70)
	at org.apache.lucene.util.TestRuleIgnoreTestSuites$1.evaluate(TestRuleIgnoreTestSuites.java:55)
	at com.carrotsearch.randomizedtesting.rules.StatementAdapter.evaluate(StatementAdapter.java:36)
	at com.carrotsearch.randomizedtesting.ThreadLeakControl$StatementRunner.run(ThreadLeakControl.java:358)
	at java.lang.Thread.run(Thread.java:779)


REGRESSION:  org.apache.solr.cloud.BasicDistributedZkTest.testDistribSearch

Error Message:
No live SolrServers available to handle this request:[http://127.0.0.1:45202/solr/collection1, http://127.0.0.1:51091/solr/collection1, http://127.0.0.1:46073/solr/collection1, http://127.0.0.1:34709/solr/collection1]

Stack Trace:
org.apache.solr.client.solrj.SolrServerException: No live SolrServers available to handle this request:[http://127.0.0.1:45202/solr/collection1, http://127.0.0.1:51091/solr/collection1, http://127.0.0.1:46073/solr/collection1, http://127.0.0.1:34709/solr/collection1]
	at __randomizedtesting.SeedInfo.seed([3241FF8677497ED3:B3A7719E00161EEF]:0)
	at org.apache.solr.client.solrj.impl.LBHttpSolrServer.request(LBHttpSolrServer.java:324)
	at org.apache.solr.client.solrj.impl.CloudSolrServer.request(CloudSolrServer.java:269)
	at org.apache.solr.client.solrj.request.QueryRequest.process(QueryRequest.java:90)
	at org.apache.solr.client.solrj.SolrServer.query(SolrServer.java:301)
	at org.apache.solr.cloud.BasicDistributedZkTest.queryServer(BasicDistributedZkTest.java:1375)
	at org.apache.solr.BaseDistributedSearchTestCase.query(BaseDistributedSearchTestCase.java:394)
	at org.apache.solr.cloud.BasicDistributedZkTest.doTest(BasicDistributedZkTest.java:211)
	at org.apache.solr.BaseDistributedSearchTestCase.testDistribSearch(BaseDistributedSearchTestCase.java:695)
	at sun.reflect.NativeMethodAccessorImpl.invoke0(Native Method)
	at sun.reflect.NativeMethodAccessorImpl.invoke(NativeMethodAccessorImpl.java:88)
	at sun.reflect.DelegatingMethodAccessorImpl.invoke(DelegatingMethodAccessorImpl.java:55)
	at java.lang.reflect.Method.invoke(Method.java:613)
	at com.carrotsearch.randomizedtesting.RandomizedRunner.invoke(RandomizedRunner.java:1559)
	at com.carrotsearch.randomizedtesting.RandomizedRunner.access$600(RandomizedRunner.java:79)
	at com.carrotsearch.randomizedtesting.RandomizedRunner$6.evaluate(RandomizedRunner.java:737)
	at com.carrotsearch.randomizedtesting.RandomizedRunner$7.evaluate(RandomizedRunner.java:773)
	at com.carrotsearch.randomizedtesting.RandomizedRunner$8.evaluate(RandomizedRunner.java:787)
	at com.carrotsearch.randomizedtesting.rules.SystemPropertiesRestoreRule$1.evaluate(SystemPropertiesRestoreRule.java:53)
	at org.apache.lucene.util.TestRuleSetupTeardownChained$1.evaluate(TestRuleSetupTeardownChained.java:50)
	at org.apache.lucene.util.TestRuleFieldCacheSanity$1.evaluate(TestRuleFieldCacheSanity.java:51)
	at org.apache.lucene.util.AbstractBeforeAfterRule$1.evaluate(AbstractBeforeAfterRule.java:45)
	at com.carrotsearch.randomizedtesting.rules.SystemPropertiesInvariantRule$1.evaluate(SystemPropertiesInvariantRule.java:55)
	at org.apache.lucene.util.TestRuleThreadAndTestName$1.evaluate(TestRuleThreadAndTestName.java:48)
	at org.apache.lucene.util.TestRuleIgnoreAfterMaxFailures$1.evaluate(TestRuleIgnoreAfterMaxFailures.java:70)
	at org.apache.lucene.util.TestRuleMarkFailure$1.evaluate(TestRuleMarkFailure.java:48)
	at com.carrotsearch.randomizedtesting.rules.StatementAdapter.evaluate(StatementAdapter.java:36)
	at com.carrotsearch.randomizedtesting.ThreadLeakControl$StatementRunner.run(ThreadLeakControl.java:358)
	at com.carrotsearch.randomizedtesting.ThreadLeakControl.forkTimeoutingTask(ThreadLeakControl.java:782)
	at com.carrotsearch.randomizedtesting.ThreadLeakControl$3.evaluate(ThreadLeakControl.java:442)
	at com.carrotsearch.randomizedtesting.RandomizedRunner.runSingleTest(RandomizedRunner.java:746)
	at com.carrotsearch.randomizedtesting.RandomizedRunner$3.evaluate(RandomizedRunner.java:648)
	at com.carrotsearch.randomizedtesting.RandomizedRunner$4.evaluate(RandomizedRunner.java:682)
	at com.carrotsearch.randomizedtesting.RandomizedRunner$5.evaluate(RandomizedRunner.java:693)
	at com.carrotsearch.randomizedtesting.rules.StatementAdapter.evaluate(StatementAdapter.java:36)
	at com.carrotsearch.randomizedtesting.rules.SystemPropertiesRestoreRule$1.evaluate(SystemPropertiesRestoreRule.java:53)
	at org.apache.lucene.util.AbstractBeforeAfterRule$1.evaluate(AbstractBeforeAfterRule.java:45)
	at org.apache.lucene.util.TestRuleStoreClassName$1.evaluate(TestRuleStoreClassName.java:42)
	at com.carrotsearch.randomizedtesting.rules.SystemPropertiesInvariantRule$1.evaluate(SystemPropertiesInvariantRule.java:55)
	at com.carrotsearch.randomizedtesting.rules.NoShadowingOrOverridesOnMethodsRule$1.evaluate(NoShadowingOrOverridesOnMethodsRule.java:39)
	at com.carrotsearch.randomizedtesting.rules.NoShadowingOrOverridesOnMethodsRule$1.evaluate(NoShadowingOrOverridesOnMethodsRule.java:39)
	at com.carrotsearch.randomizedtesting.rules.StatementAdapter.evaluate(StatementAdapter.java:36)
	at org.apache.lucene.util.TestRuleAssertionsRequired$1.evaluate(TestRuleAssertionsRequired.java:43)
	at org.apache.lucene.util.TestRuleMarkFailure$1.evaluate(TestRuleMarkFailure.java:48)
	at org.apache.lucene.util.TestRuleIgnoreAfterMaxFailures$1.evaluate(TestRuleIgnoreAfterMaxFailures.java:70)
	at org.apache.lucene.util.TestRuleIgnoreTestSuites$1.evaluate(TestRuleIgnoreTestSuites.java:55)
	at com.carrotsearch.randomizedtesting.rules.StatementAdapter.evaluate(StatementAdapter.java:36)
	at com.carrotsearch.randomizedtesting.ThreadLeakControl$StatementRunner.run(ThreadLeakControl.java:358)
	at java.lang.Thread.run(Thread.java:779)
Caused by: org.apache.solr.common.SolrException: Server at http://127.0.0.1:46073/solr/collection1 returned non ok status:500, message:Server Error
	at org.apache.solr.client.solrj.impl.HttpSolrServer.request(HttpSolrServer.java:372)
	at org.apache.solr.client.solrj.impl.HttpSolrServer.request(HttpSolrServer.java:181)
	at org.apache.solr.client.solrj.impl.LBHttpSolrServer.request(LBHttpSolrServer.java:255)
	... 47 more


REGRESSION:  org.apache.solr.handler.component.DistributedQueryElevationComponentTest.testDistribSearch

Error Message:
Server at http://127.0.0.1:50230/solr returned non ok status:500, message:Server Error

Stack Trace:
org.apache.solr.common.SolrException: Server at http://127.0.0.1:50230/solr returned non ok status:500, message:Server Error
	at __randomizedtesting.SeedInfo.seed([3241FF8677497ED3:B3A7719E00161EEF]:0)
	at org.apache.solr.client.solrj.impl.HttpSolrServer.request(HttpSolrServer.java:372)
	at org.apache.solr.client.solrj.impl.HttpSolrServer.request(HttpSolrServer.java:181)
	at org.apache.solr.client.solrj.request.QueryRequest.process(QueryRequest.java:90)
	at org.apache.solr.client.solrj.SolrServer.query(SolrServer.java:301)
	at org.apache.solr.BaseDistributedSearchTestCase.queryServer(BaseDistributedSearchTestCase.java:371)
	at org.apache.solr.BaseDistributedSearchTestCase.query(BaseDistributedSearchTestCase.java:394)
	at org.apache.solr.BaseDistributedSearchTestCase.query(BaseDistributedSearchTestCase.java:376)
	at org.apache.solr.handler.component.DistributedQueryElevationComponentTest.doTest(DistributedQueryElevationComponentTest.java:83)
	at org.apache.solr.BaseDistributedSearchTestCase.testDistribSearch(BaseDistributedSearchTestCase.java:695)
	at sun.reflect.NativeMethodAccessorImpl.invoke0(Native Method)
	at sun.reflect.NativeMethodAccessorImpl.invoke(NativeMethodAccessorImpl.java:88)
	at sun.reflect.DelegatingMethodAccessorImpl.invoke(DelegatingMethodAccessorImpl.java:55)
	at java.lang.reflect.Method.invoke(Method.java:613)
	at com.carrotsearch.randomizedtesting.RandomizedRunner.invoke(RandomizedRunner.java:1559)
	at com.carrotsearch.randomizedtesting.RandomizedRunner.access$600(RandomizedRunner.java:79)
	at com.carrotsearch.randomizedtesting.RandomizedRunner$6.evaluate(RandomizedRunner.java:737)
	at com.carrotsearch.randomizedtesting.RandomizedRunner$7.evaluate(RandomizedRunner.java:773)
	at com.carrotsearch.randomizedtesting.RandomizedRunner$8.evaluate(RandomizedRunner.java:787)
	at com.carrotsearch.randomizedtesting.rules.SystemPropertiesRestoreRule$1.evaluate(SystemPropertiesRestoreRule.java:53)
	at org.apache.lucene.util.TestRuleSetupTeardownChained$1.evaluate(TestRuleSetupTeardownChained.java:50)
	at org.apache.lucene.util.TestRuleFieldCacheSanity$1.evaluate(TestRuleFieldCacheSanity.java:51)
	at org.apache.lucene.util.AbstractBeforeAfterRule$1.evaluate(AbstractBeforeAfterRule.java:45)
	at com.carrotsearch.randomizedtesting.rules.SystemPropertiesInvariantRule$1.evaluate(SystemPropertiesInvariantRule.java:55)
	at org.apache.lucene.util.TestRuleThreadAndTestName$1.evaluate(TestRuleThreadAndTestName.java:48)
	at org.apache.lucene.util.TestRuleIgnoreAfterMaxFailures$1.evaluate(TestRuleIgnoreAfterMaxFailures.java:70)
	at org.apache.lucene.util.TestRuleMarkFailure$1.evaluate(TestRuleMarkFailure.java:48)
	at com.carrotsearch.randomizedtesting.rules.StatementAdapter.evaluate(StatementAdapter.java:36)
	at com.carrotsearch.randomizedtesting.ThreadLeakControl$StatementRunner.run(ThreadLeakControl.java:358)
	at com.carrotsearch.randomizedtesting.ThreadLeakControl.forkTimeoutingTask(ThreadLeakControl.java:782)
	at com.carrotsearch.randomizedtesting.ThreadLeakControl$3.evaluate(ThreadLeakControl.java:442)
	at com.carrotsearch.randomizedtesting.RandomizedRunner.runSingleTest(RandomizedRunner.java:746)
	at com.carrotsearch.randomizedtesting.RandomizedRunner$3.evaluate(RandomizedRunner.java:648)
	at com.carrotsearch.randomizedtesting.RandomizedRunner$4.evaluate(RandomizedRunner.java:682)
	at com.carrotsearch.randomizedtesting.RandomizedRunner$5.evaluate(RandomizedRunner.java:693)
	at com.carrotsearch.randomizedtesting.rules.StatementAdapter.evaluate(StatementAdapter.java:36)
	at com.carrotsearch.randomizedtesting.rules.SystemPropertiesRestoreRule$1.evaluate(SystemPropertiesRestoreRule.java:53)
	at org.apache.lucene.util.AbstractBeforeAfterRule$1.evaluate(AbstractBeforeAfterRule.java:45)
	at org.apache.lucene.util.TestRuleStoreClassName$1.evaluate(TestRuleStoreClassName.java:42)
	at com.carrotsearch.randomizedtesting.rules.SystemPropertiesInvariantRule$1.evaluate(SystemPropertiesInvariantRule.java:55)
	at com.carrotsearch.randomizedtesting.rules.NoShadowingOrOverridesOnMethodsRule$1.evaluate(NoShadowingOrOverridesOnMethodsRule.java:39)
	at com.carrotsearch.randomizedtesting.rules.NoShadowingOrOverridesOnMethodsRule$1.evaluate(NoShadowingOrOverridesOnMethodsRule.java:39)
	at com.carrotsearch.randomizedtesting.rules.StatementAdapter.evaluate(StatementAdapter.java:36)
	at org.apache.lucene.util.TestRuleAssertionsRequired$1.evaluate(TestRuleAssertionsRequired.java:43)
	at org.apache.lucene.util.TestRuleMarkFailure$1.evaluate(TestRuleMarkFailure.java:48)
	at org.apache.lucene.util.TestRuleIgnoreAfterMaxFailures$1.evaluate(TestRuleIgnoreAfterMaxFailures.java:70)
	at org.apache.lucene.util.TestRuleIgnoreTestSuites$1.evaluate(TestRuleIgnoreTestSuites.java:55)
	at com.carrotsearch.randomizedtesting.rules.StatementAdapter.evaluate(StatementAdapter.java:36)
	at com.carrotsearch.randomizedtesting.ThreadLeakControl$StatementRunner.run(ThreadLeakControl.java:358)
	at java.lang.Thread.run(Thread.java:779)


REGRESSION:  org.apache.solr.handler.component.StatsComponentTest.testStats

Error Message:
Exception during query

Stack Trace:
java.lang.RuntimeException: Exception during query
	at __randomizedtesting.SeedInfo.seed([3241FF8677497ED3:A8C0A6391F95B0F0]:0)
	at org.apache.solr.util.AbstractSolrTestCase.assertQ(AbstractSolrTestCase.java:283)
	at org.apache.solr.handler.component.StatsComponentTest.doTestFacetStatisticsResult(StatsComponentTest.java:239)
	at org.apache.solr.handler.component.StatsComponentTest.testStats(StatsComponentTest.java:68)
	at sun.reflect.NativeMethodAccessorImpl.invoke0(Native Method)
	at sun.reflect.NativeMethodAccessorImpl.invoke(NativeMethodAccessorImpl.java:88)
	at sun.reflect.DelegatingMethodAccessorImpl.invoke(DelegatingMethodAccessorImpl.java:55)
	at java.lang.reflect.Method.invoke(Method.java:613)
	at com.carrotsearch.randomizedtesting.RandomizedRunner.invoke(RandomizedRunner.java:1559)
	at com.carrotsearch.randomizedtesting.RandomizedRunner.access$600(RandomizedRunner.java:79)
	at com.carrotsearch.randomizedtesting.RandomizedRunner$6.evaluate(RandomizedRunner.java:737)
	at com.carrotsearch.randomizedtesting.RandomizedRunner$7.evaluate(RandomizedRunner.java:773)
	at com.carrotsearch.randomizedtesting.RandomizedRunner$8.evaluate(RandomizedRunner.java:787)
	at com.carrotsearch.randomizedtesting.rules.SystemPropertiesRestoreRule$1.evaluate(SystemPropertiesRestoreRule.java:53)
	at org.apache.lucene.util.TestRuleSetupTeardownChained$1.evaluate(TestRuleSetupTeardownChained.java:50)
	at org.apache.lucene.util.TestRuleFieldCacheSanity$1.evaluate(TestRuleFieldCacheSanity.java:51)
	at org.apache.lucene.util.AbstractBeforeAfterRule$1.evaluate(AbstractBeforeAfterRule.java:45)
	at com.carrotsearch.randomizedtesting.rules.SystemPropertiesInvariantRule$1.evaluate(SystemPropertiesInvariantRule.java:55)
	at org.apache.lucene.util.TestRuleThreadAndTestName$1.evaluate(TestRuleThreadAndTestName.java:48)
	at org.apache.lucene.util.TestRuleIgnoreAfterMaxFailures$1.evaluate(TestRuleIgnoreAfterMaxFailures.java:70)
	at org.apache.lucene.util.TestRuleMarkFailure$1.evaluate(TestRuleMarkFailure.java:48)
	at com.carrotsearch.randomizedtesting.rules.StatementAdapter.evaluate(StatementAdapter.java:36)
	at com.carrotsearch.randomizedtesting.ThreadLeakControl$StatementRunner.run(ThreadLeakControl.java:358)
	at com.carrotsearch.randomizedtesting.ThreadLeakControl.forkTimeoutingTask(ThreadLeakControl.java:782)
	at com.carrotsearch.randomizedtesting.ThreadLeakControl$3.evaluate(ThreadLeakControl.java:442)
	at com.carrotsearch.randomizedtesting.RandomizedRunner.runSingleTest(RandomizedRunner.java:746)
	at com.carrotsearch.randomizedtesting.RandomizedRunner$3.evaluate(RandomizedRunner.java:648)
	at com.carrotsearch.randomizedtesting.RandomizedRunner$4.evaluate(RandomizedRunner.java:682)
	at com.carrotsearch.randomizedtesting.RandomizedRunner$5.evaluate(RandomizedRunner.java:693)
	at com.carrotsearch.randomizedtesting.rules.StatementAdapter.evaluate(StatementAdapter.java:36)
	at com.carrotsearch.randomizedtesting.rules.SystemPropertiesRestoreRule$1.evaluate(SystemPropertiesRestoreRule.java:53)
	at org.apache.lucene.util.AbstractBeforeAfterRule$1.evaluate(AbstractBeforeAfterRule.java:45)
	at org.apache.lucene.util.TestRuleStoreClassName$1.evaluate(TestRuleStoreClassName.java:42)
	at com.carrotsearch.randomizedtesting.rules.SystemPropertiesInvariantRule$1.evaluate(SystemPropertiesInvariantRule.java:55)
	at com.carrotsearch.randomizedtesting.rules.NoShadowingOrOverridesOnMethodsRule$1.evaluate(NoShadowingOrOverridesOnMethodsRule.java:39)
	at com.carrotsearch.randomizedtesting.rules.NoShadowingOrOverridesOnMethodsRule$1.evaluate(NoShadowingOrOverridesOnMethodsRule.java:39)
	at com.carrotsearch.randomizedtesting.rules.StatementAdapter.evaluate(StatementAdapter.java:36)
	at org.apache.lucene.util.TestRuleAssertionsRequired$1.evaluate(TestRuleAssertionsRequired.java:43)
	at org.apache.lucene.util.TestRuleMarkFailure$1.evaluate(TestRuleMarkFailure.java:48)
	at org.apache.lucene.util.TestRuleIgnoreAfterMaxFailures$1.evaluate(TestRuleIgnoreAfterMaxFailures.java:70)
	at org.apache.lucene.util.TestRuleIgnoreTestSuites$1.evaluate(TestRuleIgnoreTestSuites.java:55)
	at com.carrotsearch.randomizedtesting.rules.StatementAdapter.evaluate(StatementAdapter.java:36)
	at com.carrotsearch.randomizedtesting.ThreadLeakControl$StatementRunner.run(ThreadLeakControl.java:358)
	at java.lang.Thread.run(Thread.java:779)
Caused by: java.lang.NullPointerException
	at org.apache.solr.util.NumberUtils.SortableStr2int(NumberUtils.java:162)
	at org.apache.solr.schema.SortableIntField.toObject(SortableIntField.java:96)
	at org.apache.solr.schema.SortableIntField.toObject(SortableIntField.java:55)
	at org.apache.solr.schema.FieldType.toObject(FieldType.java:342)
	at org.apache.solr.handler.component.AbstractStatsValues.accumulate(StatsValuesFactory.java:129)
	at org.apache.solr.handler.component.SimpleStats.getFieldCacheStats(StatsComponent.java:281)
	at org.apache.solr.handler.component.SimpleStats.getStatsFields(StatsComponent.java:227)
	at org.apache.solr.handler.component.SimpleStats.getStatsCounts(StatsComponent.java:201)
	at org.apache.solr.handler.component.StatsComponent.process(StatsComponent.java:70)
	at org.apache.solr.handler.component.SearchHandler.handleRequestBody(SearchHandler.java:206)
	at org.apache.solr.handler.RequestHandlerBase.handleRequest(RequestHandlerBase.java:129)
	at org.apache.solr.core.SolrCore.execute(SolrCore.java:1750)
	at org.apache.solr.util.TestHarness.query(TestHarness.java:364)
	at org.apache.solr.util.TestHarness.query(TestHarness.java:346)
	at org.apache.solr.util.AbstractSolrTestCase.assertQ(AbstractSolrTestCase.java:273)
	... 42 more


REGRESSION:  org.apache.solr.update.AutoCommitTest.testCommitWithin

Error Message:
shouldn't find any query failed XPath: //result[@numFound=0]  xml response was: <?xml version="1.0" encoding="UTF-8"?> <response> <lst name="responseHeader"><int name="status">0</int><int name="QTime">1114</int></lst><result name="response" numFound="1" start="0"><doc><int name="id">529</int><int name="range_facet_si">529</int><arr name="range_facet_l"><long>529</long></arr><arr name="range_facet_sl"><long>529</long></arr><arr name="field_t"><str>what's inside?</str></arr><arr name="subject"><str>info</str></arr><int name="intDefault">42</int><date name="timestamp">2012-10-28T21:53:27.372Z</date><arr name="multiDefault"><str>muLti-Default</str></arr></doc></result> </response>   request was: q=id:529&start=0&qt=standard&version=2.2&rows=20

Stack Trace:
java.lang.AssertionError: shouldn't find any query failed XPath: //result[@numFound=0]
 xml response was: <?xml version="1.0" encoding="UTF-8"?>
<response>
<lst name="responseHeader"><int name="status">0</int><int name="QTime">1114</int></lst><result name="response" numFound="1" start="0"><doc><int name="id">529</int><int name="range_facet_si">529</int><arr name="range_facet_l"><long>529</long></arr><arr name="range_facet_sl"><long>529</long></arr><arr name="field_t"><str>what's inside?</str></arr><arr name="subject"><str>info</str></arr><int name="intDefault">42</int><date name="timestamp">2012-10-28T21:53:27.372Z</date><arr name="multiDefault"><str>muLti-Default</str></arr></doc></result>
</response>

 request was: q=id:529&start=0&qt=standard&version=2.2&rows=20
	at __randomizedtesting.SeedInfo.seed([3241FF8677497ED3:889390FEF46790C6]:0)
	at org.junit.Assert.fail(Assert.java:93)
	at org.apache.solr.util.AbstractSolrTestCase.assertQ(AbstractSolrTestCase.java:276)
	at org.apache.solr.update.AutoCommitTest.testCommitWithin(AutoCommitTest.java:287)
	at sun.reflect.NativeMethodAccessorImpl.invoke0(Native Method)
	at sun.reflect.NativeMethodAccessorImpl.invoke(NativeMethodAccessorImpl.java:88)
	at sun.reflect.DelegatingMethodAccessorImpl.invoke(DelegatingMethodAccessorImpl.java:55)
	at java.lang.reflect.Method.invoke(Method.java:613)
	at com.carrotsearch.randomizedtesting.RandomizedRunner.invoke(RandomizedRunner.java:1559)
	at com.carrotsearch.randomizedtesting.RandomizedRunner.access$600(RandomizedRunner.java:79)
	at com.carrotsearch.randomizedtesting.RandomizedRunner$6.evaluate(RandomizedRunner.java:737)
	at com.carrotsearch.randomizedtesting.RandomizedRunner$7.evaluate(RandomizedRunner.java:773)
	at com.carrotsearch.randomizedtesting.RandomizedRunner$8.evaluate(RandomizedRunner.java:787)
	at com.carrotsearch.randomizedtesting.rules.SystemPropertiesRestoreRule$1.evaluate(SystemPropertiesRestoreRule.java:53)
	at org.apache.lucene.util.TestRuleSetupTeardownChained$1.evaluate(TestRuleSetupTeardownChained.java:50)
	at org.apache.lucene.util.TestRuleFieldCacheSanity$1.evaluate(TestRuleFieldCacheSanity.java:51)
	at org.apache.lucene.util.AbstractBeforeAfterRule$1.evaluate(AbstractBeforeAfterRule.java:45)
	at com.carrotsearch.randomizedtesting.rules.SystemPropertiesInvariantRule$1.evaluate(SystemPropertiesInvariantRule.java:55)
	at org.apache.lucene.util.TestRuleThreadAndTestName$1.evaluate(TestRuleThreadAndTestName.java:48)
	at org.apache.lucene.util.TestRuleIgnoreAfterMaxFailures$1.evaluate(TestRuleIgnoreAfterMaxFailures.java:70)
	at org.apache.lucene.util.TestRuleMarkFailure$1.evaluate(TestRuleMarkFailure.java:48)
	at com.carrotsearch.randomizedtesting.rules.StatementAdapter.evaluate(StatementAdapter.java:36)
	at com.carrotsearch.randomizedtesting.ThreadLeakControl$StatementRunner.run(ThreadLeakControl.java:358)
	at com.carrotsearch.randomizedtesting.ThreadLeakControl.forkTimeoutingTask(ThreadLeakControl.java:782)
	at com.carrotsearch.randomizedtesting.ThreadLeakControl$3.evaluate(ThreadLeakControl.java:442)
	at com.carrotsearch.randomizedtesting.RandomizedRunner.runSingleTest(RandomizedRunner.java:746)
	at com.carrotsearch.randomizedtesting.RandomizedRunner$3.evaluate(RandomizedRunner.java:648)
	at com.carrotsearch.randomizedtesting.RandomizedRunner$4.evaluate(RandomizedRunner.java:682)
	at com.carrotsearch.randomizedtesting.RandomizedRunner$5.evaluate(RandomizedRunner.java:693)
	at com.carrotsearch.randomizedtesting.rules.StatementAdapter.evaluate(StatementAdapter.java:36)
	at com.carrotsearch.randomizedtesting.rules.SystemPropertiesRestoreRule$1.evaluate(SystemPropertiesRestoreRule.java:53)
	at org.apache.lucene.util.AbstractBeforeAfterRule$1.evaluate(AbstractBeforeAfterRule.java:45)
	at org.apache.lucene.util.TestRuleStoreClassName$1.evaluate(TestRuleStoreClassName.java:42)
	at com.carrotsearch.randomizedtesting.rules.SystemPropertiesInvariantRule$1.evaluate(SystemPropertiesInvariantRule.java:55)
	at com.carrotsearch.randomizedtesting.rules.NoShadowingOrOverridesOnMethodsRule$1.evaluate(NoShadowingOrOverridesOnMethodsRule.java:39)
	at com.carrotsearch.randomizedtesting.rules.NoShadowingOrOverridesOnMethodsRule$1.evaluate(NoShadowingOrOverridesOnMethodsRule.java:39)
	at com.carrotsearch.randomizedtesting.rules.StatementAdapter.evaluate(StatementAdapter.java:36)
	at org.apache.lucene.util.TestRuleAssertionsRequired$1.evaluate(TestRuleAssertionsRequired.java:43)
	at org.apache.lucene.util.TestRuleMarkFailure$1.evaluate(TestRuleMarkFailure.java:48)
	at org.apache.lucene.util.TestRuleIgnoreAfterMaxFailures$1.evaluate(TestRuleIgnoreAfterMaxFailures.java:70)
	at org.apache.lucene.util.TestRuleIgnoreTestSuites$1.evaluate(TestRuleIgnoreTestSuites.java:55)
	at com.carrotsearch.randomizedtesting.rules.StatementAdapter.evaluate(StatementAdapter.java:36)
	at com.carrotsearch.randomizedtesting.ThreadLeakControl$StatementRunner.run(ThreadLeakControl.java:358)
	at java.lang.Thread.run(Thread.java:779)




Build Log:
[...truncated 8401 lines...]
[junit4:junit4] Suite: org.apache.solr.cloud.BasicDistributedZk2Test
[junit4:junit4]   2> 3 T239 oas.SolrTestCaseJ4.setUp ###Starting testDistribSearch
[junit4:junit4]   2> Creating dataDir: /mnt/ssd/jenkins/workspace/Lucene-Solr-4.x-Linux/solr/build/solr-core/test/J1/./solrtest-BasicDistributedZk2Test-1351460954824
[junit4:junit4]   2> 4 T239 oasc.ZkTestServer.run STARTING ZK TEST SERVER
[junit4:junit4]   2> 6 T240 oazs.ZooKeeperServer.setTickTime tickTime set to 1000
[junit4:junit4]   2> 7 T240 oazs.NIOServerCnxn$Factory.<init> binding to port 0.0.0.0/0.0.0.0:0
[junit4:junit4]   2> 7 T240 oazsp.FileTxnSnapLog.save Snapshotting: 0
[junit4:junit4]   2> 105 T239 oasc.ZkTestServer.run start zk server on port:34274
[junit4:junit4]   2> 106 T239 oaz.ZooKeeper.<init> Initiating client connection, connectString=127.0.0.1:34274 sessionTimeout=10000 watcher=org.apache.solr.common.cloud.ConnectionManager@7228bae4
[junit4:junit4]   2> 107 T245 oaz.ClientCnxn$SendThread.startConnect Opening socket connection to server /127.0.0.1:34274
[junit4:junit4]   2> 107 T239 oascc.ConnectionManager.waitForConnected Waiting for client to connect to ZooKeeper
[junit4:junit4]   2> 108 T245 oaz.ClientCnxn$SendThread.primeConnection Socket connection established to localhost.localdomain/127.0.0.1:34274, initiating session
[junit4:junit4]   2> 108 T241 oazs.NIOServerCnxn$Factory.run Accepted socket connection from /127.0.0.1:52725
[junit4:junit4]   2> 109 T241 oazs.NIOServerCnxn.readConnectRequest Client attempting to establish new session at /127.0.0.1:52725
[junit4:junit4]   2> 109 T243 oazsp.FileTxnLog.append Creating new log file: log.1
[junit4:junit4]   2> 200 T243 oazs.NIOServerCnxn.finishSessionInit Established session 0x13aa959a2cc0000 with negotiated timeout 10000 for client /127.0.0.1:52725
[junit4:junit4]   2> 200 T245 oaz.ClientCnxn$SendThread.readConnectResult Session establishment complete on server localhost.localdomain/127.0.0.1:34274, sessionid = 0x13aa959a2cc0000, negotiated timeout = 10000
[junit4:junit4]   2> 200 T246 oascc.ConnectionManager.process Watcher org.apache.solr.common.cloud.ConnectionManager@7228bae4 name:ZooKeeperConnection Watcher:127.0.0.1:34274 got event WatchedEvent state:SyncConnected type:None path:null path:null type:None
[junit4:junit4]   2> 201 T239 oascc.ConnectionManager.waitForConnected Client is connected to ZooKeeper
[junit4:junit4]   2> 201 T239 oascc.SolrZkClient.makePath makePath: /solr
[junit4:junit4]   2> 203 T244 oazs.PrepRequestProcessor.pRequest Processed session termination for sessionid: 0x13aa959a2cc0000
[junit4:junit4]   2> 204 T246 oaz.ClientCnxn$EventThread.run EventThread shut down
[junit4:junit4]   2> 204 T239 oaz.ZooKeeper.close Session: 0x13aa959a2cc0000 closed
[junit4:junit4]   2> 205 T241 oazs.NIOServerCnxn.closeSock Closed socket connection for client /127.0.0.1:52725 which had sessionid 0x13aa959a2cc0000
[junit4:junit4]   2> 205 T239 oaz.ZooKeeper.<init> Initiating client connection, connectString=127.0.0.1:34274/solr sessionTimeout=10000 watcher=org.apache.solr.common.cloud.ConnectionManager@e5b20876
[junit4:junit4]   2> 206 T247 oaz.ClientCnxn$SendThread.startConnect Opening socket connection to server /127.0.0.1:34274
[junit4:junit4]   2> 206 T239 oascc.ConnectionManager.waitForConnected Waiting for client to connect to ZooKeeper
[junit4:junit4]   2> 207 T247 oaz.ClientCnxn$SendThread.primeConnection Socket connection established to localhost.localdomain/127.0.0.1:34274, initiating session
[junit4:junit4]   2> 208 T241 oazs.NIOServerCnxn$Factory.run Accepted socket connection from /127.0.0.1:52726
[junit4:junit4]   2> 208 T241 oazs.NIOServerCnxn.readConnectRequest Client attempting to establish new session at /127.0.0.1:52726
[junit4:junit4]   2> 209 T243 oazs.NIOServerCnxn.finishSessionInit Established session 0x13aa959a2cc0001 with negotiated timeout 10000 for client /127.0.0.1:52726
[junit4:junit4]   2> 209 T247 oaz.ClientCnxn$SendThread.readConnectResult Session establishment complete on server localhost.localdomain/127.0.0.1:34274, sessionid = 0x13aa959a2cc0001, negotiated timeout = 10000
[junit4:junit4]   2> 210 T248 oascc.ConnectionManager.process Watcher org.apache.solr.common.cloud.ConnectionManager@e5b20876 name:ZooKeeperConnection Watcher:127.0.0.1:34274/solr got event WatchedEvent state:SyncConnected type:None path:null path:null type:None
[junit4:junit4]   2> 210 T239 oascc.ConnectionManager.waitForConnected Client is connected to ZooKeeper
[junit4:junit4]   2> 211 T239 oascc.SolrZkClient.makePath makePath: /collections/collection1
[junit4:junit4]   2> 213 T239 oascc.SolrZkClient.makePath makePath: /collections/collection1/shards
[junit4:junit4]   2> 216 T239 oascc.SolrZkClient.makePath makePath: /collections/control_collection
[junit4:junit4]   2> 218 T239 oascc.SolrZkClient.makePath makePath: /collections/control_collection/shards
[junit4:junit4]   2> 221 T239 oasc.AbstractZkTestCase.putConfig put /mnt/ssd/jenkins/workspace/Lucene-Solr-4.x-Linux/solr/build/solr-core/test-files/solr/collection1/conf/solrconfig.xml to /configs/conf1/solrconfig.xml
[junit4:junit4]   2> 222 T239 oascc.SolrZkClient.makePath makePath: /configs/conf1/solrconfig.xml
[junit4:junit4]   2> 229 T239 oasc.AbstractZkTestCase.putConfig put /mnt/ssd/jenkins/workspace/Lucene-Solr-4.x-Linux/solr/build/solr-core/test-files/solr/collection1/conf/schema.xml to /configs/conf1/schema.xml
[junit4:junit4]   2> 230 T239 oascc.SolrZkClient.makePath makePath: /configs/conf1/schema.xml
[junit4:junit4]   2> 234 T239 oasc.AbstractZkTestCase.putConfig put /mnt/ssd/jenkins/workspace/Lucene-Solr-4.x-Linux/solr/build/solr-core/test-files/solr/collection1/conf/solrconfig.xml to /configs/conf1/solrconfig.xml
[junit4:junit4]   2> 235 T239 oascc.SolrZkClient.makePath makePath: /configs/conf1/solrconfig.xml
[junit4:junit4]   2> 239 T239 oasc.AbstractZkTestCase.putConfig put /mnt/ssd/jenkins/workspace/Lucene-Solr-4.x-Linux/solr/build/solr-core/test-files/solr/collection1/conf/stopwords.txt to /configs/conf1/stopwords.txt
[junit4:junit4]   2> 240 T239 oascc.SolrZkClient.makePath makePath: /configs/conf1/stopwords.txt
[junit4:junit4]   2> 242 T239 oasc.AbstractZkTestCase.putConfig put /mnt/ssd/jenkins/workspace/Lucene-Solr-4.x-Linux/solr/build/solr-core/test-files/solr/collection1/conf/protwords.txt to /configs/conf1/protwords.txt
[junit4:junit4]   2> 243 T239 oascc.SolrZkClient.makePath makePath: /configs/conf1/protwords.txt
[junit4:junit4]   2> 247 T239 oasc.AbstractZkTestCase.putConfig put /mnt/ssd/jenkins/workspace/Lucene-Solr-4.x-Linux/solr/build/solr-core/test-files/solr/collection1/conf/currency.xml to /configs/conf1/currency.xml
[junit4:junit4]   2> 248 T239 oascc.SolrZkClient.makePath makePath: /configs/conf1/currency.xml
[junit4:junit4]   2> 250 T239 oasc.AbstractZkTestCase.putConfig put /mnt/ssd/jenkins/workspace/Lucene-Solr-4.x-Linux/solr/build/solr-core/test-files/solr/collection1/conf/open-exchange-rates.json to /configs/conf1/open-exchange-rates.json
[junit4:junit4]   2> 251 T239 oascc.SolrZkClient.makePath makePath: /configs/conf1/open-exchange-rates.json
[junit4:junit4]   2> 260 T239 oasc.AbstractZkTestCase.putConfig put /mnt/ssd/jenkins/workspace/Lucene-Solr-4.x-Linux/solr/build/solr-core/test-files/solr/collection1/conf/mapping-ISOLatin1Accent.txt to /configs/conf1/mapping-ISOLatin1Accent.txt
[junit4:junit4]   2> 261 T239 oascc.SolrZkClient.makePath makePath: /configs/conf1/mapping-ISOLatin1Accent.txt
[junit4:junit4]   2> 264 T239 oasc.AbstractZkTestCase.putConfig put /mnt/ssd/jenkins/workspace/Lucene-Solr-4.x-Linux/solr/build/solr-core/test-files/solr/collection1/conf/old_synonyms.txt to /configs/conf1/old_synonyms.txt
[junit4:junit4]   2> 265 T239 oascc.SolrZkClient.makePath makePath: /configs/conf1/old_synonyms.txt
[junit4:junit4]   2> 269 T239 oasc.AbstractZkTestCase.putConfig put /mnt/ssd/jenkins/workspace/Lucene-Solr-4.x-Linux/solr/build/solr-core/test-files/solr/collection1/conf/synonyms.txt to /configs/conf1/synonyms.txt
[junit4:junit4]   2> 269 T239 oascc.SolrZkClient.makePath makePath: /configs/conf1/synonyms.txt
[junit4:junit4]   2> 272 T244 oazs.PrepRequestProcessor.pRequest Processed session termination for sessionid: 0x13aa959a2cc0001
[junit4:junit4]   2> 273 T248 oaz.ClientCnxn$EventThread.run EventThread shut down
[junit4:junit4]   2> 273 T241 oazs.NIOServerCnxn.closeSock Closed socket connection for client /127.0.0.1:52726 which had sessionid 0x13aa959a2cc0001
[junit4:junit4]   2> 273 T239 oaz.ZooKeeper.close Session: 0x13aa959a2cc0001 closed
[junit4:junit4]   2> 275 T239 oejs.Server.doStart jetty-8.1.2.v20120308
[junit4:junit4]   2> 280 T239 oejs.AbstractConnector.doStart Started SelectChannelConnector@0.0.0.0:36004
[junit4:junit4]   2> 281 T239 oasc.SolrResourceLoader.locateSolrHome JNDI not configured for solr (NoInitialContextEx)
[junit4:junit4]   2> 282 T239 oasc.SolrResourceLoader.locateSolrHome using system property solr.solr.home: /mnt/ssd/jenkins/workspace/Lucene-Solr-4.x-Linux/solr/build/solr-core/test-files/solr
[junit4:junit4]   2> 283 T239 oasc.SolrResourceLoader.<init> new SolrResourceLoader for deduced Solr Home: '/mnt/ssd/jenkins/workspace/Lucene-Solr-4.x-Linux/solr/build/solr-core/test-files/solr/'
[junit4:junit4]   2> 299 T239 oass.SolrDispatchFilter.init SolrDispatchFilter.init()
[junit4:junit4]   2> 299 T239 oasc.SolrResourceLoader.locateSolrHome JNDI not configured for solr (NoInitialContextEx)
[junit4:junit4]   2> 300 T239 oasc.SolrResourceLoader.locateSolrHome using system property solr.solr.home: /mnt/ssd/jenkins/workspace/Lucene-Solr-4.x-Linux/solr/build/solr-core/test-files/solr
[junit4:junit4]   2> 301 T239 oasc.CoreContainer$Initializer.initialize looking for solr.xml: /mnt/ssd/jenkins/workspace/Lucene-Solr-4.x-Linux/solr/build/solr-core/test-files/solr/solr.xml
[junit4:junit4]   2> 301 T239 oasc.CoreContainer.<init> New CoreContainer 839375154
[junit4:junit4]   2> 302 T239 oasc.CoreContainer.load Loading CoreContainer using Solr Home: '/mnt/ssd/jenkins/workspace/Lucene-Solr-4.x-Linux/solr/build/solr-core/test-files/solr/'
[junit4:junit4]   2> 303 T239 oasc.SolrResourceLoader.<init> new SolrResourceLoader for directory: '/mnt/ssd/jenkins/workspace/Lucene-Solr-4.x-Linux/solr/build/solr-core/test-files/solr/'
[junit4:junit4]   2> 320 T239 oasc.CoreContainer.load Registering Log Listener
[junit4:junit4]   2> 333 T239 oasc.CoreContainer.initZooKeeper Zookeeper client=127.0.0.1:34274/solr
[junit4:junit4]   2> 334 T239 oaz.ZooKeeper.<init> Initiating client connection, connectString=127.0.0.1:34274/solr sessionTimeout=5000 watcher=org.apache.solr.common.cloud.ConnectionManager@5a745d8b
[junit4:junit4]   2> 336 T258 oaz.ClientCnxn$SendThread.startConnect Opening socket connection to server /127.0.0.1:34274
[junit4:junit4]   2> 336 T239 oascc.ConnectionManager.waitForConnected Waiting for client to connect to ZooKeeper
[junit4:junit4]   2> 337 T241 oazs.NIOServerCnxn$Factory.run Accepted socket connection from /127.0.0.1:52727
[junit4:junit4]   2> 337 T258 oaz.ClientCnxn$SendThread.primeConnection Socket connection established to localhost.localdomain/127.0.0.1:34274, initiating session
[junit4:junit4]   2> 338 T241 oazs.NIOServerCnxn.readConnectRequest Client attempting to establish new session at /127.0.0.1:52727
[junit4:junit4]   2> 339 T243 oazs.NIOServerCnxn.finishSessionInit Established session 0x13aa959a2cc0002 with negotiated timeout 5000 for client /127.0.0.1:52727
[junit4:junit4]   2> 339 T258 oaz.ClientCnxn$SendThread.readConnectResult Session establishment complete on server localhost.localdomain/127.0.0.1:34274, sessionid = 0x13aa959a2cc0002, negotiated timeout = 5000
[junit4:junit4]   2> 339 T259 oascc.ConnectionManager.process Watcher org.apache.solr.common.cloud.ConnectionManager@5a745d8b name:ZooKeeperConnection Watcher:127.0.0.1:34274/solr got event WatchedEvent state:SyncConnected type:None path:null path:null type:None
[junit4:junit4]   2> 339 T239 oascc.ConnectionManager.waitForConnected Client is connected to ZooKeeper
[junit4:junit4]   2> 341 T244 oazs.PrepRequestProcessor.pRequest Got user-level KeeperException when processing sessionid:0x13aa959a2cc0002 type:create cxid:0x2 zxid:0xfffffffffffffffe txntype:unknown reqpath:n/a Error Path:/solr/overseer Error:KeeperErrorCode = NodeExists for /solr/overseer
[junit4:junit4]   2> 342 T239 oascc.SolrZkClient.makePath makePath: /live_nodes
[junit4:junit4]   2> 344 T239 oasc.ZkController.createEphemeralLiveNode Register node as live in ZooKeeper:/live_nodes/127.0.0.1:36004_solr
[junit4:junit4]   2> 344 T244 oazs.PrepRequestProcessor.pRequest Got user-level KeeperException when processing sessionid:0x13aa959a2cc0002 type:delete cxid:0x7 zxid:0xfffffffffffffffe txntype:unknown reqpath:n/a Error Path:/solr/live_nodes/127.0.0.1:36004_solr Error:KeeperErrorCode = NoNode for /solr/live_nodes/127.0.0.1:36004_solr
[junit4:junit4]   2> 345 T239 oascc.SolrZkClient.makePath makePath: /live_nodes/127.0.0.1:36004_solr
[junit4:junit4]   2> 347 T239 oashc.HttpShardHandlerFactory.getParameter Setting socketTimeout to: 0
[junit4:junit4]   2> 348 T239 oashc.HttpShardHandlerFactory.getParameter Setting urlScheme to: http://
[junit4:junit4]   2> 349 T239 oashc.HttpShardHandlerFactory.getParameter Setting connTimeout to: 0
[junit4:junit4]   2> 349 T239 oashc.HttpShardHandlerFactory.getParameter Setting maxConnectionsPerHost to: 20
[junit4:junit4]   2> 350 T239 oashc.HttpShardHandlerFactory.getParameter Setting corePoolSize to: 0
[junit4:junit4]   2> 351 T239 oashc.HttpShardHandlerFactory.getParameter Setting maximumPoolSize to: 2147483647
[junit4:junit4]   2> 351 T239 oashc.HttpShardHandlerFactory.getParameter Setting maxThreadIdleTime to: 5
[junit4:junit4]   2> 352 T239 oashc.HttpShardHandlerFactory.getParameter Setting sizeOfQueue to: -1
[junit4:junit4]   2> 353 T239 oashc.HttpShardHandlerFactory.getParameter Setting fairnessPolicy to: false
[junit4:junit4]   2> 354 T239 oascsi.HttpClientUtil.createClient Creating new http client, config:maxConnectionsPerHost=20&maxConnections=10000&socketTimeout=0&connTimeout=0&retry=false
[junit4:junit4]   2> 364 T239 oascc.SolrZkClient.makePath makePath: /overseer_elect/election
[junit4:junit4]   2> 369 T244 oazs.PrepRequestProcessor.pRequest Got user-level KeeperException when processing sessionid:0x13aa959a2cc0002 type:delete cxid:0x15 zxid:0xfffffffffffffffe txntype:unknown reqpath:n/a Error Path:/solr/overseer_elect/leader Error:KeeperErrorCode = NoNode for /solr/overseer_elect/leader
[junit4:junit4]   2> 370 T239 oascc.SolrZkClient.makePath makePath: /overseer_elect/leader
[junit4:junit4]   2> 373 T239 oasc.Overseer.start Overseer (id=88569345135607810-127.0.0.1:36004_solr-n_0000000000) starting
[junit4:junit4]   2> 374 T244 oazs.PrepRequestProcessor.pRequest Got user-level KeeperException when processing sessionid:0x13aa959a2cc0002 type:create cxid:0x1a zxid:0xfffffffffffffffe txntype:unknown reqpath:n/a Error Path:/solr/overseer Error:KeeperErrorCode = NodeExists for /solr/overseer
[junit4:junit4]   2> 374 T244 oazs.PrepRequestProcessor.pRequest Got user-level KeeperException when processing sessionid:0x13aa959a2cc0002 type:create cxid:0x1b zxid:0xfffffffffffffffe txntype:unknown reqpath:n/a Error Path:/solr/overseer Error:KeeperErrorCode = NodeExists for /solr/overseer
[junit4:junit4]   2> 375 T244 oazs.PrepRequestProcessor.pRequest Got user-level KeeperException when processing sessionid:0x13aa959a2cc0002 type:create cxid:0x1c zxid:0xfffffffffffffffe txntype:unknown reqpath:n/a Error Path:/solr/overseer Error:KeeperErrorCode = NodeExists for /solr/overseer
[junit4:junit4]   2> 376 T244 oazs.PrepRequestProcessor.pRequest Got user-level KeeperException when processing sessionid:0x13aa959a2cc0002 type:create cxid:0x1d zxid:0xfffffffffffffffe txntype:unknown reqpath:n/a Error Path:/solr/overseer Error:KeeperErrorCode = NodeExists for /solr/overseer
[junit4:junit4]   2> 376 T261 oasc.OverseerCollectionProcessor.run Process current queue of collection creations
[junit4:junit4]   2> 378 T239 oascc.SolrZkClient.makePath makePath: /clusterstate.json
[junit4:junit4]   2> 382 T239 oascc.ZkStateReader.createClusterStateWatchersAndUpdate Updating cluster state from ZooKeeper... 
[junit4:junit4]   2> 387 T260 oasc.Overseer$ClusterStateUpdater.run Starting to work on the main queue
[junit4:junit4]   2> 387 T239 oasc.CoreContainer.create Creating SolrCore 'collection1' using instanceDir: /mnt/ssd/jenkins/workspace/Lucene-Solr-4.x-Linux/solr/build/solr-core/test-files/solr/collection1
[junit4:junit4]   2> 388 T239 oasc.ZkController.createCollectionZkNode Check for collection zkNode:control_collection
[junit4:junit4]   2> 390 T239 oasc.ZkController.createCollectionZkNode Collection zkNode exists
[junit4:junit4]   2> 391 T239 oasc.ZkController.readConfigName Load collection config from:/collections/control_collection
[junit4:junit4]   2> 393 T239 oasc.SolrResourceLoader.<init> new SolrResourceLoader for directory: '/mnt/ssd/jenkins/workspace/Lucene-Solr-4.x-Linux/solr/build/solr-core/test-files/solr/collection1/'
[junit4:junit4]   2> 395 T239 oasc.SolrResourceLoader.replaceClassLoader Adding 'file:/mnt/ssd/jenkins/workspace/Lucene-Solr-4.x-Linux/solr/build/solr-core/test-files/solr/collection1/lib/README' to classloader
[junit4:junit4]   2> 396 T239 oasc.SolrResourceLoader.replaceClassLoader Adding 'file:/mnt/ssd/jenkins/workspace/Lucene-Solr-4.x-Linux/solr/build/solr-core/test-files/solr/collection1/lib/classes/' to classloader
[junit4:junit4]   2> 441 T239 oasc.SolrConfig.<init> Using Lucene MatchVersion: LUCENE_41
[junit4:junit4]   2> 497 T239 oasc.SolrConfig.<init> Loaded SolrConfig: solrconfig.xml
[junit4:junit4]   2> 499 T239 oass.IndexSchema.readSchema Reading Solr Schema
[junit4:junit4]   2> 508 T239 oass.IndexSchema.readSchema Schema name=test
[junit4:junit4]   2> 1036 T239 oass.OpenExchangeRatesOrgProvider.init Initialized with rates=open-exchange-rates.json, refreshInterval=1440.
[junit4:junit4]   2> 1047 T239 oass.IndexSchema.readSchema default search field in schema is text
[junit4:junit4]   2> 1053 T239 oass.IndexSchema.readSchema unique key field: id
[junit4:junit4]   2> 1091 T239 oass.FileExchangeRateProvider.reload Reloading exchange rates from file currency.xml
[junit4:junit4]   2> 1098 T239 oass.FileExchangeRateProvider.reload Reloading exchange rates from file currency.xml
[junit4:junit4]   2> 1109 T239 oass.OpenExchangeRatesOrgProvider.reload Reloading exchange rates from open-exchange-rates.json
[junit4:junit4]   2> 1118 T239 oass.OpenExchangeRatesOrgProvider.reload Reloading exchange rates from open-exchange-rates.json
[junit4:junit4]   2> 1125 T239 oasc.SolrCore.<init> [collection1] Opening new SolrCore at /mnt/ssd/jenkins/workspace/Lucene-Solr-4.x-Linux/solr/build/solr-core/test-files/solr/collection1/, dataDir=./org.apache.solr.cloud.BasicDistributedZk2Test-1351460954824/control/data/
[junit4:junit4]   2> 1125 T239 oasc.JmxMonitoredMap.<init> JMX monitoring is enabled. Adding Solr mbeans to JMX Server: com.sun.jmx.mbeanserver.JmxMBeanServer@d9bc6930
[junit4:junit4]   2> 1126 T239 oasc.SolrCore.getNewIndexDir New index directory detected: old=null new=./org.apache.solr.cloud.BasicDistributedZk2Test-1351460954824/control/data/index/
[junit4:junit4]   2> 1127 T239 oasc.SolrCore.initIndex WARNING [collection1] Solr index directory './org.apache.solr.cloud.BasicDistributedZk2Test-1351460954824/control/data/index' doesn't exist. Creating new index...
[junit4:junit4]   2> 1128 T239 oasc.CachingDirectoryFactory.get return new directory for /mnt/ssd/jenkins/workspace/Lucene-Solr-4.x-Linux/solr/build/solr-core/test/J1/./org.apache.solr.cloud.BasicDistributedZk2Test-1351460954824/control/data/index forceNew:false
[junit4:junit4]   2> 1229 T239 oasc.SolrDeletionPolicy.onCommit SolrDeletionPolicy.onCommit: commits:num=1
[junit4:junit4]   2> 		commit{dir=NRTCachingDirectory(org.apache.lucene.store.MMapDirectory@/mnt/ssd/jenkins/workspace/Lucene-Solr-4.x-Linux/solr/build/solr-core/test/J1/org.apache.solr.cloud.BasicDistributedZk2Test-1351460954824/control/data/index lockFactory=org.apache.lucene.store.NativeFSLockFactory@eba722c2; maxCacheMB=48.0 maxMergeSizeMB=4.0),segFN=segments_1,generation=1,filenames=[segments_1]
[junit4:junit4]   2> 1230 T239 oasc.SolrDeletionPolicy.updateCommits newest commit = 1
[junit4:junit4]   2> 1231 T239 oasc.SolrCore.initWriters created xml: solr.XMLResponseWriter
[junit4:junit4]   2> 1235 T239 oasup.UpdateRequestProcessorChain.init inserting DistributedUpdateProcessorFactory into updateRequestProcessorChain "dedupe"
[junit4:junit4]   2> 1236 T239 oasup.UpdateRequestProcessorChain.init inserting DistributedUpdateProcessorFactory into updateRequestProcessorChain "dedupe-allfields"
[junit4:junit4]   2> 1236 T239 oasup.UpdateRequestProcessorChain.init inserting DistributedUpdateProcessorFactory into updateRequestProcessorChain "stored_sig"
[junit4:junit4]   2> 1239 T239 oasup.UpdateRequestProcessorChain.init inserting DistributedUpdateProcessorFactory into updateRequestProcessorChain "uniq-fields"
[junit4:junit4]   2> 1241 T239 oasup.UpdateRequestProcessorChain.init inserting DistributedUpdateProcessorFactory into updateRequestProcessorChain "distrib-dup-test-chain-implicit"
[junit4:junit4]   2> 1242 T239 oasc.RequestHandlers.initHandlersFromConfig adding lazy requestHandler: solr.ReplicationHandler
[junit4:junit4]   2> 1245 T239 oasc.RequestHandlers.initHandlersFromConfig created /replication: solr.ReplicationHandler
[junit4:junit4]   2> 1246 T239 oasc.RequestHandlers.initHandlersFromConfig created standard: solr.StandardRequestHandler
[junit4:junit4]   2> 1247 T239 oasc.RequestHandlers.initHandlersFromConfig created /get: solr.RealTimeGetHandler
[junit4:junit4]   2> 1251 T239 oasc.RequestHandlers.initHandlersFromConfig created dismax: solr.SearchHandler
[junit4:junit4]   2> 1252 T239 oasc.RequestHandlers.initHandlersFromConfig created mock: org.apache.solr.core.MockQuerySenderListenerReqHandler
[junit4:junit4]   2> 1253 T239 oasc.RequestHandlers.initHandlersFromConfig created /admin/: org.apache.solr.handler.admin.AdminHandlers
[junit4:junit4]   2> 1254 T239 oasc.RequestHandlers.initHandlersFromConfig created defaults: solr.StandardRequestHandler
[junit4:junit4]   2> 1255 T239 oasc.RequestHandlers.initHandlersFromConfig adding lazy requestHandler: solr.StandardRequestHandler
[junit4:junit4]   2> 1256 T239 oasc.RequestHandlers.initHandlersFromConfig created lazy: solr.StandardRequestHandler
[junit4:junit4]   2> 1259 T239 oasc.RequestHandlers.initHandlersFromConfig created /update: solr.UpdateRequestHandler
[junit4:junit4]   2> 1266 T239 oasc.RequestHandlers.initHandlersFromConfig created /terms: org.apache.solr.handler.component.SearchHandler
[junit4:junit4]   2> 1270 T239 oasc.RequestHandlers.initHandlersFromConfig created spellCheckCompRH: org.apache.solr.handler.component.SearchHandler
[junit4:junit4]   2> 1271 T239 oasc.RequestHandlers.initHandlersFromConfig created spellCheckCompRH_Direct: org.apache.solr.handler.component.SearchHandler
[junit4:junit4]   2> 1272 T239 oasc.RequestHandlers.initHandlersFromConfig created spellCheckWithWordbreak: org.apache.solr.handler.component.SearchHandler
[junit4:junit4]   2> 1274 T239 oasc.RequestHandlers.initHandlersFromConfig created spellCheckWithWordbreak_Direct: org.apache.solr.handler.component.SearchHandler
[junit4:junit4]   2> 1275 T239 oasc.RequestHandlers.initHandlersFromConfig created spellCheckCompRH1: org.apache.solr.handler.component.SearchHandler
[junit4:junit4]   2> 1276 T239 oasc.RequestHandlers.initHandlersFromConfig created tvrh: org.apache.solr.handler.component.SearchHandler
[junit4:junit4]   2> 1282 T239 oasc.RequestHandlers.initHandlersFromConfig created /mlt: solr.MoreLikeThisHandler
[junit4:junit4]   2> 1287 T239 oasc.RequestHandlers.initHandlersFromConfig created /debug/dump: solr.DumpRequestHandler
[junit4:junit4]   2> 1289 T239 oashl.XMLLoader.init xsltCacheLifetimeSeconds=60
[junit4:junit4]   2> 1292 T239 oasc.SolrCore.initDeprecatedSupport WARNING solrconfig.xml uses deprecated <admin/gettableFiles>, Please update your config to use the ShowFileRequestHandler.
[junit4:junit4]   2> 1300 T239 oasc.SolrCore.initDeprecatedSupport WARNING adding ShowFileRequestHandler with hidden files: [OLD_SYNONYMS.TXT, PROTWORDS.TXT, STOPWORDS.TXT, OPEN-EXCHANGE-RATES.JSON, CURRENCY.XML, SCHEMA.XML, SYNONYMS.TXT, MAPPING-ISOLATIN1ACCENT.TXT]
[junit4:junit4]   2> 1310 T239 oass.SolrIndexSearcher.<init> Opening Searcher@e40d25f0 main
[junit4:junit4]   2> 1311 T239 oasu.CommitTracker.<init> Hard AutoCommit: disabled
[junit4:junit4]   2> 1312 T239 oasu.CommitTracker.<init> Soft AutoCommit: disabled
[junit4:junit4]   2> 1313 T239 oashc.SpellCheckComponent.inform Initializing spell checkers
[junit4:junit4]   2> 1410 T239 oass.DirectSolrSpellChecker.init init: {name=direct,classname=DirectSolrSpellChecker,field=lowerfilt,minQueryLength=3}
[junit4:junit4]   2> 1443 T262 oasc.SolrCore.registerSearcher [collection1] Registered new searcher Searcher@e40d25f0 main{StandardDirectoryReader(segments_1:1)}
[junit4:junit4]   2> 1451 T239 oasc.ZkController.publish numShards not found on descriptor - reading it from system property
[junit4:junit4]   2> 1454 T244 oazs.PrepRequestProcessor.pRequest Got user-level KeeperException when processing sessionid:0x13aa959a2cc0002 type:create cxid:0x56 zxid:0xfffffffffffffffe txntype:unknown reqpath:n/a Error Path:/solr/overseer/queue Error:KeeperErrorCode = NoNode for /solr/overseer/queue
[junit4:junit4]   2> 1460 T239 oasc.CoreContainer.register registering core: collection1
[junit4:junit4]   2> 1461 T239 oasc.ZkController.register Register shard - core:collection1 address:http://127.0.0.1:36004/solr shardId:control_shard
[junit4:junit4]   2> 1464 T239 oascc.SolrZkClient.makePath makePath: /collections/control_collection/leader_elect/control_shard/election
[junit4:junit4]   2> 1473 T244 oazs.PrepRequestProcessor.pRequest Got user-level KeeperException when processing sessionid:0x13aa959a2cc0002 type:delete cxid:0x65 zxid:0xfffffffffffffffe txntype:unknown reqpath:n/a Error Path:/solr/collections/control_collection/leaders Error:KeeperErrorCode = NoNode for /solr/collections/control_collection/leaders
[junit4:junit4]   2> 1474 T239 oasc.ShardLeaderElectionContext.runLeaderProcess Running the leader process.
[junit4:junit4]   2> 1476 T244 oazs.PrepRequestProcessor.pRequest Got user-level KeeperException when processing sessionid:0x13aa959a2cc0002 type:create cxid:0x66 zxid:0xfffffffffffffffe txntype:unknown reqpath:n/a Error Path:/solr/overseer Error:KeeperErrorCode = NodeExists for /solr/overseer
[junit4:junit4]   2> 1903 T260 oascc.ZkStateReader.updateClusterState Updating cloud state from ZooKeeper... 
[junit4:junit4]   2> 1904 T260 oasc.Overseer$ClusterStateUpdater.updateState Update state numShards=null message={
[junit4:junit4]   2> 	  "base_url":"http://127.0.0.1:36004/solr",
[junit4:junit4]   2> 	  "state":"down",
[junit4:junit4]   2> 	  "operation":"state",
[junit4:junit4]   2> 	  "node_name":"127.0.0.1:36004_solr",
[junit4:junit4]   2> 	  "numShards":null,
[junit4:junit4]   2> 	  "roles":null,
[junit4:junit4]   2> 	  "collection":"control_collection",
[junit4:junit4]   2> 	  "shard":"control_shard",
[junit4:junit4]   2> 	  "core":"collection1"}
[junit4:junit4]   2> 1904 T244 oazs.PrepRequestProcessor.pRequest Got user-level KeeperException when processing sessionid:0x13aa959a2cc0002 type:create cxid:0x6d zxid:0xfffffffffffffffe txntype:unknown reqpath:n/a Error Path:/solr/overseer/queue-work Error:KeeperErrorCode = NoNode for /solr/overseer/queue-work
[junit4:junit4]   2> 1912 T259 oascc.ZkStateReader$2.process A cluster state change has occurred - updating... (1)
[junit4:junit4]   2> 1978 T239 oasc.ShardLeaderElectionContext.waitForReplicasToComeUp Enough replicas found to continue.
[junit4:junit4]   2> 1979 T239 oasc.ShardLeaderElectionContext.runLeaderProcess I may be the new leader - try and sync
[junit4:junit4]   2> 1980 T239 oasc.SyncStrategy.sync Sync replicas to http://127.0.0.1:36004/solr/collection1/
[junit4:junit4]   2> 1981 T239 oasc.SyncStrategy.syncReplicas Sync Success - now sync replicas to me
[junit4:junit4]   2> 1981 T239 oasc.SyncStrategy.syncToMe http://127.0.0.1:36004/solr/collection1/ has no replicas
[junit4:junit4]   2> 1982 T239 oasc.ShardLeaderElectionContext.runLeaderProcess I am the new leader: http://127.0.0.1:36004/solr/collection1/
[junit4:junit4]   2> 1983 T239 oascc.SolrZkClient.makePath makePath: /collections/control_collection/leaders/control_shard
[junit4:junit4]   2> 1988 T244 oazs.PrepRequestProcessor.pRequest Got user-level KeeperException when processing sessionid:0x13aa959a2cc0002 type:create cxid:0x8b zxid:0xfffffffffffffffe txntype:unknown reqpath:n/a Error Path:/solr/overseer Error:KeeperErrorCode = NodeExists for /solr/overseer
[junit4:junit4]   2> 2417 T260 oascc.ZkStateReader.updateClusterState Updating cloud state from ZooKeeper... 
[junit4:junit4]   2> 2422 T259 oascc.ZkStateReader$2.process A cluster state change has occurred - updating... (1)
[junit4:junit4]   2> 2441 T239 oasc.ZkController.register We are http://127.0.0.1:36004/solr/collection1/ and leader is http://127.0.0.1:36004/solr/collection1/
[junit4:junit4]   2> 2442 T239 oasc.ZkController.register No LogReplay needed for core=collection1 baseURL=http://127.0.0.1:36004/solr
[junit4:junit4]   2> 2443 T239 oasc.ZkController.checkRecovery I am the leader, no recovery necessary
[junit4:junit4]   2> 2444 T239 oasc.ZkController.publish numShards not found on descriptor - reading it from system property
[junit4:junit4]   2> 2447 T239 oascc.ZkStateReader.updateClusterState Updating cloud state from ZooKeeper... 
[junit4:junit4]   2> 2449 T239 oass.SolrDispatchFilter.init user.dir=/mnt/ssd/jenkins/workspace/Lucene-Solr-4.x-Linux/solr/build/solr-core/test/J1
[junit4:junit4]   2> 2450 T239 oass.SolrDispatchFilter.init SolrDispatchFilter.init() done
[junit4:junit4]   2> 2450 T239 oascsi.HttpClientUtil.createClient Creating new http client, config:maxConnections=128&maxConnectionsPerHost=32&followRedirects=false
[junit4:junit4]   2> 2665 T239 oejs.Server.doStart jetty-8.1.2.v20120308
[junit4:junit4]   2> 2668 T239 oejs.AbstractConnector.doStart Started SelectChannelConnector@0.0.0.0:58956
[junit4:junit4]   2> 2676 T239 oasc.SolrResourceLoader.locateSolrHome JNDI not configured for solr (NoInitialContextEx)
[junit4:junit4]   2> 2677 T239 oasc.SolrResourceLoader.locateSolrHome using system property solr.solr.home: /mnt/ssd/jenkins/workspace/Lucene-Solr-4.x-Linux/solr/build/solr-core/test/J1/./solrtest-jetty1-1351460957302
[junit4:junit4]   2> 2679 T239 oasc.SolrResourceLoader.<init> new SolrResourceLoader for deduced Solr Home: '/mnt/ssd/jenkins/workspace/Lucene-Solr-4.x-Linux/solr/build/solr-core/test/J1/./solrtest-jetty1-1351460957302/'
[junit4:junit4]   2> 2705 T239 oass.SolrDispatchFilter.init SolrDispatchFilter.init()
[junit4:junit4]   2> 2707 T239 oasc.SolrResourceLoader.locateSolrHome JNDI not configured for solr (NoInitialContextEx)
[junit4:junit4]   2> 2708 T239 oasc.SolrResourceLoader.locateSolrHome using system property solr.solr.home: /mnt/ssd/jenkins/workspace/Lucene-Solr-4.x-Linux/solr/build/solr-core/test/J1/./solrtest-jetty1-1351460957302
[junit4:junit4]   2> 2709 T239 oasc.CoreContainer$Initializer.initialize looking for solr.xml: /mnt/ssd/jenkins/workspace/Lucene-Solr-4.x-Linux/solr/build/solr-core/test/J1/./solrtest-jetty1-1351460957302/solr.xml
[junit4:junit4]   2> 2710 T239 oasc.CoreContainer.<init> New CoreContainer 114463358
[junit4:junit4]   2> 2717 T239 oasc.CoreContainer.load Loading CoreContainer using Solr Home: '/mnt/ssd/jenkins/workspace/Lucene-Solr-4.x-Linux/solr/build/solr-core/test/J1/./solrtest-jetty1-1351460957302/'
[junit4:junit4]   2> 2717 T239 oasc.SolrResourceLoader.<init> new SolrResourceLoader for directory: '/mnt/ssd/jenkins/workspace/Lucene-Solr-4.x-Linux/solr/build/solr-core/test/J1/./solrtest-jetty1-1351460957302/'
[junit4:junit4]   2> 2750 T239 oasc.CoreContainer.load Registering Log Listener
[junit4:junit4]   2> 2774 T239 oasc.CoreContainer.initZooKeeper Zookeeper client=127.0.0.1:34274/solr
[junit4:junit4]   2> 2775 T239 oaz.ZooKeeper.<init> Initiating client connection, connectString=127.0.0.1:34274/solr sessionTimeout=5000 watcher=org.apache.solr.common.cloud.ConnectionManager@2a15d31
[junit4:junit4]   2> 2779 T239 oascc.ConnectionManager.waitForConnected Waiting for client to connect to ZooKeeper
[junit4:junit4]   2> 2793 T276 oaz.ClientCnxn$SendThread.startConnect Opening socket connection to server /127.0.0.1:34274
[junit4:junit4]   2> 2794 T241 oazs.NIOServerCnxn$Factory.run Accepted socket connection from /127.0.0.1:52729
[junit4:junit4]   2> 2794 T276 oaz.ClientCnxn$SendThread.primeConnection Socket connection established to localhost.localdomain/127.0.0.1:34274, initiating session
[junit4:junit4]   2> 2795 T241 oazs.NIOServerCnxn.readConnectRequest Client attempting to establish new session at /127.0.0.1:52729
[junit4:junit4]   2> 2796 T243 oazs.NIOServerCnxn.finishSessionInit Established session 0x13aa959a2cc0003 with negotiated timeout 5000 for client /127.0.0.1:52729
[junit4:junit4]   2> 2797 T276 oaz.ClientCnxn$SendThread.readConnectResult Session establishment complete on server localhost.localdomain/127.0.0.1:34274, sessionid = 0x13aa959a2cc0003, negotiated timeout = 5000
[junit4:junit4]   2> 2798 T277 oascc.ConnectionManager.process Watcher org.apache.solr.common.cloud.ConnectionManager@2a15d31 name:ZooKeeperConnection Watcher:127.0.0.1:34274/solr got event WatchedEvent state:SyncConnected type:None path:null path:null type:None
[junit4:junit4]   2> 2798 T239 oascc.ConnectionManager.waitForConnected Client is connected to ZooKeeper
[junit4:junit4]   2> 2800 T244 oazs.PrepRequestProcessor.pRequest Got user-level KeeperException when processing sessionid:0x13aa959a2cc0003 type:create cxid:0x1 zxid:0xfffffffffffffffe txntype:unknown reqpath:n/a Error Path:/solr/overseer Error:KeeperErrorCode = NodeExists for /solr/overseer
[junit4:junit4]   2> 2801 T244 oazs.PrepRequestProcessor.pRequest Got user-level KeeperException when processing sessionid:0x13aa959a2cc0003 type:create cxid:0x2 zxid:0xfffffffffffffffe txntype:unknown reqpath:n/a Error Path:/solr/overseer Error:KeeperErrorCode = NodeExists for /solr/overseer
[junit4:junit4]   2> 2802 T239 oasc.ZkController.createEphemeralLiveNode Register node as live in ZooKeeper:/live_nodes/127.0.0.1:58956_solr
[junit4:junit4]   2> 2803 T244 oazs.PrepRequestProcessor.pRequest Got user-level KeeperException when processing sessionid:0x13aa959a2cc0003 type:delete cxid:0x4 zxid:0xfffffffffffffffe txntype:unknown reqpath:n/a Error Path:/solr/live_nodes/127.0.0.1:58956_solr Error:KeeperErrorCode = NoNode for /solr/live_nodes/127.0.0.1:58956_solr
[junit4:junit4]   2> 2804 T239 oascc.SolrZkClient.makePath makePath: /live_nodes/127.0.0.1:58956_solr
[junit4:junit4]   2> 2806 T259 oascc.ZkStateReader$3.process Updating live nodes... (2)
[junit4:junit4]   2> 2807 T239 oashc.HttpShardHandlerFactory.getParameter Setting socketTimeout to: 0
[junit4:junit4]   2> 2808 T239 oashc.HttpShardHandlerFactory.getParameter Setting urlScheme to: http://
[junit4:junit4]   2> 2808 T239 oashc.HttpShardHandlerFactory.getParameter Setting connTimeout to: 0
[junit4:junit4]   2> 2809 T239 oashc.HttpShardHandlerFactory.getParameter Setting maxConnectionsPerHost to: 20
[junit4:junit4]   2> 2810 T239 oashc.HttpShardHandlerFactory.getParameter Setting corePoolSize to: 0
[junit4:junit4]   2> 2811 T239 oashc.HttpShardHandlerFactory.getParameter Setting maximumPoolSize to: 2147483647
[junit4:junit4]   2> 2811 T239 oashc.HttpShardHandlerFactory.getParameter Setting maxThreadIdleTime to: 5
[junit4:junit4]   2> 2812 T239 oashc.HttpShardHandlerFactory.getParameter Setting sizeOfQueue to: -1
[junit4:junit4]   2> 2813 T239 oashc.HttpShardHandlerFactory.getParameter Setting fairnessPolicy to: false
[junit4:junit4]   2> 2817 T239 oascsi.HttpClientUtil.createClient Creating new http client, config:maxConnectionsPerHost=20&maxConnections=10000&socketTimeout=0&connTimeout=0&retry=false
[junit4:junit4]   2> 2846 T239 oascc.ZkStateReader.createClusterStateWatchersAndUpdate Updating cluster state from ZooKeeper... 
[junit4:junit4]   2> 2853 T239 oasc.CoreContainer.create Creating SolrCore 'collection1' using instanceDir: /mnt/ssd/jenkins/workspace/Lucene-Solr-4.x-Linux/solr/build/solr-core/test/J1/./solrtest-jetty1-1351460957302/collection1
[junit4:junit4]   2> 2854 T239 oasc.ZkController.createCollectionZkNode Check for collection zkNode:collection1
[junit4:junit4]   2> 2859 T239 oasc.ZkController.createCollectionZkNode Collection zkNode exists
[junit4:junit4]   2> 2860 T239 oasc.ZkController.readConfigName Load collection config from:/collections/collection1
[junit4:junit4]   2> 2870 T239 oasc.SolrResourceLoader.<init> new SolrResourceLoader for directory: '/mnt/ssd/jenkins/workspace/Lucene-Solr-4.x-Linux/solr/build/solr-core/test/J1/./solrtest-jetty1-1351460957302/collection1/'
[junit4:junit4]   2> 2875 T239 oasc.SolrResourceLoader.replaceClassLoader Adding 'file:/mnt/ssd/jenkins/workspace/Lucene-Solr-4.x-Linux/solr/build/solr-core/test/J1/solrtest-jetty1-1351460957302/collection1/lib/README' to classloader
[junit4:junit4]   2> 2876 T239 oasc.SolrResourceLoader.replaceClassLoader Adding 'file:/mnt/ssd/jenkins/workspace/Lucene-Solr-4.x-Linux/solr/build/solr-core/test/J1/solrtest-jetty1-1351460957302/collection1/lib/classes/' to classloader
[junit4:junit4]   2> 2926 T260 oascc.ZkStateReader.updateClusterState Updating cloud state from ZooKeeper... 
[junit4:junit4]   2> 2927 T260 oasc.Overseer$ClusterStateUpdater.updateState Update state numShards=null message={
[junit4:junit4]   2> 	  "base_url":"http://127.0.0.1:36004/solr",
[junit4:junit4]   2> 	  "state":"active",
[junit4:junit4]   2> 	  "operation":"state",
[junit4:junit4]   2> 	  "node_name":"127.0.0.1:36004_solr",
[junit4:junit4]   2> 	  "numShards":null,
[junit4:junit4]   2> 	  "roles":null,
[junit4:junit4]   2> 	  "collection":"control_collection",
[junit4:junit4]   2> 	  "shard":"control_shard",
[junit4:junit4]   2> 	  "core":"collection1"}
[junit4:junit4]   2> 2930 T277 oascc.ZkStateReader$2.process A cluster state change has occurred - updating... (2)
[junit4:junit4]   2> 2930 T259 oascc.ZkStateReader$2.process A cluster state change has occurred - updating... (2)
[junit4:junit4]   2> 2952 T239 oasc.SolrConfig.<init> Using Lucene MatchVersion: LUCENE_41
[junit4:junit4]   2> 3036 T239 oasc.SolrConfig.<init> Loaded SolrConfig: solrconfig.xml
[junit4:junit4]   2> 3043 T239 oass.IndexSchema.readSchema Reading Solr Schema
[junit4:junit4]   2> 3061 T239 oass.IndexSchema.readSchema Schema name=test
[junit4:junit4]   2> 3751 T239 oass.OpenExchangeRatesOrgProvider.init Initialized with rates=open-exchange-rates.json, refreshInterval=1440.
[junit4:junit4]   2> 3761 T239 oass.IndexSchema.readSchema default search field in schema is text
[junit4:junit4]   2> 3766 T239 oass.IndexSchema.readSchema unique key field: id
[junit4:junit4]   2> 3794 T239 oass.FileExchangeRateProvider.reload Reloading exchange rates from file currency.xml
[junit4:junit4]   2> 3800 T239 oass.FileExchangeRateProvider.reload Reloading exchange rates from file currency.xml
[junit4:junit4]   2> 3806 T239 oass.OpenExchangeRatesOrgProvider.reload Reloading exchange rates from open-exchange-rates.json
[junit4:junit4]   2> 3808 T239 oass.OpenExchangeRatesOrgProvider.reload Reloading exchange rates from open-exchange-rates.json
[junit4:junit4]   2> 3810 T239 oasc.SolrCore.<init> [collection1] Opening new SolrCore at /mnt/ssd/jenkins/workspace/Lucene-Solr-4.x-Linux/solr/build/solr-core/test/J1/./solrtest-jetty1-1351460957302/collection1/, dataDir=./org.apache.solr.cloud.BasicDistributedZk2Test-1351460954824/jetty1/
[junit4:junit4]   2> 3811 T239 oasc.JmxMonitoredMap.<init> JMX monitoring is enabled. Adding Solr mbeans to JMX Server: com.sun.jmx.mbeanserver.JmxMBeanServer@d9bc6930
[junit4:junit4]   2> 3812 T239 oasc.SolrCore.getNewIndexDir New index directory detected: old=null new=./org.apache.solr.cloud.BasicDistributedZk2Test-1351460954824/jetty1/index/
[junit4:junit4]   2> 3813 T239 oasc.SolrCore.initIndex WARNING [collection1] Solr index directory './org.apache.solr.cloud.BasicDistributedZk2Test-1351460954824/jetty1/index' doesn't exist. Creating new index...
[junit4:junit4]   2> 3814 T239 oasc.CachingDirectoryFactory.get return new directory for /mnt/ssd/jenkins/workspace/Lucene-Solr-4.x-Linux/solr/build/solr-core/test/J1/./org.apache.solr.cloud.BasicDistributedZk2Test-1351460954824/jetty1/index forceNew:false
[junit4:junit4]   2> 3820 T239 oasc.SolrDeletionPolicy.onCommit SolrDeletionPolicy.onCommit: commits:num=1
[junit4:junit4]   2> 		commit{dir=NRTCachingDirectory(org.apache.lucene.store.MMapDirectory@/mnt/ssd/jenkins/workspace/Lucene-Solr-4.x-Linux/solr/build/solr-core/test/J1/org.apache.solr.cloud.BasicDistributedZk2Test-1351460954824/jetty1/index lockFactory=org.apache.lucene.store.NativeFSLockFactory@880dce29; maxCacheMB=48.0 maxMergeSizeMB=4.0),segFN=segments_1,generation=1,filenames=[segments_1]
[junit4:junit4]   2> 3821 T239 oasc.SolrDeletionPolicy.updateCommits newest commit = 1
[junit4:junit4]   2> 3822 T239 oasc.SolrCore.initWriters created xml: solr.XMLResponseWriter
[junit4:junit4]   2> 3831 T239 oasup.UpdateRequestProcessorChain.init inserting DistributedUpdateProcessorFactory into updateRequestProcessorChain "dedupe"
[junit4:junit4]   2> 3834 T239 oasup.UpdateRequestProcessorChain.init inserting DistributedUpdateProcessorFactory into updateRequestProcessorChain "dedupe-allfields"
[junit4:junit4]   2> 3838 T239 oasup.UpdateRequestProcessorChain.init inserting DistributedUpdateProcessorFactory into updateRequestProcessorChain "stored_sig"
[junit4:junit4]   2> 3841 T239 oasup.UpdateRequestProcessorChain.init inserting DistributedUpdateProcessorFactory into updateRequestProcessorChain "uniq-fields"
[junit4:junit4]   2> 3843 T239 oasup.UpdateRequestProcessorChain.init inserting DistributedUpdateProcessorFactory into updateRequestProcessorChain "distrib-dup-test-chain-implicit"
[junit4:junit4]   2> 3844 T239 oasc.RequestHandlers.initHandlersFromConfig adding lazy requestHandler: solr.ReplicationHandler
[junit4:junit4]   2> 3845 T239 oasc.RequestHandlers.initHandlersFromConfig created /replication: solr.ReplicationHandler
[junit4:junit4]   2> 3847 T239 oasc.RequestHandlers.initHandlersFromConfig created standard: solr.StandardRequestHandler
[junit4:junit4]   2> 3848 T239 oasc.RequestHandlers.initHandlersFromConfig created /get: solr.RealTimeGetHandler
[junit4:junit4]   2> 3849 T239 oasc.RequestHandlers.initHandlersFromConfig created dismax: solr.SearchHandler
[junit4:junit4]   2> 3851 T239 oasc.RequestHandlers.initHandlersFromConfig created mock: org.apache.solr.core.MockQuerySenderListenerReqHandler
[junit4:junit4]   2> 3852 T239 oasc.RequestHandlers.initHandlersFromConfig created /admin/: org.apache.solr.handler.admin.AdminHandlers
[junit4:junit4]   2> 3860 T239 oasc.RequestHandlers.initHandlersFromConfig created defaults: solr.StandardRequestHandler
[junit4:junit4]   2> 3861 T239 oasc.RequestHandlers.initHandlersFromConfig adding lazy requestHandler: solr.StandardRequestHandler
[junit4:junit4]   2> 3867 T239 oasc.RequestHandlers.initHandlersFromConfig created lazy: solr.StandardRequestHandler
[junit4:junit4]   2> 3868 T239 oasc.RequestHandlers.initHandlersFromConfig created /update: solr.UpdateRequestHandler
[junit4:junit4]   2> 3869 T239 oasc.RequestHandlers.initHandlersFromConfig created /terms: org.apache.solr.handler.component.SearchHandler
[junit4:junit4]   2> 3871 T239 oasc.RequestHandlers.initHandlersFromConfig created spellCheckCompRH: org.apache.solr.handler.component.SearchHandler
[junit4:junit4]   2> 3872 T239 oasc.RequestHandlers.initHandlersFromConfig created spellCheckCompRH_Direct: org.apache.solr.handler.component.SearchHandler
[junit4:junit4]   2> 3873 T239 oasc.RequestHandlers.initHandlersFromConfig created spellCheckWithWordbreak: org.apache.solr.handler.component.SearchHandler
[junit4:junit4]   2> 3875 T239 oasc.RequestHandlers.initHandlersFromConfig created spellCheckWithWordbreak_Direct: org.apache.solr.handler.component.SearchHandler
[junit4:junit4]   2> 3876 T239 oasc.RequestHandlers.initHandlersFromConfig created spellCheckCompRH1: org.apache.solr.handler.component.SearchHandler
[junit4:junit4]   2> 3885 T239 oasc.RequestHandlers.initHandlersFromConfig created tvrh: org.apache.solr.handler.component.SearchHandler
[junit4:junit4]   2> 3889 T239 oasc.RequestHandlers.initHandlersFromConfig created /mlt: solr.MoreLikeThisHandler
[junit4:junit4]   2> 3891 T239 oasc.RequestHandlers.initHandlersFromConfig created /debug/dump: solr.DumpRequestHandler
[junit4:junit4]   2> 3893 T239 oashl.XMLLoader.init xsltCacheLifetimeSeconds=60
[junit4:junit4]   2> 3896 T239 oasc.SolrCore.initDeprecatedSupport WARNING solrconfig.xml uses deprecated <admin/gettableFiles>, Please update your config to use the ShowFileRequestHandler.
[junit4:junit4]   2> 3898 T239 oasc.SolrCore.initDeprecatedSupport WARNING adding ShowFileRequestHandler with hidden files: [OLD_SYNONYMS.TXT, PROTWORDS.TXT, STOPWORDS.TXT, OPEN-EXCHANGE-RATES.JSON, CURRENCY.XML, SCHEMA.XML, SYNONYMS.TXT, MAPPING-ISOLATIN1ACCENT.TXT]
[junit4:junit4]   2> 3901 T239 oass.SolrIndexSearcher.<init> Opening Searcher@506b2113 main
[junit4:junit4]   2> 3903 T239 oasu.CommitTracker.<init> Hard AutoCommit: disabled
[junit4:junit4]   2> 3904 T239 oasu.CommitTracker.<init> Soft AutoCommit: disabled
[junit4:junit4]   2> 3905 T239 oashc.SpellCheckComponent.inform Initializing spell checkers
[junit4:junit4]   2> 3911 T239 oass.DirectSolrSpellChecker.init init: {name=direct,classname=DirectSolrSpellChecker,field=lowerfilt,minQueryLength=3}
[junit4:junit4]   2> 3949 T278 oasc.SolrCore.registerSearcher [collection1] Registered new searcher Searcher@506b2113 main{StandardDirectoryReader(segments_1:1)}
[junit4:junit4]   2> 3956 T239 oasc.ZkController.publish numShards not found on descriptor - reading it from system property
[junit4:junit4]   2> 4435 T260 oascc.ZkStateReader.updateClusterState Updating cloud state from ZooKeeper... 
[junit4:junit4]   2> 4436 T260 oasc.Overseer$ClusterStateUpdater.updateState Update state numShards=2 message={
[junit4:junit4]   2> 	  "base_url":"http://127.0.0.1:58956/solr",
[junit4:junit4]   2> 	  "state":"down",
[junit4:junit4]   2> 	  "operation":"state",
[junit4:junit4]   2> 	  "node_name":"127.0.0.1:58956_solr",
[junit4:junit4]   2> 	  "numShards":"2",
[junit4:junit4]   2> 	  "roles":null,
[junit4:junit4]   2> 	  "collection":"collection1",
[junit4:junit4]   2> 	  "shard":null,
[junit4:junit4]   2> 	  "core":"collection1"}
[junit4:junit4]   2> 4436 T260 oasc.Overseer$ClusterStateUpdater.createCollection Create collection collection1 with numShards 2
[junit4:junit4]   2> 4440 T277 oascc.ZkStateReader$2.process A cluster state change has occurred - updating... (2)
[junit4:junit4]   2> 4440 T259 oascc.ZkStateReader$2.process A cluster state change has occurred - updating... (2)
[junit4:junit4]   2> 4458 T239 oasc.CoreContainer.register registering core: collection1
[junit4:junit4]   2> 4459 T239 oasc.ZkController.register Register shard - core:collection1 address:http://127.0.0.1:58956/solr shardId:shard1
[junit4:junit4]   2> 4460 T239 oascc.SolrZkClient.makePath makePath: /collections/collection1/leader_elect/shard1/election
[junit4:junit4]   2> 4465 T244 oazs.PrepRequestProcessor.pRequest Got user-level KeeperException when processing sessionid:0x13aa959a2cc0003 type:delete cxid:0x43 zxid:0xfffffffffffffffe txntype:unknown reqpath:n/a Error Path:/solr/collections/collection1/leaders Error:KeeperErrorCode = NoNode for /solr/collections/collection1/leaders
[junit4:junit4]   2> 4466 T239 oasc.ShardLeaderElectionContext.runLeaderProcess Running the leader process.
[junit4:junit4]   2> 4467 T244 oazs.PrepRequestProcessor.pRequest Got user-level KeeperException when processing sessionid:0x13aa959a2cc0003 type:create cxid:0x44 zxid:0xfffffffffffffffe txntype:unknown reqpath:n/a Error Path:/solr/overseer Error:KeeperErrorCode = NodeExists for /solr/overseer
[junit4:junit4]   2> 4468 T239 oasc.ShardLeaderElectionContext.waitForReplicasToComeUp Enough replicas found to continue.
[junit4:junit4]   2> 4469 T239 oasc.ShardLeaderElectionContext.runLeaderProcess I may be the new leader - try and sync
[junit4:junit4]   2> 4470 T239 oasc.SyncStrategy.sync Sync replicas to http://127.0.0.1:58956/solr/collection1/
[junit4:junit4]   2> 4471 T239 oasc.SyncStrategy.syncReplicas Sync Success - now sync replicas to me
[junit4:junit4]   2> 4471 T239 oasc.SyncStrategy.syncToMe http://127.0.0.1:58956/solr/collection1/ has no replicas
[junit4:junit4]   2> 4472 T239 oasc.ShardLeaderElectionContext.runLeaderProcess I am the new leader: http://127.0.0.1:58956/solr/collection1/
[junit4:junit4]   2> 4473 T239 oascc.SolrZkClient.makePath makePath: /collections/collection1/leaders/shard1
[junit4:junit4]   2> 4478 T244 oazs.PrepRequestProcessor.pRequest Got user-level KeeperException when processing sessionid:0x13aa959a2cc0003 type:create cxid:0x4e zxid:0xfffffffffffffffe txntype:unknown reqpath:n/a Error Path:/solr/overseer Error:KeeperErrorCode = NodeExists for /solr/overseer
[junit4:junit4]   2> 4943 T260 oascc.ZkStateReader.updateClusterState Updating cloud state from ZooKeeper... 
[junit4:junit4]   2> 4950 T277 oascc.ZkStateReader$2.process A cluster state change has occurred - updating... (2)
[junit4:junit4]   2> 4950 T259 oascc.ZkStateReader$2.process A cluster state change has occurred - updating... (2)
[junit4:junit4]   2> 4981 T239 oasc.ZkController.register We are http://127.0.0.1:58956/solr/collection1/ and leader is http://127.0.0.1:58956/solr/collection1/
[junit4:junit4]   2> 4981 T239 oasc.ZkController.register No LogReplay needed for core=collection1 baseURL=http://127.0.0.1:58956/solr
[junit4:junit4]   2> 4982 T239 oasc.ZkController.checkRecovery I am the leader, no recovery necessary
[junit4:junit4]   2> 4983 T239 oasc.ZkController.publish numShards not found on descriptor - reading it from system property
[junit4:junit4]   2> 4985 T239 oascc.ZkStateReader.updateClusterState Updating cloud state from ZooKeeper... 
[junit4:junit4]   2> 4987 T239 oass.SolrDispatchFilter.init user.dir=/mnt/ssd/jenkins/workspace/Lucene-Solr-4.x-Linux/solr/build/solr-core/test/J1
[junit4:junit4]   2> 4987 T239 oass.SolrDispatchFilter.init SolrDispatchFilter.init() done
[junit4:junit4]   2> 4988 T239 oascsi.HttpClientUtil.createClient Creating new http client, config:maxConnections=128&maxConnectionsPerHost=32&followRedirects=false
[junit4:junit4]   2> 5067 T239 oejs.Server.doStart jetty-8.1.2.v20120308
[junit4:junit4]   2> 5069 T239 oejs.AbstractConnector.doStart Started SelectChannelConnector@0.0.0.0:44643
[junit4:junit4]   2> 5070 T239 oasc.SolrResourceLoader.locateSolrHome JNDI not configured for solr (NoInitialContextEx)
[junit4:junit4]   2> 5070 T239 oasc.SolrResourceLoader.locateSolrHome using system property solr.solr.home: /mnt/ssd/jenkins/workspace/Lucene-Solr-4.x-Linux/solr/build/solr-core/test/J1/./solrtest-jetty2-1351460959815
[junit4:junit4]   2> 5071 T239 oasc.SolrResourceLoader.<init> new SolrResourceLoader for deduced Solr Home: '/mnt/ssd/jenkins/workspace/Lucene-Solr-4.x-Linux/solr/build/solr-core/test/J1/./solrtest-jetty2-1351460959815/'
[junit4:junit4]   2> 5082 T239 oass.SolrDispatchFilter.init SolrDispatchFilter.init()
[junit4:junit4]   2> 5082 T239 oasc.SolrResourceLoader.locateSolrHome JNDI not configured for solr (NoInitialContextEx)
[junit4:junit4]   2> 5083 T239 oasc.SolrResourceLoader.locateSolrHome using system property solr.solr.home: /mnt/ssd/jenkins/workspace/Lucene-Solr-4.x-Linux/solr/build/solr-core/test/J1/./solrtest-jetty2-1351460959815
[junit4:junit4]   2> 5083 T239 oasc.CoreContainer$Initializer.initialize looking for solr.xml: /mnt/ssd/jenkins/workspace/Lucene-Solr-4.x-Linux/solr/build/solr-core/test/J1/./solrtest-jetty2-1351460959815/solr.xml
[junit4:junit4]   2> 5083 T239 oasc.CoreContainer.<init> New CoreContainer 1368487297
[junit4:junit4]   2> 5084 T239 oasc.CoreContainer.load Loading CoreContainer using Solr Home: '/mnt/ssd/jenkins/workspace/Lucene-Solr-4.x-Linux/solr/build/solr-core/test/J1/./solrtest-jetty2-1351460959815/'
[junit4:junit4]   2> 5084 T239 oasc.SolrResourceLoader.<init> new SolrResourceLoader for directory: '/mnt/ssd/jenkins/workspace/Lucene-Solr-4.x-Linux/solr/build/solr-core/test/J1/./solrtest-jetty2-1351460959815/'
[junit4:junit4]   2> 5097 T239 oasc.CoreContainer.load Registering Log Listener
[junit4:junit4]   2> 5111 T239 oasc.CoreContainer.initZooKeeper Zookeeper client=127.0.0.1:34274/solr
[junit4:junit4]   2> 5112 T239 oaz.ZooKeeper.<init> Initiating client connection, connectString=127.0.0.1:34274/solr sessionTimeout=5000 watcher=org.apache.solr.common.cloud.ConnectionManager@647ed41b
[junit4:junit4]   2> 5113 T288 oaz.ClientCnxn$SendThread.startConnect Opening socket connection to server /127.0.0.1:34274
[junit4:junit4]   2> 5113 T239 oascc.ConnectionManager.waitForConnected Waiting for client to connect to ZooKeeper
[junit4:junit4]   2> 5114 T288 oaz.ClientCnxn$SendThread.primeConnection Socket connection established to localhost.localdomain/127.0.0.1:34274, initiating session
[junit4:junit4]   2> 5115 T241 oazs.NIOServerCnxn$Factory.run Accepted socket connection from /127.0.0.1:52731
[junit4:junit4]   2> 5115 T241 oazs.NIOServerCnxn.readConnectRequest Client attempting to establish new session at /127.0.0.1:52731
[junit4:junit4]   2> 5116 T243 oazs.NIOServerCnxn.finishSessionInit Established session 0x13aa959a2cc0004 with negotiated timeout 5000 for client /127.0.0.1:52731
[junit4:junit4]   2> 5116 T288 oaz.ClientCnxn$SendThread.readConnectResult Session establishment complete on server localhost.localdomain/127.0.0.1:34274, sessionid = 0x13aa959a2cc0004, negotiated timeout = 5000
[junit4:junit4]   2> 5116 T289 oascc.ConnectionManager.process Watcher org.apache.solr.common.cloud.ConnectionManager@647ed41b name:ZooKeeperConnection Watcher:127.0.0.1:34274/solr got event WatchedEvent state:SyncConnected type:None path:null path:null type:None
[junit4:junit4]   2> 5117 T239 oascc.ConnectionManager.waitForConnected Client is connected to ZooKeeper
[junit4:junit4]   2> 5117 T244 oazs.PrepRequestProcessor.pRequest Got user-level KeeperException when processing sessionid:0x13aa959a2cc0004 type:create cxid:0x1 zxid:0xfffffffffffffffe txntype:unknown reqpath:n/a Error Path:/solr/overseer Error:KeeperErrorCode = NodeExists for /solr/overseer
[junit4:junit4]   2> 5119 T244 oazs.PrepRequestProcessor.pRequest Got user-level KeeperException when processing sessionid:0x13aa959a2cc0004 type:create cxid:0x2 zxid:0xfffffffffffffffe txntype:unknown reqpath:n/a Error Path:/solr/overseer Error:KeeperErrorCode = NodeExists for /solr/overseer
[junit4:junit4]   2> 5120 T239 oasc.ZkController.createEphemeralLiveNode Register node as live in ZooKeeper:/live_nodes/127.0.0.1:44643_solr
[junit4:junit4]   2> 5121 T244 oazs.PrepRequestProcessor.pRequest Got user-level KeeperException when processing sessionid:0x13aa959a2cc0004 type:delete cxid:0x4 zxid:0xfffffffffffffffe txntype:unknown reqpath:n/a Error Path:/solr/live_nodes/127.0.0.1:44643_solr Error:KeeperErrorCode = NoNode for /solr/live_nodes/127.0.0.1:44643_solr
[junit4:junit4]   2> 5121 T239 oascc.SolrZkClient.makePath makePath: /live_nodes/127.0.0.1:44643_solr
[junit4:junit4]   2> 5123 T277 oascc.ZkStateReader$3.process Updating live nodes... (3)
[junit4:junit4]   2> 5123 T259 oascc.ZkStateReader$3.process Updating live nodes... (3)
[junit4:junit4]   2> 5124 T239 oashc.HttpShardHandlerFactory.getParameter Setting socketTimeout to: 0
[junit4:junit4]   2> 5125 T239 oashc.HttpShardHandlerFactory.getParameter Setting urlScheme to: http://
[junit4:junit4]   2> 5126 T239 oashc.HttpShardHandlerFactory.getParameter Setting connTimeout to: 0
[junit4:junit4]   2> 5126 T239 oashc.HttpShardHandlerFactory.getParameter Setting maxConnectionsPerHost to: 20
[junit4:junit4]   2> 5127 T239 oashc.HttpShardHandlerFactory.getParameter Setting corePoolSize to: 0
[junit4:junit4]   2> 5127 T239 oashc.HttpShardHandlerFactory.getParameter Setting maximumPoolSize to: 2147483647
[junit4:junit4]   2> 5128 T239 oashc.HttpShardHandlerFactory.getParameter Setting maxThreadIdleTime to: 5
[junit4:junit4]   2> 5128 T239 oashc.HttpShardHandlerFactory.getParameter Setting sizeOfQueue to: -1
[junit4:junit4]   2> 5128 T239 oashc.HttpShardHandlerFactory.getParameter Setting fairnessPolicy to: false
[junit4:junit4]   2> 5129 T239 oascsi.HttpClientUtil.createClient Creating new http client, config:maxConnectionsPerHost=20&maxConnections=10000&socketTimeout=0&connTimeout=0&retry=false
[junit4:junit4]   2> 5138 T239 oascc.ZkStateReader.createClusterStateWatchersAndUpdate Updating cluster state from ZooKeeper... 
[junit4:junit4]   2> 5143 T239 oasc.CoreContainer.create Creating SolrCore 'collection1' using instanceDir: /mnt/ssd/jenkins/workspace/Lucene-Solr-4.x-Linux/solr/build/solr-core/test/J1/./solrtest-jetty2-1351460959815/collection1
[junit4:junit4]   2> 5143 T239 oasc.ZkController.createCollectionZkNode Check for collection zkNode:collection1
[junit4:junit4]   2> 5144 T239 oasc.ZkController.createCollectionZkNode Collection zkNode exists
[junit4:junit4]   2> 5144 T239 oasc.ZkController.readConfigName Load collection config from:/collections/collection1
[junit4:junit4]   2> 5145 T239 oasc.SolrResourceLoader.<init> new SolrResourceLoader for directory: '/mnt/ssd/jenkins/workspace/Lucene-Solr-4.x-Linux/solr/build/solr-core/test/J1/./solrtest-jetty2-1351460959815/collection1/'
[junit4:junit4]   2> 5146 T239 oasc.SolrResourceLoader.replaceClassLoader Adding 'file:/mnt/ssd/jenkins/workspace/Lucene-Solr-4.x-Linux/solr/build/solr-core/test/J1/solrtest-jetty2-1351460959815/collection1/lib/README' to classloader
[junit4:junit4]   2> 5147 T239 oasc.SolrResourceLoader.replaceClassLoader Adding 'file:/mnt/ssd/jenkins/workspace/Lucene-Solr-4.x-Linux/solr/build/solr-core/test/J1/solrtest-jetty2-1351460959815/collection1/lib/classes/' to classloader
[junit4:junit4]   2> 5195 T239 oasc.SolrConfig.<init> Using Lucene MatchVersion: LUCENE_41
[junit4:junit4]   2> 5251 T239 oasc.SolrConfig.<init> Loaded SolrConfig: solrconfig.xml
[junit4:junit4]   2> 5252 T239 oass.IndexSchema.readSchema Reading Solr Schema
[junit4:junit4]   2> 5260 T239 oass.IndexSchema.readSchema Schema name=test
[junit4:junit4]   2> 5454 T260 oascc.ZkStateReader.updateClusterState Updating cloud state from ZooKeeper... 
[junit4:junit4]   2> 5455 T260 oasc.Overseer$ClusterStateUpdater.updateState Update state numShards=2 message={
[junit4:junit4]   2> 	  "base_url":"http://127.0.0.1:58956/solr",
[junit4:junit4]   2> 	  "state":"active",
[junit4:junit4]   2> 	  "operation":"state",
[junit4:junit4]   2> 	  "node_name":"127.0.0.1:58956_solr",
[junit4:junit4]   2> 	  "numShards":"2",
[junit4:junit4]   2> 	  "roles":null,
[junit4:junit4]   2> 	  "collection":"collection1",
[junit4:junit4]   2> 	  "shard":"shard1",
[junit4:junit4]   2> 	  "core":"collection1"}
[junit4:junit4]   2> 5459 T277 oascc.ZkStateReader$2.process A cluster state change has occurred - updating... (3)
[junit4:junit4]   2> 5459 T259 oascc.ZkStateReader$2.process A cluster state change has occurred - updating... (3)
[junit4:junit4]   2> 5459 T289 oascc.ZkStateReader$2.process A cluster state change has occurred - updating... (3)
[junit4:junit4]   2> 5730 T239 oass.OpenExchangeRatesOrgProvider.init Initialized with rates=open-exchange-rates.json, refreshInterval=1440.
[junit4:junit4]   2> 5737 T239 oass.IndexSchema.readSchema default search field in schema is text
[junit4:junit4]   2> 5740 T239 oass.IndexSchema.readSchema unique key field: id
[junit4:junit4]   2> 5756 T239 oass.FileExchangeRateProvider.reload Reloading exchange rates from file currency.xml
[junit4:junit4]   2> 5761 T239 oass.FileExchangeRateProvider.reload Reloading exchange rates from file currency.xml
[junit4:junit4]   2> 5766 T239 oass.OpenExchangeRatesOrgProvider.reload Reloading exchange rates from open-exchange-rates.json
[junit4:junit4]   2> 5768 T239 oass.OpenExchangeRatesOrgProvider.reload Reloading exchange rates from open-exchange-rates.json
[junit4:junit4]   2> 5770 T239 oasc.SolrCore.<init> [collection1] Opening new SolrCore at /mnt/ssd/jenkins/workspace/Lucene-Solr-4.x-Linux/solr/build/solr-core/test/J1/./solrtest-jetty2-1351460959815/collection1/, dataDir=./org.apache.solr.cloud.BasicDistributedZk2Test-1351460954824/jetty2/
[junit4:junit4]   2> 5770 T239 oasc.JmxMonitoredMap.<init> JMX monitoring is enabled. Adding Solr mbeans to JMX Server: com.sun.jmx.mbeanserver.JmxMBeanServer@d9bc6930
[junit4:junit4]   2> 5771 T239 oasc.SolrCore.getNewIndexDir New index directory detected: old=null new=./org.apache.solr.cloud.BasicDistributedZk2Test-1351460954824/jetty2/index/
[junit4:junit4]   2> 5772 T239 oasc.SolrCore.initIndex WARNING [collection1] Solr index directory './org.apache.solr.cloud.BasicDistributedZk2Test-1351460954824/jetty2/index' doesn't exist. Creating new index...
[junit4:junit4]   2> 5773 T239 oasc.CachingDirectoryFactory.get return new directory for /mnt/ssd/jenkins/workspace/Lucene-Solr-4.x-Linux/solr/build/solr-core/test/J1/./org.apache.solr.cloud.BasicDistributedZk2Test-1351460954824/jetty2/index forceNew:false
[junit4:junit4]   2> 5777 T239 oasc.SolrDeletionPolicy.onCommit SolrDeletionPolicy.onCommit: commits:num=1
[junit4:junit4]   2> 		commit{dir=NRTCachingDirectory(org.apache.lucene.store.MMapDirectory@/mnt/ssd/jenkins/workspace/Lucene-Solr-4.x-Linux/solr/build/solr-core/test/J1/org.apache.solr.cloud.BasicDistributedZk2Test-1351460954824/jetty2/index lockFactory=org.apache.lucene.store.NativeFSLockFactory@67e10592; maxCacheMB=48.0 maxMergeSizeMB=4.0),segFN=segments_1,generation=1,filenames=[segments_1]
[junit4:junit4]   2> 5778 T239 oasc.SolrDeletionPolicy.updateCommits newest commit = 1
[junit4:junit4]   2> 5779 T239 oasc.SolrCore.initWriters created xml: solr.XMLResponseWriter
[junit4:junit4]   2> 5782 T239 oasup.UpdateRequestProcessorChain.init inserting DistributedUpdateProcessorFactory into updateRequestProcessorChain "dedupe"
[junit4:junit4]   2> 5782 T239 oasup.UpdateRequestProcessorChain.init inserting DistributedUpdateProcessorFactory into updateRequestProcessorChain "dedupe-allfields"
[junit4:junit4]   2> 5783 T239 oasup.UpdateRequestProcessorChain.init inserting DistributedUpdateProcessorFactory into updateRequestProcessorChain "stored_sig"
[junit4:junit4]   2> 5784 T239 oasup.UpdateRequestProcessorChain.init inserting DistributedUpdateProcessorFactory into updateRequestProcessorChain "uniq-fields"
[junit4:junit4]   2> 5785 T239 oasup.UpdateRequestProcessorChain.init inserting DistributedUpdateProcessorFactory into updateRequestProcessorChain "distrib-dup-test-chain-implicit"
[junit4:junit4]   2> 5785 T239 oasc.RequestHandlers.initHandlersFromConfig adding lazy requestHandler: solr.ReplicationHandler
[junit4:junit4]   2> 5786 T239 oasc.RequestHandlers.initHandlersFromConfig created /replication: solr.ReplicationHandler
[junit4:junit4]   2> 5787 T239 oasc.RequestHandlers.initHandlersFromConfig created standard: solr.StandardRequestHandler
[junit4:junit4]   2> 5788 T239 oasc.RequestHandlers.initHandlersFromConfig created /get: solr.RealTimeGetHandler
[junit4:junit4]   2> 5789 T239 oasc.RequestHandlers.initHandlersFromConfig created dismax: solr.SearchHandler
[junit4:junit4]   2> 5790 T239 oasc.RequestHandlers.initHandlersFromConfig created mock: org.apache.solr.core.MockQuerySenderListenerReqHandler
[junit4:junit4]   2> 5790 T239 oasc.RequestHandlers.initHandlersFromConfig created /admin/: org.apache.solr.handler.admin.AdminHandlers
[junit4:junit4]   2> 5791 T239 oasc.RequestHandlers.initHandlersFromConfig created defaults: solr.StandardRequestHandler
[junit4:junit4]   2> 5792 T239 oasc.RequestHandlers.initHandlersFromConfig adding lazy requestHandler: solr.StandardRequestHandler
[junit4:junit4]   2> 5792 T239 oasc.RequestHandlers.initHandlersFromConfig created lazy: solr.StandardRequestHandler
[junit4:junit4]   2> 5793 T239 oasc.RequestHandlers.initHandlersFromConfig created /update: solr.UpdateRequestHandler
[junit4:junit4]   2> 5794 T239 oasc.RequestHandlers.initHandlersFromConfig created /terms: org.apache.solr.handler.component.SearchHandler
[junit4:junit4]   2> 5795 T239 oasc.RequestHandlers.initHandlersFromConfig created spellCheckCompRH: org.apache.solr.handler.component.SearchHandler
[junit4:junit4]   2> 5796 T239 oasc.RequestHandlers.initHandlersFromConfig created spellCheckCompRH_Direct: org.apache.solr.handler.component.SearchHandler
[junit4:junit4]   2> 5797 T239 oasc.RequestHandlers.initHandlersFromConfig created spellCheckWithWordbreak: org.apache.solr.handler.component.SearchHandler
[junit4:junit4]   2> 5798 T239 oasc.RequestHandlers.initHandlersFromConfig created spellCheckWithWordbreak_Direct: org.apache.solr.handler.component.SearchHandler
[junit4:junit4]   2> 5799 T239 oasc.RequestHandlers.initHandlersFromConfig created spellCheckCompRH1: org.apache.solr.handler.component.SearchHandler
[junit4:junit4]   2> 5800 T239 oasc.RequestHandlers.initHandlersFromConfig created tvrh: org.apache.solr.handler.component.SearchHandler
[junit4:junit4]   2> 5800 T239 oasc.RequestHandlers.initHandlersFromConfig created /mlt: solr.MoreLikeThisHandler
[junit4:junit4]   2> 5802 T239 oasc.RequestHandlers.initHandlersFromConfig created /debug/dump: solr.DumpRequestHandler
[junit4:junit4]   2> 5803 T239 oashl.XMLLoader.init xsltCacheLifetimeSeconds=60
[junit4:junit4]   2> 5805 T239 oasc.SolrCore.initDeprecatedSupport WARNING solrconfig.xml uses deprecated <admin/gettableFiles>, Please update your config to use the ShowFileRequestHandler.
[junit4:junit4]   2> 5807 T239 oasc.SolrCore.initDeprecatedSupport WARNING adding ShowFileRequestHandler with hidden files: [OLD_SYNONYMS.TXT, PROTWORDS.TXT, STOPWORDS.TXT, OPEN-EXCHANGE-RATES.JSON, CURRENCY.XML, SCHEMA.XML, SYNONYMS.TXT, MAPPING-ISOLATIN1ACCENT.TXT]
[junit4:junit4]   2> 5809 T239 oass.SolrIndexSearcher.<init> Opening Searcher@457c11aa main
[junit4:junit4]   2> 5810 T239 oasu.CommitTracker.<init> Hard AutoCommit: disabled
[junit4:junit4]   2> 5811 T239 oasu.CommitTracker.<init> Soft AutoCommit: disabled
[junit4:junit4]   2> 5812 T239 oashc.SpellCheckComponent.inform Initializing spell checkers
[junit4:junit4]   2> 5817 T239 oass.DirectSolrSpellChecker.init init: {name=direct,classname=DirectSolrSpellChecker,field=lowerfilt,minQueryLength=3}
[junit4:junit4]   2> 5854 T290 oasc.SolrCore.registerSearcher [collection1] Registered new searcher Searcher@457c11aa main{StandardDirectoryReader(segments_1:1)}
[junit4:junit4]   2> 5861 T239 oasc.ZkController.publish numShards not found on descriptor - reading it from system property
[junit4:junit4]   2> 5962 T260 oascc.ZkStateReader.updateClusterState Updating cloud state from ZooKeeper... 
[junit4:junit4]   2> 5963 T260 oasc.Overseer$ClusterStateUpdater.updateState Update state numShards=2 message={
[junit4:junit4]   2> 	  "base_url":"http://127.0.0.1:44643/solr",
[junit4:junit4]   2> 	  "state":"down",
[junit4:junit4]   2> 	  "operation":"state",
[junit4:junit4]   2> 	  "node_name":"127.0.0.1:44643_solr",
[junit4:junit4]   2> 	  "numShards":"2",
[junit4:junit4]   2> 	  "roles":null,
[junit4:junit4]   2> 	  "collection":"collection1",
[junit4:junit4]   2> 	  "shard":null,
[junit4:junit4]   2> 	  "core":"collection1"}
[junit4:junit4]   2> 5967 T277 oascc.ZkStateReader$2.process A cluster state change has occurred - updating... (3)
[junit4:junit4]   2> 5968 T289 oascc.ZkStateReader$2.process A cluster state change has occurred - updating... (3)
[junit4:junit4]   2> 5968 T259 oascc.ZkStateReader$2.process A cluster state change has occurred - updating... (3)
[junit4:junit4]   2> 6363 T239 oasc.CoreContainer.register registering core: collection1
[junit4:junit4]   2> 6364 T239 oasc.ZkController.register Register shard - core:collection1 address:http://127.0.0.1:44643/solr shardId:shard2
[junit4:junit4]   2> 6365 T239 oascc.SolrZkClient.makePath makePath: /collections/collection1/leader_elect/shard2/election
[junit4:junit4]   2> 6369 T244 oazs.PrepRequestProcessor.pRequest Got user-level KeeperException when processing sessionid:0x13aa959a2cc0004 type:delete cxid:0x42 zxid:0xfffffffffffffffe txntype:unknown reqpath:n/a Error Path:/solr/collections/collection1/leaders/shard2 Error:KeeperErrorCode = NoNode for /solr/collections/collection1/leaders/shard2
[junit4:junit4]   2> 6370 T239 oasc.ShardLeaderElectionContext.runLeaderProcess Running the leader process.
[junit4:junit4]   2> 6371 T244 oazs.PrepRequestProcessor.pRequest Got user-level KeeperException when processing sessionid:0x13aa959a2cc0004 type:create cxid:0x43 zxid:0xfffffffffffffffe txntype:unknown reqpath:n/a Error Path:/solr/overseer Error:KeeperErrorCode = NodeExists for /solr/overseer
[junit4:junit4]   2> 6372 T239 oasc.ShardLeaderElectionContext.waitForReplicasToComeUp Enough replicas found to continue.
[junit4:junit4]   2> 6373 T239 oasc.ShardLeaderElectionContext.runLeaderProcess I may be the new leader - try and sync
[junit4:junit4]   2> 6373 T239 oasc.SyncStrategy.sync Sync replicas to http://127.0.0.1:44643/solr/collection1/
[junit4:junit4]   2> 6373 T239 oasc.SyncStrategy.syncReplicas Sync Success - now sync replicas to me
[junit4:junit4]   2> 6374 T239 oasc.SyncStrategy.syncToMe http://127.0.0.1:44643/solr/collection1/ has no replicas
[junit4:junit4]   2> 6374 T239 oasc.ShardLeaderElectionContext.runLeaderProcess I am the new leader: http://127.0.0.1:44643/solr/collection1/
[junit4:junit4]   2> 6375 T239 oascc.SolrZkClient.makePath makePath: /collections/collection1/leaders/shard2
[junit4:junit4]   2> 6378 T244 oazs.PrepRequestProcessor.pRequest Got user-level KeeperException when processing sessionid:0x13aa959a2cc0004 type:create cxid:0x4c zxid:0xfffffffffffffffe txntype:unknown reqpath:n/a Error Path:/solr/overseer Error:KeeperErrorCode = NodeExists for /solr/overseer
[junit4:junit4]   2> 6471 T260 oascc.ZkStateReader.updateClusterState Updating cloud state from ZooKeeper... 
[junit4:junit4]   2> 6477 T277 oascc.ZkStateReader$2.process A cluster state change has occurred - updating... (3)
[junit4:junit4]   2> 6477 T289 oascc.ZkStateReader$2.process A cluster state change has occurred - updating... (3)
[junit4:junit4]   2> 6477 T259 oascc.ZkStateReader$2.process A cluster state change has occurred - updating... (3)
[junit4:junit4]   2> 6480 T239 oasc.ZkController.register We are http://127.0.0.1:44643/solr/collection1/ and leader is http://127.0.0.1:44643/solr/collection1/
[junit4:junit4]   2> 6480 T239 oasc.ZkController.register No LogReplay needed for core=collection1 baseURL=http://127.0.0.1:44643/solr
[junit4:junit4]   2> 6481 T239 oasc.ZkController.checkRecovery I am the leader, no recovery necessary
[junit4:junit4]   2> 6481 T239 oasc.ZkController.publish numShards not found on descriptor - reading it from system property
[junit4:junit4]   2> 6482 T239 oascc.ZkStateReader.updateClusterState Updating cloud state from ZooKeeper... 
[junit4:junit4]   2> 6483 T239 oass.SolrDispatchFilter.init user.dir=/mnt/ssd/jenkins/workspace/Lucene-Solr-4.x-Linux/solr/build/solr-core/test/J1
[junit4:junit4]   2> 6484 T239 oass.SolrDispatchFilter.init SolrDispatchFilter.init() done
[junit4:junit4]   2> 6484 T239 oascsi.HttpClientUtil.createClient Creating new http client, config:maxConnections=128&maxConnectionsPerHost=32&followRedirects=false
[junit4:junit4]   2> 6536 T239 oejs.Server.doStart jetty-8.1.2.v20120308
[junit4:junit4]   2> 6538 T239 oejs.AbstractConnector.doStart Started SelectChannelConnector@0.0.0.0:53934
[junit4:junit4]   2> 6539 T239 oasc.SolrResourceLoader.locateSolrHome JNDI not configured for solr (NoInitialContextEx)
[junit4:junit4]   2> 6539 T239 oasc.SolrResourceLoader.locateSolrHome using system property solr.solr.home: /mnt/ssd/jenkins/workspace/Lucene-Solr-4.x-Linux/solr/build/solr-core/test/J1/./solrtest-jetty3-1351460961308
[junit4:junit4]   2> 6540 T239 oasc.SolrResourceLoader.<init> new SolrResourceLoader for deduced Solr Home: '/mnt/ssd/jenkins/workspace/Lucene-Solr-4.x-Linux/solr/build/solr-core/test/J1/./solrtest-jetty3-1351460961308/'
[junit4:junit4]   2> 6548 T239 oass.SolrDispatchFilter.init SolrDispatchFilter.init()
[junit4:junit4]   2> 6549 T239 oasc.SolrResourceLoader.locateSolrHome JNDI not configured for solr (NoInitialContextEx)
[junit4:junit4]   2> 6549 T239 oasc.SolrResourceLoader.locateSolrHome using system property solr.solr.home: /mnt/ssd/jenkins/workspace/Lucene-Solr-4.x-Linux/solr/build/solr-core/test/J1/./solrtest-jetty3-1351460961308
[junit4:junit4]   2> 6550 T239 oasc.CoreContainer$Initializer.initialize looking for solr.xml: /mnt/ssd/jenkins/workspace/Lucene-Solr-4.x-Linux/solr/build/solr-core/test/J1/./solrtest-jetty3-1351460961308/solr.xml
[junit4:junit4]   2> 6550 T239 oasc.CoreContainer.<init> New CoreContainer -610516680
[junit4:junit4]   2> 6550 T239 oasc.CoreContainer.load Loading CoreContainer using Solr Home: '/mnt/ssd/jenkins/workspace/Lucene-Solr-4.x-Linux/solr/build/solr-core/test/J1/./solrtest-jetty3-1351460961308/'
[junit4:junit4]   2> 6551 T239 oasc.SolrResourceLoader.<init> new SolrResourceLoader for directory: '/mnt/ssd/jenkins/workspace/Lucene-Solr-4.x-Linux/solr/build/solr-core/test/J1/./solrtest-jetty3-1351460961308/'
[junit4:junit4]   2> 6563 T239 oasc.CoreContainer.load Registering Log Listener
[junit4:junit4]   2> 6571 T239 oasc.CoreContainer.initZooKeeper Zookeeper client=127.0.0.1:34274/solr
[junit4:junit4]   2> 6571 T239 oaz.ZooKeeper.<init> Initiating client connection, connectString=127.0.0.1:34274/solr sessionTimeout=5000 watcher=org.apache.solr.common.cloud.ConnectionManager@e567a9a
[junit4:junit4]   2> 6572 T300 oaz.ClientCnxn$SendThread.startConnect Opening socket connection to server /127.0.0.1:34274
[junit4:junit4]   2> 6572 T239 oascc.ConnectionManager.waitForConnected Waiting for client to connect to ZooKeeper
[junit4:junit4]   2> 6574 T300 oaz.ClientCnxn$SendThread.primeConnection Socket connection established to localhost.localdomain/127.0.0.1:34274, initiating session
[junit4:junit4]   2> 6574 T241 oazs.NIOServerCnxn$Factory.run Accepted socket connection from /127.0.0.1:52733
[junit4:junit4]   2> 6574 T241 oazs.NIOServerCnxn.readConnectRequest Client attempting to establish new session at /127.0.0.1:52733
[junit4:junit4]   2> 6575 T243 oazs.NIOServerCnxn.finishSessionInit Established session 0x13aa959a2cc0005 with negotiated timeout 5000 for client /127.0.0.1:52733
[junit4:junit4]   2> 6576 T300 oaz.ClientCnxn$SendThread.readConnectResult Session establishment complete on server localhost.localdomain/127.0.0.1:34274, sessionid = 0x13aa959a2cc0005, negotiated timeout = 5000
[junit4:junit4]   2> 6576 T301 oascc.ConnectionManager.process Watcher org.apache.solr.common.cloud.ConnectionManager@e567a9a name:ZooKeeperConnection Watcher:127.0.0.1:34274/solr got event WatchedEvent state:SyncConnected type:None path:null path:null type:None
[junit4:junit4]   2> 6577 T239 oascc.ConnectionManager.waitForConnected Client is connected to ZooKeeper
[junit4:junit4]   2> 6577 T244 oazs.PrepRequestProcessor.pRequest Got user-level KeeperException when processing sessionid:0x13aa959a2cc0005 type:create cxid:0x1 zxid:0xfffffffffffffffe txntype:unknown reqpath:n/a Error Path:/solr/overseer Error:KeeperErrorCode = NodeExists for /solr/overseer
[junit4:junit4]   2> 6578 T244 oazs.PrepRequestProcessor.pRequest Got user-level KeeperException when processing sessionid:0x13aa959a2cc0005 type:create cxid:0x2 zxid:0xfffffffffffffffe txntype:unknown reqpath:n/a Error Path:/solr/overseer Error:KeeperErrorCode = NodeExists for /solr/overseer
[junit4:junit4]   2> 6579 T239 oasc.ZkController.createEphemeralLiveNode Register node as live in ZooKeeper:/live_nodes/127.0.0.1:53934_solr
[junit4:junit4]   2> 6579 T244 oazs.PrepRequestProcessor.pRequest Got user-level KeeperException when processing sessionid:0x13aa959a2cc0005 type:delete cxid:0x4 zxid:0xfffffffffffffffe txntype:unknown reqpath:n/a Error Path:/solr/live_nodes/127.0.0.1:53934_solr Error:KeeperErrorCode = NoNode for /solr/live_nodes/127.0.0.1:53934_solr
[junit4:junit4]   2> 6581 T239 oascc.SolrZkClient.makePath makePath: /live_nodes/127.0.0.1:53934_solr
[junit4:junit4]   2> 6584 T289 oascc.ZkStateReader$3.process Updating live nodes... (4)
[junit4:junit4]   2> 6584 T259 oascc.ZkStateReader$3.process Updating live nodes... (4)
[junit4:junit4]   2> 6584 T277 oascc.ZkStateReader$3.process Updating live nodes... (4)
[junit4:junit4]   2> 6584 T239 oashc.HttpShardHandlerFactory.getParameter Setting socketTimeout to: 0
[junit4:junit4]   2> 6585 T239 oashc.HttpShardHandlerFactory.getParameter Setting urlScheme to: http://
[junit4:junit4]   2> 6585 T239 oashc.HttpShardHandlerFactory.getParameter Setting connTimeout to: 0
[junit4:junit4]   2> 6586 T239 oashc.HttpShardHandlerFactory.getParameter Setting maxConnectionsPerHost to: 20
[junit4:junit4]   2> 6586 T239 oashc.HttpShardHandlerFactory.getParameter Setting corePoolSize to: 0
[junit4:junit4]   2> 6586 T239 oashc.HttpShardHandlerFactory.getParameter Setting maximumPoolSize to: 2147483647
[junit4:junit4]   2> 6587 T239 oashc.HttpShardHandlerFactory.getParameter Setting maxThreadIdleTime to: 5
[junit4:junit4]   2> 6587 T239 oashc.HttpShardHandlerFactory.getParameter Setting sizeOfQueue to: -1
[junit4:junit4]   2> 6588 T239 oashc.HttpShardHandlerFactory.getParameter Setting fairnessPolicy to: false
[junit4:junit4]   2> 6588 T239 oascsi.HttpClientUtil.createClient Creating new http client, config:maxConnectionsPerHost=20&maxConnections=10000&socketTimeout=0&connTimeout=0&retry=false
[junit4:junit4]   2> 6595 T239 oascc.ZkStateReader.createClusterStateWatchersAndUpdate Updating cluster state from ZooKeeper... 
[junit4:junit4]   2> 6599 T239 oasc.CoreContainer.create Creating SolrCore 'collection1' using instanceDir: /mnt/ssd/jenkins/workspace/Lucene-Solr-4.x-Linux/solr/build/solr-core/test/J1/./solrtest-jetty3-1351460961308/collection1
[junit4:junit4]   2> 6599 T239 oasc.ZkController.createCollectionZkNode Check for collection zkNode:collection1
[junit4:junit4]   2> 6600 T239 oasc.ZkController.createCollectionZkNode Collection zkNode exists
[junit4:junit4]   2> 6600 T239 oasc.ZkController.readConfigName Load collection config from:/collections/collection1
[junit4:junit4]   2> 6601 T239 oasc.SolrResourceLoader.<init> new SolrResourceLoader for directory: '/mnt/ssd/jenkins/workspace/Lucene-Solr-4.x-Linux/solr/build/solr-core/test/J1/./solrtest-jetty3-1351460961308/collection1/'
[junit4:junit4]   2> 6602 T239 oasc.SolrResourceLoader.replaceClassLoader Adding 'file:/mnt/ssd/jenkins/workspace/Lucene-Solr-4.x-Linux/solr/build/solr-core/test/J1/solrtest-jetty3-1351460961308/collection1/lib/README' to classloader
[junit4:junit4]   2> 6603 T239 oasc.SolrResourceLoader.replaceClassLoader Adding 'file:/mnt/ssd/jenkins/workspace/Lucene-Solr-4.x-Linux/solr/build/solr-core/test/J1/solrtest-jetty3-1351460961308/collection1/lib/classes/' to classloader
[junit4:junit4]   2> 6634 T239 oasc.SolrConfig.<init> Using Lucene MatchVersion: LUCENE_41
[junit4:junit4]   2> 6688 T239 oasc.SolrConfig.<init> Loaded SolrConfig: solrconfig.xml
[junit4:junit4]   2> 6697 T239 oass.IndexSchema.readSchema Reading Solr Schema
[junit4:junit4]   2> 6707 T239 oass.IndexSchema.readSchema Schema name=test
[junit4:junit4]   2> 6981 T260 oascc.ZkStateReader.updateClusterState Updating cloud state from ZooKeeper... 
[junit4:junit4]   2> 6982 T260 oasc.Overseer$ClusterStateUpdater.updateState Update state numShards=2 message={
[junit4:junit4]   2> 	  "base_url":"http://127.0.0.1:44643/solr",
[junit4:junit4]   2> 	  "state":"active",
[junit4:junit4]   2> 	  "operation":"state",
[junit4:junit4]   2> 	  "node_name":"127.0.0.1:44643_solr",
[junit4:junit4]   2> 	  "numShards":"2",
[junit4:junit4]   2> 	  "roles":null,
[junit4:junit4]   2> 	  "collection":"collection1",
[junit4:junit4]   2> 	  "shard":"shard2",
[junit4:junit4]   2> 	  "core":"collection1"}
[junit4:junit4]   2> 6985 T301 oascc.ZkStateReader$2.process A cluster state change has occurred - updating... (4)
[junit4:junit4]   2> 6985 T277 oascc.ZkStateReader$2.process A cluster state change has occurred - updating... (4)
[junit4:junit4]   2> 6985 T289 oascc.ZkStateReader$2.process A cluster state change has occurred - updating... (4)
[junit4:junit4]   2> 6985 T259 oascc.ZkStateReader$2.process A cluster state change has occurred - updating... (4)
[junit4:junit4]   2> 7276 T239 oass.OpenExchangeRatesOrgProvider.init Initialized with rates=open-exchange-rates.json, refreshInterval=1440.
[junit4:junit4]   2> 7285 T239 oass.IndexSchema.readSchema default search field in schema is text
[junit4:junit4]   2> 7289 T239 oass.IndexSchema.readSchema unique key field: id
[junit4:junit4]   2> 7308 T239 oass.FileExchangeRateProvider.reload Reloading exchange rates from file currency.xml
[junit4:junit4]   2> 7313 T239 oass.FileExchangeRateProvider.reload Reloading exchange rates from file currency.xml
[junit4:junit4]   2> 7317 T239 oass.OpenExchangeRatesOrgProvider.reload Reloading exchange rates from open-exchange-rates.json
[junit4:junit4]   2> 7319 T239 oass.OpenExchangeRatesOrgProvider.reload Reloading exchange rates from open-exchange-rates.json
[junit4:junit4]   2> 7320 T239 oasc.SolrCore.<init> [collection1] Opening new SolrCore at /mnt/ssd/jenkins/workspace/Lucene-Solr-4.x-Linux/solr/build/solr-core/test/J1/./solrtest-jetty3-1351460961308/collection1/, dataDir=./org.apache.solr.cloud.BasicDistributedZk2Test-1351460954824/jetty3/
[junit4:junit4]   2> 7321 T239 oasc.JmxMonitoredMap.<init> JMX monitoring is enabled. Adding Solr mbeans to JMX Server: com.sun.jmx.mbeanserver.JmxMBeanServer@d9bc6930
[junit4:junit4]   2> 7322 T239 oasc.SolrCore.getNewIndexDir New index directory detected: old=null new=./org.apache.solr.cloud.BasicDistributedZk2Test-1351460954824/jetty3/index/
[junit4:junit4]   2> 7322 T239 oasc.SolrCore.initIndex WARNING [collection1] Solr index directory './org.apache.solr.cloud.BasicDistributedZk2Test-1351460954824/jetty3/index' doesn't exist. Creating new index...
[junit4:junit4]   2> 7323 T239 oasc.CachingDirectoryFactory.get return new directory for /mnt/ssd/jenkins/workspace/Lucene-Solr-4.x-Linux/solr/build/solr-core/test/J1/./org.apache.solr.cloud.BasicDistributedZk2Test-1351460954824/jetty3/index forceNew:false
[junit4:junit4]   2> 7328 T239 oasc.SolrDeletionPolicy.onCommit SolrDeletionPolicy.onCommit: commits:num=1
[junit4:junit4]   2> 		commit{dir=NRTCachingDirectory(org.apache.lucene.store.MMapDirectory@/mnt/ssd/jenkins/workspace/Lucene-Solr-4.x-Linux/solr/build/solr-core/test/J1/org.apache.solr.cloud.BasicDistributedZk2Test-1351460954824/jetty3/index lockFactory=org.apache.lucene.store.NativeFSLockFactory@30e054b6; maxCacheMB=48.0 maxMergeSizeMB=4.0),segFN=segments_1,generation=1,filenames=[segments_1]
[junit4:junit4]   2> 7329 T239 oasc.SolrDeletionPolicy.updateCommits newest commit = 1
[junit4:junit4]   2> 7330 T239 oasc.SolrCore.initWriters created xml: solr.XMLResponseWriter
[junit4:junit4]   2> 7332 T239 oasup.UpdateRequestProcessorChain.init inserting DistributedUpdateProcessorFactory into updateRequestProcessorChain "dedupe"
[junit4:junit4]   2> 7333 T239 oasup.UpdateRequestProcessorChain.init inserting DistributedUpdateProcessorFactory into updateRequestProcessorChain "dedupe-allfields"
[junit4:junit4]   2> 7334 T239 oasup.UpdateRequestProcessorChain.init inserting DistributedUpdateProcessorFactory into updateRequestProcessorChain "stored_sig"
[junit4:junit4]   2> 7334 T239 oasup.UpdateRequestProcessorChain.init inserting DistributedUpdateProcessorFactory into updateRequestProcessorChain "uniq-fields"
[junit4:junit4]   2> 7335 T239 oasup.UpdateRequestProcessorChain.init inserting DistributedUpdateProcessorFactory into updateRequestProcessorChain "distrib-dup-test-chain-implicit"
[junit4:junit4]   2> 7335 T239 oasc.RequestHandlers.initHandlersFromConfig adding lazy requestHandler: solr.ReplicationHandler
[junit4:junit4]   2> 7336 T239 oasc.RequestHandlers.initHandlersFromConfig created /replication: solr.ReplicationHandler
[junit4:junit4]   2> 7337 T239 oasc.RequestHandlers.initHandlersFromConfig created standard: solr.StandardRequestHandler
[junit4:junit4]   2> 7338 T239 oasc.RequestHandlers.initHandlersFromConfig created /get: solr.RealTimeGetHandler
[junit4:junit4]   2> 7339 T239 oasc.RequestHandlers.initHandlersFromConfig created dismax: solr.SearchHandler
[junit4:junit4]   2> 7339 T239 oasc.RequestHandlers.initHandlersFromConfig created mock: org.apache.solr.core.MockQuerySenderListenerReqHandler
[junit4:junit4]   2> 7340 T239 oasc.RequestHandlers.initHandlersFromConfig created /admin/: org.apache.solr.handler.admin.AdminHandlers
[junit4:junit4]   2> 7341 T239 oasc.RequestHandlers.initHandlersFromConfig created defaults: solr.StandardRequestHandler
[junit4:junit4]   2> 7341 T239 oasc.RequestHandlers.initHandlersFromConfig adding lazy requestHandler: solr.StandardRequestHandler
[junit4:junit4]   2> 7342 T239 oasc.RequestHandlers.initHandlersFromConfig created lazy: solr.StandardRequestHandler
[junit4:junit4]   2> 7343 T239 oasc.RequestHandlers.initHandlersFromConfig created /update: solr.UpdateRequestHandler
[junit4:junit4]   2> 7344 T239 oasc.RequestHandlers.initHandlersFromConfig created /terms: org.apache.solr.handler.component.SearchHandler
[junit4:junit4]   2> 7345 T239 oasc.RequestHandlers.initHandlersFromConfig created spellCheckCompRH: org.apache.solr.handler.component.SearchHandler
[junit4:junit4]   2> 7346 T239 oasc.RequestHandlers.initHandlersFromConfig created spellCheckCompRH_Direct: org.apache.solr.handler.component.SearchHandler
[junit4:junit4]   2> 7347 T239 oasc.RequestHandlers.initHandlersFromConfig created spellCheckWithWordbreak: org.apache.solr.handler.component.SearchHandler
[junit4:junit4]   2> 7348 T239 oasc.RequestHandlers.initHandlersFromConfig created spellCheckWithWordbreak_Direct: org.apache.solr.handler.component.SearchHandler
[junit4:junit4]   2> 7349 T239 oasc.RequestHandlers.initHandlersFromConfig created spellCheckCompRH1: org.apache.solr.handler.component.SearchHandler
[junit4:junit4]   2> 7350 T239 oasc.RequestHandlers.initHandlersFromConfig created tvrh: org.apache.solr.handler.component.SearchHandler
[junit4:junit4]   2> 7351 T239 oasc.RequestHandlers.initHandlersFromConfig created /mlt: solr.MoreLikeThisHandler
[junit4:junit4]   2> 7352 T239 oasc.RequestHandlers.initHandlersFromConfig created /debug/dump: solr.DumpRequestHandler
[junit4:junit4]   2> 7354 T239 oashl.XMLLoader.init xsltCacheLifetimeSeconds=60
[junit4:junit4]   2> 7355 T239 oasc.SolrCore.initDeprecatedSupport WARNING solrconfig.xml uses deprecated <admin/gettableFiles>, Please update your config to use the ShowFileRequestHandler.
[junit4:junit4]   2> 7357 T239 oasc.SolrCore.initDeprecatedSupport WARNING adding ShowFileRequestHandler with hidden files: [OLD_SYNONYMS.TXT, PROTWORDS.TXT, STOPWORDS.TXT, OPEN-EXCHANGE-RATES.JSON, CURRENCY.XML, SCHEMA.XML, SYNONYMS.TXT, MAPPING-ISOLATIN1ACCENT.TXT]
[junit4:junit4]   2> 7360 T239 oass.SolrIndexSearcher.<init> Opening Searcher@15ba3292 main
[junit4:junit4]   2> 7361 T239 oasu.CommitTracker.<init> Hard AutoCommit: disabled
[junit4:junit4]   2> 7362 T239 oasu.CommitTracker.<init> Soft AutoCommit: disabled
[junit4:junit4]   2> 7363 T239 oashc.SpellCheckComponent.inform Initializing spell checkers
[junit4:junit4]   2> 7368 T239 oass.DirectSolrSpellChecker.init init: {name=direct,classname=DirectSolrSpellChecker,field=lowerfilt,minQueryLength=3}
[junit4:junit4]   2> 7400 T302 oasc.SolrCore.registerSearcher [collection1] Registered new searcher Searcher@15ba3292 main{StandardDirectoryReader(segments_1:1)}
[junit4:junit4]   2> 7407 T239 oasc.ZkController.publish numShards not found on descriptor - reading it from system property
[junit4:junit4]   2> 7489 T260 oascc.ZkStateReader.updateClusterState Updating cloud state from ZooKeeper... 
[junit4:junit4]   2> 7490 T260 oasc.Overseer$ClusterStateUpdater.updateState Update state numShards=2 message={
[junit4:junit4]   2> 	  "base_url":"http://127.0.0.1:53934/solr",
[junit4:junit4]   2> 	  "state":"down",
[junit4:junit4]   2> 	  "operation":"state",
[junit4:junit4]   2> 	  "node_name":"127.0.0.1:53934_solr",
[junit4:junit4]   2> 	  "numShards":"2",
[junit4:junit4]   2> 	  "roles":null,
[junit4:junit4]   2> 	  "collection":"collection1",
[junit4:junit4]   2> 	  "shard":null,
[junit4:junit4]   2> 	  "core":"collection1"}
[junit4:junit4]   2> 7494 T301 oascc.ZkStateReader$2.process A cluster state change has occurred - updating... (4)
[junit4:junit4]   2> 7494 T289 oascc.ZkStateReader$2.process A cluster state change has occurred - updating... (4)
[junit4:junit4]   2> 7494 T259 oascc.ZkStateReader$2.process A cluster state change has occurred - updating... (4)
[junit4:junit4]   2> 7494 T277 oascc.ZkStateReader$2.process A cluster state change has occurred - updating... (4)
[junit4:junit4]   2> 7910 T239 oasc.CoreContainer.register registering core: collection1
[junit4:junit4]   2> 7911 T239 oasc.ZkController.register Register shard - core:collection1 address:http://127.0.0.1:53934/solr shardId:shard1
[junit4:junit4]   2> 7914 T239 oasc.ZkController.register We are http://127.0.0.1:53934/solr/collection1/ and leader is http://127.0.0.1:58956/solr/collection1/
[junit4:junit4]   2> 7914 T239 oasc.ZkController.register No LogReplay needed for core=collection1 baseURL=http://127.0.0.1:53934/solr
[junit4:junit4]   2> 7915 T239 oasc.ZkController.checkRecovery Core needs to recover:collection1
[junit4:junit4]   2> 7915 T239 oasu.DefaultSolrCoreState.doRecovery Running recovery - first canceling any ongoing recovery
[junit4:junit4]   2> ASYNC  NEW_CORE C19 name=collection1 org.apache.solr.core.SolrCore@3430e11e url=http://127.0.0.1:53934/solr/collection1 node=127.0.0.1:53934_solr
[junit4:junit4]   2> 7916 T303 C19 P53934 oasc.RecoveryStrategy.run Starting recovery process.  core=collection1 recoveringAfterStartup=true
[junit4:junit4]   2> 7916 T239 oascc.ZkStateReader.updateClusterState Updating cloud state from ZooKeeper... 
[junit4:junit4]   2> 7916 T303 C19 P53934 oasc.RecoveryStrategy.doRecovery ###### startupVersions=[]
[junit4:junit4]   2> 7917 T303 C19 P53934 oasc.ZkController.publish numShards not found on descriptor - reading it from system property
[junit4:junit4]   2> 7917 T239 oass.SolrDispatchFilter.init user.dir=/mnt/ssd/jenkins/workspace/Lucene-Solr-4.x-Linux/solr/build/solr-core/test/J1
[junit4:junit4]   2> 7918 T239 oass.SolrDispatchFilter.init SolrDispatchFilter.init() done
[junit4:junit4]   2> 7918 T303 C19 P53934 oasc.RecoveryStrategy.doRecovery Attempting to PeerSync from http://127.0.0.1:58956/solr/collection1/ core=collection1 - recoveringAfterStartup=true
[junit4:junit4]   2> 7918 T239 oascsi.HttpClientUtil.createClient Creating new http client, config:maxConnections=128&maxConnectionsPerHost=32&followRedirects=false
[junit4:junit4]   2> 7919 T303 C19 P53934 oasu.PeerSync.sync PeerSync: core=collection1 url=http://127.0.0.1:53934/solr START replicas=[http://127.0.0.1:58956/solr/collection1/] nUpdates=100
[junit4:junit4]   2> 7919 T303 C19 P53934 oasu.PeerSync.sync WARNING no frame of reference to tell of we've missed updates
[junit4:junit4]   2> 7920 T303 C19 P53934 oasc.RecoveryStrategy.doRecovery PeerSync Recovery was not successful - trying replication. core=collection1
[junit4:junit4]   2> 7920 T303 C19 P53934 oasc.RecoveryStrategy.doRecovery Starting Replication Recovery. core=collection1
[junit4:junit4]   2> 7920 T303 C19 P53934 oascsi.HttpClientUtil.createClient Creating new http client, config:maxConnections=128&maxConnectionsPerHost=32&followRedirects=false
[junit4:junit4]   2> 7982 T239 oejs.Server.doStart jetty-8.1.2.v20120308
[junit4:junit4]   2> 7984 T239 oejs.AbstractConnector.doStart Started SelectChannelConnector@0.0.0.0:57993
[junit4:junit4]   2> 7985 T239 oasc.SolrResourceLoader.locateSolrHome JNDI not configured for solr (NoInitialContextEx)
[junit4:junit4]   2> 7986 T239 oasc.SolrResourceLoader.locateSolrHome using system property solr.solr.home: /mnt/ssd/jenkins/workspace/Lucene-Solr-4.x-Linux/solr/build/solr-core/test/J1/./solrtest-jetty4-1351460962752
[junit4:junit4]   2> 7986 T239 oasc.SolrResourceLoader.<init> new SolrResourceLoader for deduced Solr Home: '/mnt/ssd/jenkins/workspace/Lucene-Solr-4.x-Linux/solr/build/solr-core/test/J1/./solrtest-jetty4-1351460962752/'
[junit4:junit4]   2> 7996 T239 oass.SolrDispatchFilter.init SolrDispatchFilter.init()
[junit4:junit4]   2> 7996 T239 oasc.SolrResourceLoader.locateSolrHome JNDI not configured for solr (NoInitialContextEx)
[junit4:junit4]   2> 7997 T239 oasc.SolrResourceLoader.locateSolrHome using system property solr.solr.home: /mnt/ssd/jenkins/workspace/Lucene-Solr-4.x-Linux/solr/build/solr-core/test/J1/./solrtest-jetty4-1351460962752
[junit4:junit4]   2> 7997 T239 oasc.CoreContainer$Initializer.initialize looking for solr.xml: /mnt/ssd/jenkins/workspace/Lucene-Solr-4.x-Linux/solr/build/solr-core/test/J1/./solrtest-jetty4-1351460962752/solr.xml
[junit4:junit4]   2> 7998 T239 oasc.CoreContainer.<init> New CoreContainer 1780446377
[junit4:junit4]   2> 7999 T260 oascc.ZkStateReader.updateClusterState Updating cloud state from ZooKeeper... 
[junit4:junit4]   2> 7999 T239 oasc.CoreContainer.load Loading CoreContainer using Solr Home: '/mnt/ssd/jenkins/workspace/Lucene-Solr-4.x-Linux/solr/build/solr-core/test/J1/./solrtest-jetty4-1351460962752/'
[junit4:junit4]   2> 8000 T239 oasc.SolrResourceLoader.<init> new SolrResourceLoader for directory: '/mnt/ssd/jenkins/workspace/Lucene-Solr-4.x-Linux/solr/build/solr-core/test/J1/./solrtest-jetty4-1351460962752/'
[junit4:junit4]   2> 8001 T260 oasc.Overseer$ClusterStateUpdater.updateState Update state numShards=2 message={
[junit4:junit4]   2> 	  "base_url":"http://127.0.0.1:53934/solr",
[junit4:junit4]   2> 	  "state":"recovering",
[junit4:junit4]   2> 	  "operation":"state",
[junit4:junit4]   2> 	  "node_name":"127.0.0.1:53934_solr",
[junit4:junit4]   2> 	  "numShards":"2",
[junit4:junit4]   2> 	  "roles":null,
[junit4:junit4]   2> 	  "collection":"collection1",
[junit4:junit4]   2> 	  "shard":"shard1",
[junit4:junit4]   2> 	  "core":"collection1"}
[junit4:junit4]   2> 8006 T277 oascc.ZkStateReader$2.process A cluster state change has occurred - updating... (4)
[junit4:junit4]   2> 8006 T289 oascc.ZkStateReader$2.process A cluster state change has occurred - updating... (4)
[junit4:junit4]   2> 8007 T259 oascc.ZkStateReader$2.process A cluster state change has occurred - updating... (4)
[junit4:junit4]   2> 8006 T301 oascc.ZkStateReader$2.process A cluster state change has occurred - updating... (4)
[junit4:junit4]   2> 8018 T239 oasc.CoreContainer.load Registering Log Listener
[junit4:junit4]   2> 8029 T239 oasc.CoreContainer.initZooKeeper Zookeeper client=127.0.0.1:34274/solr
[junit4:junit4]   2> 8030 T239 oaz.ZooKeeper.<init> Initiating client connection, connectString=127.0.0.1:34274/solr sessionTimeout=5000 watcher=org.apache.solr.common.cloud.ConnectionManager@23fc7444
[junit4:junit4]   2> 8031 T314 oaz.ClientCnxn$SendThread.startConnect Opening socket connection to server /127.0.0.1:34274
[junit4:junit4]   2> 8031 T239 oascc.ConnectionManager.waitForConnected Waiting for client to connect to ZooKeeper
[junit4:junit4]   2> 8032 T314 oaz.ClientCnxn$SendThread.primeConnection Socket connection established to localhost.localdomain/127.0.0.1:34274, initiating session
[junit4:junit4]   2> 8032 T241 oazs.NIOServerCnxn$Factory.run Accepted socket connection from /127.0.0.1:52736
[junit4:junit4]   2> 8033 T241 oazs.NIOServerCnxn.readConnectRequest Client attempting to establish new session at /127.0.0.1:52736
[junit4:junit4]   2> 8034 T243 oazs.NIOServerCnxn.finishSessionInit Established session 0x13aa959a2cc0006 with negotiated timeout 5000 for client /127.0.0.1:52736
[junit4:junit4]   2> 8034 T314 oaz.ClientCnxn$SendThread.readConnectResult Session establishment complete on server localhost.localdomain/127.0.0.1:34274, sessionid = 0x13aa959a2cc0006, negotiated timeout = 5000
[junit4:junit4]   2> 8035 T315 oascc.ConnectionManager.process Watcher org.apache.solr.common.cloud.ConnectionManager@23fc7444 name:ZooKeeperConnection Watcher:127.0.0.1:34274/solr got event WatchedEvent state:SyncConnected type:None path:null path:null type:None
[junit4:junit4]   2> 8035 T239 oascc.ConnectionManager.waitForConnected Client is connected to ZooKeeper
[junit4:junit4]   2> 8036 T244 oazs.PrepRequestProcessor.pRequest Got user-level KeeperException when processing sessionid:0x13aa959a2cc0006 type:create cxid:0x1 zxid:0xfffffffffffffffe txntype:unknown reqpath:n/a Error Path:/solr/overseer Error:KeeperErrorCode = NodeExists for /solr/overseer
[junit4:junit4]   2> 8037 T244 oazs.PrepRequestProcessor.pRequest Got user-level KeeperException when processing sessionid:0x13aa959a2cc0006 type:create cxid:0x2 zxid:0xfffffffffffffffe txntype:unknown reqpath:n/a Error Path:/solr/overseer Error:KeeperErrorCode = NodeExists for /solr/overseer
[junit4:junit4]   2> 8038 T239 oasc.ZkController.createEphemeralLiveNode Register node as live in ZooKeeper:/live_nodes/127.0.0.1:57993_solr
[junit4:junit4]   2> 8039 T244 oazs.PrepRequestProcessor.pRequest Got user-level KeeperException when processing sessionid:0x13aa959a2cc0006 type:delete cxid:0x4 zxid:0xfffffffffffffffe txntype:unknown reqpath:n/a Error Path:/solr/live_nodes/127.0.0.1:57993_solr Error:KeeperErrorCode = NoNode for /solr/live_nodes/127.0.0.1:57993_solr
[junit4:junit4]   2> 8039 T239 oascc.SolrZkClient.makePath makePath: /live_nodes/127.0.0.1:57993_solr
[junit4:junit4]   2> 8042 T259 oascc.ZkStateReader$3.process Updating live nodes... (5)
[junit4:junit4]   2> 8042 T301 oascc.ZkStateReader$3.process Updating live nodes... (5)
[junit4:junit4]   2> 8042 T289 oascc.ZkStateReader$3.process Updating live nodes... (5)
[junit4:junit4]   2> 8042 T277 oascc.ZkStateReader$3.process Updating live nodes... (5)
[junit4:junit4]   2> 8043 T239 oashc.HttpShardHandlerFactory.getParameter Setting socketTimeout to: 0
[junit4:junit4]   2> 8044 T239 oashc.HttpShardHandlerFactory.getParameter Setting urlScheme to: http://
[junit4:junit4]   2> 8044 T239 oashc.HttpShardHandlerFactory.getParameter Setting connTimeout to: 0
[junit4:junit4]   2> 8045 T239 oashc.HttpShardHandlerFactory.getParameter Setting maxConnectionsPerHost to: 20
[junit4:junit4]   2> 8046 T239 oashc.HttpShardHandlerFactory.getParameter Setting corePoolSize to: 0
[junit4:junit4]   2> 8046 T239 oashc.HttpShardHandlerFactory.getParameter Setting maximumPoolSize to: 2147483647
[junit4:junit4]   2> 8047 T239 oashc.HttpShardHandlerFactory.getParameter Setting maxThreadIdleTime to: 5
[junit4:junit4]   2> 8048 T239 oashc.HttpShardHandlerFactory.getParameter Setting sizeOfQueue to: -1
[junit4:junit4]   2> 8048 T239 oashc.HttpShardHandlerFactory.getParameter Setting fairnessPolicy to: false
[junit4:junit4]   2> 8049 T239 oascsi.HttpClientUtil.createClient Creating new http client, config:maxConnectionsPerHost=20&maxConnections=10000&socketTimeout=0&connTimeout=0&retry=false
[junit4:junit4]   2> 8060 T239 oascc.ZkStateReader.createClusterStateWatchersAndUpdate Updating cluster state from ZooKeeper... 
[junit4:junit4]   2> 8065 T239 oasc.CoreContainer.create Creating SolrCore 'collection1' using instanceDir: /mnt/ssd/jenkins/workspace/Lucene-Solr-4.x-Linux/solr/build/solr-core/test/J1/./solrtest-jetty4-1351460962752/collection1
[junit4:junit4]   2> 8065 T239 oasc.ZkController.createCollectionZkNode Check for collection zkNode:collection1
[junit4:junit4]   2> 8066 T239 oasc.ZkController.createCollectionZkNode Collection zkNode exists
[junit4:junit4]   2> 8067 T239 oasc.ZkController.readConfigName Load collection config from:/collections/collection1
[junit4:junit4]   2> 8068 T239 oasc.SolrResourceLoader.<init> new SolrResourceLoader for directory: '/mnt/ssd/jenkins/workspace/Lucene-Solr-4.x-Linux/solr/build/solr-core/test/J1/./solrtest-jetty4-1351460962752/collection1/'
[junit4:junit4]   2> 8069 T239 oasc.SolrResourceLoader.replaceClassLoader Adding 'file:/mnt/ssd/jenkins/workspace/Lucene-Solr-4.x-Linux/solr/build/solr-core/test/J1/solrtest-jetty4-1351460962752/collection1/lib/README' to classloader
[junit4:junit4]   2> 8070 T239 oasc.SolrResourceLoader.replaceClassLoader Adding 'file:/mnt/ssd/jenkins/workspace/Lucene-Solr-4.x-Linux/solr/build/solr-core/test/J1/solrtest-jetty4-1351460962752/collection1/lib/classes/' to classloader
[junit4:junit4]   2> 8099 T239 oasc.SolrConfig.<init> Using Lucene MatchVersion: LUCENE_41
[junit4:junit4]   2> 8137 T239 oasc.SolrConfig.<init> Loaded SolrConfig: solrconfig.xml
[junit4:junit4]   2> 8138 T239 oass.IndexSchema.readSchema Reading Solr Schema
[junit4:junit4]   2> 8144 T239 oass.IndexSchema.readSchema Schema name=test
[junit4:junit4]   2> ASYNC  NEW_CORE C20 name=collection1 org.apache.solr.core.SolrCore@1e0e6bd9 url=http://127.0.0.1:58956/solr/collection1 node=127.0.0.1:58956_solr
[junit4:junit4]   2> 8206 T271 C20 P58956 REQ /get {version=2&getVersions=100&qt=/get&wt=javabin&distrib=false} status=0 QTime=278 
[junit4:junit4]   2> 8590 T239 oass.OpenExchangeRatesOrgProvider.init Initialized with rates=open-exchange-rates.json, refreshInterval=1440.
[junit4:junit4]   2> 8596 T239 oass.IndexSchema.readSchema default search field in schema is text
[junit4:junit4]   2> 8599 T239 oass.IndexSchema.readSchema unique key field: id
[junit4:junit4]   2> 8614 T239 oass.FileExchangeRateProvider.reload Reloading exchange rates from file currency.xml
[junit4:junit4]   2> 8617 T239 oass.FileExchangeRateProvider.reload Reloading exchange rates from file currency.xml
[junit4:junit4]   2> 8621 T239 oass.OpenExchangeRatesOrgProvider.reload Reloading exchange rates from open-exchange-rates.json
[junit4:junit4]   2> 8622 T239 oass.OpenExchangeRatesOrgProvider.reload Reloading exchange rates from open-exchange-rates.json
[junit4:junit4]   2> 8623 T239 oasc.SolrCore.<init> [collection1] Opening new SolrCore at /mnt/ssd/jenkins/workspace/Lucene-Solr-4.x-Linux/solr/build/solr-core/test/J1/./solrtest-jetty4-1351460962752/collection1/, dataDir=./org.apache.solr.cloud.BasicDistributedZk2Test-1351460954824/jetty4/
[junit4:junit4]   2> 8624 T239 oasc.JmxMonitoredMap.<init> JMX monitoring is enabled. Adding Solr mbeans to JMX Server: com.sun.jmx.mbeanserver.JmxMBeanServer@d9bc6930
[junit4:junit4]   2> 8625 T239 oasc.SolrCore.getNewIndexDir New index directory detected: old=null new=./org.apache.solr.cloud.BasicDistributedZk2Test-1351460954824/jetty4/index/
[junit4:junit4]   2> 8625 T239 oasc.SolrCore.initIndex WARNING [collection1] Solr index directory './org.apache.solr.cloud.BasicDistributedZk2Test-1351460954824/jetty4/index' doesn't exist. Creating new index...
[junit4:junit4]   2> 8626 T239 oasc.CachingDirectoryFactory.get return new directory for /mnt/ssd/jenkins/workspace/Lucene-Solr-4.x-Linux/solr/build/solr-core/test/J1/./org.apache.solr.cloud.BasicDistributedZk2Test-1351460954824/jetty4/index forceNew:false
[junit4:junit4]   2> 8630 T239 oasc.SolrDeletionPolicy.onCommit SolrDeletionPolicy.onCommit: commits:num=1
[junit4:junit4]   2> 		commit{dir=NRTCachingDirectory(org.apache.lucene.store.MMapDirectory@/mnt/ssd/jenkins/workspace/Lucene-Solr-4.x-Linux/solr/build/solr-core/test/J1/org.apache.solr.cloud.BasicDistributedZk2Test-1351460954824/jetty4/index lockFactory=org.apache.lucene.store.NativeFSLockFactory@691ff3aa; maxCacheMB=48.0 maxMergeSizeMB=4.0),segFN=segments_1,generation=1,filenames=[segments_1]
[junit4:junit4]   2> 8630 T239 oasc.SolrDeletionPolicy.updateCommits newest commit = 1
[junit4:junit4]   2> 8631 T239 oasc.SolrCore.initWriters created xml: solr.XMLResponseWriter
[junit4:junit4]   2> 8634 T239 oasup.UpdateRequestProcessorChain.init inserting DistributedUpdateProcessorFactory into updateRequestProcessorChain "dedupe"
[junit4:junit4]   2> 8634 T239 oasup.UpdateRequestProcessorChain.init inserting DistributedUpdateProcessorFactory into updateRequestProcessorChain "dedupe-allfields"
[junit4:junit4]   2> 8635 T239 oasup.UpdateRequestProcessorChain.init inserting DistributedUpdateProcessorFactory into updateRequestProcessorChain "stored_sig"
[junit4:junit4]   2> 8635 T239 oasup.UpdateRequestProcessorChain.init inserting DistributedUpdateProcessorFactory into updateRequestProcessorChain "uniq-fields"
[junit4:junit4]   2> 8636 T239 oasup.UpdateRequestProcessorChain.init inserting DistributedUpdateProcessorFactory into updateRequestProcessorChain "distrib-dup-test-chain-implicit"
[junit4:junit4]   2> 8636 T239 oasc.RequestHandlers.initHandlersFromConfig adding lazy requestHandler: solr.ReplicationHandler
[junit4:junit4]   2> 8637 T239 oasc.RequestHandlers.initHandlersFromConfig created /replication: solr.ReplicationHandler
[junit4:junit4]   2> 8638 T239 oasc.RequestHandlers.initHandlersFromConfig created standard: solr.StandardRequestHandler
[junit4:junit4]   2> 8639 T239 oasc.RequestHandlers.initHandlersFromConfig created /get: solr.RealTimeGetHandler
[junit4:junit4]   2> 8639 T239 oasc.RequestHandlers.initHandlersFromConfig created dismax: solr.SearchHandler
[junit4:junit4]   2> 8640 T239 oasc.RequestHandlers.initHandlersFromConfig created mock: org.apache.solr.core.MockQuerySenderListenerReqHandler
[junit4:junit4]   2> 8641 T239 oasc.RequestHandlers.initHandlersFromConfig created /admin/: org.apache.solr.handler.admin.AdminHandlers
[junit4:junit4]   2> 8642 T239 oasc.RequestHandlers.initHandlersFromConfig created defaults: solr.StandardRequestHandler
[junit4:junit4]   2> 8642 T239 oasc.RequestHandlers.initHandlersFromConfig adding lazy requestHandler: solr.StandardRequestHandler
[junit4:junit4]   2> 8643 T239 oasc.RequestHandlers.initHandlersFromConfig created lazy: solr.StandardRequestHandler
[junit4:junit4]   2> 8645 T239 oasc.RequestHandlers.initHandlersFromConfig created /update: solr.UpdateRequestHandler
[junit4:junit4]   2> 8646 T239 oasc.RequestHandlers.initHandlersFromConfig created /terms: org.apache.solr.handler.component.SearchHandler
[junit4:junit4]   2> 8655 T239 oasc.RequestHandlers.initHandlersFromConfig created spellCheckCompRH: org.apache.solr.handler.component.SearchHandler
[junit4:junit4]   2> 8656 T239 oasc.RequestHandlers.initHandlersFromConfig created spellCheckCompRH_Direct: org.apache.solr.handler.component.SearchHandler
[junit4:junit4]   2> 8657 T239 oasc.RequestHandlers.initHandlersFromConfig created spellCheckWithWordbreak: org.apache.solr.handler.component.SearchHandler
[junit4:junit4]   2> 8658 T239 oasc.RequestHandlers.initHandlersFromConfig created spellCheckWithWordbreak_Direct: org.apache.solr.handler.component.SearchHandler
[junit4:junit4]   2> 8659 T239 oasc.RequestHandlers.initHandlersFromConfig created spellCheckCompRH1: org.apache.solr.handler.component.SearchHandler
[junit4:junit4]   2> 8659 T239 oasc.RequestHandlers.initHandlersFromConfig created tvrh: org.apache.solr.handler.component.SearchHandler
[junit4:junit4]   2> 8660 T239 oasc.RequestHandlers.initHandlersFromConfig created /mlt: solr.MoreLikeThisHandler
[junit4:junit4]   2> 8661 T239 oasc.RequestHandlers.initHandlersFromConfig created /debug/dump: solr.DumpRequestHandler
[junit4:junit4]   2> 8662 T239 oashl.XMLLoader.init xsltCacheLifetimeSeconds=60
[junit4:junit4]   2> 8664 T239 oasc.SolrCore.initDeprecatedSupport WARNING solrconfig.xml uses deprecated <admin/gettableFiles>, Please update your config to use the ShowFileRequestHandler.
[junit4:junit4]   2> 8669 T239 oasc.SolrCore.initDeprecatedSupport WARNING adding ShowFileRequestHandler with hidden files: [OLD_SYNONYMS.TXT, PROTWORDS.TXT, STOPWORDS.TXT, OPEN-EXCHANGE-RATES.JSON, CURRENCY.XML, SCHEMA.XML, SYNONYMS.TXT, MAPPING-ISOLATIN1ACCENT.TXT]
[junit4:junit4]   2> 8673 T239 oass.SolrIndexSearcher.<init> Opening Searcher@8a5142b5 main
[junit4:junit4]   2> 8674 T239 oasu.CommitTracker.<init> Hard AutoCommit: disabled
[junit4:junit4]   2> 8675 T239 oasu.CommitTracker.<init> Soft AutoCommit: disabled
[junit4:junit4]   2> 8676 T239 oashc.SpellCheckComponent.inform Initializing spell checkers
[junit4:junit4]   2> 8690 T239 oass.DirectSolrSpellChecker.init init: {name=direct,classname=DirectSolrSpellChecker,field=lowerfilt,minQueryLength=3}
[junit4:junit4]   2> 8719 T316 oasc.SolrCore.registerSearcher [collection1] Registered new searcher Searcher@8a5142b5 main{StandardDirectoryReader(segments_1:1)}
[junit4:junit4]   2> 8727 T239 oasc.ZkController.publish numShards not found on descriptor - reading it from system property
[junit4:junit4]   2> 9014 T260 oascc.ZkStateReader.updateClusterState Updating cloud state from ZooKeeper... 
[junit4:junit4]   2> 9015 T260 oasc.Overseer$ClusterStateUpdater.updateState Update state numShards=2 message={
[junit4:junit4]   2> 	  "base_url":"http://127.0.0.1:57993/solr",
[junit4:junit4]   2> 	  "state":"down",
[junit4:junit4]   2> 	  "operation":"state",
[junit4:junit4]   2> 	  "node_name":"127.0.0.1:57993_solr",
[junit4:junit4]   2> 	  "numShards":"2",
[junit4:junit4]   2> 	  "roles":null,
[junit4:junit4]   2> 	  "collection":"collection1",
[junit4:junit4]   2> 	  "shard":null,
[junit4:junit4]   2> 	  "core":"collection1"}
[junit4:junit4]   2> 9019 T301 oascc.ZkStateReader$2.process A cluster state change has occurred - updating... (5)
[junit4:junit4]   2> 9019 T315 oascc.ZkStateReader$2.process A cluster state change has occurred - updating... (5)
[junit4:junit4]   2> 9019 T289 oascc.ZkStateReader$2.process A cluster state change has occurred - updating... (5)
[junit4:junit4]   2> 9019 T277 oascc.ZkStateReader$2.process A cluster state change has occurred - updating... (5)
[junit4:junit4]   2> 9020 T259 oascc.ZkStateReader$2.process A cluster state change has occurred - updating... (5)
[junit4:junit4]   2> 9229 T239 oasc.CoreContainer.register registering core: collection1
[junit4:junit4]   2> 9230 T239 oasc.ZkController.register Register shard - core:collection1 address:http://127.0.0.1:57993/solr shardId:shard2
[junit4:junit4]   2> 9235 T239 oasc.ZkController.register We are http://127.0.0.1:57993/solr/collection1/ and leader is http://127.0.0.1:44643/solr/collection1/
[junit4:junit4]   2> 9236 T239 oasc.ZkController.register No LogReplay needed for core=collection1 baseURL=http://127.0.0.1:57993/solr
[junit4:junit4]   2> 9236 T239 oasc.ZkController.checkRecovery Core needs to recover:collection1
[junit4:junit4]   2> 9237 T239 oasu.DefaultSolrCoreState.doRecovery Running recovery - first canceling any ongoing recovery
[junit4:junit4]   2> ASYNC  NEW_CORE C21 name=collection1 org.apache.solr.core.SolrCore@2e02340e url=http://127.0.0.1:57993/solr/collection1 node=127.0.0.1:57993_solr
[junit4:junit4]   2> 9238 T317 C21 P57993 oasc.RecoveryStrategy.run Starting recovery process.  core=collection1 recoveringAfterStartup=true
[junit4:junit4]   2> 9238 T317 C21 P57993 oasc.RecoveryStrategy.doRecovery ###### startupVersions=[]
[junit4:junit4]   2> 9239 T317 C21 P57993 oasc.ZkController.publish numShards not found on descriptor - reading it from system property
[junit4:junit4]   2> 9238 T239 oascc.ZkStateReader.updateClusterState Updating cloud state from ZooKeeper... 
[junit4:junit4]   2> 9240 T317 C21 P57993 oasc.RecoveryStrategy.doRecovery Attempting to PeerSync from http://127.0.0.1:44643/solr/collection1/ core=collection1 - recoveringAfterStartup=true
[junit4:junit4]   2> 9240 T317 C21 P57993 oasu.PeerSync.sync PeerSync: core=collection1 url=http://127.0.0.1:57993/solr START replicas=[http://127.0.0.1:44643/solr/collection1/] nUpdates=100
[junit4:junit4]   2> 9240 T317 C21 P57993 oasu.PeerSync.sync WARNING no frame of reference to tell of we've missed updates
[junit4:junit4]   2> 9241 T317 C21 P57993 oasc.RecoveryStrategy.doRecovery PeerSync Recovery was not successful - trying replication. core=collection1
[junit4:junit4]   2> 9241 T239 oass.SolrDispatchFilter.init user.dir=/mnt/ssd/jenkins/workspace/Lucene-Solr-4.x-Linux/solr/build/solr-core/test/J1
[junit4:junit4]   2> 9241 T317 C21 P57993 oasc.RecoveryStrategy.doRecovery Starting Replication Recovery. core=collection1
[junit4:junit4]   2> 9241 T239 oass.SolrDispatchFilter.init SolrDispatchFilter.init() done
[junit4:junit4]   2> 9243 T317 C21 P57993 oascsi.HttpClientUtil.createClient Creating new http client, config:maxConnections=128&maxConnectionsPerHost=32&followRedirects=false
[junit4:junit4]   2> 9243 T239 oascsi.HttpClientUtil.createClient Creating new http client, config:maxConnections=128&maxConnectionsPerHost=32&followRedirects=false
[junit4:junit4]   2> ASYNC  NEW_CORE C22 name=collection1 org.apache.solr.core.SolrCore@b9cb5bcf url=http://127.0.0.1:44643/solr/collection1 node=127.0.0.1:44643_solr
[junit4:junit4]   2> 9254 T284 C22 P44643 REQ /get {version=2&getVersions=100&qt=/get&wt=javabin&distrib=false} status=0 QTime=0 
[junit4:junit4]   2> 9257 T239 oaz.ZooKeeper.<init> Initiating client connection, connectString=127.0.0.1:34274/solr sessionTimeout=10000 watcher=org.apache.solr.common.cloud.ConnectionManager@8f6b3ef0
[junit4:junit4]   2> 9259 T319 oaz.ClientCnxn$SendThread.startConnect Opening socket connection to server /127.0.0.1:34274
[junit4:junit4]   2> 9259 T239 oascc.ConnectionManager.waitForConnected Waiting for client to connect to ZooKeeper
[junit4:junit4]   2> 9261 T319 oaz.ClientCnxn$SendThread.primeConnection Socket connection established to localhost.localdomain/127.0.0.1:34274, initiating session
[junit4:junit4]   2> 9262 T241 oazs.NIOServerCnxn$Factory.run Accepted socket connection from /127.0.0.1:52739
[junit4:junit4]   2> 9262 T241 oazs.NIOServerCnxn.readConnectRequest Client attempting to establish new session at /127.0.0.1:52739
[junit4:junit4]   2> 9263 T243 oazs.NIOServerCnxn.finishSessionInit Established session 0x13aa959a2cc0007 with negotiated timeout 10000 for client /127.0.0.1:52739
[junit4:junit4]   2> 9263 T319 oaz.ClientCnxn$SendThread.readConnectResult Session establishment complete on server localhost.localdomain/127.0.0.1:34274, sessionid = 0x13aa959a2cc0007, negotiated timeout = 10000
[junit4:junit4]   2> 9264 T320 oascc.ConnectionManager.process Watcher org.apache.solr.common.cloud.ConnectionManager@8f6b3ef0 name:ZooKeeperConnection Watcher:127.0.0.1:34274/solr got event WatchedEvent state:SyncConnected type:None path:null path:null type:None
[junit4:junit4]   2> 9264 T239 oascc.ConnectionManager.waitForConnected Client is connected to ZooKeeper
[junit4:junit4]   2> 9265 T239 oascc.ZkStateReader.createClusterStateWatchersAndUpdate Updating cluster state from ZooKeeper... 
[junit4:junit4]   2> 9267 T239 oasc.ChaosMonkey.monkeyLog monkey: init - expire sessions:true cause connection loss:true
[junit4:junit4]   2> 9268 T239 oascsi.HttpClientUtil.createClient Creating new http client, config:
[junit4:junit4]   2> 9275 T239 oascc.ZkStateReader.updateClusterState Updating cloud state from ZooKeeper... 
[junit4:junit4]   2> 9524 T260 oascc.ZkStateReader.updateClusterState Updating cloud state from ZooKeeper... 
[junit4:junit4]   2> 9526 T260 oasc.Overseer$ClusterStateUpdater.updateState Update state numShards=2 message={
[junit4:junit4]   2> 	  "base_url":"http://127.0.0.1:57993/solr",
[junit4:junit4]   2> 	  "state":"recovering",
[junit4:junit4]   2> 	  "operation":"state",
[junit4:junit4]   2> 	  "node_name":"127.0.0.1:57993_solr",
[junit4:junit4]   2> 	  "numShards":"2",
[junit4:junit4]   2> 	  "roles":null,
[junit4:junit4]   2> 	  "collection":"collection1",
[junit4:junit4]   2> 	  "shard":"shard2",
[junit4:junit4]   2> 	  "core":"collection1"}
[junit4:junit4]   2> 9530 T277 oascc.ZkStateReader$2.process A cluster state change has occurred - updating... (5)
[junit4:junit4]   2> 9530 T259 oascc.ZkStateReader$2.process A cluster state change has occurred - updating... (5)
[junit4:junit4]   2> 9531 T315 oascc.ZkStateReader$2.process A cluster state change has occurred - updating... (5)
[junit4:junit4]   2> 9531 T301 oascc.ZkStateReader$2.process A cluster state change has occurred - updating... (5)
[junit4:junit4]   2> 9531 T289 oascc.ZkStateReader$2.process A cluster state change has occurred - updating... (5)
[junit4:junit4]   2> 9530 T320 oascc.ZkStateReader$2.process A cluster state change has occurred - updating... (5)
[junit4:junit4]   2> ASYNC  NEW_CORE C23 name=collection1 org.apache.solr.core.SolrCore@9524d184 url=http://127.0.0.1:36004/solr/collection1 node=127.0.0.1:36004_solr
[junit4:junit4]   2> 9807 T257 C23 P36004 oasc.SolrDeletionPolicy.onInit SolrDeletionPolicy.onInit: commits:num=1
[junit4:junit4]   2> 		commit{dir=NRTCachingDirectory(org.apache.lucene.store.MMapDirectory@/mnt/ssd/jenkins/workspace/Lucene-Solr-4.x-Linux/solr/build/solr-core/test/J1/org.apache.solr.cloud.BasicDistributedZk2Test-1351460954824/control/data/index lockFactory=org.apache.lucene.store.NativeFSLockFactory@eba722c2; maxCacheMB=48.0 maxMergeSizeMB=4.0),segFN=segments_1,generation=1,filenames=[segments_1]
[junit4:junit4]   2> 9808 T257 C23 P36004 oasc.SolrDeletionPolicy.updateCommits newest commit = 1
[junit4:junit4]   2> 9814 T257 C23 P36004 /update {version=2&wt=javabin} {add=[1 (1417109532442624000)]} 0 529
[junit4:junit4]   2> 9815 T239 oaz.ZooKeeper.<init> Initiating client connection, connectString=127.0.0.1:34274/solr sessionTimeout=10000 watcher=org.apache.solr.common.cloud.ConnectionManager@2cd88faa
[junit4:junit4]   2> 9816 T321 oaz.ClientCnxn$SendThread.startConnect Opening socket connection to server /127.0.0.1:34274
[junit4:junit4]   2> 9816 T239 oascc.ConnectionManager.waitForConnected Waiting for client to connect to ZooKeeper
[junit4:junit4]   2> 9817 T321 oaz.ClientCnxn$SendThread.primeConnection Socket connection established to localhost.localdomain/127.0.0.1:34274, initiating session
[junit4:junit4]   2> 9817 T241 oazs.NIOServerCnxn$Factory.run Accepted socket connection from /127.0.0.1:52741
[junit4:junit4]   2> 9817 T241 oazs.NIOServerCnxn.readConnectRequest Client attempting to establish new session at /127.0.0.1:52741
[junit4:junit4]   2> 9819 T243 oazs.NIOServerCnxn.finishSessionInit Established session 0x13aa959a2cc0008 with negotiated timeout 10000 for client /127.0.0.1:52741
[junit4:junit4]   2> 9819 T321 oaz.ClientCnxn$SendThread.readConnectResult Session establishment complete on server localhost.localdomain/127.0.0.1:34274, sessionid = 0x13aa959a2cc0008, negotiated timeout = 10000
[junit4:junit4]   2> 9819 T322 oascc.ConnectionManager.process Watcher org.apache.solr.common.cloud.ConnectionManager@2cd88faa name:ZooKeeperConnection Watcher:127.0.0.1:34274/solr got event WatchedEvent state:SyncConnected type:None path:null path:null type:None
[junit4:junit4]   2> 9819 T239 oascc.ConnectionManager.waitForConnected Client is connected to ZooKeeper
[junit4:junit4]   2> 9820 T239 oascc.ZkStateReader.createClusterStateWatchersAndUpdate Updating cluster state from ZooKeeper... 
[junit4:junit4]   2> 9831 T273 C20 P58956 oasc.SolrDeletionPolicy.onInit SolrDeletionPolicy.onInit: commits:num=1
[junit4:junit4]   2> 		commit{dir=NRTCachingDirectory(org.apache.lucene.store.MMapDirectory@/mnt/ssd/jenkins/workspace/Lucene-Solr-4.x-Linux/solr/build/solr-core/test/J1/org.apache.solr.cloud.BasicDistributedZk2Test-1351460954824/jetty1/index lockFactory=org.apache.lucene.store.NativeFSLockFactory@880dce29; maxCacheMB=48.0 maxMergeSizeMB=4.0),segFN=segments_1,generation=1,filenames=[segments_1]
[junit4:junit4]   2> 9831 T273 C20 P58956 oasc.SolrDeletionPolicy.updateCommits newest commit = 1
[junit4:junit4]   2>  C19_STATE=coll:collection1 core:collection1 props:{base_url=http://127.0.0.1:53934/solr, state=recovering, node_name=127.0.0.1:53934_solr, roles=null, collection=collection1, shard=shard1, core=collection1}
[junit4:junit4]   2> 9850 T299 C19 P53934 oasc.SolrDeletionPolicy.onInit SolrDeletionPolicy.onInit: commits:num=1
[junit4:junit4]   2> 		commit{dir=NRTCachingDirectory(org.apache.lucene.store.MMapDirectory@/mnt/ssd/jenkins/workspace/Lucene-Solr-4.x-Linux/solr/build/solr-core/test/J1/org.apache.solr.cloud.BasicDistributedZk2Test-1351460954824/jetty3/index lockFactory=org.apache.lucene.store.NativeFSLockFactory@30e054b6; maxCacheMB=48.0 maxMergeSizeMB=4.0),segFN=segments_1,generation=1,filenames=[segments_1]
[junit4:junit4]   2> 9851 T299 C19 P53934 oasc.SolrDeletionPolicy.updateCommits newest commit = 1
[junit4:junit4]   2> 9869 T299 C19 P53934 REQ /update {update.distrib=FROMLEADER&distrib.from=http://127.0.0.1:58956/solr/collection1/&version=2&wt=javabin} status=0 QTime=27 
[junit4:junit4]   2> 9871 T273 C20 P58956 REQ /update {update.distrib=TOLEADER&distrib.from=http://127.0.0.1:44643/solr/collection1/&version=2&wt=javabin} status=0 QTime=43 
[junit4:junit4]   2> 9872 T284 C22 P44643 /update {version=2&wt=javabin} {add=[1]} 0 48
[junit4:junit4]   2> 9876 T255 C23 P36004 oasu.DirectUpdateHandler2.commit start commit{flags=0,_version_=0,optimize=false,openSearcher=true,waitSearcher=true,expungeDeletes=false,softCommit=false}
[junit4:junit4]   2> 9898 T255 C23 P36004 oasc.SolrDeletionPolicy.onCommit SolrDeletionPolicy.onCommit: commits:num=2
[junit4:junit4]   2> 		commit{dir=NRTCachingDirectory(org.apache.lucene.store.MMapDirectory@/mnt/ssd/jenkins/workspace/Lucene-Solr-4.x-Linux/solr/build/solr-core/test/J1/org.apache.solr.cloud.BasicDistributedZk2Test-1351460954824/control/data/index lockFactory=org.apache.lucene.store.NativeFSLockFactory@eba722c2; maxCacheMB=48.0 maxMergeSizeMB=4.0),segFN=segments_1,generation=1,filenames=[segments_1]
[junit4:junit4]   2> 		commit{dir=NRTCachingDirectory(org.apache.lucene.store.MMapDirectory@/mnt/ssd/jenkins/workspace/Lucene-Solr-4.x-Linux/solr/build/solr-core/test/J1/org.apache.solr.cloud.BasicDistributedZk2Test-1351460954824/control/data/index lockFactory=org.apache.lucene.store.NativeFSLockFactory@eba722c2; maxCacheMB=48.0 maxMergeSizeMB=4.0),segFN=segments_2,generation=2,filenames=[_0.tis, _0.si, segments_2, _0.tii, _0.frq, _0.fnm, _0.fdt, _0.prx, _0.nrm, _0.fdx]
[junit4:junit4]   2> 9898 T255 C23 P36004 oasc.SolrDeletionPolicy.updateCommits newest commit = 2
[junit4:junit4]   2> 9902 T255 C23 P36004 oass.SolrIndexSearcher.<init> Opening Searcher@f4537d9c main
[junit4:junit4]   2> 9904 T255 C23 P36004 oasu.DirectUpdateHandler2.commit end_commit_flush
[junit4:junit4]   2> 9906 T262 oasc.SolrCore.registerSearcher [collection1] Registered new searcher Searcher@f4537d9c main{StandardDirectoryReader(segments_2:3 _0(4.1):C1)}
[junit4:junit4]   2> 9909 T255 C23 P36004 /update {version=2&softCommit=false&waitSearcher=true&wt=javabin&commit=true} {commit=} 0 33
[junit4:junit4]   2> 9914 T272 C20 P58956 oasu.DirectUpdateHandler2.commit start commit{flags=0,_version_=0,optimize=false,openSearcher=true,waitSearcher=true,expungeDeletes=false,softCommit=false}
[junit4:junit4]   2> 9938 T272 C20 P58956 oasc.SolrDeletionPolicy.onCommit SolrDeletionPolicy.onCommit: commits:num=2
[junit4:junit4]   2> 		commit{dir=NRTCachingDirectory(org.apache.lucene.store.MMapDirectory@/mnt/ssd/jenkins/workspace/Lucene-Solr-4.x-Linux/solr/build/solr-core/test/J1/org.apache.solr.cloud.BasicDistributedZk2Test-1351460954824/jetty1/index lockFactory=org.apache.lucene.store.NativeFSLockFactory@880dce29; maxCacheMB=48.0 maxMergeSizeMB=4.0),segFN=segments_1,generation=1,filenames=[segments_1]
[junit4:junit4]   2> 		commit{dir=NRTCachingDirectory(org.apache.lucene.store.MMapDirectory@/mnt/ssd/jenkins/workspace/Lucene-Solr-4.x-Linux/solr/build/solr-core/test/J1/org.apache.solr.cloud.BasicDistributedZk2Test-1351460954824/jetty1/index lockFactory=org.apache.lucene.store.NativeFSLockFactory@880dce29; maxCacheMB=48.0 maxMergeSizeMB=4.0),segFN=segments_2,generation=2,filenames=[_0.tis, _0.si, segments_2, _0.tii, _0.frq, _0.fnm, _0.fdt, _0.prx, _0.nrm, _0.fdx]
[junit4:junit4]   2> 9938 T272 C20 P58956 oasc.SolrDeletionPolicy.updateCommits newest commit = 2
[junit4:junit4]   2> 9942 T272 C20 P58956 oass.SolrIndexSearcher.<init> Opening Searcher@23ea422b main
[junit4:junit4]   2> 9943 T272 C20 P58956 oasu.DirectUpdateHandler2.commit end_commit_flush
[junit4:junit4]   2> 9946 T278 oasc.SolrCore.registerSearcher [collection1] Registered new searcher Searcher@23ea422b main{StandardDirectoryReader(segments_2:3 _0(4.1):C1)}
[junit4:junit4]   2> 9946 T272 C20 P58956 oasu.SolrCmdDistributor.distribCommit Distrib commit to:[StdNode: http://127.0.0.1:53934/solr/collection1/, StdNode: http://127.0.0.1:44643/solr/collection1/, StdNode: http://127.0.0.1:57993/solr/collection1/] params:commit_end_point=true&commit=true&softCommit=false&waitSearcher=true&expungeDeletes=false
[junit4:junit4]   2> 9950 T285 C22 P44643 oasu.DirectUpdateHandler2.commit start commit{flags=0,_version_=0,optimize=false,openSearcher=true,waitSearcher=true,expungeDeletes=false,softCommit=false}
[junit4:junit4]   2> 9950 T297 C19 P53934 oasu.DirectUpdateHandler2.commit start commit{flags=0,_version_=0,optimize=false,openSearcher=true,waitSearcher=true,expungeDeletes=false,softCommit=false}
[junit4:junit4]   2> 9953 T285 C22 P44643 oasc.SolrDeletionPolicy.onInit SolrDeletionPolicy.onInit: commits:num=1
[junit4:junit4]   2> 		commit{dir=NRTCachingDirectory(org.apache.lucene.store.MMapDirectory@/mnt/ssd/jenkins/workspace/Lucene-Solr-4.x-Linux/solr/build/solr-core/test/J1/org.apache.solr.cloud.BasicDistributedZk2Test-1351460954824/jetty2/index lockFactory=org.apache.lucene.store.NativeFSLockFactory@67e10592; maxCacheMB=48.0 maxMergeSizeMB=4.0),segFN=segments_1,generation=1,filenames=[segments_1]
[junit4:junit4]   2> 9954 T285 C22 P44643 oasc.SolrDeletionPolicy.updateCommits newest commit = 1
[junit4:junit4]   2> 9957 T285 C22 P44643 oass.SolrIndexSearcher.<init> Opening Searcher@e928af32 main
[junit4:junit4]   2> 9958 T285 C22 P44643 oasu.DirectUpdateHandler2.commit end_commit_flush
[junit4:junit4]   2> 9960 T290 oasc.SolrCore.registerSearcher [collection1] Registered new searcher Searcher@e928af32 main{StandardDirectoryReader(segments_1:1)}
[junit4:junit4]   2>  C21_STATE=coll:collection1 core:collection1 props:{base_url=http://127.0.0.1:57993/solr, state=recovering, node_name=127.0.0.1:57993_solr, roles=null, collection=collection1, shard=shard2, core=collection1}
[junit4:junit4]   2> 9961 T313 C21 P57993 oasu.DirectUpdateHandler2.commit start commit{flags=0,_version_=0,optimize=false,openSearcher=true,waitSearcher=true,expungeDeletes=false,softCommit=false}
[junit4:junit4]   2> 9961 T285 C22 P44643 /update {softCommit=false&commit_end_point=true&expungeDeletes=false&commit=true&version=2&waitSearcher=true&wt=javabin} {commit=} 0 11
[junit4:junit4]   2> 9964 T313 C21 P57993 oasc.SolrDeletionPolicy.onInit SolrDeletionPolicy.onInit: commits:num=1
[junit4:junit4]   2> 		commit{dir=NRTCachingDirectory(org.apache.lucene.store.MMapDirectory@/mnt/ssd/jenkins/workspace/Lucene-Solr-4.x-Linux/solr/build/solr-core/test/J1/org.apache.solr.cloud.BasicDistributedZk2Test-1351460954824/jetty4/index lockFactory=org.apache.lucene.store.NativeFSLockFactory@691ff3aa; maxCacheMB=48.0 maxMergeSizeMB=4.0),segFN=segments_1,generation=1,filenames=[segments_1]
[junit4:junit4]   2> 9965 T313 C21 P57993 oasc.SolrDeletionPolicy.updateCommits newest commit = 1
[junit4:junit4]   2> 9966 T313 C21 P57993 oass.SolrIndexSearcher.<init> Opening Searcher@a421284b main
[junit4:junit4]   2> 9967 T313 C21 P57993 oasu.DirectUpdateHandler2.commit end_commit_flush
[junit4:junit4]   2> 9970 T316 oasc.SolrCore.registerSearcher [collection1] Registered new searcher Searcher@a421284b main{StandardDirectoryReader(segments_1:1)}
[junit4:junit4]   2> 9971 T313 C21 P57993 /update {softCommit=false&commit_end_point=true&expungeDeletes=false&commit=true&version=2&waitSearcher=true&wt=javabin} {commit=} 0 10
[junit4:junit4]   2> 9988 T297 C19 P53934 oasc.SolrDeletionPolicy.onCommit SolrDeletionPolicy.onCommit: commits:num=2
[junit4:junit4]   2> 		commit{dir=NRTCachingDirectory(org.apache.lucene.store.MMapDirectory@/mnt/ssd/jenkins/workspace/Lucene-Solr-4.x-Linux/solr/build/solr-core/test/J1/org.apache.solr.cloud.BasicDistributedZk2Test-1351460954824/jetty3/index lockFactory=org.apache.lucene.store.NativeFSLockFactory@30e054b6; maxCacheMB=48.0 maxMergeSizeMB=4.0),segFN=segments_1,generation=1,filenames=[segments_1]
[junit4:junit4]   2> 		commit{dir=NRTCachingDirectory(org.apache.lucene.store.MMapDirectory@/mnt/ssd/jenkins/workspace/Lucene-Solr-4.x-Linux/solr/build/solr-core/test/J1/org.apache.solr.cloud.BasicDistributedZk2Test-1351460954824/jetty3/index lockFactory=org.apache.lucene.store.NativeFSLockFactory@30e054b6; maxCacheMB=48.0 maxMergeSizeMB=4.0),segFN=segments_2,generation=2,filenames=[_0.tis, _0.si, segments_2, _0.tii, _0.frq, _0.fnm, _0.fdt, _0.prx, _0.nrm, _0.fdx]
[junit4:junit4]   2> 9988 T297 C19 P53934 oasc.SolrDeletionPolicy.updateCommits newest commit = 2
[junit4:junit4]   2> 9992 T297 C19 P53934 oass.SolrIndexSearcher.<init> Opening Searcher@9db40ea main
[junit4:junit4]   2> 9993 T297 C19 P53934 oasu.DirectUpdateHandler2.commit end_commit_flush
[junit4:junit4]   2> 9996 T302 oasc.SolrCore.registerSearcher [collection1] Registered new searcher Searcher@9db40ea main{StandardDirectoryReader(segments_2:3 _0(4.1):C1)}
[junit4:junit4]   2> 9996 T297 C19 P53934 /update {softCommit=false&commit_end_point=true&expungeDeletes=false&commit=true&version=2&waitSearcher=true&wt=javabin} {commit=} 0 46
[junit4:junit4]   2> 9997 T272 C20 P58956 /update {version=2&softCommit=false&waitSearcher=true&wt=javabin&commit=true} {commit=} 0 84
[junit4:junit4]   2> 9998 T239 oasc.AbstractDistribZkTestBase.waitForRecoveriesToFinish Wait for recoveries to finish - collection: collection1 failOnTimeout:true timeout (sec):1800
[junit4:junit4]   2> 9999 T239 oascc.ZkStateReader.updateClusterState Updating cloud state from ZooKeeper... 
[junit4:junit4]   2> 10939 T303 C19 P53934 oasc.RecoveryStrategy.doRecovery Begin buffering updates. core=collection1
[junit4:junit4]   2> 10939 T303 C19 P53934 oasu.UpdateLog.bufferUpdates Starting to buffer updates. FSUpdateLog{state=ACTIVE, tlog=null}
[junit4:junit4]   2> 10939 T303 C19 P53934 oasc.RecoveryStrategy.replicate Attempting to replicate from http://127.0.0.1:58956/solr/collection1/. core=collection1
[junit4:junit4]   2> 10940 T303 C19 P53934 oascsi.HttpClientUtil.createClient Creating new http client, config:maxConnections=128&maxConnectionsPerHost=32&followRedirects=false
[junit4:junit4]   2> 10946 T273 C20 P58956 oasu.DirectUpdateHandler2.commit start commit{flags=0,_version_=0,optimize=false,openSearcher=false,waitSearcher=true,expungeDeletes=false,softCommit=false}
[junit4:junit4]   2> 10948 T273 C20 P58956 oass.SolrIndexSearcher.<init> Opening Searcher@4745bd4 realtime
[junit4:junit4]   2> 10948 T273 C20 P58956 oasu.DirectUpdateHandler2.commit end_commit_flush
[junit4:junit4]   2> 10949 T273 C20 P58956 /update {softCommit=false&commit_end_point=true&commit=true&version=2&waitSearcher=true&wt=javabin&openSearcher=false} {commit=} 0 3
[junit4:junit4]   2> 10950 T303 C19 P53934 oash.ReplicationHandler.inform Commits will be reserved for  10000
[junit4:junit4]   2> 10951 T303 C19 P53934 oash.SnapPuller.<init>  No value set for 'pollInterval'. Timer Task not started.
[junit4:junit4]   2> 10953 T269 C20 P58956 oash.ReplicationHandler.inform Commits will be reserved for  10000
[junit4:junit4]   2> 10954 T269 C20 P58956 REQ /replication {version=2&command=indexversion&qt=/replication&wt=javabin} status=0 QTime=1 
[junit4:junit4]   2> 10955 T303 C19 P53934 oash.SnapPuller.fetchLatestIndex Master's generation: 2
[junit4:junit4]   2> 10955 T303 C19 P53934 oash.SnapPuller.fetchLatestIndex Slave's generation: 2
[junit4:junit4]   2> 10956 T303 C19 P53934 oash.SnapPuller.fetchLatestIndex Starting replication process
[junit4:junit4]   2> 10959 T270 C20 P58956 REQ /replication {generation=2&version=2&command=filelist&qt=/replication&wt=javabin} status=0 QTime=1 
[junit4:junit4]   2> 10960 T303 C19 P53934 oash.SnapPuller.fetchLatestIndex Number of files in latest index in master: 10
[junit4:junit4]   2> 10961 T303 C19 P53934 oash.SnapPuller.fetchLatestIndex Starting download to ./org.apache.solr.cloud.BasicDistributedZk2Test-1351460954824/jetty3/index.20121029054925780 fullCopy=true
[junit4:junit4]   2> 10965 T271 C20 P58956 REQ /replication {qt=/replication&checksum=true&generation=2&command=filecontent&file=_0.tis&wt=filestream} status=0 QTime=1 
[junit4:junit4]   2> 10971 T268 C20 P58956 REQ /replication {qt=/replication&checksum=true&generation=2&command=filecontent&file=_0.fnm&wt=filestream} status=0 QTime=0 
[junit4:junit4]   2> 10976 T265 C20 P58956 REQ /replication {qt=/replication&checksum=true&generation=2&command=filecontent&file=_0.frq&wt=filestream} status=0 QTime=1 
[junit4:junit4]   2> 10980 T273 C20 P58956 REQ /replication {qt=/replication&checksum=true&generation=2&command=filecontent&file=_0.nrm&wt=filestream} status=0 QTime=0 
[junit4:junit4]   2> 10985 T272 C20 P58956 REQ /replication {qt=/replication&checksum=true&generation=2&command=filecontent&file=segments_2&wt=filestream} status=0 QTime=0 
[junit4:junit4]   2> 10989 T269 C20 P58956 REQ /replication {qt=/replication&checksum=true&generation=2&command=filecontent&file=_0.si&wt=filestream} status=0 QTime=0 
[junit4:junit4]   2> 10993 T270 C20 P58956 REQ /replication {qt=/replication&checksum=true&generation=2&command=filecontent&file=_0.tii&wt=filestream} status=0 QTime=0 
[junit4:junit4]   2> 10997 T271 C20 P58956 REQ /replication {qt=/replication&checksum=true&generation=2&command=filecontent&file=_0.prx&wt=filestream} status=0 QTime=0 
[junit4:junit4]   2> 11001 T239 oascc.ZkStateReader.updateClusterState Updating cloud state from ZooKeeper... 
[junit4:junit4]   2> 11001 T268 C20 P58956 REQ /replication {qt=/replication&checksum=true&generation=2&command=filecontent&file=_0.fdt&wt=filestream} status=0 QTime=0 
[junit4:junit4]   2> 11005 T265 C20 P58956 REQ /replication {qt=/replication&checksum=true&generation=2&command=filecontent&file=_0.fdx&wt=filestream} status=0 QTime=0 
[junit4:junit4]   2> 11007 T303 C19 P53934 oash.SnapPuller.fetchLatestIndex Total time taken for download : 0 secs
[junit4:junit4]   2> 11007 T303 C19 P53934 oash.SnapPuller.modifyIndexProps New index installed. Updating index properties... index=index.20121029054925780
[junit4:junit4]   2> 11009 T303 C19 P53934 oasu.DefaultSolrCoreState.newIndexWriter Creating new IndexWriter...
[junit4:junit4]   2> 11009 T303 C19 P53934 oasu.DefaultSolrCoreState.newIndexWriter Waiting until IndexWriter is unused... core=collection1
[junit4:junit4]   2> 11009 T303 C19 P53934 oasu.DefaultSolrCoreState.newIndexWriter Rollback old IndexWriter... core=collection1
[junit4:junit4]   2> 11010 T303 C19 P53934 oasc.SolrCore.getNewIndexDir New index directory detected: old=./org.apache.solr.cloud.BasicDistributedZk2Test-1351460954824/jetty3/index/ new=./org.apache.solr.cloud.BasicDistributedZk2Test-1351460954824/jetty3/index.20121029054925780
[junit4:junit4]   2> 11011 T303 C19 P53934 oasc.CachingDirectoryFactory.get return new directory for /mnt/ssd/jenkins/workspace/Lucene-Solr-4.x-Linux/solr/build/solr-core/test/J1/./org.apache.solr.cloud.BasicDistributedZk2Test-1351460954824/jetty3/index.20121029054925780 forceNew:true
[junit4:junit4]   2> 11013 T303 C19 P53934 oasc.SolrDeletionPolicy.onInit SolrDeletionPolicy.onInit: commits:num=1
[junit4:junit4]   2> 		commit{dir=NRTCachingDirectory(org.apache.lucene.store.MMapDirectory@/mnt/ssd/jenkins/workspace/Lucene-Solr-4.x-Linux/solr/build/solr-core/test/J1/org.apache.solr.cloud.BasicDistributedZk2Test-1351460954824/jetty3/index.20121029054925780 lockFactory=org.apache.lucene.store.NativeFSLockFactory@1af29438; maxCacheMB=48.0 maxMergeSizeMB=4.0),segFN=segments_2,generation=2,filenames=[_0.tis, _0.si, segments_2, _0.tii, _0.fnm, _0.frq, _0.prx, _0.fdt, _0.nrm, _0.fdx]
[junit4:junit4]   2> 11014 T303 C19 P53934 oasc.SolrDeletionPolicy.updateCommits newest commit = 2
[junit4:junit4]   2> 11014 T303 C19 P53934 oasu.DefaultSolrCoreState.newIndexWriter New IndexWriter is ready to be used.
[junit4:junit4]   2> 11015 T303 C19 P53934 oass.SolrIndexSearcher.<init> Opening Searcher@1db67b22 main
[junit4:junit4]   2> 11018 T302 oasc.SolrCore.registerSearcher [collection1] Registered new searcher Searcher@1db67b22 main{StandardDirectoryReader(segments_2:3:nrt _0(4.1):C1)}
[junit4:junit4]   2> 11019 T302 oasc.CachingDirectoryFactory.close Closing directory:/mnt/ssd/jenkins/workspace/Lucene-Solr-4.x-Linux/solr/build/solr-core/test/J1/./org.apache.solr.cloud.BasicDistributedZk2Test-1351460954824/jetty3/index
[junit4:junit4]   2> 11019 T302 oash.SnapPuller$2.onClose removing old index directory ./org.apache.solr.cloud.BasicDistributedZk2Test-1351460954824/jetty3/index
[junit4:junit4]   2> 11021 T303 C19 P53934 oasu.DirectUpdateHandler2.commit start commit{flags=0,_version_=0,optimize=false,openSearcher=false,waitSearcher=false,expungeDeletes=false,softCommit=false}
[junit4:junit4]   2> 11021 T303 C19 P53934 oasu.DirectUpdateHandler2.commit end_commit_flush
[junit4:junit4]   2> 11021 T303 C19 P53934 oasc.RecoveryStrategy.replay No replay needed. core=collection1
[junit4:junit4]   2> 11022 T303 C19 P53934 oasc.RecoveryStrategy.doRecovery Replication Recovery was successful - registering as Active. core=collection1
[junit4:junit4]   2> 11022 T303 C19 P53934 oasc.ZkController.publish numShards not found on descriptor - reading it from system property
[junit4:junit4]   2> 11023 T303 C19 P53934 oasc.RecoveryStrategy.doRecovery Finished recovery process. core=collection1
[junit4:junit4]   2> 11039 T260 oascc.ZkStateReader.updateClusterState Updating cloud state from ZooKeeper... 
[junit4:junit4]   2> 11040 T260 oasc.Overseer$ClusterStateUpdater.updateState Update state numShards=2 message={
[junit4:junit4]   2> 	  "base_url":"http://127.0.0.1:53934/solr",
[junit4:junit4]   2> 	  "state":"active",
[junit4:junit4]   2> 	  "operation":"state",
[junit4:junit4]   2> 	  "node_name":"127.0.0.1:53934_solr",
[junit4:junit4]   2> 	  "numShards":"2",
[junit4:junit4]   2> 	  "roles":null,
[junit4:junit4]   2> 	  "collection":"collection1",
[junit4:junit4]   2> 	  "shard":"shard1",
[junit4:junit4]   2> 	  "core":"collection1"}
[junit4:junit4]   2> 11044 T301 oascc.ZkStateReader$2.process A cluster state change has occurred - updating... (5)
[junit4:junit4]   2> 11044 T315 oascc.ZkStateReader$2.process A cluster state change has occurred - updating... (5)
[junit4:junit4]   2> 11044 T259 oascc.ZkStateReader$2.process A cluster state change has occurred - updating... (5)
[junit4:junit4]   2> 11044 T322 oascc.ZkStateReader$2.process A cluster state change has occurred - updating... (5)
[junit4:junit4]   2> 11044 T277 oascc.ZkStateReader$2.process A cluster state change has occurred - updating... (5)
[junit4:junit4]   2> 11044 T320 oascc.ZkStateReader$2.process A cluster state change has occurred - updating... (5)
[junit4:junit4]   2> 11044 T289 oascc.ZkStateReader$2.process A cluster state change has occurred - updating... (5)
[junit4:junit4]   2> 12004 T239 oascc.ZkStateReader.updateClusterState Updating cloud state from ZooKeeper... 
[junit4:junit4]   2> 12257 T317 C21 P57993 oasc.RecoveryStrategy.doRecovery Begin buffering updates. core=collection1
[junit4:junit4]   2> 12257 T317 C21 P57993 oasu.UpdateLog.bufferUpdates Starting to buffer updates. FSUpdateLog{state=ACTIVE, tlog=null}
[junit4:junit4]   2> 12257 T317 C21 P57993 oasc.RecoveryStrategy.replicate Attempting to replicate from http://127.0.0.1:44643/solr/collection1/. core=collection1
[junit4:junit4]   2> 12257 T317 C21 P57993 oascsi.HttpClientUtil.createClient Creating new http client, config:maxConnections=128&maxConnectionsPerHost=32&followRedirects=false
[junit4:junit4]   2> 12263 T284 C22 P44643 oasu.DirectUpdateHandler2.commit start commit{flags=0,_version_=0,optimize=false,openSearcher=false,waitSearcher=true,expungeDeletes=false,softCommit=false}
[junit4:junit4]   2> 12263 T284 C22 P44643 oass.SolrIndexSearcher.<init> Opening Searcher@d517fc30 realtime
[junit4:junit4]   2> 12264 T284 C22 P44643 oasu.DirectUpdateHandler2.commit end_commit_flush
[junit4:junit4]   2> 12264 T284 C22 P44643 /update {softCommit=false&commit_end_point=true&commit=true&version=2&waitSearcher=true&wt=javabin&openSearcher=false} {commit=} 0 1
[junit4:junit4]   2> 12265 T317 C21 P57993 oash.ReplicationHandler.inform Commits will be reserved for  10000
[junit4:junit4]   2> 12265 T317 C21 P57993 oash.SnapPuller.<init>  No value set for 'pollInterval'. Timer Task not started.
[junit4:junit4]   2> 12267 T287 C22 P44643 oash.ReplicationHandler.inform Commits will be reserved for  10000
[junit4:junit4]   2> 12268 T287 C22 P44643 REQ /replication {version=2&command=indexversion&qt=/replication&wt=javabin} status=0 QTime=1 
[junit4:junit4]   2> 12269 T317 C21 P57993 oasu.DirectUpdateHandler2.commit start commit{flags=0,_version_=0,optimize=false,openSearcher=true,waitSearcher=true,expungeDeletes=false,softCommit=false}
[junit4:junit4]   2> 12317 T317 C21 P57993 oasc.SolrDeletionPolicy.onCommit SolrDeletionPolicy.onCommit: commits:num=2
[junit4:junit4]   2> 		commit{dir=NRTCachingDirectory(org.apache.lucene.store.MMapDirectory@/mnt/ssd/jenkins/workspace/Lucene-Solr-4.x-Linux/solr/build/solr-core/test/J1/org.apache.solr.cloud.BasicDistributedZk2Test-1351460954824/jetty4/index lockFactory=org.apache.lucene.store.NativeFSLockFactory@691ff3aa; maxCacheMB=48.0 maxMergeSizeMB=4.0),segFN=segments_1,generation=1,filenames=[segments_1]
[junit4:junit4]   2> 		commit{dir=NRTCachingDirectory(org.apache.lucene.store.MMapDirectory@/mnt/ssd/jenkins/workspace/Lucene-Solr-4.x-Linux/solr/build/solr-core/test/J1/org.apache.solr.cloud.BasicDistributedZk2Test-1351460954824/jetty4/index lockFactory=org.apache.lucene.store.NativeFSLockFactory@691ff3aa; maxCacheMB=48.0 maxMergeSizeMB=4.0),segFN=segments_2,generation=2,filenames=[segments_2]
[junit4:junit4]   2> 12317 T317 C21 P57993 oasc.SolrDeletionPolicy.updateCommits newest commit = 2
[junit4:junit4]   2> 12319 T317 C21 P57993 oass.SolrIndexSearcher.<init> Opening Searcher@bc327ee7 main
[junit4:junit4]   2> 12320 T317 C21 P57993 oasu.DirectUpdateHandler2.commit end_commit_flush
[junit4:junit4]   2> 12322 T316 oasc.SolrCore.registerSearcher [collection1] Registered new searcher Searcher@bc327ee7 main{StandardDirectoryReader(segments_2:2)}
[junit4:junit4]   2> 12322 T317 C21 P57993 oasc.RecoveryStrategy.replay No replay needed. core=collection1
[junit4:junit4]   2> 12322 T317 C21 P57993 oasc.RecoveryStrategy.doRecovery Replication Recovery was successful - registering as Active. core=collection1
[junit4:junit4]   2> 12322 T317 C21 P57993 oasc.ZkController.publish numShards not found on descriptor - reading it from system property
[junit4:junit4]   2> 12324 T317 C21 P57993 oasc.RecoveryStrategy.doRecovery Finished recovery process. core=collection1
[junit4:junit4]   2> 12551 T260 oascc.ZkStateReader.updateClusterState Updating cloud state from ZooKeeper... 
[junit4:junit4]   2> 12553 T260 oasc.Overseer$ClusterStateUpdater.updateState Update state numShards=2 message={
[junit4:junit4]   2> 	  "base_url":"http://127.0.0.1:57993/solr",
[junit4:junit4]   2> 	  "state":"active",
[junit4:junit4]   2> 	  "operation":"state",
[junit4:junit4]   2> 	  "node_name":"127.0.0.1:57993_solr",
[junit4:junit4]   2> 	  "numShards":"2",
[junit4:junit4]   2> 	  "roles":null,
[junit4:junit4]   2> 	  "collection":"collection1",
[junit4:junit4]   2> 	  "shard":"shard2",
[junit4:junit4]   2> 	  "core":"collection1"}
[junit4:junit4]   2> 12562 T301 oascc.ZkStateReader$2.process A cluster state change has occurred - updating... (5)
[junit4:junit4]   2> 12562 T315 oascc.ZkStateReader$2.process A cluster state change has occurred - updating... (5)
[junit4:junit4]   2> 12562 T277 oascc.ZkStateReader$2.process A cluster state change has occurred - updating... (5)
[junit4:junit4]   2> 12562 T320 oascc.ZkStateReader$2.process A cluster state change has occurred - updating... (5)
[junit4:junit4]   2> 12563 T259 oascc.ZkStateReader$2.process A cluster state change has occurred - updating... (5)
[junit4:junit4]   2> 12562 T322 oascc.ZkStateReader$2.process A cluster state change has occurred - updating... (5)
[junit4:junit4]   2> 12562 T289 oascc.ZkStateReader$2.process A cluster state change has occurred - updating... (5)
[junit4:junit4]   2> 13006 T239 oascc.ZkStateReader.updateClusterState Updating cloud state from ZooKeeper... 
[junit4:junit4]   2> 13012 T252 C23 P36004 REQ /select {q=*:*&start=0&isShard=true&distrib=false&fl=id,score&NOW=1351460967829&version=2&rows=10&fsv=true&wt=javabin&shard.url=127.0.0.1:36004/solr/collection1/} hits=1 status=0 QTime=0 
[junit4:junit4]   2> 13021 T255 C23 P36004 REQ /select {q=*:*&isShard=true&distrib=false&NOW=1351460967829&ids=1&version=2&wt=javabin&shard.url=127.0.0.1:36004/solr/collection1/} status=0 QTime=2 
[junit4:junit4]   2> 13024 T256 C23 P36004 REQ /select {version=2&wt=javabin&q=*:*} hits=1 status=0 QTime=15 
[junit4:junit4]   2> 13025 T239 oaz.ZooKeeper.<init> Initiating client connection, connectString=127.0.0.1:34274/solr sessionTimeout=10000 watcher=org.apache.solr.common.cloud.ConnectionManager@f8cd20bb
[junit4:junit4]   2> 13027 T329 oaz.ClientCnxn$SendThread.startConnect Opening socket connection to server /127.0.0.1:34274
[junit4:junit4]   2> 13027 T239 oascc.ConnectionManager.waitForConnected Waiting for client to connect to ZooKeeper
[junit4:junit4]   2> 13028 T241 oazs.NIOServerCnxn$Factory.run Accepted socket connection from /127.0.0.1:52753
[junit4:junit4]   2> 13028 T329 oaz.ClientCnxn$SendThread.primeConnection Socket connection established to localhost.localdomain/127.0.0.1:34274, initiating session
[junit4:junit4]   2> 13029 T241 oazs.NIOServerCnxn.readConnectRequest Client attempting to establish new session at /127.0.0.1:52753
[junit4:junit4]   2> 13030 T243 oazs.NIOServerCnxn.finishSessionInit Established session 0x13aa959a2cc0009 with negotiated timeout 10000 for client /127.0.0.1:52753
[junit4:junit4]   2> 13030 T329 oaz.ClientCnxn$SendThread.readConnectResult Session establishment complete on server localhost.localdomain/127.0.0.1:34274, sessionid = 0x13aa959a2cc0009, negotiated timeout = 10000
[junit4:junit4]   2> 13031 T330 oascc.ConnectionManager.process Watcher org.apache.solr.common.cloud.ConnectionManager@f8cd20bb name:ZooKeeperConnection Watcher:127.0.0.1:34274/solr got event WatchedEvent state:SyncConnected type:None path:null path:null type:None
[junit4:junit4]   2> 13031 T239 oascc.ConnectionManager.waitForConnected Client is connected to ZooKeeper
[junit4:junit4]   2> 13032 T239 oascc.ZkStateReader.createClusterStateWatchersAndUpdate Updating cluster state from ZooKeeper... 
[junit4:junit4]   2> 13035 T244 oazs.PrepRequestProcessor.pRequest Processed session termination for sessionid: 0x13aa959a2cc0009
[junit4:junit4]   2> 13035 T241 oazs.NIOServerCnxn.closeSock Closed socket connection for client /127.0.0.1:52753 which had sessionid 0x13aa959a2cc0009
[junit4:junit4]   2> 13036 T239 oaz.ZooKeeper.close Session: 0x13aa959a2cc0009 closed
[junit4:junit4]   2> 13037 T330 oaz.ClientCnxn$EventThread.run EventThread shut down
[junit4:junit4]   2> 13039 T273 C20 P58956 REQ /select {version=2&q=*:*&wt=javabin&distrib=false} hits=1 status=0 QTime=1 
[junit4:junit4]   2> 13043 T285 C22 P44643 REQ /select {version=2&q=*:*&wt=javabin&distrib=false} hits=0 status=0 QTime=0 
[junit4:junit4]   2>  C19_STATE=coll:collection1 core:collection1 props:{base_url=http://127.0.0.1:53934/solr, state=active, node_name=127.0.0.1:53934_solr, roles=null, collection=collection1, shard=shard1, core=collection1}
[junit4:junit4]   2> 13051 T299 C19 P53934 REQ /select {q=*:*&start=0&isShard=true&distrib=false&fl=id,score&NOW=1351460967866&version=2&rows=10&fsv=true&wt=javabin&shard.url=127.0.0.1:58956/solr/collection1/|127.0.0.1:53934/solr/collection1/} hits=1 status=0 QTime=0 
[junit4:junit4]   2> 13051 T284 C22 P44643 REQ /select {q=*:*&start=0&isShard=true&distrib=false&fl=id,score&NOW=1351460967866&version=2&rows=10&fsv=true&wt=javabin&shard.url=127.0.0.1:44643/solr/collection1/|127.0.0.1:57993/solr/collection1/} hits=0 status=0 QTime=0 
[junit4:junit4]   2> 13056 T297 C19 P53934 REQ /select {q=*:*&isShard=true&distrib=false&NOW=1351460967866&ids=1&version=2&wt=javabin&shard.url=127.0.0.1:58956/solr/collection1/|127.0.0.1:53934/solr/collection1/} status=0 QTime=1 
[junit4:junit4]   2>  C21_STATE=coll:collection1 core:collection1 props:{base_url=http://127.0.0.1:57993/solr, state=active, node_name=127.0.0.1:57993_solr, roles=null, collection=collection1, shard=shard2, core=collection1}
[junit4:junit4]   2> 13060 T312 C21 P57993 REQ /select {version=2&wt=javabin&q=*:*} hits=1 status=0 QTime=13 
[junit4:junit4]   2> 13068 T257 C23 P36004 /update {version=2&wt=javabin} {add=[2 (1417109535859933184)]} 0 4
[junit4:junit4]   2> 13087 T313 C21 P57993 REQ /update {update.distrib=FROMLEADER&distrib.from=http://127.0.0.1:44643/solr/collection1/&version=2&wt=javabin} status=0 QTime=5 
[junit4:junit4]   2> 13088 T286 C22 P44643 REQ /update {update.distrib=TOLEADER&distrib.from=http://127.0.0.1:58956/solr/collection1/&version=2&wt=javabin} status=0 QTime=13 
[junit4:junit4]   2> 13089 T272 C20 P58956 /update {version=2&wt=javabin} {add=[2]} 0 18
[junit4:junit4]   2> 13095 T252 C23 P36004 /update {version=2&wt=javabin} {add=[3 (1417109535890341888)]} 0 2
[junit4:junit4]   2> 13113 T311 C21 P57993 REQ /update {update.distrib=FROMLEADER&distrib.from=http://127.0.0.1:44643/solr/collection1/&version=2&wt=javabin} status=0 QTime=4 
[junit4:junit4]   2> 13114 T287 C22 P44643 REQ /update {update.distrib=TOLEADER&distrib.from=http://127.0.0.1:58956/solr/collection1/&version=2&wt=javabin} status=0 QTime=11 
[junit4:junit4]   2> 13115 T269 C20 P58956 /update {version=2&wt=javabin} {add=[3]} 0 16
[junit4:junit4]   2> 13122 T255 C23 P36004 /update {version=2&wt=javabin} {add=[4 (1417109535916556288)]} 0 4
[junit4:junit4]   2> 13148 T298 C19 P53934 REQ /update {update.distrib=FROMLEADER&distrib.from=http://127.0.0.1:58956/solr/collection1/&version=2&wt=javabin} status=0 QTime=7 
[junit4:junit4]   2> 13150 T270 C20 P58956 REQ /update {update.distrib=TOLEADER&distrib.from=http://127.0.0.1:44643/solr/collection1/&version=2&wt=javabin} status=0 QTime=19 
[junit4:junit4]   2> 13151 T284 C22 P44643 /update {version=2&wt=javabin} {add=[4]} 0 24
[junit4:junit4]   2> 13158 T256 C23 P36004 /update {version=2&wt=javabin} {add=[5 (1417109535955353600)]} 0 3
[junit4:junit4]   2> 13171 T312 C21 P57993 REQ /update {update.distrib=FROMLEADER&distrib.from=http://127.0.0.1:44643/solr/collection1/&version=2&wt=javabin} status=0 QTime=3 
[junit4:junit4]   2> 13173 T286 C22 P44643 /update {version=2&wt=javabin} {add=[5 (1417109535963742208)]} 0 11
[junit4:junit4]   2> 13180 T257 C23 P36004 /update {version=2&wt=javabin} {add=[6 (1417109535978422272)]} 0 3
[junit4:junit4]   2> 13191 T310 C21 P57993 REQ /update {update.distrib=FROMLEADER&distrib.from=http://127.0.0.1:44643/solr/collection1/&version=2&wt=javabin} status=0 QTime=3 
[junit4:junit4]   2> 13192 T287 C22 P44643 /update {version=2&wt=javabin} {add=[6 (1417109535985762304)]} 0 9
[junit4:junit4]   2> 13197 T252 C23 P36004 /update {version=2&wt=javabin} {add=[7 (1417109535998345216)]} 0 2
[junit4:junit4]   2> 13214 T313 C21 P57993 REQ /update {update.distrib=FROMLEADER&distrib.from=http://127.0.0.1:44643/solr/collection1/&version=2&wt=javabin} status=0 QTime=4 
[junit4:junit4]   2> 13215 T285 C22 P44643 REQ /update {update.distrib=TOLEADER&distrib.from=http://127.0.0.1:58956/solr/collection1/&version=2&wt=javabin} status=0 QTime=11 
[junit4:junit4]   2> 13216 T271 C20 P58956 /update {version=2&wt=javabin} {add=[7]} 0 15
[junit4:junit4]   2> 13222 T255 C23 P36004 /update {version=2&wt=javabin} {add=[8 (1417109536023511040)]} 0 3
[junit4:junit4]   2> 13241 T296 C19 P53934 REQ /update {update.distrib=FROMLE

[...truncated too long message...]

23 oass.SolrIndexSearcher.getIndexDir WARNING WARNING: Directory impl does not support setting indexDir: org.apache.lucene.store.MockDirectoryWrapper
[junit4:junit4]   2> 25127 T1823 oasu.CommitTracker.<init> Hard AutoCommit: disabled
[junit4:junit4]   2> 25127 T1823 oasu.CommitTracker.<init> Soft AutoCommit: disabled
[junit4:junit4]   2> 25127 T1823 oashc.SpellCheckComponent.inform Initializing spell checkers
[junit4:junit4]   2> 25197 T1823 oass.DirectSolrSpellChecker.init init: {name=direct,classname=DirectSolrSpellChecker,field=lowerfilt,minQueryLength=3}
[junit4:junit4]   2> 25211 T1823 oashc.HttpShardHandlerFactory.getParameter Setting socketTimeout to: 0
[junit4:junit4]   2> 25211 T1823 oashc.HttpShardHandlerFactory.getParameter Setting urlScheme to: http://
[junit4:junit4]   2> 25212 T1823 oashc.HttpShardHandlerFactory.getParameter Setting connTimeout to: 0
[junit4:junit4]   2> 25212 T1823 oashc.HttpShardHandlerFactory.getParameter Setting maxConnectionsPerHost to: 20
[junit4:junit4]   2> 25212 T1823 oashc.HttpShardHandlerFactory.getParameter Setting corePoolSize to: 0
[junit4:junit4]   2> 25213 T1823 oashc.HttpShardHandlerFactory.getParameter Setting maximumPoolSize to: 2147483647
[junit4:junit4]   2> 25213 T1823 oashc.HttpShardHandlerFactory.getParameter Setting maxThreadIdleTime to: 5
[junit4:junit4]   2> 25214 T1823 oashc.HttpShardHandlerFactory.getParameter Setting sizeOfQueue to: -1
[junit4:junit4]   2> 25214 T1823 oashc.HttpShardHandlerFactory.getParameter Setting fairnessPolicy to: false
[junit4:junit4]   2> 25214 T1823 oascsi.HttpClientUtil.createClient Creating new http client, config:maxConnectionsPerHost=20&maxConnections=10000&socketTimeout=0&connTimeout=0&retry=false
[junit4:junit4]   2> 25221 T1828 oasc.SolrCore.registerSearcher [collection1] Registered new searcher Searcher@90bead6e main{StandardDirectoryReader(segments_1:1)}
[junit4:junit4]   2> 25223 T1823 oasc.CoreContainer.register registering core: collection1
[junit4:junit4]   2> 25225 T1823 oasu.AbstractSolrTestCase.setUp ####SETUP_END testMaxDocs
[junit4:junit4]   2> 25226 T1823 oasc.SolrDeletionPolicy.onInit SolrDeletionPolicy.onInit: commits:num=1
[junit4:junit4]   2> 		commit{dir=MockDirWrapper(org.apache.lucene.store.RAMDirectory@f9ed8998 lockFactory=org.apache.lucene.store.NativeFSLockFactory@b7e9a488),segFN=segments_1,generation=1,filenames=[segments_1]
[junit4:junit4]   2> 25227 T1823 oasc.SolrDeletionPolicy.updateCommits newest commit = 1
[junit4:junit4]   2> 25228 T1823 UPDATE [collection1] {add=[0]} 0 2
[junit4:junit4]   2> 25228 T1823 UPDATE [collection1] {add=[1]} 0 2
[junit4:junit4]   2> 25229 T1823 UPDATE [collection1] {add=[2]} 0 2
[junit4:junit4]   2> 25229 T1823 UPDATE [collection1] {add=[3]} 0 2
[junit4:junit4]   2> 25230 T1823 UPDATE [collection1] {add=[4]} 0 2
[junit4:junit4]   2> 25231 T1823 UPDATE [collection1] {add=[5]} 0 2
[junit4:junit4]   2> 25231 T1823 UPDATE [collection1] {add=[6]} 0 2
[junit4:junit4]   2> 25232 T1823 UPDATE [collection1] {add=[7]} 0 2
[junit4:junit4]   2> 25232 T1823 UPDATE [collection1] {add=[8]} 0 2
[junit4:junit4]   2> 25233 T1823 UPDATE [collection1] {add=[9]} 0 2
[junit4:junit4]   2> 25234 T1823 UPDATE [collection1] {add=[10]} 0 2
[junit4:junit4]   2> 25235 T1823 UPDATE [collection1] {add=[11]} 0 2
[junit4:junit4]   2> 25235 T1823 UPDATE [collection1] {add=[12]} 0 2
[junit4:junit4]   2> 25236 T1823 UPDATE [collection1] {add=[13]} 0 2
[junit4:junit4]   2> ASYNC  NEW_CORE C114 name=collection1 org.apache.solr.core.SolrCore@1bfd7527
[junit4:junit4]   2> 25236 T1823 C114 REQ [collection1] webapp=null path=null params={q=id:1&start=0&qt=standard&version=2.2&rows=20} hits=0 status=0 QTime=0 
[junit4:junit4]   2> 25240 T1823 UPDATE [collection1] {add=[14]} 0 2
[junit4:junit4]   2> 25241 T1829 oasu.DirectUpdateHandler2.commit start commit{flags=0,_version_=0,optimize=false,openSearcher=true,waitSearcher=true,expungeDeletes=false,softCommit=true}
[junit4:junit4]   2> 25242 T1829 oass.SolrIndexSearcher.<init> Opening Searcher@ffdf4b10 main
[junit4:junit4]   2> 25243 T1829 oass.SolrIndexSearcher.getIndexDir WARNING WARNING: Directory impl does not support setting indexDir: org.apache.lucene.store.MockDirectoryWrapper
[junit4:junit4]   2> 25244 T1829 oasu.DirectUpdateHandler2.commit end_commit_flush
[junit4:junit4]   2> 25245 T1828 oasc.SolrCore.registerSearcher [collection1] Registered new searcher Searcher@ffdf4b10 main{StandardDirectoryReader(segments_1:5:nrt _0(4.1):C10 _1(4.1):C5)}
[junit4:junit4]   2> 25491 T1823 UPDATE [collection1] {add=[15]} 0 2
[junit4:junit4]   2> 25491 T1823 C114 REQ [collection1] webapp=null path=null params={q=id:14&start=0&qt=standard&version=2.2&rows=20} hits=1 status=0 QTime=0 
[junit4:junit4]   2> 25493 T1823 C114 REQ [collection1] webapp=null path=null params={q=id:15&start=0&qt=standard&version=2.2&rows=20} hits=0 status=0 QTime=0 
[junit4:junit4]   2> 25494 T1823 oasu.AbstractSolrTestCase.tearDown ####TEARDOWN_START testMaxDocs
[junit4:junit4]   2> 25495 T1823 oasc.CoreContainer.shutdown Shutting down CoreContainer instance=-1250891692
[junit4:junit4]   2> 25495 T1823 oasc.SolrCore.close [collection1]  CLOSING SolrCore org.apache.solr.core.SolrCore@1bfd7527
[junit4:junit4]   2> 25502 T1823 oasu.DirectUpdateHandler2.close closing DirectUpdateHandler2{commits=1,autocommits=0,soft autocommit maxDocs=14,soft autocommits=1,optimizes=0,rollbacks=0,expungeDeletes=0,docsPending=16,adds=1,deletesById=0,deletesByQuery=0,errors=0,cumulative_adds=16,cumulative_deletesById=0,cumulative_deletesByQuery=0,cumulative_errors=0}
[junit4:junit4]   2> 25502 T1823 oasc.SolrCore.decrefSolrCoreState Closing SolrCoreState
[junit4:junit4]   2> 25503 T1823 oasu.DefaultSolrCoreState.closeIndexWriter SolrCoreState ref count has reached 0 - closing IndexWriter
[junit4:junit4]   2> 25504 T1823 oasu.DefaultSolrCoreState.closeIndexWriter closing IndexWriter with IndexWriterCloser
[junit4:junit4]   2> 25505 T1823 C114 oasc.SolrDeletionPolicy.onCommit SolrDeletionPolicy.onCommit: commits:num=2
[junit4:junit4]   2> 		commit{dir=MockDirWrapper(org.apache.lucene.store.RAMDirectory@f9ed8998 lockFactory=org.apache.lucene.store.NativeFSLockFactory@b7e9a488),segFN=segments_1,generation=1,filenames=[segments_1]
[junit4:junit4]   2> 		commit{dir=MockDirWrapper(org.apache.lucene.store.RAMDirectory@f9ed8998 lockFactory=org.apache.lucene.store.NativeFSLockFactory@b7e9a488),segFN=segments_2,generation=2,filenames=[_2_Lucene40_0.prx, _0_Lucene40_0.prx, _1_Lucene40_0.tim, _1_Lucene40_0.tip, _0_nrm.cfe, _1_nrm.cfe, _2_nrm.cfe, _1.si, segments_2, _1_Lucene40_0.frq, _0_nrm.cfs, _1_nrm.cfs, _2_nrm.cfs, _1_Lucene40_0.prx, _2_Lucene40_0.tim, _0_Lucene40_0.tim, _0.fnm, _2_Lucene40_0.tip, _1.fnm, _0_Lucene40_0.tip, _2.fnm, _2.si, _2_Lucene40_0.frq, _0.si, _0_Lucene40_0.frq, _0.fdt, _1.fdt, _2.fdt, _0.fdx, _1.fdx, _2.fdx]
[junit4:junit4]   2> 25506 T1823 C114 oasc.SolrDeletionPolicy.updateCommits newest commit = 2
[junit4:junit4]   2> 25507 T1823 oasc.SolrCore.closeSearcher [collection1] Closing main searcher on request.
[junit4:junit4]   2> NOTE: test params are: codec=Lucene40, sim=DefaultSimilarity, locale=ar_KW, timezone=America/Argentina/Mendoza
[junit4:junit4]   2> NOTE: Linux 3.2.0-32-generic amd64/IBM Corporation 1.7.0 (64-bit)/cpus=8,threads=1,free=24059784,total=173604864
[junit4:junit4]   2> NOTE: All tests run in this JVM: [TestSolrCoreProperties, CoreContainerCoreInitFailuresTest, XsltUpdateRequestHandlerTest, TestUtils, DirectUpdateHandlerTest, FileUtilsTest, TestReversedWildcardFilterFactory, DisMaxRequestHandlerTest, DocumentBuilderTest, SolrIndexConfigTest, TestPluginEnable, TestRemoteStreaming, TestQueryUtils, TestSolrXMLSerializer, FullSolrCloudDistribCmdsTest, TestTrie, RAMDirectoryFactoryTest, URLClassifyProcessorTest, SuggesterTest, TestQuerySenderListener, TestStressLucene, BasicDistributedZk2Test, MultiTermTest, TestFoldingMultitermQuery, TestRecovery, IndexSchemaTest, DistributedQueryElevationComponentTest, TestRTGBase, TestDistributedGrouping, TestLRUCache, TestPropInject, ShowFileRequestHandlerTest, StatsComponentTest, TestSurroundQueryParser, DOMUtilTest, TestRealTimeGet, TestDocumentBuilder, TestMergePolicyConfig, TermVectorComponentTest, TestCSVLoader, RecoveryZkTest, LegacyHTMLStripCharFilterTest, SuggesterTSTTest, TestOmitPositions, FieldMutatingUpdateProcessorTest, PolyFieldTest, TestValueSourceCache, TestReplicationHandler, OverseerTest, BadIndexSchemaTest, EchoParamsTest, TestSort, TestSolrDeletionPolicy2, IndexSchemaRuntimeFieldTest, RequiredFieldsTest, ZkNodePropsTest, BasicDistributedZkTest, SpellCheckComponentTest, LeaderElectionIntegrationTest, ZkControllerTest, TestDistributedSearch, TestExtendedDismaxParser, SoftAutoCommitTest, AutoCommitTest]
[junit4:junit4] Completed on J1 in 6.76s, 3 tests, 1 failure <<< FAILURES!

[...truncated 340 lines...]
BUILD FAILED
/mnt/ssd/jenkins/workspace/Lucene-Solr-4.x-Linux/build.xml:348: The following error occurred while executing this line:
/mnt/ssd/jenkins/workspace/Lucene-Solr-4.x-Linux/build.xml:39: The following error occurred while executing this line:
/mnt/ssd/jenkins/workspace/Lucene-Solr-4.x-Linux/solr/build.xml:178: The following error occurred while executing this line:
/mnt/ssd/jenkins/workspace/Lucene-Solr-4.x-Linux/lucene/module-build.xml:61: The following error occurred while executing this line:
/mnt/ssd/jenkins/workspace/Lucene-Solr-4.x-Linux/lucene/common-build.xml:1159: The following error occurred while executing this line:
/mnt/ssd/jenkins/workspace/Lucene-Solr-4.x-Linux/lucene/common-build.xml:827: There were test failures: 233 suites, 965 tests, 5 errors, 2 failures, 7 ignored (2 assumptions)

Total time: 23 minutes 32 seconds
Build step 'Invoke Ant' marked build as failure
Archiving artifacts
Recording test results
Description set: Java: 64bit/ibm-j9-jdk7 -Xjit:exclude={org/apache/lucene/util/fst/FST.pack(IIF)Lorg/apache/lucene/util/fst/FST;}
Email was triggered for: Failure
Sending email for trigger: Failure



Mime
View raw message