lucene-dev mailing list archives

Site index · List index
Message view « Date » · « Thread »
Top « Date » · « Thread »
From Policeman Jenkins Server <jenk...@sd-datasolutions.de>
Subject [JENKINS] Lucene-Solr-trunk-Linux (32bit/ibm-j9-jdk7) - Build # 2083 - Still Failing!
Date Tue, 30 Oct 2012 01:00:37 GMT
Build: http://jenkins.sd-datasolutions.de/job/Lucene-Solr-trunk-Linux/2083/
Java: 32bit/ibm-j9-jdk7 -Xjit:exclude={org/apache/lucene/util/fst/FST.pack(IIF)Lorg/apache/lucene/util/fst/FST;}

2 tests failed.
FAILED:  junit.framework.TestSuite.org.apache.solr.client.solrj.embedded.TestEmbeddedSolrServer

Error Message:
2 threads leaked from SUITE scope at org.apache.solr.client.solrj.embedded.TestEmbeddedSolrServer:     1) Thread[id=29, name=metrics-meter-tick-thread-2, state=TIMED_WAITING, group=TGRP-TestEmbeddedSolrServer]         at sun.misc.Unsafe.park(Native Method)         at java.util.concurrent.locks.LockSupport.parkNanos(LockSupport.java:237)         at java.util.concurrent.locks.AbstractQueuedSynchronizer$ConditionObject.awaitNanos(AbstractQueuedSynchronizer.java:2093)         at java.util.concurrent.ScheduledThreadPoolExecutor$DelayedWorkQueue.take(ScheduledThreadPoolExecutor.java:1101)         at java.util.concurrent.ScheduledThreadPoolExecutor$DelayedWorkQueue.take(ScheduledThreadPoolExecutor.java:818)         at java.util.concurrent.ThreadPoolExecutor.getTask(ThreadPoolExecutor.java:1054)         at java.util.concurrent.ThreadPoolExecutor.runWorker(ThreadPoolExecutor.java:1114)         at java.util.concurrent.ThreadPoolExecutor$Worker.run(ThreadPoolExecutor.java:614)         at java.lang.Thread.run(Thread.java:779)    2) Thread[id=28, name=metrics-meter-tick-thread-1, state=WAITING, group=TGRP-TestEmbeddedSolrServer]         at sun.misc.Unsafe.park(Native Method)         at java.util.concurrent.locks.LockSupport.park(LockSupport.java:197)         at java.util.concurrent.locks.AbstractQueuedSynchronizer$ConditionObject.await(AbstractQueuedSynchronizer.java:2054)         at java.util.concurrent.ScheduledThreadPoolExecutor$DelayedWorkQueue.take(ScheduledThreadPoolExecutor.java:1096)         at java.util.concurrent.ScheduledThreadPoolExecutor$DelayedWorkQueue.take(ScheduledThreadPoolExecutor.java:818)         at java.util.concurrent.ThreadPoolExecutor.getTask(ThreadPoolExecutor.java:1054)         at java.util.concurrent.ThreadPoolExecutor.runWorker(ThreadPoolExecutor.java:1114)         at java.util.concurrent.ThreadPoolExecutor$Worker.run(ThreadPoolExecutor.java:614)         at java.lang.Thread.run(Thread.java:779)

Stack Trace:
com.carrotsearch.randomizedtesting.ThreadLeakError: 2 threads leaked from SUITE scope at org.apache.solr.client.solrj.embedded.TestEmbeddedSolrServer: 
   1) Thread[id=29, name=metrics-meter-tick-thread-2, state=TIMED_WAITING, group=TGRP-TestEmbeddedSolrServer]
        at sun.misc.Unsafe.park(Native Method)
        at java.util.concurrent.locks.LockSupport.parkNanos(LockSupport.java:237)
        at java.util.concurrent.locks.AbstractQueuedSynchronizer$ConditionObject.awaitNanos(AbstractQueuedSynchronizer.java:2093)
        at java.util.concurrent.ScheduledThreadPoolExecutor$DelayedWorkQueue.take(ScheduledThreadPoolExecutor.java:1101)
        at java.util.concurrent.ScheduledThreadPoolExecutor$DelayedWorkQueue.take(ScheduledThreadPoolExecutor.java:818)
        at java.util.concurrent.ThreadPoolExecutor.getTask(ThreadPoolExecutor.java:1054)
        at java.util.concurrent.ThreadPoolExecutor.runWorker(ThreadPoolExecutor.java:1114)
        at java.util.concurrent.ThreadPoolExecutor$Worker.run(ThreadPoolExecutor.java:614)
        at java.lang.Thread.run(Thread.java:779)
   2) Thread[id=28, name=metrics-meter-tick-thread-1, state=WAITING, group=TGRP-TestEmbeddedSolrServer]
        at sun.misc.Unsafe.park(Native Method)
        at java.util.concurrent.locks.LockSupport.park(LockSupport.java:197)
        at java.util.concurrent.locks.AbstractQueuedSynchronizer$ConditionObject.await(AbstractQueuedSynchronizer.java:2054)
        at java.util.concurrent.ScheduledThreadPoolExecutor$DelayedWorkQueue.take(ScheduledThreadPoolExecutor.java:1096)
        at java.util.concurrent.ScheduledThreadPoolExecutor$DelayedWorkQueue.take(ScheduledThreadPoolExecutor.java:818)
        at java.util.concurrent.ThreadPoolExecutor.getTask(ThreadPoolExecutor.java:1054)
        at java.util.concurrent.ThreadPoolExecutor.runWorker(ThreadPoolExecutor.java:1114)
        at java.util.concurrent.ThreadPoolExecutor$Worker.run(ThreadPoolExecutor.java:614)
        at java.lang.Thread.run(Thread.java:779)
	at __randomizedtesting.SeedInfo.seed([8B1D2CB11C872124]:0)


FAILED:  junit.framework.TestSuite.org.apache.solr.client.solrj.embedded.TestEmbeddedSolrServer

Error Message:
There are still zombie threads that couldn't be terminated:    1) Thread[id=29, name=metrics-meter-tick-thread-2, state=TIMED_WAITING, group=TGRP-TestEmbeddedSolrServer]         at sun.misc.Unsafe.park(Native Method)         at java.util.concurrent.locks.LockSupport.parkNanos(LockSupport.java:237)         at java.util.concurrent.locks.AbstractQueuedSynchronizer$ConditionObject.awaitNanos(AbstractQueuedSynchronizer.java:2093)         at java.util.concurrent.ScheduledThreadPoolExecutor$DelayedWorkQueue.take(ScheduledThreadPoolExecutor.java:1101)         at java.util.concurrent.ScheduledThreadPoolExecutor$DelayedWorkQueue.take(ScheduledThreadPoolExecutor.java:818)         at java.util.concurrent.ThreadPoolExecutor.getTask(ThreadPoolExecutor.java:1054)         at java.util.concurrent.ThreadPoolExecutor.runWorker(ThreadPoolExecutor.java:1114)         at java.util.concurrent.ThreadPoolExecutor$Worker.run(ThreadPoolExecutor.java:614)         at java.lang.Thread.run(Thread.java:779)    2) Thread[id=28, name=metrics-meter-tick-thread-1, state=WAITING, group=TGRP-TestEmbeddedSolrServer]         at sun.misc.Unsafe.park(Native Method)         at java.util.concurrent.locks.LockSupport.park(LockSupport.java:197)         at java.util.concurrent.locks.AbstractQueuedSynchronizer$ConditionObject.await(AbstractQueuedSynchronizer.java:2054)         at java.util.concurrent.ScheduledThreadPoolExecutor$DelayedWorkQueue.take(ScheduledThreadPoolExecutor.java:1096)         at java.util.concurrent.ScheduledThreadPoolExecutor$DelayedWorkQueue.take(ScheduledThreadPoolExecutor.java:818)         at java.util.concurrent.ThreadPoolExecutor.getTask(ThreadPoolExecutor.java:1054)         at java.util.concurrent.ThreadPoolExecutor.runWorker(ThreadPoolExecutor.java:1114)         at java.util.concurrent.ThreadPoolExecutor$Worker.run(ThreadPoolExecutor.java:614)         at java.lang.Thread.run(Thread.java:779)

Stack Trace:
com.carrotsearch.randomizedtesting.ThreadLeakError: There are still zombie threads that couldn't be terminated:
   1) Thread[id=29, name=metrics-meter-tick-thread-2, state=TIMED_WAITING, group=TGRP-TestEmbeddedSolrServer]
        at sun.misc.Unsafe.park(Native Method)
        at java.util.concurrent.locks.LockSupport.parkNanos(LockSupport.java:237)
        at java.util.concurrent.locks.AbstractQueuedSynchronizer$ConditionObject.awaitNanos(AbstractQueuedSynchronizer.java:2093)
        at java.util.concurrent.ScheduledThreadPoolExecutor$DelayedWorkQueue.take(ScheduledThreadPoolExecutor.java:1101)
        at java.util.concurrent.ScheduledThreadPoolExecutor$DelayedWorkQueue.take(ScheduledThreadPoolExecutor.java:818)
        at java.util.concurrent.ThreadPoolExecutor.getTask(ThreadPoolExecutor.java:1054)
        at java.util.concurrent.ThreadPoolExecutor.runWorker(ThreadPoolExecutor.java:1114)
        at java.util.concurrent.ThreadPoolExecutor$Worker.run(ThreadPoolExecutor.java:614)
        at java.lang.Thread.run(Thread.java:779)
   2) Thread[id=28, name=metrics-meter-tick-thread-1, state=WAITING, group=TGRP-TestEmbeddedSolrServer]
        at sun.misc.Unsafe.park(Native Method)
        at java.util.concurrent.locks.LockSupport.park(LockSupport.java:197)
        at java.util.concurrent.locks.AbstractQueuedSynchronizer$ConditionObject.await(AbstractQueuedSynchronizer.java:2054)
        at java.util.concurrent.ScheduledThreadPoolExecutor$DelayedWorkQueue.take(ScheduledThreadPoolExecutor.java:1096)
        at java.util.concurrent.ScheduledThreadPoolExecutor$DelayedWorkQueue.take(ScheduledThreadPoolExecutor.java:818)
        at java.util.concurrent.ThreadPoolExecutor.getTask(ThreadPoolExecutor.java:1054)
        at java.util.concurrent.ThreadPoolExecutor.runWorker(ThreadPoolExecutor.java:1114)
        at java.util.concurrent.ThreadPoolExecutor$Worker.run(ThreadPoolExecutor.java:614)
        at java.lang.Thread.run(Thread.java:779)
	at __randomizedtesting.SeedInfo.seed([8B1D2CB11C872124]:0)




Build Log:
[...truncated 9474 lines...]
[junit4:junit4] Suite: org.apache.solr.client.solrj.embedded.TestEmbeddedSolrServer
[junit4:junit4]   2> -5 T24 oasc.CoreContainer.<init> New CoreContainer 516166765
[junit4:junit4]   2> 5 T24 oasc.CoreContainer.load Loading CoreContainer using Solr Home: '/mnt/ssd/jenkins/workspace/Lucene-Solr-trunk-Linux/solr/solrj/src/test-files/solrj/solr/shared'
[junit4:junit4]   2> 17 T24 oasc.SolrResourceLoader.<init> new SolrResourceLoader for directory: '/mnt/ssd/jenkins/workspace/Lucene-Solr-trunk-Linux/solr/solrj/src/test-files/solrj/solr/shared/'
[junit4:junit4]   2> 243 T24 oasc.CoreContainer.load Registering Log Listener
[junit4:junit4]   2> 385 T24 oasc.CoreContainer.create Creating SolrCore 'collection1' using instanceDir: /mnt/ssd/jenkins/workspace/Lucene-Solr-trunk-Linux/solr/solrj/src/test-files/solrj/solr/shared/.
[junit4:junit4]   2> 386 T24 oasc.SolrResourceLoader.<init> new SolrResourceLoader for directory: '/mnt/ssd/jenkins/workspace/Lucene-Solr-trunk-Linux/solr/solrj/src/test-files/solrj/solr/shared/./'
[junit4:junit4]   2> 447 T24 oasc.SolrConfig.<init> Using Lucene MatchVersion: LUCENE_50
[junit4:junit4]   2> 555 T24 oasc.SolrConfig.<init> Loaded SolrConfig: solrconfig.xml
[junit4:junit4]   2> 561 T24 oass.IndexSchema.readSchema Reading Solr Schema
[junit4:junit4]   2> 572 T24 oass.IndexSchema.readSchema Schema name=example core 
[junit4:junit4]   2> 657 T24 oass.IndexSchema.readSchema default search field in schema is name
[junit4:junit4]   2> 660 T24 oass.IndexSchema.readSchema query parser default operator is OR
[junit4:junit4]   2> 663 T24 oass.IndexSchema.readSchema unique key field: id
[junit4:junit4]   2> 720 T24 oasc.SolrCore.<init> [collection1] Opening new SolrCore at /mnt/ssd/jenkins/workspace/Lucene-Solr-trunk-Linux/solr/solrj/src/test-files/solrj/solr/shared/./, dataDir=/mnt/ssd/jenkins/workspace/Lucene-Solr-trunk-Linux/solr/build/solr-solrj/test/J0/./solrtest-TestEmbeddedSolrServer-1351558782197/data/-1.3/
[junit4:junit4]   2> 721 T24 oasc.SolrCore.<init> JMX monitoring not detected for core: collection1
[junit4:junit4]   2> 727 T24 oasc.SolrCore.initDirectoryFactory org.apache.solr.core.MockDirectoryFactory
[junit4:junit4]   2> 752 T24 oasc.CachingDirectoryFactory.injectLockFactory WARNING No lockType configured for MockDirWrapper(org.apache.lucene.store.RAMDirectory@9731d484 lockFactory=org.apache.lucene.store.SingleInstanceLockFactory@7d9ab4e1) assuming 'simple'
[junit4:junit4]   2> 754 T24 oasc.CachingDirectoryFactory.get return new directory for /mnt/ssd/jenkins/workspace/Lucene-Solr-trunk-Linux/solr/build/solr-solrj/test/J0/./solrtest-TestEmbeddedSolrServer-1351558782197/data/-1.3 forceNew:false
[junit4:junit4]   2> 756 T24 oasc.CachingDirectoryFactory.close Releasing directory:/mnt/ssd/jenkins/workspace/Lucene-Solr-trunk-Linux/solr/build/solr-solrj/test/J0/./solrtest-TestEmbeddedSolrServer-1351558782197/data/-1.3
[junit4:junit4]   2> 757 T24 oasc.SolrCore.getNewIndexDir New index directory detected: old=null new=/mnt/ssd/jenkins/workspace/Lucene-Solr-trunk-Linux/solr/build/solr-solrj/test/J0/./solrtest-TestEmbeddedSolrServer-1351558782197/data/-1.3/index/
[junit4:junit4]   2> 759 T24 oasc.SolrCore.initIndex WARNING [collection1] Solr index directory '/mnt/ssd/jenkins/workspace/Lucene-Solr-trunk-Linux/solr/build/solr-solrj/test/J0/./solrtest-TestEmbeddedSolrServer-1351558782197/data/-1.3/index' doesn't exist. Creating new index...
[junit4:junit4]   2> 767 T24 oasc.CachingDirectoryFactory.get return new directory for /mnt/ssd/jenkins/workspace/Lucene-Solr-trunk-Linux/solr/build/solr-solrj/test/J0/./solrtest-TestEmbeddedSolrServer-1351558782197/data/-1.3/index forceNew:false
[junit4:junit4]   2> 877 T24 oasc.SolrDeletionPolicy.onCommit SolrDeletionPolicy.onCommit: commits:num=1
[junit4:junit4]   2> 		commit{dir=MockDirWrapper(org.apache.lucene.store.RAMDirectory@888384be lockFactory=org.apache.lucene.store.NativeFSLockFactory@3b964d44),segFN=segments_1,generation=1,filenames=[segments_1]
[junit4:junit4]   2> 878 T24 oasc.SolrDeletionPolicy.updateCommits newest commit = 1[segments_1]
[junit4:junit4]   2> 881 T24 oasc.CachingDirectoryFactory.close Releasing directory:/mnt/ssd/jenkins/workspace/Lucene-Solr-trunk-Linux/solr/build/solr-solrj/test/J0/./solrtest-TestEmbeddedSolrServer-1351558782197/data/-1.3/index
[junit4:junit4]   2> 1003 T24 oasc.RequestHandlers.initHandlersFromConfig created standard: solr.StandardRequestHandler
[junit4:junit4]   2> 1008 T24 oasc.RequestHandlers.initHandlersFromConfig created /update: solr.UpdateRequestHandler
[junit4:junit4]   2> 1010 T24 oasc.RequestHandlers.initHandlersFromConfig created /admin/: org.apache.solr.handler.admin.AdminHandlers
[junit4:junit4]   2> 1031 T24 oashl.XMLLoader.init xsltCacheLifetimeSeconds=60
[junit4:junit4]   2> 1038 T24 oasc.CachingDirectoryFactory.close Releasing directory:/mnt/ssd/jenkins/workspace/Lucene-Solr-trunk-Linux/solr/build/solr-solrj/test/J0/./solrtest-TestEmbeddedSolrServer-1351558782197/data/-1.3
[junit4:junit4]   2> 1047 T24 oass.SolrIndexSearcher.<init> Opening Searcher@d7c2b698 main
[junit4:junit4]   2> 1059 T24 oasu.CommitTracker.<init> Hard AutoCommit: disabled
[junit4:junit4]   2> 1060 T24 oasu.CommitTracker.<init> Soft AutoCommit: disabled
[junit4:junit4]   2> 1074 T24 oashc.HttpShardHandlerFactory.getParameter Setting socketTimeout to: 0
[junit4:junit4]   2> 1075 T24 oashc.HttpShardHandlerFactory.getParameter Setting urlScheme to: http://
[junit4:junit4]   2> 1076 T24 oashc.HttpShardHandlerFactory.getParameter Setting connTimeout to: 0
[junit4:junit4]   2> 1077 T24 oashc.HttpShardHandlerFactory.getParameter Setting maxConnectionsPerHost to: 20
[junit4:junit4]   2> 1078 T24 oashc.HttpShardHandlerFactory.getParameter Setting corePoolSize to: 0
[junit4:junit4]   2> 1079 T24 oashc.HttpShardHandlerFactory.getParameter Setting maximumPoolSize to: 2147483647
[junit4:junit4]   2> 1080 T24 oashc.HttpShardHandlerFactory.getParameter Setting maxThreadIdleTime to: 5
[junit4:junit4]   2> 1081 T24 oashc.HttpShardHandlerFactory.getParameter Setting sizeOfQueue to: -1
[junit4:junit4]   2> 1082 T24 oashc.HttpShardHandlerFactory.getParameter Setting fairnessPolicy to: false
[junit4:junit4]   2> 1092 T24 oascsi.HttpClientUtil.createClient Creating new http client, config:maxConnectionsPerHost=20&maxConnections=10000&socketTimeout=0&connTimeout=0&retry=false
[junit4:junit4]   2> 1605 T30 oasc.SolrCore.registerSearcher [collection1] Registered new searcher Searcher@d7c2b698 main{StandardDirectoryReader(segments_1:1)}
[junit4:junit4]   2> 1605 T24 oasc.CoreContainer.register registering core: collection1
[junit4:junit4]   2> 1610 T24 oasc.CoreContainer.create Creating SolrCore 'core0' using instanceDir: /mnt/ssd/jenkins/workspace/Lucene-Solr-trunk-Linux/solr/solrj/src/test-files/solrj/solr/shared/.
[junit4:junit4]   2> 1611 T24 oasc.SolrResourceLoader.<init> new SolrResourceLoader for directory: '/mnt/ssd/jenkins/workspace/Lucene-Solr-trunk-Linux/solr/solrj/src/test-files/solrj/solr/shared/./'
[junit4:junit4]   2> 1676 T24 oasc.SolrConfig.<init> Using Lucene MatchVersion: LUCENE_50
[junit4:junit4]   2> 1733 T24 oasc.SolrConfig.<init> Loaded SolrConfig: solrconfig.xml
[junit4:junit4]   2> 1734 T24 oass.IndexSchema.readSchema Reading Solr Schema
[junit4:junit4]   2> 1743 T24 oass.IndexSchema.readSchema Schema name=example core EN
[junit4:junit4]   2> 1819 T24 oass.IndexSchema.readSchema default search field in schema is name
[junit4:junit4]   2> 1822 T24 oass.IndexSchema.readSchema query parser default operator is OR
[junit4:junit4]   2> 1824 T24 oass.IndexSchema.readSchema unique key field: id
[junit4:junit4]   2> 1829 T24 oasc.SolrCore.<init> [core0] Opening new SolrCore at /mnt/ssd/jenkins/workspace/Lucene-Solr-trunk-Linux/solr/solrj/src/test-files/solrj/solr/shared/./, dataDir=/mnt/ssd/jenkins/workspace/Lucene-Solr-trunk-Linux/solr/build/solr-solrj/test/J0/./solrtest-TestEmbeddedSolrServer-1351558782197/data/EN-3.5/
[junit4:junit4]   2> 1830 T24 oasc.SolrCore.<init> JMX monitoring not detected for core: core0
[junit4:junit4]   2> 1831 T24 oasc.SolrCore.initDirectoryFactory org.apache.solr.core.MockDirectoryFactory
[junit4:junit4]   2> 1832 T24 oasc.CachingDirectoryFactory.injectLockFactory WARNING No lockType configured for MockDirWrapper(org.apache.lucene.store.RAMDirectory@3638237f lockFactory=org.apache.lucene.store.SingleInstanceLockFactory@cc6d5809) assuming 'simple'
[junit4:junit4]   2> 1833 T24 oasc.CachingDirectoryFactory.get return new directory for /mnt/ssd/jenkins/workspace/Lucene-Solr-trunk-Linux/solr/build/solr-solrj/test/J0/./solrtest-TestEmbeddedSolrServer-1351558782197/data/EN-3.5 forceNew:false
[junit4:junit4]   2> 1834 T24 oasc.CachingDirectoryFactory.close Releasing directory:/mnt/ssd/jenkins/workspace/Lucene-Solr-trunk-Linux/solr/build/solr-solrj/test/J0/./solrtest-TestEmbeddedSolrServer-1351558782197/data/EN-3.5
[junit4:junit4]   2> 1835 T24 oasc.SolrCore.getNewIndexDir New index directory detected: old=null new=/mnt/ssd/jenkins/workspace/Lucene-Solr-trunk-Linux/solr/build/solr-solrj/test/J0/./solrtest-TestEmbeddedSolrServer-1351558782197/data/EN-3.5/index/
[junit4:junit4]   2> 1836 T24 oasc.SolrCore.initIndex WARNING [core0] Solr index directory '/mnt/ssd/jenkins/workspace/Lucene-Solr-trunk-Linux/solr/build/solr-solrj/test/J0/./solrtest-TestEmbeddedSolrServer-1351558782197/data/EN-3.5/index' doesn't exist. Creating new index...
[junit4:junit4]   2> 1837 T24 oasc.CachingDirectoryFactory.get return new directory for /mnt/ssd/jenkins/workspace/Lucene-Solr-trunk-Linux/solr/build/solr-solrj/test/J0/./solrtest-TestEmbeddedSolrServer-1351558782197/data/EN-3.5/index forceNew:false
[junit4:junit4]   2> 1840 T24 oasc.SolrDeletionPolicy.onCommit SolrDeletionPolicy.onCommit: commits:num=1
[junit4:junit4]   2> 		commit{dir=MockDirWrapper(org.apache.lucene.store.RAMDirectory@3b83b784 lockFactory=org.apache.lucene.store.NativeFSLockFactory@8de4bfb5),segFN=segments_1,generation=1,filenames=[segments_1]
[junit4:junit4]   2> 1841 T24 oasc.SolrDeletionPolicy.updateCommits newest commit = 1[segments_1]
[junit4:junit4]   2> 1842 T24 oasc.CachingDirectoryFactory.close Releasing directory:/mnt/ssd/jenkins/workspace/Lucene-Solr-trunk-Linux/solr/build/solr-solrj/test/J0/./solrtest-TestEmbeddedSolrServer-1351558782197/data/EN-3.5/index
[junit4:junit4]   2> 1845 T24 oasc.RequestHandlers.initHandlersFromConfig created standard: solr.StandardRequestHandler
[junit4:junit4]   2> 1847 T24 oasc.RequestHandlers.initHandlersFromConfig created /update: solr.UpdateRequestHandler
[junit4:junit4]   2> 1851 T24 oasc.RequestHandlers.initHandlersFromConfig created /admin/: org.apache.solr.handler.admin.AdminHandlers
[junit4:junit4]   2> 1853 T24 oashl.XMLLoader.init xsltCacheLifetimeSeconds=60
[junit4:junit4]   2> 1856 T24 oasc.CachingDirectoryFactory.close Releasing directory:/mnt/ssd/jenkins/workspace/Lucene-Solr-trunk-Linux/solr/build/solr-solrj/test/J0/./solrtest-TestEmbeddedSolrServer-1351558782197/data/EN-3.5
[junit4:junit4]   2> 1858 T24 oass.SolrIndexSearcher.<init> Opening Searcher@41fdaae4 main
[junit4:junit4]   2> 1859 T24 oasu.CommitTracker.<init> Hard AutoCommit: disabled
[junit4:junit4]   2> 1860 T24 oasu.CommitTracker.<init> Soft AutoCommit: disabled
[junit4:junit4]   2> 1871 T31 oasc.SolrCore.registerSearcher [core0] Registered new searcher Searcher@41fdaae4 main{StandardDirectoryReader(segments_1:1)}
[junit4:junit4]   2> 1871 T24 oasc.CoreContainer.register registering core: core0
[junit4:junit4]   2> 1873 T24 oasc.CoreContainer.create Creating SolrCore 'core1' using instanceDir: /mnt/ssd/jenkins/workspace/Lucene-Solr-trunk-Linux/solr/solrj/src/test-files/solrj/solr/shared/.
[junit4:junit4]   2> 1874 T24 oasc.SolrResourceLoader.<init> new SolrResourceLoader for directory: '/mnt/ssd/jenkins/workspace/Lucene-Solr-trunk-Linux/solr/solrj/src/test-files/solrj/solr/shared/./'
[junit4:junit4]   2> 1918 T24 oasc.SolrConfig.<init> Using Lucene MatchVersion: LUCENE_50
[junit4:junit4]   2> 1957 T24 oasc.SolrConfig.<init> Loaded SolrConfig: solrconfig.xml
[junit4:junit4]   2> 1957 T24 oass.IndexSchema.readSchema Reading Solr Schema
[junit4:junit4]   2> 1969 T24 oass.IndexSchema.readSchema Schema name=example core FR
[junit4:junit4]   2> 1999 T24 oass.IndexSchema.readSchema default search field in schema is name
[junit4:junit4]   2> 2001 T24 oass.IndexSchema.readSchema query parser default operator is OR
[junit4:junit4]   2> 2002 T24 oass.IndexSchema.readSchema unique key field: id
[junit4:junit4]   2> 2006 T24 oasc.SolrCore.<init> [core1] Opening new SolrCore at /mnt/ssd/jenkins/workspace/Lucene-Solr-trunk-Linux/solr/solrj/src/test-files/solrj/solr/shared/./, dataDir=/mnt/ssd/jenkins/workspace/Lucene-Solr-trunk-Linux/solr/build/solr-solrj/test/J0/./solrtest-TestEmbeddedSolrServer-1351558782197/data/FR-2.4/
[junit4:junit4]   2> 2006 T24 oasc.SolrCore.<init> JMX monitoring not detected for core: core1
[junit4:junit4]   2> 2007 T24 oasc.SolrCore.initDirectoryFactory org.apache.solr.core.MockDirectoryFactory
[junit4:junit4]   2> 2008 T24 oasc.CachingDirectoryFactory.injectLockFactory WARNING No lockType configured for MockDirWrapper(org.apache.lucene.store.RAMDirectory@26b798a8 lockFactory=org.apache.lucene.store.SingleInstanceLockFactory@169bbedb) assuming 'simple'
[junit4:junit4]   2> 2009 T24 oasc.CachingDirectoryFactory.get return new directory for /mnt/ssd/jenkins/workspace/Lucene-Solr-trunk-Linux/solr/build/solr-solrj/test/J0/./solrtest-TestEmbeddedSolrServer-1351558782197/data/FR-2.4 forceNew:false
[junit4:junit4]   2> 2010 T24 oasc.CachingDirectoryFactory.close Releasing directory:/mnt/ssd/jenkins/workspace/Lucene-Solr-trunk-Linux/solr/build/solr-solrj/test/J0/./solrtest-TestEmbeddedSolrServer-1351558782197/data/FR-2.4
[junit4:junit4]   2> 2010 T24 oasc.SolrCore.getNewIndexDir New index directory detected: old=null new=/mnt/ssd/jenkins/workspace/Lucene-Solr-trunk-Linux/solr/build/solr-solrj/test/J0/./solrtest-TestEmbeddedSolrServer-1351558782197/data/FR-2.4/index/
[junit4:junit4]   2> 2011 T24 oasc.SolrCore.initIndex WARNING [core1] Solr index directory '/mnt/ssd/jenkins/workspace/Lucene-Solr-trunk-Linux/solr/build/solr-solrj/test/J0/./solrtest-TestEmbeddedSolrServer-1351558782197/data/FR-2.4/index' doesn't exist. Creating new index...
[junit4:junit4]   2> 2012 T24 oasc.CachingDirectoryFactory.get return new directory for /mnt/ssd/jenkins/workspace/Lucene-Solr-trunk-Linux/solr/build/solr-solrj/test/J0/./solrtest-TestEmbeddedSolrServer-1351558782197/data/FR-2.4/index forceNew:false
[junit4:junit4]   2> 2021 T24 oasc.SolrDeletionPolicy.onCommit SolrDeletionPolicy.onCommit: commits:num=1
[junit4:junit4]   2> 		commit{dir=MockDirWrapper(org.apache.lucene.store.RAMDirectory@1090b781 lockFactory=org.apache.lucene.store.NativeFSLockFactory@ed718272),segFN=segments_1,generation=1,filenames=[segments_1]
[junit4:junit4]   2> 2022 T24 oasc.SolrDeletionPolicy.updateCommits newest commit = 1[segments_1]
[junit4:junit4]   2> 2022 T24 oasc.CachingDirectoryFactory.close Releasing directory:/mnt/ssd/jenkins/workspace/Lucene-Solr-trunk-Linux/solr/build/solr-solrj/test/J0/./solrtest-TestEmbeddedSolrServer-1351558782197/data/FR-2.4/index
[junit4:junit4]   2> 2025 T24 oasc.RequestHandlers.initHandlersFromConfig created standard: solr.StandardRequestHandler
[junit4:junit4]   2> 2027 T24 oasc.RequestHandlers.initHandlersFromConfig created /update: solr.UpdateRequestHandler
[junit4:junit4]   2> 2027 T24 oasc.RequestHandlers.initHandlersFromConfig created /admin/: org.apache.solr.handler.admin.AdminHandlers
[junit4:junit4]   2> 2029 T24 oashl.XMLLoader.init xsltCacheLifetimeSeconds=60
[junit4:junit4]   2> 2031 T24 oasc.CachingDirectoryFactory.close Releasing directory:/mnt/ssd/jenkins/workspace/Lucene-Solr-trunk-Linux/solr/build/solr-solrj/test/J0/./solrtest-TestEmbeddedSolrServer-1351558782197/data/FR-2.4
[junit4:junit4]   2> 2032 T24 oass.SolrIndexSearcher.<init> Opening Searcher@366a663e main
[junit4:junit4]   2> 2033 T24 oasu.CommitTracker.<init> Hard AutoCommit: disabled
[junit4:junit4]   2> 2034 T24 oasu.CommitTracker.<init> Soft AutoCommit: disabled
[junit4:junit4]   2> 2043 T32 oasc.SolrCore.registerSearcher [core1] Registered new searcher Searcher@366a663e main{StandardDirectoryReader(segments_1:1)}
[junit4:junit4]   2> 2043 T24 oasc.CoreContainer.register registering core: core1
[junit4:junit4]   2> 2054 T24 oasc.CoreContainer.shutdown Shutting down CoreContainer instance=516166765
[junit4:junit4]   2> 2055 T24 oasc.SolrCore.close [collection1]  CLOSING SolrCore org.apache.solr.core.SolrCore@827cf2c9
[junit4:junit4]   2> 2056 T24 oasu.DirectUpdateHandler2.close closing DirectUpdateHandler2{commits=0,autocommits=0,soft autocommits=0,optimizes=0,rollbacks=0,expungeDeletes=0,docsPending=0,adds=0,deletesById=0,deletesByQuery=0,errors=0,cumulative_adds=0,cumulative_deletesById=0,cumulative_deletesByQuery=0,cumulative_errors=0}
[junit4:junit4]   2> 2057 T24 oasc.SolrCore.decrefSolrCoreState Closing SolrCoreState
[junit4:junit4]   2> 2058 T24 oasu.DefaultSolrCoreState.closeIndexWriter SolrCoreState ref count has reached 0 - closing IndexWriter
[junit4:junit4]   2> 2059 T24 oasu.DefaultSolrCoreState.closeIndexWriter closing IndexWriter with IndexWriterCloser
[junit4:junit4]   2> 2062 T24 oasc.SolrCore.closeSearcher [collection1] Closing main searcher on request.
[junit4:junit4]   2> 2063 T24 oasc.CachingDirectoryFactory.close Releasing directory:/mnt/ssd/jenkins/workspace/Lucene-Solr-trunk-Linux/solr/build/solr-solrj/test/J0/./solrtest-TestEmbeddedSolrServer-1351558782197/data/-1.3/index
[junit4:junit4]   2> 2064 T24 oasc.SolrCore.close [core0]  CLOSING SolrCore org.apache.solr.core.SolrCore@1019e42a
[junit4:junit4]   2> 2069 T24 oasu.DirectUpdateHandler2.close closing DirectUpdateHandler2{commits=0,autocommits=0,soft autocommits=0,optimizes=0,rollbacks=0,expungeDeletes=0,docsPending=0,adds=0,deletesById=0,deletesByQuery=0,errors=0,cumulative_adds=0,cumulative_deletesById=0,cumulative_deletesByQuery=0,cumulative_errors=0}
[junit4:junit4]   2> 2070 T24 oasc.SolrCore.decrefSolrCoreState Closing SolrCoreState
[junit4:junit4]   2> 2070 T24 oasu.DefaultSolrCoreState.closeIndexWriter SolrCoreState ref count has reached 0 - closing IndexWriter
[junit4:junit4]   2> 2071 T24 oasu.DefaultSolrCoreState.closeIndexWriter closing IndexWriter with IndexWriterCloser
[junit4:junit4]   2> 2072 T24 oasc.SolrCore.closeSearcher [core0] Closing main searcher on request.
[junit4:junit4]   2> 2072 T24 oasc.CachingDirectoryFactory.close Releasing directory:/mnt/ssd/jenkins/workspace/Lucene-Solr-trunk-Linux/solr/build/solr-solrj/test/J0/./solrtest-TestEmbeddedSolrServer-1351558782197/data/EN-3.5/index
[junit4:junit4]   2> 2073 T24 oasc.SolrCore.close [core1]  CLOSING SolrCore org.apache.solr.core.SolrCore@1765928c
[junit4:junit4]   2> 2074 T24 oasu.DirectUpdateHandler2.close closing DirectUpdateHandler2{commits=0,autocommits=0,soft autocommits=0,optimizes=0,rollbacks=0,expungeDeletes=0,docsPending=0,adds=0,deletesById=0,deletesByQuery=0,errors=0,cumulative_adds=0,cumulative_deletesById=0,cumulative_deletesByQuery=0,cumulative_errors=0}
[junit4:junit4]   2> 2074 T24 oasc.SolrCore.decrefSolrCoreState Closing SolrCoreState
[junit4:junit4]   2> 2075 T24 oasu.DefaultSolrCoreState.closeIndexWriter SolrCoreState ref count has reached 0 - closing IndexWriter
[junit4:junit4]   2> 2076 T24 oasu.DefaultSolrCoreState.closeIndexWriter closing IndexWriter with IndexWriterCloser
[junit4:junit4]   2> 2076 T24 oasc.SolrCore.closeSearcher [core1] Closing main searcher on request.
[junit4:junit4]   2> 2077 T24 oasc.CachingDirectoryFactory.close Releasing directory:/mnt/ssd/jenkins/workspace/Lucene-Solr-trunk-Linux/solr/build/solr-solrj/test/J0/./solrtest-TestEmbeddedSolrServer-1351558782197/data/FR-2.4/index
[junit4:junit4]   2> 2078 T24 oasc.CoreContainer.shutdown Shutting down CoreContainer instance=516166765
[junit4:junit4]   2> 2113 T24 oasc.CoreContainer.<init> New CoreContainer -1239082407
[junit4:junit4]   2> 2113 T24 oasc.CoreContainer.load Loading CoreContainer using Solr Home: '/mnt/ssd/jenkins/workspace/Lucene-Solr-trunk-Linux/solr/solrj/src/test-files/solrj/solr/shared'
[junit4:junit4]   2> 2114 T24 oasc.SolrResourceLoader.<init> new SolrResourceLoader for directory: '/mnt/ssd/jenkins/workspace/Lucene-Solr-trunk-Linux/solr/solrj/src/test-files/solrj/solr/shared/'
[junit4:junit4]   2> 2139 T24 oasc.CoreContainer.load Registering Log Listener
[junit4:junit4]   2> 2163 T24 oasc.CoreContainer.create Creating SolrCore 'collection1' using instanceDir: /mnt/ssd/jenkins/workspace/Lucene-Solr-trunk-Linux/solr/solrj/src/test-files/solrj/solr/shared/.
[junit4:junit4]   2> 2164 T24 oasc.SolrResourceLoader.<init> new SolrResourceLoader for directory: '/mnt/ssd/jenkins/workspace/Lucene-Solr-trunk-Linux/solr/solrj/src/test-files/solrj/solr/shared/./'
[junit4:junit4]   2> 2200 T24 oasc.SolrConfig.<init> Using Lucene MatchVersion: LUCENE_50
[junit4:junit4]   2> 2237 T24 oasc.SolrConfig.<init> Loaded SolrConfig: solrconfig.xml
[junit4:junit4]   2> 2238 T24 oass.IndexSchema.readSchema Reading Solr Schema
[junit4:junit4]   2> 2250 T24 oass.IndexSchema.readSchema Schema name=example core 
[junit4:junit4]   2> 2281 T24 oass.IndexSchema.readSchema default search field in schema is name
[junit4:junit4]   2> 2283 T24 oass.IndexSchema.readSchema query parser default operator is OR
[junit4:junit4]   2> 2285 T24 oass.IndexSchema.readSchema unique key field: id
[junit4:junit4]   2> 2288 T24 oasc.SolrCore.<init> [collection1] Opening new SolrCore at /mnt/ssd/jenkins/workspace/Lucene-Solr-trunk-Linux/solr/solrj/src/test-files/solrj/solr/shared/./, dataDir=/mnt/ssd/jenkins/workspace/Lucene-Solr-trunk-Linux/solr/build/solr-solrj/test/J0/./solrtest-TestEmbeddedSolrServer-1351558784327/data/-1.3/
[junit4:junit4]   2> 2288 T24 oasc.SolrCore.<init> JMX monitoring not detected for core: collection1
[junit4:junit4]   2> 2289 T24 oasc.SolrCore.initDirectoryFactory org.apache.solr.core.MockDirectoryFactory
[junit4:junit4]   2> 2290 T24 oasc.CachingDirectoryFactory.injectLockFactory WARNING No lockType configured for MockDirWrapper(org.apache.lucene.store.RAMDirectory@20548811 lockFactory=org.apache.lucene.store.SingleInstanceLockFactory@6d76ec2e) assuming 'simple'
[junit4:junit4]   2> 2291 T24 oasc.CachingDirectoryFactory.get return new directory for /mnt/ssd/jenkins/workspace/Lucene-Solr-trunk-Linux/solr/build/solr-solrj/test/J0/./solrtest-TestEmbeddedSolrServer-1351558784327/data/-1.3 forceNew:false
[junit4:junit4]   2> 2291 T24 oasc.CachingDirectoryFactory.close Releasing directory:/mnt/ssd/jenkins/workspace/Lucene-Solr-trunk-Linux/solr/build/solr-solrj/test/J0/./solrtest-TestEmbeddedSolrServer-1351558784327/data/-1.3
[junit4:junit4]   2> 2292 T24 oasc.SolrCore.getNewIndexDir New index directory detected: old=null new=/mnt/ssd/jenkins/workspace/Lucene-Solr-trunk-Linux/solr/build/solr-solrj/test/J0/./solrtest-TestEmbeddedSolrServer-1351558784327/data/-1.3/index/
[junit4:junit4]   2> 2293 T24 oasc.SolrCore.initIndex WARNING [collection1] Solr index directory '/mnt/ssd/jenkins/workspace/Lucene-Solr-trunk-Linux/solr/build/solr-solrj/test/J0/./solrtest-TestEmbeddedSolrServer-1351558784327/data/-1.3/index' doesn't exist. Creating new index...
[junit4:junit4]   2> 2294 T24 oasc.CachingDirectoryFactory.get return new directory for /mnt/ssd/jenkins/workspace/Lucene-Solr-trunk-Linux/solr/build/solr-solrj/test/J0/./solrtest-TestEmbeddedSolrServer-1351558784327/data/-1.3/index forceNew:false
[junit4:junit4]   2> 2297 T24 oasc.SolrDeletionPolicy.onCommit SolrDeletionPolicy.onCommit: commits:num=1
[junit4:junit4]   2> 		commit{dir=MockDirWrapper(org.apache.lucene.store.RAMDirectory@fbdf4e24 lockFactory=org.apache.lucene.store.NativeFSLockFactory@9826198d),segFN=segments_1,generation=1,filenames=[segments_1]
[junit4:junit4]   2> 2297 T24 oasc.SolrDeletionPolicy.updateCommits newest commit = 1[segments_1]
[junit4:junit4]   2> 2298 T24 oasc.CachingDirectoryFactory.close Releasing directory:/mnt/ssd/jenkins/workspace/Lucene-Solr-trunk-Linux/solr/build/solr-solrj/test/J0/./solrtest-TestEmbeddedSolrServer-1351558784327/data/-1.3/index
[junit4:junit4]   2> 2301 T24 oasc.RequestHandlers.initHandlersFromConfig created standard: solr.StandardRequestHandler
[junit4:junit4]   2> 2303 T24 oasc.RequestHandlers.initHandlersFromConfig created /update: solr.UpdateRequestHandler
[junit4:junit4]   2> 2304 T24 oasc.RequestHandlers.initHandlersFromConfig created /admin/: org.apache.solr.handler.admin.AdminHandlers
[junit4:junit4]   2> 2305 T24 oashl.XMLLoader.init xsltCacheLifetimeSeconds=60
[junit4:junit4]   2> 2308 T24 oasc.CachingDirectoryFactory.close Releasing directory:/mnt/ssd/jenkins/workspace/Lucene-Solr-trunk-Linux/solr/build/solr-solrj/test/J0/./solrtest-TestEmbeddedSolrServer-1351558784327/data/-1.3
[junit4:junit4]   2> 2309 T24 oass.SolrIndexSearcher.<init> Opening Searcher@fe0a4d1a main
[junit4:junit4]   2> 2310 T24 oasu.CommitTracker.<init> Hard AutoCommit: disabled
[junit4:junit4]   2> 2311 T24 oasu.CommitTracker.<init> Soft AutoCommit: disabled
[junit4:junit4]   2> 2312 T24 oashc.HttpShardHandlerFactory.getParameter Setting socketTimeout to: 0
[junit4:junit4]   2> 2312 T24 oashc.HttpShardHandlerFactory.getParameter Setting urlScheme to: http://
[junit4:junit4]   2> 2313 T24 oashc.HttpShardHandlerFactory.getParameter Setting connTimeout to: 0
[junit4:junit4]   2> 2314 T24 oashc.HttpShardHandlerFactory.getParameter Setting maxConnectionsPerHost to: 20
[junit4:junit4]   2> 2315 T24 oashc.HttpShardHandlerFactory.getParameter Setting corePoolSize to: 0
[junit4:junit4]   2> 2315 T24 oashc.HttpShardHandlerFactory.getParameter Setting maximumPoolSize to: 2147483647
[junit4:junit4]   2> 2316 T24 oashc.HttpShardHandlerFactory.getParameter Setting maxThreadIdleTime to: 5
[junit4:junit4]   2> 2317 T24 oashc.HttpShardHandlerFactory.getParameter Setting sizeOfQueue to: -1
[junit4:junit4]   2> 2318 T24 oashc.HttpShardHandlerFactory.getParameter Setting fairnessPolicy to: false
[junit4:junit4]   2> 2318 T24 oascsi.HttpClientUtil.createClient Creating new http client, config:maxConnectionsPerHost=20&maxConnections=10000&socketTimeout=0&connTimeout=0&retry=false
[junit4:junit4]   2> 2366 T33 oasc.SolrCore.registerSearcher [collection1] Registered new searcher Searcher@fe0a4d1a main{StandardDirectoryReader(segments_1:1)}
[junit4:junit4]   2> 2366 T24 oasc.CoreContainer.register registering core: collection1
[junit4:junit4]   2> 2369 T24 oasc.CoreContainer.create Creating SolrCore 'core0' using instanceDir: /mnt/ssd/jenkins/workspace/Lucene-Solr-trunk-Linux/solr/solrj/src/test-files/solrj/solr/shared/.
[junit4:junit4]   2> 2370 T24 oasc.SolrResourceLoader.<init> new SolrResourceLoader for directory: '/mnt/ssd/jenkins/workspace/Lucene-Solr-trunk-Linux/solr/solrj/src/test-files/solrj/solr/shared/./'
[junit4:junit4]   2> 2422 T24 oasc.SolrConfig.<init> Using Lucene MatchVersion: LUCENE_50
[junit4:junit4]   2> 2470 T24 oasc.SolrConfig.<init> Loaded SolrConfig: solrconfig.xml
[junit4:junit4]   2> 2471 T24 oass.IndexSchema.readSchema Reading Solr Schema
[junit4:junit4]   2> 2483 T24 oass.IndexSchema.readSchema Schema name=example core EN
[junit4:junit4]   2> 2513 T24 oass.IndexSchema.readSchema default search field in schema is name
[junit4:junit4]   2> 2515 T24 oass.IndexSchema.readSchema query parser default operator is OR
[junit4:junit4]   2> 2517 T24 oass.IndexSchema.readSchema unique key field: id
[junit4:junit4]   2> 2520 T24 oasc.SolrCore.<init> [core0] Opening new SolrCore at /mnt/ssd/jenkins/workspace/Lucene-Solr-trunk-Linux/solr/solrj/src/test-files/solrj/solr/shared/./, dataDir=/mnt/ssd/jenkins/workspace/Lucene-Solr-trunk-Linux/solr/build/solr-solrj/test/J0/./solrtest-TestEmbeddedSolrServer-1351558784327/data/EN-3.5/
[junit4:junit4]   2> 2521 T24 oasc.SolrCore.<init> JMX monitoring not detected for core: core0
[junit4:junit4]   2> 2522 T24 oasc.SolrCore.initDirectoryFactory org.apache.solr.core.MockDirectoryFactory
[junit4:junit4]   2> 2523 T24 oasc.CachingDirectoryFactory.injectLockFactory WARNING No lockType configured for MockDirWrapper(org.apache.lucene.store.RAMDirectory@7e88fe06 lockFactory=org.apache.lucene.store.SingleInstanceLockFactory@9c2914a8) assuming 'simple'
[junit4:junit4]   2> 2524 T24 oasc.CachingDirectoryFactory.get return new directory for /mnt/ssd/jenkins/workspace/Lucene-Solr-trunk-Linux/solr/build/solr-solrj/test/J0/./solrtest-TestEmbeddedSolrServer-1351558784327/data/EN-3.5 forceNew:false
[junit4:junit4]   2> 2524 T24 oasc.CachingDirectoryFactory.close Releasing directory:/mnt/ssd/jenkins/workspace/Lucene-Solr-trunk-Linux/solr/build/solr-solrj/test/J0/./solrtest-TestEmbeddedSolrServer-1351558784327/data/EN-3.5
[junit4:junit4]   2> 2525 T24 oasc.SolrCore.getNewIndexDir New index directory detected: old=null new=/mnt/ssd/jenkins/workspace/Lucene-Solr-trunk-Linux/solr/build/solr-solrj/test/J0/./solrtest-TestEmbeddedSolrServer-1351558784327/data/EN-3.5/index/
[junit4:junit4]   2> 2526 T24 oasc.SolrCore.initIndex WARNING [core0] Solr index directory '/mnt/ssd/jenkins/workspace/Lucene-Solr-trunk-Linux/solr/build/solr-solrj/test/J0/./solrtest-TestEmbeddedSolrServer-1351558784327/data/EN-3.5/index' doesn't exist. Creating new index...
[junit4:junit4]   2> 2527 T24 oasc.CachingDirectoryFactory.get return new directory for /mnt/ssd/jenkins/workspace/Lucene-Solr-trunk-Linux/solr/build/solr-solrj/test/J0/./solrtest-TestEmbeddedSolrServer-1351558784327/data/EN-3.5/index forceNew:false
[junit4:junit4]   2> 2531 T24 oasc.SolrDeletionPolicy.onCommit SolrDeletionPolicy.onCommit: commits:num=1
[junit4:junit4]   2> 		commit{dir=MockDirWrapper(org.apache.lucene.store.RAMDirectory@1099b04f lockFactory=org.apache.lucene.store.NativeFSLockFactory@421708f2),segFN=segments_1,generation=1,filenames=[segments_1]
[junit4:junit4]   2> 2532 T24 oasc.SolrDeletionPolicy.updateCommits newest commit = 1[segments_1]
[junit4:junit4]   2> 2534 T24 oasc.CachingDirectoryFactory.close Releasing directory:/mnt/ssd/jenkins/workspace/Lucene-Solr-trunk-Linux/solr/build/solr-solrj/test/J0/./solrtest-TestEmbeddedSolrServer-1351558784327/data/EN-3.5/index
[junit4:junit4]   2> 2537 T24 oasc.RequestHandlers.initHandlersFromConfig created standard: solr.StandardRequestHandler
[junit4:junit4]   2> 2540 T24 oasc.RequestHandlers.initHandlersFromConfig created /update: solr.UpdateRequestHandler
[junit4:junit4]   2> 2541 T24 oasc.RequestHandlers.initHandlersFromConfig created /admin/: org.apache.solr.handler.admin.AdminHandlers
[junit4:junit4]   2> 2544 T24 oashl.XMLLoader.init xsltCacheLifetimeSeconds=60
[junit4:junit4]   2> 2547 T24 oasc.CachingDirectoryFactory.close Releasing directory:/mnt/ssd/jenkins/workspace/Lucene-Solr-trunk-Linux/solr/build/solr-solrj/test/J0/./solrtest-TestEmbeddedSolrServer-1351558784327/data/EN-3.5
[junit4:junit4]   2> 2547 T24 oass.SolrIndexSearcher.<init> Opening Searcher@806591e1 main
[junit4:junit4]   2> 2548 T24 oasu.CommitTracker.<init> Hard AutoCommit: disabled
[junit4:junit4]   2> 2549 T24 oasu.CommitTracker.<init> Soft AutoCommit: disabled
[junit4:junit4]   2> 2562 T34 oasc.SolrCore.registerSearcher [core0] Registered new searcher Searcher@806591e1 main{StandardDirectoryReader(segments_1:1)}
[junit4:junit4]   2> 2562 T24 oasc.CoreContainer.register registering core: core0
[junit4:junit4]   2> 2564 T24 oasc.CoreContainer.create Creating SolrCore 'core1' using instanceDir: /mnt/ssd/jenkins/workspace/Lucene-Solr-trunk-Linux/solr/solrj/src/test-files/solrj/solr/shared/.
[junit4:junit4]   2> 2565 T24 oasc.SolrResourceLoader.<init> new SolrResourceLoader for directory: '/mnt/ssd/jenkins/workspace/Lucene-Solr-trunk-Linux/solr/solrj/src/test-files/solrj/solr/shared/./'
[junit4:junit4]   2> 2632 T24 oasc.SolrConfig.<init> Using Lucene MatchVersion: LUCENE_50
[junit4:junit4]   2> 2692 T24 oasc.SolrConfig.<init> Loaded SolrConfig: solrconfig.xml
[junit4:junit4]   2> 2693 T24 oass.IndexSchema.readSchema Reading Solr Schema
[junit4:junit4]   2> 2706 T24 oass.IndexSchema.readSchema Schema name=example core FR
[junit4:junit4]   2> 2750 T24 oass.IndexSchema.readSchema default search field in schema is name
[junit4:junit4]   2> 2752 T24 oass.IndexSchema.readSchema query parser default operator is OR
[junit4:junit4]   2> 2754 T24 oass.IndexSchema.readSchema unique key field: id
[junit4:junit4]   2> 2759 T24 oasc.SolrCore.<init> [core1] Opening new SolrCore at /mnt/ssd/jenkins/workspace/Lucene-Solr-trunk-Linux/solr/solrj/src/test-files/solrj/solr/shared/./, dataDir=/mnt/ssd/jenkins/workspace/Lucene-Solr-trunk-Linux/solr/build/solr-solrj/test/J0/./solrtest-TestEmbeddedSolrServer-1351558784327/data/FR-2.4/
[junit4:junit4]   2> 2760 T24 oasc.SolrCore.<init> JMX monitoring not detected for core: core1
[junit4:junit4]   2> 2761 T24 oasc.SolrCore.initDirectoryFactory org.apache.solr.core.MockDirectoryFactory
[junit4:junit4]   2> 2763 T24 oasc.CachingDirectoryFactory.injectLockFactory WARNING No lockType configured for MockDirWrapper(org.apache.lucene.store.RAMDirectory@758b7224 lockFactory=org.apache.lucene.store.SingleInstanceLockFactory@f0f3f4aa) assuming 'simple'
[junit4:junit4]   2> 2764 T24 oasc.CachingDirectoryFactory.get return new directory for /mnt/ssd/jenkins/workspace/Lucene-Solr-trunk-Linux/solr/build/solr-solrj/test/J0/./solrtest-TestEmbeddedSolrServer-1351558784327/data/FR-2.4 forceNew:false
[junit4:junit4]   2> 2764 T24 oasc.CachingDirectoryFactory.close Releasing directory:/mnt/ssd/jenkins/workspace/Lucene-Solr-trunk-Linux/solr/build/solr-solrj/test/J0/./solrtest-TestEmbeddedSolrServer-1351558784327/data/FR-2.4
[junit4:junit4]   2> 2765 T24 oasc.SolrCore.getNewIndexDir New index directory detected: old=null new=/mnt/ssd/jenkins/workspace/Lucene-Solr-trunk-Linux/solr/build/solr-solrj/test/J0/./solrtest-TestEmbeddedSolrServer-1351558784327/data/FR-2.4/index/
[junit4:junit4]   2> 2766 T24 oasc.SolrCore.initIndex WARNING [core1] Solr index directory '/mnt/ssd/jenkins/workspace/Lucene-Solr-trunk-Linux/solr/build/solr-solrj/test/J0/./solrtest-TestEmbeddedSolrServer-1351558784327/data/FR-2.4/index' doesn't exist. Creating new index...
[junit4:junit4]   2> 2767 T24 oasc.CachingDirectoryFactory.get return new directory for /mnt/ssd/jenkins/workspace/Lucene-Solr-trunk-Linux/solr/build/solr-solrj/test/J0/./solrtest-TestEmbeddedSolrServer-1351558784327/data/FR-2.4/index forceNew:false
[junit4:junit4]   2> 2770 T24 oasc.SolrDeletionPolicy.onCommit SolrDeletionPolicy.onCommit: commits:num=1
[junit4:junit4]   2> 		commit{dir=MockDirWrapper(NRTCachingDirectory(org.apache.lucene.store.RAMDirectory@6eb0c4e0 lockFactory=org.apache.lucene.store.NativeFSLockFactory@33a5ed79; maxCacheMB=0.6748046875 maxMergeSizeMB=0.083984375)),segFN=segments_1,generation=1,filenames=[segments_1]
[junit4:junit4]   2> 2771 T24 oasc.SolrDeletionPolicy.updateCommits newest commit = 1[segments_1]
[junit4:junit4]   2> 2772 T24 oasc.CachingDirectoryFactory.close Releasing directory:/mnt/ssd/jenkins/workspace/Lucene-Solr-trunk-Linux/solr/build/solr-solrj/test/J0/./solrtest-TestEmbeddedSolrServer-1351558784327/data/FR-2.4/index
[junit4:junit4]   2> 2774 T24 oasc.RequestHandlers.initHandlersFromConfig created standard: solr.StandardRequestHandler
[junit4:junit4]   2> 2775 T24 oasc.RequestHandlers.initHandlersFromConfig created /update: solr.UpdateRequestHandler
[junit4:junit4]   2> 2776 T24 oasc.RequestHandlers.initHandlersFromConfig created /admin/: org.apache.solr.handler.admin.AdminHandlers
[junit4:junit4]   2> 2777 T24 oashl.XMLLoader.init xsltCacheLifetimeSeconds=60
[junit4:junit4]   2> 2780 T24 oasc.CachingDirectoryFactory.close Releasing directory:/mnt/ssd/jenkins/workspace/Lucene-Solr-trunk-Linux/solr/build/solr-solrj/test/J0/./solrtest-TestEmbeddedSolrServer-1351558784327/data/FR-2.4
[junit4:junit4]   2> 2781 T24 oass.SolrIndexSearcher.<init> Opening Searcher@61163c96 main
[junit4:junit4]   2> 2781 T24 oasu.CommitTracker.<init> Hard AutoCommit: disabled
[junit4:junit4]   2> 2782 T24 oasu.CommitTracker.<init> Soft AutoCommit: disabled
[junit4:junit4]   2> 2797 T35 oasc.SolrCore.registerSearcher [core1] Registered new searcher Searcher@61163c96 main{StandardDirectoryReader(segments_1:1)}
[junit4:junit4]   2> 2797 T24 oasc.CoreContainer.register registering core: core1
[junit4:junit4]   2> 2798 T24 oasc.CoreContainer.shutdown Shutting down CoreContainer instance=-1239082407
[junit4:junit4]   2> 2799 T24 oasc.SolrCore.close [collection1]  CLOSING SolrCore org.apache.solr.core.SolrCore@aadc83f1
[junit4:junit4]   2> 2799 T24 oasu.DirectUpdateHandler2.close closing DirectUpdateHandler2{commits=0,autocommits=0,soft autocommits=0,optimizes=0,rollbacks=0,expungeDeletes=0,docsPending=0,adds=0,deletesById=0,deletesByQuery=0,errors=0,cumulative_adds=0,cumulative_deletesById=0,cumulative_deletesByQuery=0,cumulative_errors=0}
[junit4:junit4]   2> 2800 T24 oasc.SolrCore.decrefSolrCoreState Closing SolrCoreState
[junit4:junit4]   2> 2801 T24 oasu.DefaultSolrCoreState.closeIndexWriter SolrCoreState ref count has reached 0 - closing IndexWriter
[junit4:junit4]   2> 2802 T24 oasu.DefaultSolrCoreState.closeIndexWriter closing IndexWriter with IndexWriterCloser
[junit4:junit4]   2> 2805 T24 oasc.SolrCore.closeSearcher [collection1] Closing main searcher on request.
[junit4:junit4]   2> 2806 T24 oasc.CachingDirectoryFactory.close Releasing directory:/mnt/ssd/jenkins/workspace/Lucene-Solr-trunk-Linux/solr/build/solr-solrj/test/J0/./solrtest-TestEmbeddedSolrServer-1351558784327/data/-1.3/index
[junit4:junit4]   2> 2810 T24 oasc.SolrCore.close [core0]  CLOSING SolrCore org.apache.solr.core.SolrCore@83b3df9e
[junit4:junit4]   2> 2811 T24 oasu.DirectUpdateHandler2.close closing DirectUpdateHandler2{commits=0,autocommits=0,soft autocommits=0,optimizes=0,rollbacks=0,expungeDeletes=0,docsPending=0,adds=0,deletesById=0,deletesByQuery=0,errors=0,cumulative_adds=0,cumulative_deletesById=0,cumulative_deletesByQuery=0,cumulative_errors=0}
[junit4:junit4]   2> 2812 T24 oasc.SolrCore.decrefSolrCoreState Closing SolrCoreState
[junit4:junit4]   2> 2813 T24 oasu.DefaultSolrCoreState.closeIndexWriter SolrCoreState ref count has reached 0 - closing IndexWriter
[junit4:junit4]   2> 2814 T24 oasu.DefaultSolrCoreState.closeIndexWriter closing IndexWriter with IndexWriterCloser
[junit4:junit4]   2> 2817 T24 oasc.SolrCore.closeSearcher [core0] Closing main searcher on request.
[junit4:junit4]   2> 2824 T24 oasc.CachingDirectoryFactory.close Releasing directory:/mnt/ssd/jenkins/workspace/Lucene-Solr-trunk-Linux/solr/build/solr-solrj/test/J0/./solrtest-TestEmbeddedSolrServer-1351558784327/data/EN-3.5/index
[junit4:junit4]   2> 2826 T24 oasc.SolrCore.close [core1]  CLOSING SolrCore org.apache.solr.core.SolrCore@b0a18b8c
[junit4:junit4]   2> 2828 T24 oasu.DirectUpdateHandler2.close closing DirectUpdateHandler2{commits=0,autocommits=0,soft autocommits=0,optimizes=0,rollbacks=0,expungeDeletes=0,docsPending=0,adds=0,deletesById=0,deletesByQuery=0,errors=0,cumulative_adds=0,cumulative_deletesById=0,cumulative_deletesByQuery=0,cumulative_errors=0}
[junit4:junit4]   2> 2829 T24 oasc.SolrCore.decrefSolrCoreState Closing SolrCoreState
[junit4:junit4]   2> 2830 T24 oasu.DefaultSolrCoreState.closeIndexWriter SolrCoreState ref count has reached 0 - closing IndexWriter
[junit4:junit4]   2> 2831 T24 oasu.DefaultSolrCoreState.closeIndexWriter closing IndexWriter with IndexWriterCloser
[junit4:junit4]   2> 2832 T24 oasc.SolrCore.closeSearcher [core1] Closing main searcher on request.
[junit4:junit4]   2> 2833 T24 oasc.CachingDirectoryFactory.close Releasing directory:/mnt/ssd/jenkins/workspace/Lucene-Solr-trunk-Linux/solr/build/solr-solrj/test/J0/./solrtest-TestEmbeddedSolrServer-1351558784327/data/FR-2.4/index
[junit4:junit4]   2> 2860 T23 ccr.ThreadLeakControl.checkThreadLeaks WARNING Will linger awaiting termination of 2 leaked thread(s).
[junit4:junit4]   2> 22925 T23 ccr.ThreadLeakControl.checkThreadLeaks SEVERE 2 threads leaked from SUITE scope at org.apache.solr.client.solrj.embedded.TestEmbeddedSolrServer: 
[junit4:junit4]   2> 	   1) Thread[id=29, name=metrics-meter-tick-thread-2, state=TIMED_WAITING, group=TGRP-TestEmbeddedSolrServer]
[junit4:junit4]   2> 	        at sun.misc.Unsafe.park(Native Method)
[junit4:junit4]   2> 	        at java.util.concurrent.locks.LockSupport.parkNanos(LockSupport.java:237)
[junit4:junit4]   2> 	        at java.util.concurrent.locks.AbstractQueuedSynchronizer$ConditionObject.awaitNanos(AbstractQueuedSynchronizer.java:2093)
[junit4:junit4]   2> 	        at java.util.concurrent.ScheduledThreadPoolExecutor$DelayedWorkQueue.take(ScheduledThreadPoolExecutor.java:1101)
[junit4:junit4]   2> 	        at java.util.concurrent.ScheduledThreadPoolExecutor$DelayedWorkQueue.take(ScheduledThreadPoolExecutor.java:818)
[junit4:junit4]   2> 	        at java.util.concurrent.ThreadPoolExecutor.getTask(ThreadPoolExecutor.java:1054)
[junit4:junit4]   2> 	        at java.util.concurrent.ThreadPoolExecutor.runWorker(ThreadPoolExecutor.java:1114)
[junit4:junit4]   2> 	        at java.util.concurrent.ThreadPoolExecutor$Worker.run(ThreadPoolExecutor.java:614)
[junit4:junit4]   2> 	        at java.lang.Thread.run(Thread.java:779)
[junit4:junit4]   2> 	   2) Thread[id=28, name=metrics-meter-tick-thread-1, state=WAITING, group=TGRP-TestEmbeddedSolrServer]
[junit4:junit4]   2> 	        at sun.misc.Unsafe.park(Native Method)
[junit4:junit4]   2> 	        at java.util.concurrent.locks.LockSupport.park(LockSupport.java:197)
[junit4:junit4]   2> 	        at java.util.concurrent.locks.AbstractQueuedSynchronizer$ConditionObject.await(AbstractQueuedSynchronizer.java:2054)
[junit4:junit4]   2> 	        at java.util.concurrent.ScheduledThreadPoolExecutor$DelayedWorkQueue.take(ScheduledThreadPoolExecutor.java:1096)
[junit4:junit4]   2> 	        at java.util.concurrent.ScheduledThreadPoolExecutor$DelayedWorkQueue.take(ScheduledThreadPoolExecutor.java:818)
[junit4:junit4]   2> 	        at java.util.concurrent.ThreadPoolExecutor.getTask(ThreadPoolExecutor.java:1054)
[junit4:junit4]   2> 	        at java.util.concurrent.ThreadPoolExecutor.runWorker(ThreadPoolExecutor.java:1114)
[junit4:junit4]   2> 	        at java.util.concurrent.ThreadPoolExecutor$Worker.run(ThreadPoolExecutor.java:614)
[junit4:junit4]   2> 	        at java.lang.Thread.run(Thread.java:779)
[junit4:junit4]   2> 22927 T23 ccr.ThreadLeakControl.tryToInterruptAll Starting to interrupt leaked threads:
[junit4:junit4]   2> 	   1) Thread[id=29, name=metrics-meter-tick-thread-2, state=TIMED_WAITING, group=TGRP-TestEmbeddedSolrServer]
[junit4:junit4]   2> 	   2) Thread[id=28, name=metrics-meter-tick-thread-1, state=WAITING, group=TGRP-TestEmbeddedSolrServer]
[junit4:junit4]   2> 25936 T23 ccr.ThreadLeakControl.tryToInterruptAll SEVERE There are still zombie threads that couldn't be terminated:
[junit4:junit4]   2> 	   1) Thread[id=29, name=metrics-meter-tick-thread-2, state=TIMED_WAITING, group=TGRP-TestEmbeddedSolrServer]
[junit4:junit4]   2> 	        at sun.misc.Unsafe.park(Native Method)
[junit4:junit4]   2> 	        at java.util.concurrent.locks.LockSupport.parkNanos(LockSupport.java:237)
[junit4:junit4]   2> 	        at java.util.concurrent.locks.AbstractQueuedSynchronizer$ConditionObject.awaitNanos(AbstractQueuedSynchronizer.java:2093)
[junit4:junit4]   2> 	        at java.util.concurrent.ScheduledThreadPoolExecutor$DelayedWorkQueue.take(ScheduledThreadPoolExecutor.java:1101)
[junit4:junit4]   2> 	        at java.util.concurrent.ScheduledThreadPoolExecutor$DelayedWorkQueue.take(ScheduledThreadPoolExecutor.java:818)
[junit4:junit4]   2> 	        at java.util.concurrent.ThreadPoolExecutor.getTask(ThreadPoolExecutor.java:1054)
[junit4:junit4]   2> 	        at java.util.concurrent.ThreadPoolExecutor.runWorker(ThreadPoolExecutor.java:1114)
[junit4:junit4]   2> 	        at java.util.concurrent.ThreadPoolExecutor$Worker.run(ThreadPoolExecutor.java:614)
[junit4:junit4]   2> 	        at java.lang.Thread.run(Thread.java:779)
[junit4:junit4]   2> 	   2) Thread[id=28, name=metrics-meter-tick-thread-1, state=WAITING, group=TGRP-TestEmbeddedSolrServer]
[junit4:junit4]   2> 	        at sun.misc.Unsafe.park(Native Method)
[junit4:junit4]   2> 	        at java.util.concurrent.locks.LockSupport.park(LockSupport.java:197)
[junit4:junit4]   2> 	        at java.util.concurrent.locks.AbstractQueuedSynchronizer$ConditionObject.await(AbstractQueuedSynchronizer.java:2054)
[junit4:junit4]   2> 	        at java.util.concurrent.ScheduledThreadPoolExecutor$DelayedWorkQueue.take(ScheduledThreadPoolExecutor.java:1096)
[junit4:junit4]   2> 	        at java.util.concurrent.ScheduledThreadPoolExecutor$DelayedWorkQueue.take(ScheduledThreadPoolExecutor.java:818)
[junit4:junit4]   2> 	        at java.util.concurrent.ThreadPoolExecutor.getTask(ThreadPoolExecutor.java:1054)
[junit4:junit4]   2> 	        at java.util.concurrent.ThreadPoolExecutor.runWorker(ThreadPoolExecutor.java:1114)
[junit4:junit4]   2> 	        at java.util.concurrent.ThreadPoolExecutor$Worker.run(ThreadPoolExecutor.java:614)
[junit4:junit4]   2> 	        at java.lang.Thread.run(Thread.java:779)
[junit4:junit4]   2> NOTE: test params are: codec=Lucene41: {}, sim=DefaultSimilarity, locale=ar_IQ, timezone=Brazil/Acre
[junit4:junit4]   2> NOTE: Linux 3.2.0-32-generic x86/IBM Corporation 1.7.0 (32-bit)/cpus=8,threads=4,free=1414912,total=9240576
[junit4:junit4]   2> NOTE: All tests run in this JVM: [TestEmbeddedSolrServer]
[junit4:junit4]   2> NOTE: reproduce with: ant test  -Dtestcase=TestEmbeddedSolrServer -Dtests.seed=8B1D2CB11C872124 -Dtests.multiplier=3 -Dtests.slow=true -Dtests.locale=ar_IQ -Dtests.timezone=Brazil/Acre -Dtests.file.encoding=UTF-8
[junit4:junit4] ERROR   0.00s J0 | TestEmbeddedSolrServer (suite) <<<
[junit4:junit4]    > Throwable #1: com.carrotsearch.randomizedtesting.ThreadLeakError: 2 threads leaked from SUITE scope at org.apache.solr.client.solrj.embedded.TestEmbeddedSolrServer: 
[junit4:junit4]    >    1) Thread[id=29, name=metrics-meter-tick-thread-2, state=TIMED_WAITING, group=TGRP-TestEmbeddedSolrServer]
[junit4:junit4]    >         at sun.misc.Unsafe.park(Native Method)
[junit4:junit4]    >         at java.util.concurrent.locks.LockSupport.parkNanos(LockSupport.java:237)
[junit4:junit4]    >         at java.util.concurrent.locks.AbstractQueuedSynchronizer$ConditionObject.awaitNanos(AbstractQueuedSynchronizer.java:2093)
[junit4:junit4]    >         at java.util.concurrent.ScheduledThreadPoolExecutor$DelayedWorkQueue.take(ScheduledThreadPoolExecutor.java:1101)
[junit4:junit4]    >         at java.util.concurrent.ScheduledThreadPoolExecutor$DelayedWorkQueue.take(ScheduledThreadPoolExecutor.java:818)
[junit4:junit4]    >         at java.util.concurrent.ThreadPoolExecutor.getTask(ThreadPoolExecutor.java:1054)
[junit4:junit4]    >         at java.util.concurrent.ThreadPoolExecutor.runWorker(ThreadPoolExecutor.java:1114)
[junit4:junit4]    >         at java.util.concurrent.ThreadPoolExecutor$Worker.run(ThreadPoolExecutor.java:614)
[junit4:junit4]    >         at java.lang.Thread.run(Thread.java:779)
[junit4:junit4]    >    2) Thread[id=28, name=metrics-meter-tick-thread-1, state=WAITING, group=TGRP-TestEmbeddedSolrServer]
[junit4:junit4]    >         at sun.misc.Unsafe.park(Native Method)
[junit4:junit4]    >         at java.util.concurrent.locks.LockSupport.park(LockSupport.java:197)
[junit4:junit4]    >         at java.util.concurrent.locks.AbstractQueuedSynchronizer$ConditionObject.await(AbstractQueuedSynchronizer.java:2054)
[junit4:junit4]    >         at java.util.concurrent.ScheduledThreadPoolExecutor$DelayedWorkQueue.take(ScheduledThreadPoolExecutor.java:1096)
[junit4:junit4]    >         at java.util.concurrent.ScheduledThreadPoolExecutor$DelayedWorkQueue.take(ScheduledThreadPoolExecutor.java:818)
[junit4:junit4]    >         at java.util.concurrent.ThreadPoolExecutor.getTask(ThreadPoolExecutor.java:1054)
[junit4:junit4]    >         at java.util.concurrent.ThreadPoolExecutor.runWorker(ThreadPoolExecutor.java:1114)
[junit4:junit4]    >         at java.util.concurrent.ThreadPoolExecutor$Worker.run(ThreadPoolExecutor.java:614)
[junit4:junit4]    >         at java.lang.Thread.run(Thread.java:779)
[junit4:junit4]    > 	at __randomizedtesting.SeedInfo.seed([8B1D2CB11C872124]:0)
[junit4:junit4]    > Throwable #2: com.carrotsearch.randomizedtesting.ThreadLeakError: There are still zombie threads that couldn't be terminated:
[junit4:junit4]    >    1) Thread[id=29, name=metrics-meter-tick-thread-2, state=TIMED_WAITING, group=TGRP-TestEmbeddedSolrServer]
[junit4:junit4]    >         at sun.misc.Unsafe.park(Native Method)
[junit4:junit4]    >         at java.util.concurrent.locks.LockSupport.parkNanos(LockSupport.java:237)
[junit4:junit4]    >         at java.util.concurrent.locks.AbstractQueuedSynchronizer$ConditionObject.awaitNanos(AbstractQueuedSynchronizer.java:2093)
[junit4:junit4]    >         at java.util.concurrent.ScheduledThreadPoolExecutor$DelayedWorkQueue.take(ScheduledThreadPoolExecutor.java:1101)
[junit4:junit4]    >         at java.util.concurrent.ScheduledThreadPoolExecutor$DelayedWorkQueue.take(ScheduledThreadPoolExecutor.java:818)
[junit4:junit4]    >         at java.util.concurrent.ThreadPoolExecutor.getTask(ThreadPoolExecutor.java:1054)
[junit4:junit4]    >         at java.util.concurrent.ThreadPoolExecutor.runWorker(ThreadPoolExecutor.java:1114)
[junit4:junit4]    >         at java.util.concurrent.ThreadPoolExecutor$Worker.run(ThreadPoolExecutor.java:614)
[junit4:junit4]    >         at java.lang.Thread.run(Thread.java:779)
[junit4:junit4]    >    2) Thread[id=28, name=metrics-meter-tick-thread-1, state=WAITING, group=TGRP-TestEmbeddedSolrServer]
[junit4:junit4]    >         at sun.misc.Unsafe.park(Native Method)
[junit4:junit4]    >         at java.util.concurrent.locks.LockSupport.park(LockSupport.java:197)
[junit4:junit4]    >         at java.util.concurrent.locks.AbstractQueuedSynchronizer$ConditionObject.await(AbstractQueuedSynchronizer.java:2054)
[junit4:junit4]    >         at java.util.concurrent.ScheduledThreadPoolExecutor$DelayedWorkQueue.take(ScheduledThreadPoolExecutor.java:1096)
[junit4:junit4]    >         at java.util.concurrent.ScheduledThreadPoolExecutor$DelayedWorkQueue.take(ScheduledThreadPoolExecutor.java:818)
[junit4:junit4]    >         at java.util.concurrent.ThreadPoolExecutor.getTask(ThreadPoolExecutor.java:1054)
[junit4:junit4]    >         at java.util.concurrent.ThreadPoolExecutor.runWorker(ThreadPoolExecutor.java:1114)
[junit4:junit4]    >         at java.util.concurrent.ThreadPoolExecutor$Worker.run(ThreadPoolExecutor.java:614)
[junit4:junit4]    >         at java.lang.Thread.run(Thread.java:779)
[junit4:junit4]    > 	at __randomizedtesting.SeedInfo.seed([8B1D2CB11C872124]:0)
[junit4:junit4] Completed on J0 in 26.30s, 2 tests, 2 errors <<< FAILURES!

[...truncated 115 lines...]
BUILD FAILED
/mnt/ssd/jenkins/workspace/Lucene-Solr-trunk-Linux/build.xml:348: The following error occurred while executing this line:
/mnt/ssd/jenkins/workspace/Lucene-Solr-trunk-Linux/build.xml:39: The following error occurred while executing this line:
/mnt/ssd/jenkins/workspace/Lucene-Solr-trunk-Linux/solr/build.xml:185: The following error occurred while executing this line:
/mnt/ssd/jenkins/workspace/Lucene-Solr-trunk-Linux/lucene/module-build.xml:61: The following error occurred while executing this line:
/mnt/ssd/jenkins/workspace/Lucene-Solr-trunk-Linux/lucene/common-build.xml:1159: The following error occurred while executing this line:
/mnt/ssd/jenkins/workspace/Lucene-Solr-trunk-Linux/lucene/common-build.xml:827: There were test failures: 43 suites, 239 tests, 2 suite-level errors, 136 ignored

Total time: 26 minutes 51 seconds
Build step 'Invoke Ant' marked build as failure
Archiving artifacts
Recording test results
Description set: Java: 32bit/ibm-j9-jdk7 -Xjit:exclude={org/apache/lucene/util/fst/FST.pack(IIF)Lorg/apache/lucene/util/fst/FST;}
Email was triggered for: Failure
Sending email for trigger: Failure



Mime
View raw message