lucene-dev mailing list archives

Site index · List index
Message view « Date » · « Thread »
Top « Date » · « Thread »
From Charlie Cron <hudsonsevilt...@gmail.com>
Subject Build failed in Jenkins: fast-io-beasting #6244
Date Mon, 29 Oct 2012 15:38:20 GMT
See <http://sierranevada.servebeer.com/job/fast-io-beasting/6244/>

------------------------------------------
[...truncated 24285 lines...]
[junit4:junit4]   2> 117316 T12 oasu.DefaultSolrCoreState.closeIndexWriter SolrCoreState
ref count has reached 0 - closing IndexWriter
[junit4:junit4]   2> 117316 T12 oasu.DefaultSolrCoreState.closeIndexWriter closing IndexWriter
with IndexWriterCloser
[junit4:junit4]   2> 117321 T12 oasc.SolrCore.closeSearcher [awholynewcollection_0] Closing
main searcher on request.
[junit4:junit4]   2> 117321 T12 oasc.SolrCore.close [awholynewcollection_2]  CLOSING SolrCore
org.apache.solr.core.SolrCore@8fe6a6a
[junit4:junit4]   2> 117328 T12 oasu.DirectUpdateHandler2.close closing DirectUpdateHandler2{commits=1,autocommits=0,soft
autocommits=0,optimizes=0,rollbacks=0,expungeDeletes=0,docsPending=0,adds=0,deletesById=0,deletesByQuery=0,errors=0,cumulative_adds=0,cumulative_deletesById=0,cumulative_deletesByQuery=0,cumulative_errors=0}
[junit4:junit4]   2> 117329 T12 oasc.SolrCore.decrefSolrCoreState Closing SolrCoreState
[junit4:junit4]   2> 117329 T12 oasu.DefaultSolrCoreState.closeIndexWriter SolrCoreState
ref count has reached 0 - closing IndexWriter
[junit4:junit4]   2> 117329 T12 oasu.DefaultSolrCoreState.closeIndexWriter closing IndexWriter
with IndexWriterCloser
[junit4:junit4]   2> 117331 T12 oasc.SolrCore.closeSearcher [awholynewcollection_2] Closing
main searcher on request.
[junit4:junit4]   2> 117331 T12 oasc.SolrCore.close [unloadcollection3]  CLOSING SolrCore
org.apache.solr.core.SolrCore@3137c799
[junit4:junit4]   2> 117353 T12 oasu.DirectUpdateHandler2.close closing DirectUpdateHandler2{commits=1,autocommits=0,soft
autocommits=0,optimizes=0,rollbacks=0,expungeDeletes=0,docsPending=80,adds=80,deletesById=0,deletesByQuery=0,errors=0,cumulative_adds=80,cumulative_deletesById=0,cumulative_deletesByQuery=0,cumulative_errors=0}
[junit4:junit4]   2> 117356 T12 oasc.SolrCore.decrefSolrCoreState Closing SolrCoreState
[junit4:junit4]   2> 117357 T12 oasu.DefaultSolrCoreState.closeIndexWriter SolrCoreState
ref count has reached 0 - closing IndexWriter
[junit4:junit4]   2> 117357 T12 oasu.DefaultSolrCoreState.closeIndexWriter closing IndexWriter
with IndexWriterCloser
[junit4:junit4]   2> 117368 T12 oasc.SolrCore.closeSearcher [unloadcollection3] Closing
main searcher on request.
[junit4:junit4]   2> 117603 T97 oaz.ClientCnxn$SendThread.startConnect Opening socket connection
to server localhost.localdomain/127.0.0.1:50196
[junit4:junit4]   2> 117604 T97 oaz.ClientCnxn$SendThread.run WARNING Session 0x13aad2a33640009
for server null, unexpected error, closing socket connection and attempting reconnect java.net.ConnectException:
Connection refused
[junit4:junit4]   2> 	at sun.nio.ch.SocketChannelImpl.checkConnect(Native Method)
[junit4:junit4]   2> 	at sun.nio.ch.SocketChannelImpl.finishConnect(SocketChannelImpl.java:567)
[junit4:junit4]   2> 	at org.apache.zookeeper.ClientCnxn$SendThread.run(ClientCnxn.java:1143)
[junit4:junit4]   2> 
[junit4:junit4]   2> 118797 T70 oaz.ClientCnxn$SendThread.startConnect Opening socket connection
to server localhost.localdomain/127.0.0.1:50196
[junit4:junit4]   2> 118898 T71 oaz.ClientCnxn$EventThread.run EventThread shut down
[junit4:junit4]   2> 118898 T12 oaz.ZooKeeper.close Session: 0x13aad2a33640005 closed
[junit4:junit4]   2> 118921 T12 oejsh.ContextHandler.doStop stopped o.e.j.s.ServletContextHandler{/solr,null}
[junit4:junit4]   2> 118973 T12 oasc.ChaosMonkey.monkeyLog monkey: stop shard! 44820
[junit4:junit4]   2> 118974 T12 oasc.CoreContainer.shutdown Shutting down CoreContainer
instance=203141979
[junit4:junit4]   2> 118974 T12 oasc.SolrCore.close [collection1]  CLOSING SolrCore org.apache.solr.core.SolrCore@37d3ac6e
[junit4:junit4]   2> 118994 T12 oasu.DirectUpdateHandler2.close closing DirectUpdateHandler2{commits=118,autocommits=0,soft
autocommits=0,optimizes=0,rollbacks=0,expungeDeletes=0,docsPending=0,adds=0,deletesById=0,deletesByQuery=0,errors=0,cumulative_adds=86,cumulative_deletesById=0,cumulative_deletesByQuery=1,cumulative_errors=0}
[junit4:junit4]   2> 118994 T12 oasc.SolrCore.decrefSolrCoreState Closing SolrCoreState
[junit4:junit4]   2> 118995 T12 oasu.DefaultSolrCoreState.closeIndexWriter SolrCoreState
ref count has reached 0 - closing IndexWriter
[junit4:junit4]   2> 118995 T12 oasu.DefaultSolrCoreState.closeIndexWriter closing IndexWriter
with IndexWriterCloser
[junit4:junit4]   2> 119001 T12 oasc.SolrCore.closeSearcher [collection1] Closing main
searcher on request.
[junit4:junit4]   2> 119002 T12 oasc.SolrCore.close [collection2]  CLOSING SolrCore org.apache.solr.core.SolrCore@290e6c5e
[junit4:junit4]   2> 119013 T12 oasu.DirectUpdateHandler2.close closing DirectUpdateHandler2{commits=2,autocommits=0,soft
autocommits=0,optimizes=0,rollbacks=0,expungeDeletes=0,docsPending=0,adds=0,deletesById=0,deletesByQuery=0,errors=0,cumulative_adds=2,cumulative_deletesById=0,cumulative_deletesByQuery=0,cumulative_errors=0}
[junit4:junit4]   2> 119014 T12 oasc.SolrCore.decrefSolrCoreState Closing SolrCoreState
[junit4:junit4]   2> 119015 T12 oasu.DefaultSolrCoreState.closeIndexWriter SolrCoreState
ref count has reached 0 - closing IndexWriter
[junit4:junit4]   2> 119015 T12 oasu.DefaultSolrCoreState.closeIndexWriter closing IndexWriter
with IndexWriterCloser
[junit4:junit4]   2> 119016 T12 oasc.SolrCore.closeSearcher [collection2] Closing main
searcher on request.
[junit4:junit4]   2> 119017 T12 oasc.SolrCore.close [collection3]  CLOSING SolrCore org.apache.solr.core.SolrCore@885acc2
[junit4:junit4]   2> 119027 T12 oasu.DirectUpdateHandler2.close closing DirectUpdateHandler2{commits=2,autocommits=0,soft
autocommits=0,optimizes=0,rollbacks=0,expungeDeletes=0,docsPending=0,adds=0,deletesById=0,deletesByQuery=0,errors=0,cumulative_adds=0,cumulative_deletesById=0,cumulative_deletesByQuery=0,cumulative_errors=0}
[junit4:junit4]   2> 119027 T12 oasc.SolrCore.decrefSolrCoreState Closing SolrCoreState
[junit4:junit4]   2> 119027 T12 oasu.DefaultSolrCoreState.closeIndexWriter SolrCoreState
ref count has reached 0 - closing IndexWriter
[junit4:junit4]   2> 119028 T12 oasu.DefaultSolrCoreState.closeIndexWriter closing IndexWriter
with IndexWriterCloser
[junit4:junit4]   2> 119029 T12 oasc.SolrCore.closeSearcher [collection3] Closing main
searcher on request.
[junit4:junit4]   2> 119030 T12 oasc.SolrCore.close [awholynewcollection_0]  CLOSING SolrCore
org.apache.solr.core.SolrCore@4baf19d7
[junit4:junit4]   2> 119032 T12 oasu.DirectUpdateHandler2.close closing DirectUpdateHandler2{commits=1,autocommits=0,soft
autocommits=0,optimizes=0,rollbacks=0,expungeDeletes=0,docsPending=0,adds=0,deletesById=0,deletesByQuery=0,errors=0,cumulative_adds=0,cumulative_deletesById=0,cumulative_deletesByQuery=0,cumulative_errors=0}
[junit4:junit4]   2> 119039 T12 oasc.SolrCore.decrefSolrCoreState Closing SolrCoreState
[junit4:junit4]   2> 119040 T12 oasu.DefaultSolrCoreState.closeIndexWriter SolrCoreState
ref count has reached 0 - closing IndexWriter
[junit4:junit4]   2> 119044 T12 oasu.DefaultSolrCoreState.closeIndexWriter closing IndexWriter
with IndexWriterCloser
[junit4:junit4]   2> 119046 T12 oasc.SolrCore.closeSearcher [awholynewcollection_0] Closing
main searcher on request.
[junit4:junit4]   2> 119046 T12 oasc.SolrCore.close [awholynewcollection_2]  CLOSING SolrCore
org.apache.solr.core.SolrCore@5d79653
[junit4:junit4]   2> 119048 T12 oasu.DirectUpdateHandler2.close closing DirectUpdateHandler2{commits=1,autocommits=0,soft
autocommits=0,optimizes=0,rollbacks=0,expungeDeletes=0,docsPending=0,adds=0,deletesById=0,deletesByQuery=0,errors=0,cumulative_adds=0,cumulative_deletesById=0,cumulative_deletesByQuery=0,cumulative_errors=0}
[junit4:junit4]   2> 119049 T12 oasc.SolrCore.decrefSolrCoreState Closing SolrCoreState
[junit4:junit4]   2> 119049 T12 oasu.DefaultSolrCoreState.closeIndexWriter SolrCoreState
ref count has reached 0 - closing IndexWriter
[junit4:junit4]   2> 119049 T12 oasu.DefaultSolrCoreState.closeIndexWriter closing IndexWriter
with IndexWriterCloser
[junit4:junit4]   2> 119052 T12 oasc.SolrCore.closeSearcher [awholynewcollection_2] Closing
main searcher on request.
[junit4:junit4]   2> 119131 T84 oaz.ClientCnxn$SendThread.startConnect Opening socket connection
to server localhost.localdomain/127.0.0.1:50196
[junit4:junit4]   2> 119233 T85 oaz.ClientCnxn$EventThread.run EventThread shut down
[junit4:junit4]   2> 119233 T12 oaz.ZooKeeper.close Session: 0x13aad2a33640006 closed
[junit4:junit4]   2> 119255 T12 oejsh.ContextHandler.doStop stopped o.e.j.s.ServletContextHandler{/solr,null}
[junit4:junit4]   2> 119372 T97 oaz.ClientCnxn$SendThread.startConnect Opening socket connection
to server localhost.localdomain/127.0.0.1:50196
[junit4:junit4]   2> 119372 T97 oaz.ClientCnxn$SendThread.run WARNING Session 0x13aad2a33640009
for server null, unexpected error, closing socket connection and attempting reconnect java.net.ConnectException:
Connection refused
[junit4:junit4]   2> 	at sun.nio.ch.SocketChannelImpl.checkConnect(Native Method)
[junit4:junit4]   2> 	at sun.nio.ch.SocketChannelImpl.finishConnect(SocketChannelImpl.java:567)
[junit4:junit4]   2> 	at org.apache.zookeeper.ClientCnxn$SendThread.run(ClientCnxn.java:1143)
[junit4:junit4]   2> 
[junit4:junit4]   2> 119382 T12 oas.SolrTestCaseJ4.tearDown ###Ending testDistribSearch
[junit4:junit4]   2> 119473 T98 oaz.ClientCnxn$EventThread.run EventThread shut down
[junit4:junit4]   2> 119473 T12 oaz.ZooKeeper.close Session: 0x13aad2a33640009 closed
[junit4:junit4]   1>            "base_url":"http://127.0.0.1:40022/solr"}
[junit4:junit4]   1>    /solr/collections/control_collection (3)
[junit4:junit4]   1>    DATA:
[junit4:junit4]   1>        {"configName":"conf1"}
[junit4:junit4]   1>     /solr/collections/control_collection/shards (0)
[junit4:junit4]   1>     /solr/collections/control_collection/leader_elect (1)
[junit4:junit4]   1>      /solr/collections/control_collection/leader_elect/control_shard
(1)
[junit4:junit4]   1>       /solr/collections/control_collection/leader_elect/control_shard/election
(1)
[junit4:junit4]   1>        /solr/collections/control_collection/leader_elect/control_shard/election/88573539449569282-127.0.0.1:45763_solr_collection1-n_0000000000
(0)
[junit4:junit4]   1>     /solr/collections/control_collection/leaders (1)
[junit4:junit4]   1>      /solr/collections/control_collection/leaders/control_shard (0)
[junit4:junit4]   1>      DATA:
[junit4:junit4]   1>          {
[junit4:junit4]   1>            "core":"collection1",
[junit4:junit4]   1>            "node_name":"127.0.0.1:45763_solr",
[junit4:junit4]   1>            "base_url":"http://127.0.0.1:45763/solr"}
[junit4:junit4]   1>   /solr/clusterstate.json (0)
[junit4:junit4]   1>   DATA:
[junit4:junit4]   1>       {
[junit4:junit4]   1>         "collection1":{
[junit4:junit4]   1>           "shard1":{
[junit4:junit4]   1>             "range":"80000000-ffffffff",
[junit4:junit4]   1>             "replicas":{
[junit4:junit4]   1>               "127.0.0.1:53556_solr_collection1":{
[junit4:junit4]   1>                 "shard":"shard1",
[junit4:junit4]   1>                 "roles":null,
[junit4:junit4]   1>                 "state":"active",
[junit4:junit4]   1>                 "core":"collection1",
[junit4:junit4]   1>                 "collection":"collection1",
[junit4:junit4]   1>                 "node_name":"127.0.0.1:53556_solr",
[junit4:junit4]   1>                 "base_url":"http://127.0.0.1:53556/solr",
[junit4:junit4]   1>                 "leader":"true"},
[junit4:junit4]   1>               "127.0.0.1:33112_solr_collection1":{
[junit4:junit4]   1>                 "shard":"shard1",
[junit4:junit4]   1>                 "roles":null,
[junit4:junit4]   1>                 "state":"active",
[junit4:junit4]   1>                 "core":"collection1",
[junit4:junit4]   1>                 "collection":"collection1",
[junit4:junit4]   1>                 "node_name":"127.0.0.1:33112_solr",
[junit4:junit4]   1>                 "base_url":"http://127.0.0.1:33112/solr"}}},
[junit4:junit4]   1>           "shard2":{
[junit4:junit4]   1>             "range":"0-7fffffff",
[junit4:junit4]   1>             "replicas":{
[junit4:junit4]   1>               "127.0.0.1:40022_solr_collection1":{
[junit4:junit4]   1>                 "shard":"shard2",
[junit4:junit4]   1>                 "roles":null,
[junit4:junit4]   1>                 "state":"active",
[junit4:junit4]   1>                 "core":"collection1",
[junit4:junit4]   1>                 "collection":"collection1",
[junit4:junit4]   1>                 "node_name":"127.0.0.1:40022_solr",
[junit4:junit4]   1>                 "base_url":"http://127.0.0.1:40022/solr",
[junit4:junit4]   1>                 "leader":"true"},
[junit4:junit4]   1>               "127.0.0.1:44820_solr_collection1":{
[junit4:junit4]   1>                 "shard":"shard2",
[junit4:junit4]   1>                 "roles":null,
[junit4:junit4]   1>                 "state":"active",
[junit4:junit4]   1>                 "core":"collection1",
[junit4:junit4]   1>                 "collection":"collection1",
[junit4:junit4]   1>                 "node_name":"127.0.0.1:44820_solr",
[junit4:junit4]   1>                 "base_url":"http://127.0.0.1:44820/solr"}}}},
[junit4:junit4]   1>         "control_collection":{"control_shard":{"replicas":{"127.0.0.1:45763_solr_collection1":{
[junit4:junit4]   1>                 "shard":"control_shard",
[junit4:junit4]   1>                 "roles":null,
[junit4:junit4]   1>                 "state":"active",
[junit4:junit4]   1>                 "core":"collection1",
[junit4:junit4]   1>                 "collection":"control_collection",
[junit4:junit4]   1>                 "node_name":"127.0.0.1:45763_solr",
[junit4:junit4]   1>                 "base_url":"http://127.0.0.1:45763/solr",
[junit4:junit4]   1>                 "leader":"true"}}}}}
[junit4:junit4]   1>  /zookeeper (1)
[junit4:junit4]   1>  DATA:
[junit4:junit4]   1>      
[junit4:junit4]   1> 
[junit4:junit4]   2> NOTE: reproduce with: ant test  -Dtestcase=BasicDistributedZkTest
-Dtests.method=testDistribSearch -Dtests.seed=CC730D1F2E6D2A4E -Dtests.slow=true -Dtests.locale=es_PY
-Dtests.timezone=Asia/Vladivostok -Dtests.file.encoding=UTF-8
[junit4:junit4] FAILURE  119s J0 | BasicDistributedZkTest.testDistribSearch <<<
[junit4:junit4]    > Throwable #1: java.lang.AssertionError: Leader never changed
[junit4:junit4]    > 	at __randomizedtesting.SeedInfo.seed([CC730D1F2E6D2A4E:4D95830759324A72]:0)
[junit4:junit4]    > 	at org.junit.Assert.fail(Assert.java:93)
[junit4:junit4]    > 	at org.apache.solr.cloud.BasicDistributedZkTest.testCoreUnloadAndLeaders(BasicDistributedZkTest.java:446)
[junit4:junit4]    > 	at org.apache.solr.cloud.BasicDistributedZkTest.doTest(BasicDistributedZkTest.java:335)
[junit4:junit4]    > 	at org.apache.solr.BaseDistributedSearchTestCase.testDistribSearch(BaseDistributedSearchTestCase.java:695)
[junit4:junit4]    > 	at sun.reflect.NativeMethodAccessorImpl.invoke0(Native Method)
[junit4:junit4]    > 	at sun.reflect.NativeMethodAccessorImpl.invoke(NativeMethodAccessorImpl.java:39)
[junit4:junit4]    > 	at sun.reflect.DelegatingMethodAccessorImpl.invoke(DelegatingMethodAccessorImpl.java:25)
[junit4:junit4]    > 	at java.lang.reflect.Method.invoke(Method.java:597)
[junit4:junit4]    > 	at com.carrotsearch.randomizedtesting.RandomizedRunner.invoke(RandomizedRunner.java:1559)
[junit4:junit4]    > 	at com.carrotsearch.randomizedtesting.RandomizedRunner.access$600(RandomizedRunner.java:79)
[junit4:junit4]    > 	at com.carrotsearch.randomizedtesting.RandomizedRunner$6.evaluate(RandomizedRunner.java:737)
[junit4:junit4]    > 	at com.carrotsearch.randomizedtesting.RandomizedRunner$7.evaluate(RandomizedRunner.java:773)
[junit4:junit4]    > 	at com.carrotsearch.randomizedtesting.RandomizedRunner$8.evaluate(RandomizedRunner.java:787)
[junit4:junit4]    > 	at com.carrotsearch.randomizedtesting.rules.SystemPropertiesRestoreRule$1.evaluate(SystemPropertiesRestoreRule.java:53)
[junit4:junit4]    > 	at org.apache.lucene.util.TestRuleSetupTeardownChained$1.evaluate(TestRuleSetupTeardownChained.java:50)
[junit4:junit4]    > 	at org.apache.lucene.util.TestRuleFieldCacheSanity$1.evaluate(TestRuleFieldCacheSanity.java:51)
[junit4:junit4]    > 	at org.apache.lucene.util.AbstractBeforeAfterRule$1.evaluate(AbstractBeforeAfterRule.java:45)
[junit4:junit4]    > 	at com.carrotsearch.randomizedtesting.rules.SystemPropertiesInvariantRule$1.evaluate(SystemPropertiesInvariantRule.java:55)
[junit4:junit4]    > 	at org.apache.lucene.util.TestRuleThreadAndTestName$1.evaluate(TestRuleThreadAndTestName.java:48)
[junit4:junit4]    > 	at org.apache.lucene.util.TestRuleIgnoreAfterMaxFailures$1.evaluate(TestRuleIgnoreAfterMaxFailures.java:70)
[junit4:junit4]    > 	at org.apache.lucene.util.TestRuleMarkFailure$1.evaluate(TestRuleMarkFailure.java:48)
[junit4:junit4]    > 	at com.carrotsearch.randomizedtesting.rules.StatementAdapter.evaluate(StatementAdapter.java:36)
[junit4:junit4]    > 	at com.carrotsearch.randomizedtesting.ThreadLeakControl$StatementRunner.run(ThreadLeakControl.java:358)
[junit4:junit4]    > 	at com.carrotsearch.randomizedtesting.ThreadLeakControl.forkTimeoutingTask(ThreadLeakControl.java:782)
[junit4:junit4]    > 	at com.carrotsearch.randomizedtesting.ThreadLeakControl$3.evaluate(ThreadLeakControl.java:442)
[junit4:junit4]    > 	at com.carrotsearch.randomizedtesting.RandomizedRunner.runSingleTest(RandomizedRunner.java:746)
[junit4:junit4]    > 	at com.carrotsearch.randomizedtesting.RandomizedRunner$3.evaluate(RandomizedRunner.java:648)
[junit4:junit4]    > 	at com.carrotsearch.randomizedtesting.RandomizedRunner$4.evaluate(RandomizedRunner.java:682)
[junit4:junit4]    > 	at com.carrotsearch.randomizedtesting.RandomizedRunner$5.evaluate(RandomizedRunner.java:693)
[junit4:junit4]    > 	at com.carrotsearch.randomizedtesting.rules.StatementAdapter.evaluate(StatementAdapter.java:36)
[junit4:junit4]    > 	at com.carrotsearch.randomizedtesting.rules.SystemPropertiesRestoreRule$1.evaluate(SystemPropertiesRestoreRule.java:53)
[junit4:junit4]    > 	at org.apache.lucene.util.AbstractBeforeAfterRule$1.evaluate(AbstractBeforeAfterRule.java:45)
[junit4:junit4]    > 	at org.apache.lucene.util.TestRuleStoreClassName$1.evaluate(TestRuleStoreClassName.java:42)
[junit4:junit4]    > 	at com.carrotsearch.randomizedtesting.rules.SystemPropertiesInvariantRule$1.evaluate(SystemPropertiesInvariantRule.java:55)
[junit4:junit4]    > 	at com.carrotsearch.randomizedtesting.rules.NoShadowingOrOverridesOnMethodsRule$1.evaluate(NoShadowingOrOverridesOnMethodsRule.java:39)
[junit4:junit4]    > 	at com.carrotsearch.randomizedtesting.rules.NoShadowingOrOverridesOnMethodsRule$1.evaluate(NoShadowingOrOverridesOnMethodsRule.java:39)
[junit4:junit4]    > 	at com.carrotsearch.randomizedtesting.rules.StatementAdapter.evaluate(StatementAdapter.java:36)
[junit4:junit4]    > 	at org.apache.lucene.util.TestRuleAssertionsRequired$1.evaluate(TestRuleAssertionsRequired.java:43)
[junit4:junit4]    > 	at org.apache.lucene.util.TestRuleMarkFailure$1.evaluate(TestRuleMarkFailure.java:48)
[junit4:junit4]    > 	at org.apache.lucene.util.TestRuleIgnoreAfterMaxFailures$1.evaluate(TestRuleIgnoreAfterMaxFailures.java:70)
[junit4:junit4]    > 	at org.apache.lucene.util.TestRuleIgnoreTestSuites$1.evaluate(TestRuleIgnoreTestSuites.java:55)
[junit4:junit4]    > 	at com.carrotsearch.randomizedtesting.rules.StatementAdapter.evaluate(StatementAdapter.java:36)
[junit4:junit4]    > 	at com.carrotsearch.randomizedtesting.ThreadLeakControl$StatementRunner.run(ThreadLeakControl.java:358)
[junit4:junit4]    > 	at java.lang.Thread.run(Thread.java:662)
[junit4:junit4]   2> 119537 T12 oas.SolrTestCaseJ4.deleteCore ###deleteCore
[junit4:junit4]   2> NOTE: test params are: codec=Lucene41: {n_f1=PostingsFormat(name=Memory
doPackFST= true), foo_b=Lucene41(blocksize=128), cat=PostingsFormat(name=Memory doPackFST=
false), foo_d=Pulsing41(freqCutoff=3 minBlockSize=36 maxBlockSize=84), foo_f=Lucene41(blocksize=128),
n_tl1=PostingsFormat(name=Memory doPackFST= true), n_d1=PostingsFormat(name=Memory doPackFST=
false), rnd_b=Pulsing41(freqCutoff=3 minBlockSize=36 maxBlockSize=84), intDefault=PostingsFormat(name=Memory
doPackFST= true), n_td1=PostingsFormat(name=Memory doPackFST= true), id=Pulsing41(freqCutoff=3
minBlockSize=36 maxBlockSize=84), timestamp=PostingsFormat(name=Memory doPackFST= false),
range_facet_sl=Pulsing41(freqCutoff=3 minBlockSize=36 maxBlockSize=84), range_facet_si=PostingsFormat(name=Memory
doPackFST= false), oddField_s=Pulsing41(freqCutoff=3 minBlockSize=36 maxBlockSize=84), sequence_i=Pulsing41(freqCutoff=3
minBlockSize=36 maxBlockSize=84), name=Pulsing41(freqCutoff=3 minBlockSize=36 maxBlockSize=84),
foo_i=PostingsFormat(name=Memory doPackFST= true), regex_dup_B_s=PostingsFormat(name=Memory
doPackFST= false), multiDefault=PostingsFormat(name=Memory doPackFST= false), n_tf1=PostingsFormat(name=Memory
doPackFST= false), n_dt1=PostingsFormat(name=Memory doPackFST= true), genre_s=Pulsing41(freqCutoff=3
minBlockSize=36 maxBlockSize=84), author_t=PostingsFormat(name=Memory doPackFST= true), n_ti1=Pulsing41(freqCutoff=3
minBlockSize=36 maxBlockSize=84), range_facet_l=PostingsFormat(name=Memory doPackFST= false),
text=Lucene41(blocksize=128), _version_=PostingsFormat(name=Memory doPackFST= true), val_i=Pulsing41(freqCutoff=3
minBlockSize=36 maxBlockSize=84), SubjectTerms_mfacet=PostingsFormat(name=Memory doPackFST=
true), series_t=PostingsFormat(name=Memory doPackFST= true), a_t=PostingsFormat(name=Memory
doPackFST= false), n_tdt1=PostingsFormat(name=Memory doPackFST= true), regex_dup_A_s=Lucene41(blocksize=128),
price=Lucene41(blocksize=128), other_tl1=PostingsFormat(name=Memory doPackFST= true), n_l1=PostingsFormat(name=Memory
doPackFST= false), a_si=PostingsFormat(name=Memory doPackFST= true), inStock=Lucene41(blocksize=128)},
sim=RandomSimilarityProvider(queryNorm=false,coord=yes): {}, locale=es_PY, timezone=Asia/Vladivostok
[junit4:junit4]   2> NOTE: Linux 3.2.0-24-generic amd64/Sun Microsystems Inc. 1.6.0_27
(64-bit)/cpus=8,threads=1,free=209439000,total=348848128
[junit4:junit4]   2> NOTE: All tests run in this JVM: [TestFastWriter, BasicDistributedZkTest]
[junit4:junit4] Completed on J0 in 120.12s, 1 test, 1 failure <<< FAILURES!
[junit4:junit4] 
[junit4:junit4] Suite: org.apache.solr.cloud.ClusterStateUpdateTest
[junit4:junit4] Completed on J6 in 9.88s, 1 test
[junit4:junit4] 
[junit4:junit4] Suite: org.apache.solr.core.CoreContainerCoreInitFailuresTest
[junit4:junit4] Completed on J0 in 0.73s, 2 tests
[junit4:junit4] 
[junit4:junit4] Suite: org.apache.solr.request.TestBinaryResponseWriter
[junit4:junit4] Completed on J7 in 1.63s, 2 tests
[junit4:junit4] 
[junit4:junit4] Suite: org.apache.solr.search.TestStressReorder
[junit4:junit4] Completed on J4 in 10.66s, 1 test
[junit4:junit4] 
[junit4:junit4] Suite: org.apache.solr.core.TestBadConfig
[junit4:junit4] Completed on J7 in 1.66s, 6 tests
[junit4:junit4] 
[junit4:junit4] Suite: org.apache.solr.search.TestStressVersions
[junit4:junit4] Completed on J1 in 11.93s, 1 test
[junit4:junit4] 
[junit4:junit4] Suite: org.apache.solr.spelling.suggest.TestAnalyzedSuggestions
[junit4:junit4] Completed on J7 in 0.27s, 2 tests
[junit4:junit4] 
[junit4:junit4] Suite: org.apache.solr.servlet.CacheHeaderTest
[junit4:junit4] Completed on J7 in 0.61s, 5 tests
[junit4:junit4] 
[junit4:junit4] Suite: org.apache.solr.cloud.SyncSliceTest
[junit4:junit4] Completed on J3 in 35.29s, 1 test
[junit4:junit4] 
[junit4:junit4] 
[junit4:junit4] Tests with failures:
[junit4:junit4]   - org.apache.solr.cloud.BasicDistributedZkTest.testDistribSearch
[junit4:junit4] 
[junit4:junit4] 
[junit4:junit4] JVM J0:     1.12 ..   124.65 =   123.53s
[junit4:junit4] JVM J1:     1.12 ..   127.30 =   126.18s
[junit4:junit4] JVM J2:     1.12 ..   117.69 =   116.57s
[junit4:junit4] JVM J3:     0.90 ..   149.54 =   148.64s
[junit4:junit4] JVM J4:     0.91 ..   126.11 =   125.20s
[junit4:junit4] JVM J5:     1.12 ..   116.61 =   115.49s
[junit4:junit4] JVM J6:     0.90 ..   124.89 =   123.99s
[junit4:junit4] JVM J7:     0.90 ..   128.13 =   127.22s
[junit4:junit4] Execution time total: 2 minutes 29 seconds
[junit4:junit4] Tests summary: 233 suites, 965 tests, 1 failure, 8 ignored (3 assumptions)

BUILD FAILED
<http://sierranevada.servebeer.com/job/fast-io-beasting/ws/build.xml>:39: The following
error occurred while executing this line:
<http://sierranevada.servebeer.com/job/fast-io-beasting/ws/solr/build.xml>:178: The
following error occurred while executing this line:
<http://sierranevada.servebeer.com/job/fast-io-beasting/ws/lucene/module-build.xml>:61:
The following error occurred while executing this line:
<http://sierranevada.servebeer.com/job/fast-io-beasting/ws/lucene/common-build.xml>:1159:
The following error occurred while executing this line:
<http://sierranevada.servebeer.com/job/fast-io-beasting/ws/lucene/common-build.xml>:827:
There were test failures: 233 suites, 965 tests, 1 failure, 8 ignored (3 assumptions)

Total time: 7 minutes 41 seconds
Build step 'Invoke Ant' marked build as failure

---------------------------------------------------------------------
To unsubscribe, e-mail: dev-unsubscribe@lucene.apache.org
For additional commands, e-mail: dev-help@lucene.apache.org


Mime
View raw message