lucene-dev mailing list archives

Site index · List index
Message view « Date » · « Thread »
Top « Date » · « Thread »
From Policeman Jenkins Server <jenk...@sd-datasolutions.de>
Subject [JENKINS] Lucene-Solr-trunk-Linux (64bit/ibm-j9-jdk6) - Build # 2039 - Failure!
Date Sat, 27 Oct 2012 23:09:02 GMT
Build: http://jenkins.sd-datasolutions.de/job/Lucene-Solr-trunk-Linux/2039/
Java: 64bit/ibm-j9-jdk6 -Xjit:exclude={org/apache/lucene/util/fst/FST.pack(IIF)Lorg/apache/lucene/util/fst/FST;}

1 tests failed.
REGRESSION:  org.apache.solr.core.TestJmxIntegration.testJmxUpdate

Error Message:
No mbean found for SolrIndexSearcher

Stack Trace:
java.lang.AssertionError: No mbean found for SolrIndexSearcher
	at __randomizedtesting.SeedInfo.seed([2E40678C78091803:382755E6E8DFB3A8]:0)
	at org.junit.Assert.fail(Assert.java:93)
	at org.junit.Assert.assertTrue(Assert.java:43)
	at org.junit.Assert.assertFalse(Assert.java:68)
	at org.apache.solr.core.TestJmxIntegration.testJmxUpdate(TestJmxIntegration.java:99)
	at sun.reflect.NativeMethodAccessorImpl.invoke0(Native Method)
	at sun.reflect.NativeMethodAccessorImpl.invoke(NativeMethodAccessorImpl.java:60)
	at sun.reflect.DelegatingMethodAccessorImpl.invoke(DelegatingMethodAccessorImpl.java:37)
	at java.lang.reflect.Method.invoke(Method.java:611)
	at com.carrotsearch.randomizedtesting.RandomizedRunner.invoke(RandomizedRunner.java:1559)
	at com.carrotsearch.randomizedtesting.RandomizedRunner.access$600(RandomizedRunner.java:79)
	at com.carrotsearch.randomizedtesting.RandomizedRunner$6.evaluate(RandomizedRunner.java:737)
	at com.carrotsearch.randomizedtesting.RandomizedRunner$7.evaluate(RandomizedRunner.java:773)
	at com.carrotsearch.randomizedtesting.RandomizedRunner$8.evaluate(RandomizedRunner.java:787)
	at com.carrotsearch.randomizedtesting.rules.SystemPropertiesRestoreRule$1.evaluate(SystemPropertiesRestoreRule.java:53)
	at org.apache.lucene.util.TestRuleSetupTeardownChained$1.evaluate(TestRuleSetupTeardownChained.java:50)
	at org.apache.lucene.util.TestRuleFieldCacheSanity$1.evaluate(TestRuleFieldCacheSanity.java:51)
	at org.apache.lucene.util.AbstractBeforeAfterRule$1.evaluate(AbstractBeforeAfterRule.java:45)
	at com.carrotsearch.randomizedtesting.rules.SystemPropertiesInvariantRule$1.evaluate(SystemPropertiesInvariantRule.java:55)
	at org.apache.lucene.util.TestRuleThreadAndTestName$1.evaluate(TestRuleThreadAndTestName.java:48)
	at org.apache.lucene.util.TestRuleIgnoreAfterMaxFailures$1.evaluate(TestRuleIgnoreAfterMaxFailures.java:70)
	at org.apache.lucene.util.TestRuleMarkFailure$1.evaluate(TestRuleMarkFailure.java:48)
	at com.carrotsearch.randomizedtesting.rules.StatementAdapter.evaluate(StatementAdapter.java:36)
	at com.carrotsearch.randomizedtesting.ThreadLeakControl$StatementRunner.run(ThreadLeakControl.java:358)
	at com.carrotsearch.randomizedtesting.ThreadLeakControl.forkTimeoutingTask(ThreadLeakControl.java:782)
	at com.carrotsearch.randomizedtesting.ThreadLeakControl$3.evaluate(ThreadLeakControl.java:442)
	at com.carrotsearch.randomizedtesting.RandomizedRunner.runSingleTest(RandomizedRunner.java:746)
	at com.carrotsearch.randomizedtesting.RandomizedRunner$3.evaluate(RandomizedRunner.java:648)
	at com.carrotsearch.randomizedtesting.RandomizedRunner$4.evaluate(RandomizedRunner.java:682)
	at com.carrotsearch.randomizedtesting.RandomizedRunner$5.evaluate(RandomizedRunner.java:693)
	at com.carrotsearch.randomizedtesting.rules.StatementAdapter.evaluate(StatementAdapter.java:36)
	at com.carrotsearch.randomizedtesting.rules.SystemPropertiesRestoreRule$1.evaluate(SystemPropertiesRestoreRule.java:53)
	at org.apache.lucene.util.AbstractBeforeAfterRule$1.evaluate(AbstractBeforeAfterRule.java:45)
	at org.apache.lucene.util.TestRuleStoreClassName$1.evaluate(TestRuleStoreClassName.java:42)
	at com.carrotsearch.randomizedtesting.rules.SystemPropertiesInvariantRule$1.evaluate(SystemPropertiesInvariantRule.java:55)
	at com.carrotsearch.randomizedtesting.rules.NoShadowingOrOverridesOnMethodsRule$1.evaluate(NoShadowingOrOverridesOnMethodsRule.java:39)
	at com.carrotsearch.randomizedtesting.rules.NoShadowingOrOverridesOnMethodsRule$1.evaluate(NoShadowingOrOverridesOnMethodsRule.java:39)
	at com.carrotsearch.randomizedtesting.rules.StatementAdapter.evaluate(StatementAdapter.java:36)
	at org.apache.lucene.util.TestRuleAssertionsRequired$1.evaluate(TestRuleAssertionsRequired.java:43)
	at org.apache.lucene.util.TestRuleMarkFailure$1.evaluate(TestRuleMarkFailure.java:48)
	at org.apache.lucene.util.TestRuleIgnoreAfterMaxFailures$1.evaluate(TestRuleIgnoreAfterMaxFailures.java:70)
	at org.apache.lucene.util.TestRuleIgnoreTestSuites$1.evaluate(TestRuleIgnoreTestSuites.java:55)
	at com.carrotsearch.randomizedtesting.rules.StatementAdapter.evaluate(StatementAdapter.java:36)
	at com.carrotsearch.randomizedtesting.ThreadLeakControl$StatementRunner.run(ThreadLeakControl.java:358)
	at java.lang.Thread.run(Thread.java:738)




Build Log:
[...truncated 7822 lines...]
[junit4:junit4] Suite: org.apache.solr.core.TestJmxIntegration
[junit4:junit4]   2> 0 T38 oas.SolrTestCaseJ4.initCore ####initCore
[junit4:junit4]   2> Creating dataDir: /mnt/ssd/jenkins/workspace/Lucene-Solr-trunk-Linux/solr/build/solr-core/test/J1/./solrtest-TestJmxIntegration-1351378587732
[junit4:junit4]   2> 2 T38 oasc.SolrResourceLoader.<init> new SolrResourceLoader
for directory: '/mnt/ssd/jenkins/workspace/Lucene-Solr-trunk-Linux/solr/build/solr-core/test-files/solr/collection1/'
[junit4:junit4]   2> 7 T38 oasc.SolrResourceLoader.replaceClassLoader Adding 'file:/mnt/ssd/jenkins/workspace/Lucene-Solr-trunk-Linux/solr/build/solr-core/test-files/solr/collection1/lib/README'
to classloader
[junit4:junit4]   2> 10 T38 oasc.SolrResourceLoader.replaceClassLoader Adding 'file:/mnt/ssd/jenkins/workspace/Lucene-Solr-trunk-Linux/solr/build/solr-core/test-files/solr/collection1/lib/classes/'
to classloader
[junit4:junit4]   2> 132 T38 oasc.SolrConfig.<init> Using Lucene MatchVersion: LUCENE_50
[junit4:junit4]   2> 213 T38 oasc.SolrConfig.<init> Loaded SolrConfig: solrconfig.xml
[junit4:junit4]   2> 215 T38 oass.IndexSchema.readSchema Reading Solr Schema
[junit4:junit4]   2> 241 T38 oass.IndexSchema.readSchema Schema name=test
[junit4:junit4]   2> 1060 T38 oass.OpenExchangeRatesOrgProvider.init Initialized with rates=open-exchange-rates.json,
refreshInterval=1440.
[junit4:junit4]   2> 1093 T38 oass.IndexSchema.readSchema default search field in schema
is text
[junit4:junit4]   2> 1100 T38 oass.IndexSchema.readSchema unique key field: id
[junit4:junit4]   2> 1154 T38 oass.FileExchangeRateProvider.reload Reloading exchange rates
from file currency.xml
[junit4:junit4]   2> 1162 T38 oass.FileExchangeRateProvider.reload Reloading exchange rates
from file currency.xml
[junit4:junit4]   2> 1167 T38 oass.OpenExchangeRatesOrgProvider.reload Reloading exchange
rates from open-exchange-rates.json
[junit4:junit4]   2> 1169 T38 oass.OpenExchangeRatesOrgProvider.reload Reloading exchange
rates from open-exchange-rates.json
[junit4:junit4]   2> 1182 T38 oasc.SolrResourceLoader.locateSolrHome JNDI not configured
for solr (NoInitialContextEx)
[junit4:junit4]   2> 1183 T38 oasc.SolrResourceLoader.locateSolrHome using system property
solr.solr.home: /mnt/ssd/jenkins/workspace/Lucene-Solr-trunk-Linux/solr/build/solr-core/test-files/solr
[junit4:junit4]   2> 1184 T38 oasc.SolrResourceLoader.<init> new SolrResourceLoader
for directory: '/mnt/ssd/jenkins/workspace/Lucene-Solr-trunk-Linux/solr/build/solr-core/test-files/solr/'
[junit4:junit4]   2> 1200 T38 oasc.CoreContainer.<init> New CoreContainer 1661231876
[junit4:junit4]   2> 1202 T38 oasc.SolrCore.<init> [collection1] Opening new SolrCore
at /mnt/ssd/jenkins/workspace/Lucene-Solr-trunk-Linux/solr/build/solr-core/test-files/solr/collection1/,
dataDir=/mnt/ssd/jenkins/workspace/Lucene-Solr-trunk-Linux/solr/build/solr-core/test/J1/./solrtest-TestJmxIntegration-1351378587732/
[junit4:junit4]   2> 1203 T38 oasc.JmxMonitoredMap.<init> No JMX servers found, not
exposing Solr information with JMX.
[junit4:junit4]   2> 1203 T38 oasc.SolrCore.initDirectoryFactory org.apache.solr.core.MockDirectoryFactory
[junit4:junit4]   2> 1205 T38 oasc.CachingDirectoryFactory.injectLockFactory WARNING No
lockType configured for MockDirWrapper(org.apache.lucene.store.RAMDirectory@22a322a3 lockFactory=org.apache.lucene.store.SingleInstanceLockFactory@24102410)
assuming 'simple'
[junit4:junit4]   2> 1205 T38 oasc.CachingDirectoryFactory.get return new directory for
/mnt/ssd/jenkins/workspace/Lucene-Solr-trunk-Linux/solr/build/solr-core/test/J1/./solrtest-TestJmxIntegration-1351378587732
forceNew:false
[junit4:junit4]   2> 1206 T38 oasc.CachingDirectoryFactory.close Releasing directory:/mnt/ssd/jenkins/workspace/Lucene-Solr-trunk-Linux/solr/build/solr-core/test/J1/./solrtest-TestJmxIntegration-1351378587732
[junit4:junit4]   2> 1207 T38 oasc.SolrCore.getNewIndexDir New index directory detected:
old=null new=/mnt/ssd/jenkins/workspace/Lucene-Solr-trunk-Linux/solr/build/solr-core/test/J1/./solrtest-TestJmxIntegration-1351378587732/index/
[junit4:junit4]   2> 1208 T38 oasc.SolrCore.initIndex WARNING [collection1] Solr index
directory '/mnt/ssd/jenkins/workspace/Lucene-Solr-trunk-Linux/solr/build/solr-core/test/J1/./solrtest-TestJmxIntegration-1351378587732/index'
doesn't exist. Creating new index...
[junit4:junit4]   2> 1209 T38 oasc.CachingDirectoryFactory.get return new directory for
/mnt/ssd/jenkins/workspace/Lucene-Solr-trunk-Linux/solr/build/solr-core/test/J1/./solrtest-TestJmxIntegration-1351378587732/index
forceNew:false
[junit4:junit4]   2> 1211 T38 oasc.SolrDeletionPolicy.onCommit SolrDeletionPolicy.onCommit:
commits:num=1
[junit4:junit4]   2> 		commit{dir=MockDirWrapper(org.apache.lucene.store.RAMDirectory@580e580e
lockFactory=org.apache.lucene.store.NativeFSLockFactory@65ea65ea),segFN=segments_1,generation=1,filenames=[segments_1]
[junit4:junit4]   2> 1212 T38 oasc.SolrDeletionPolicy.updateCommits newest commit = 1[segments_1]
[junit4:junit4]   2> 1213 T38 oasc.CachingDirectoryFactory.close Releasing directory:/mnt/ssd/jenkins/workspace/Lucene-Solr-trunk-Linux/solr/build/solr-core/test/J1/./solrtest-TestJmxIntegration-1351378587732/index
[junit4:junit4]   2> 1214 T38 oasc.SolrCore.initWriters created xml: solr.XMLResponseWriter
[junit4:junit4]   2> 1216 T38 oasup.UpdateRequestProcessorChain.init inserting DistributedUpdateProcessorFactory
into updateRequestProcessorChain "dedupe"
[junit4:junit4]   2> 1217 T38 oasup.UpdateRequestProcessorChain.init inserting DistributedUpdateProcessorFactory
into updateRequestProcessorChain "dedupe-allfields"
[junit4:junit4]   2> 1218 T38 oasup.UpdateRequestProcessorChain.init inserting DistributedUpdateProcessorFactory
into updateRequestProcessorChain "stored_sig"
[junit4:junit4]   2> 1219 T38 oasup.UpdateRequestProcessorChain.init inserting DistributedUpdateProcessorFactory
into updateRequestProcessorChain "uniq-fields"
[junit4:junit4]   2> 1220 T38 oasup.UpdateRequestProcessorChain.init inserting DistributedUpdateProcessorFactory
into updateRequestProcessorChain "distrib-dup-test-chain-implicit"
[junit4:junit4]   2> 1221 T38 oasc.RequestHandlers.initHandlersFromConfig adding lazy requestHandler:
solr.ReplicationHandler
[junit4:junit4]   2> 1221 T38 oasc.RequestHandlers.initHandlersFromConfig created /replication:
solr.ReplicationHandler
[junit4:junit4]   2> 1222 T38 oasc.RequestHandlers.initHandlersFromConfig created standard:
solr.StandardRequestHandler
[junit4:junit4]   2> 1223 T38 oasc.RequestHandlers.initHandlersFromConfig created /get:
solr.RealTimeGetHandler
[junit4:junit4]   2> 1224 T38 oasc.RequestHandlers.initHandlersFromConfig created dismax:
solr.SearchHandler
[junit4:junit4]   2> 1224 T38 oasc.RequestHandlers.initHandlersFromConfig created mock:
org.apache.solr.core.MockQuerySenderListenerReqHandler
[junit4:junit4]   2> 1225 T38 oasc.RequestHandlers.initHandlersFromConfig created /admin/:
org.apache.solr.handler.admin.AdminHandlers
[junit4:junit4]   2> 1226 T38 oasc.RequestHandlers.initHandlersFromConfig created defaults:
solr.StandardRequestHandler
[junit4:junit4]   2> 1227 T38 oasc.RequestHandlers.initHandlersFromConfig adding lazy requestHandler:
solr.StandardRequestHandler
[junit4:junit4]   2> 1227 T38 oasc.RequestHandlers.initHandlersFromConfig created lazy:
solr.StandardRequestHandler
[junit4:junit4]   2> 1228 T38 oasc.RequestHandlers.initHandlersFromConfig created /update:
solr.UpdateRequestHandler
[junit4:junit4]   2> 1229 T38 oasc.RequestHandlers.initHandlersFromConfig created /terms:
org.apache.solr.handler.component.SearchHandler
[junit4:junit4]   2> 1230 T38 oasc.RequestHandlers.initHandlersFromConfig created spellCheckCompRH:
org.apache.solr.handler.component.SearchHandler
[junit4:junit4]   2> 1230 T38 oasc.RequestHandlers.initHandlersFromConfig created spellCheckCompRH_Direct:
org.apache.solr.handler.component.SearchHandler
[junit4:junit4]   2> 1231 T38 oasc.RequestHandlers.initHandlersFromConfig created spellCheckWithWordbreak:
org.apache.solr.handler.component.SearchHandler
[junit4:junit4]   2> 1232 T38 oasc.RequestHandlers.initHandlersFromConfig created spellCheckWithWordbreak_Direct:
org.apache.solr.handler.component.SearchHandler
[junit4:junit4]   2> 1232 T38 oasc.RequestHandlers.initHandlersFromConfig created spellCheckCompRH1:
org.apache.solr.handler.component.SearchHandler
[junit4:junit4]   2> 1233 T38 oasc.RequestHandlers.initHandlersFromConfig created tvrh:
org.apache.solr.handler.component.SearchHandler
[junit4:junit4]   2> 1234 T38 oasc.RequestHandlers.initHandlersFromConfig created /mlt:
solr.MoreLikeThisHandler
[junit4:junit4]   2> 1235 T38 oasc.RequestHandlers.initHandlersFromConfig created /debug/dump:
solr.DumpRequestHandler
[junit4:junit4]   2> 1237 T38 oashl.XMLLoader.init xsltCacheLifetimeSeconds=60
[junit4:junit4]   2> 1239 T38 oasc.SolrCore.initDeprecatedSupport WARNING solrconfig.xml
uses deprecated <admin/gettableFiles>, Please update your config to use the ShowFileRequestHandler.
[junit4:junit4]   2> 1241 T38 oasc.SolrCore.initDeprecatedSupport WARNING adding ShowFileRequestHandler
with hidden files: [BAD-SCHEMA-NOT-INDEXED-BUT-TF.XML, SCHEMA-REQUIRED-FIELDS.XML, SOLRCONFIG-MASTER1-KEEPONEBACKUP.XML,
BAD-SCHEMA-NONTEXT-ANALYZER.XML, SOLRCONFIG-PROPINJECT.XML, SOLRCONFIG-PROPINJECT-INDEXDEFAULT.XML,
STOP-2.TXT, SCHEMA11.XML, BAD-SCHEMA-UNIQUEKEY-USES-DEFAULT.XML, SCHEMA15.XML, SOLRCONFIG-NATIVELOCK.XML,
SCHEMA-SIM.XML, CONDITIONAL.UPDATEPROCESSOR.JS, BAD-SOLRCONFIG-MISSING-SCRIPTFILE.XML, SOLRCONFIG-SCRIPT-UPDATEPROCESSOR.XML,
SOLRCONFIG-REPEATER.XML, SOLRCONFIG-SPELLCHECKER.XML, SOLRCONFIG-NOCACHE.XML, SCHEMA-CHARFILTERS.XML,
SOLRCONFIG-SOLCOREPROPERTIES.XML, SOLRCONFIG_CODEC.XML, BAD-SCHEMA-EXTERNAL-FILEFIELD.XML,
HYPHENATION.DTD, TRIVIAL.UPDATEPROCESSOR1.JS, SCHEMA.XML, SOLRCONFIG-MERGEPOLICY.XML, SOLRCONFIG-PHRASESUGGEST.XML,
SOLRCONFIG-SLAVE1.XML, SOLRCONFIG-BASIC.XML, SCHEMA-LMJELINEKMERCER.XML, JASUGGEST.TXT, BAD-MP-SOLRCONFIG.XML,
BAD-SCHEMA-DUP-FIELD.XML, BAD-SCHEMA-UNIQUEKEY-MULTIVALUED.XML, SOLRCONFIG-MASTER.XML, SOLRCONFIG-HIGHLIGHT.XML,
SCHEMA-TFIDF.XML, SCHEMA-REPLICATION1.XML, SYNONYMS.TXT, SOLRCONFIG-ELEVATE.XML, STOPWITHBOM.TXT,
SOLRCONFIG-QUERYSENDER.XML, WDFTYPES.TXT, SOLRCONFIG-SNIPPET-PROCESSOR.XML, SOLRCONFIG-DELPOLICY1.XML,
BAD_SOLRCONFIG.XML, HUNSPELL-TEST.DIC, SCHEMA-NUMERIC.XML, SCHEMA-LUCENEMATCHVERSION.XML,
KEEP-2.TXT, SCHEMA-STOP-KEEP.XML, SCHEMA-IB.XML, STOP-SNOWBALL.TXT, SOLRCONFIG-INDEXCONFIG.XML,
SOLRCONFIG-SLAVE.XML, BAD-SCHEMA-NOT-INDEXED-BUT-NORMS.XML, STOPWORDSWRONGENCODING.TXT, THROW.ERROR.ON.ADD.UPDATEPROCESSOR.JS,
STOPTYPES-1.TXT, SOLRCONFIG-SPELLCHECKCOMPONENT.XML, SOLRCONFIG-TLOG.XML, COMPOUNDDICTIONARY.TXT,
DA_COMPOUNDDICTIONARY.TXT, SOLRCONFIG-TERMINDEX.XML, BAD-SOLRCONFIG-INVALID-SCRIPTFILE.XML,
SCHEMASURROUND.XML, OPEN-EXCHANGE-RATES.JSON, BAD-SCHEMA-DUP-FIELDTYPE.XML, PHRASESUGGEST.TXT,
BAD-SCHEMA-CURRENCY-FT-MULTIVALUED.XML, SOLRCONFIG-MASTER2.XML, OLD_SYNONYMS.TXT, BAD-SCHEMA-UNIQUEKEY-IS-COPYFIELD-DEST.XML,
SCHEMA-NOT-REQUIRED-UNIQUE-KEY.XML, BAD-SCHEMA-CODEC-GLOBAL-VS-FT-MISMATCH.XML, SCHEMA-LMDIRICHLET.XML,
BAD-SCHEMA-NOT-INDEXED-BUT-POS.XML, SCHEMA-REVERSED.XML, BAD-SCHEMA-CURRENCY-MULTIVALUED.XML,
SCHEMA-FOLDING.XML, SOLRCONFIG-CACHING.XML, MAPPING-ISOLATIN1ACCENT.TXT, ADDFIELDS.UPDATEPROCESSOR.JS,
SCHEMA-BM25.XML, STOP-1.TXT, SOLRCONFIG-ENABLEPLUGIN.XML, MISSING.FUNCTIONS.UPDATEPROCESSOR.JS,
SCHEMA12.XML, SOLRCONFIG-TRANSFORMERS.XML, SCHEMA-COPYFIELD-TEST.XML, BAD-SCHEMA-DUP-DYNAMICFIELD.XML,
CURRENCY.XML, DA_UTF8.XML, MISSLEADING.EXTENSION.UPDATEPROCESSOR.JS.TXT, SOLRCONFIG-SOLR-749.XML,
STOPWORDS.TXT, HUNSPELL-TEST.AFF, SOLRCONFIG_PERF.XML, SOLRCONFIG-SIMPLELOCK.XML, FRENCHARTICLES.TXT,
SOLRCONFIG-LAZYWRITER.XML, SOLRCONFIG-RESPONSE-LOG-COMPONENT.XML, SCHEMA-REPLICATION2.XML,
SCHEMA-SNIPPET-TYPE.XML, SCHEMA-SPATIAL.XML, SOLRCONFIG-XINCLUDE.XML, SCHEMA-SPELLCHECKER.XML,
XSLT, SOLRCONFIG-DELPOLICY2.XML, TRIVIAL.UPDATEPROCESSOR0.JS, KEEP-1.TXT, BAD-SCHEMA-CURRENCY-DYNAMIC-MULTIVALUED.XML,
SCHEMA-TRIE.XML, SCHEMA-BINARYFIELD.XML, BAD-SCHEMA-OMIT-TF-BUT-NOT-POS.XML, SCHEMA-MINIMAL.XML,
STOPTYPES-2.TXT, SCHEMA_CODEC.XML, STEMDICT.TXT, ELEVATE.XML, SCHEMA-COLLATE.XML, PROTWORDS.TXT,
SCHEMA-XINCLUDE.XML, SCHEMA-SNIPPET-FIELD.XML, SOLRCONFIG-REQHANDLER.INCL, SCHEMA-PHRASESUGGEST.XML,
SCHEMA-DFR.XML, BAD-SCHEMA-ANALYZER-CLASS-AND-NESTED.XML, SOLRCONFIG-MASTER1.XML, SOLRCONFIG-FUNCTIONQUERY.XML,
SOLRCONFIG-MASTER3.XML, SOLRCONFIG-UPDATE-PROCESSOR-CHAINS.XML, SOLRCONFIG-ALTDIRECTORY.XML,
BAD-SCHEMA-SIM-GLOBAL-VS-FT-MISMATCH.XML, SOLRCONFIG-QUERYSENDER-NOQUERY.XML, BAD-SOLRCONFIG-BOGUS-SCRIPTENGINE-NAME.XML]
[junit4:junit4]   2> 1248 T38 oasc.CachingDirectoryFactory.close Releasing directory:/mnt/ssd/jenkins/workspace/Lucene-Solr-trunk-Linux/solr/build/solr-core/test/J1/./solrtest-TestJmxIntegration-1351378587732
[junit4:junit4]   2> 1249 T38 oass.SolrIndexSearcher.<init> Opening Searcher@2a2a2a2a
main
[junit4:junit4]   2> 1250 T38 oasu.CommitTracker.<init> Hard AutoCommit: disabled
[junit4:junit4]   2> 1251 T38 oasu.CommitTracker.<init> Soft AutoCommit: disabled
[junit4:junit4]   2> 1252 T38 oashc.SpellCheckComponent.inform Initializing spell checkers
[junit4:junit4]   2> 1437 T38 oass.DirectSolrSpellChecker.init init: {name=direct,classname=DirectSolrSpellChecker,field=lowerfilt,minQueryLength=3}
[junit4:junit4]   2> 1523 T38 oashc.HttpShardHandlerFactory.getParameter Setting socketTimeout
to: 0
[junit4:junit4]   2> 1524 T38 oashc.HttpShardHandlerFactory.getParameter Setting urlScheme
to: http://
[junit4:junit4]   2> 1525 T38 oashc.HttpShardHandlerFactory.getParameter Setting connTimeout
to: 0
[junit4:junit4]   2> 1525 T38 oashc.HttpShardHandlerFactory.getParameter Setting maxConnectionsPerHost
to: 20
[junit4:junit4]   2> 1546 T38 oashc.HttpShardHandlerFactory.getParameter Setting corePoolSize
to: 0
[junit4:junit4]   2> 1547 T38 oashc.HttpShardHandlerFactory.getParameter Setting maximumPoolSize
to: 2147483647
[junit4:junit4]   2> 1547 T38 oashc.HttpShardHandlerFactory.getParameter Setting maxThreadIdleTime
to: 5
[junit4:junit4]   2> 1548 T38 oashc.HttpShardHandlerFactory.getParameter Setting sizeOfQueue
to: -1
[junit4:junit4]   2> 1548 T38 oashc.HttpShardHandlerFactory.getParameter Setting fairnessPolicy
to: false
[junit4:junit4]   2> 1549 T38 oascsi.HttpClientUtil.createClient Creating new http client,
config:maxConnectionsPerHost=20&maxConnections=10000&socketTimeout=0&connTimeout=0&retry=false
[junit4:junit4]   2> 1572 T39 oasc.SolrCore.registerSearcher [collection1] Registered new
searcher Searcher@2a2a2a2a main{StandardDirectoryReader(segments_1:1)}
[junit4:junit4]   2> 1573 T38 oasc.CoreContainer.register registering core: collection1
[junit4:junit4]   2> 1577 T38 oas.SolrTestCaseJ4.initCore ####initCore end
[junit4:junit4]   2> 1675 T38 oas.SolrTestCaseJ4.setUp ###Starting testJmxRegistration
[junit4:junit4]   2> 1676 T38 oasc.TestJmxIntegration.testJmxRegistration Servers in testJmxRegistration:
[com.sun.jmx.mbeanserver.JmxMBeanServer@1920192]
[junit4:junit4]   2> 1699 T38 oas.SolrTestCaseJ4.tearDown ###Ending testJmxRegistration
[junit4:junit4]   2> 1755 T38 oas.SolrTestCaseJ4.setUp ###Starting testJmxUpdate
[junit4:junit4]   2> 1756 T38 oasc.TestJmxIntegration.testJmxUpdate Servers in testJmxUpdate:
[com.sun.jmx.mbeanserver.JmxMBeanServer@1920192]
[junit4:junit4]   2> 1758 T38 oasc.TestJmxIntegration.testJmxUpdate {org.apache.solr.handler.StandardRequestHandler=org.apache.solr.handler.StandardRequestHandler@644e644e,
/admin/system=org.apache.solr.handler.admin.SystemInfoHandler@c280c28, spellCheckWithWordbreak_Direct=org.apache.solr.handler.component.SearchHandler@762e762e,
/admin/logging=org.apache.solr.handler.admin.LoggingHandler@553f553f, org.apache.solr.highlight.RegexFragmenter=org.apache.solr.highlight.RegexFragmenter@55575557,
/admin/plugins=org.apache.solr.handler.admin.PluginInfoHandler@55095509, queryResultCache=queryResultCache{lookups=0,hits=0,hitratio=0.00,inserts=0,evictions=0,size=0,warmupTime=0,cumulative_lookups=0,cumulative_hits=0,cumulative_hitratio=0.00,cumulative_inserts=0,cumulative_evictions=0},
org.apache.solr.highlight.BreakIteratorBoundaryScanner=org.apache.solr.highlight.BreakIteratorBoundaryScanner@5f1c5f1c,
org.apache.solr.highlight.HtmlFormatter=org.apache.solr.highlight.HtmlFormatter@57b157b1,
org.apache.solr.handler.RealTimeGetHandler=org.apache.solr.handler.RealTimeGetHandler@6cda6cda,
org.apache.solr.highlight.GapFragmenter=org.apache.solr.highlight.GapFragmenter@53cd53cd,
org.apache.solr.highlight.SimpleFragmentsBuilder=org.apache.solr.highlight.SimpleFragmentsBuilder@5b2d5b2d,
/admin/file=org.apache.solr.handler.admin.ShowFileRequestHandler@137b137b, mock=org.apache.solr.core.MockQuerySenderListenerReqHandler@44f744f7,
core=org.apache.solr.core.SolrCore@6f726f72, spellCheckWithWordbreak=org.apache.solr.handler.component.SearchHandler@26a726a7,
searcher=Searcher@2a2a2a2a main{StandardDirectoryReader(segments_1:1)}, spellCheckCompRH1=org.apache.solr.handler.component.SearchHandler@46114611,
org.apache.solr.handler.component.TermVectorComponent=org.apache.solr.handler.component.TermVectorComponent@5b9e5b9e,
/admin/luke=org.apache.solr.handler.admin.LukeRequestHandler@c160c16, /update=org.apache.solr.handler.UpdateRequestHandler@55445544,
fieldCache=org.apache.solr.search.SolrFieldCacheMBean@2e872e87, defaults=org.apache.solr.handler.StandardRequestHandler@644e644e,
org.apache.solr.handler.MoreLikeThisHandler=org.apache.solr.handler.MoreLikeThisHandler@651d651d,
/terms=org.apache.solr.handler.component.SearchHandler@255d255d, /admin/threads=org.apache.solr.handler.admin.ThreadDumpHandler@551b551b,
org.apache.solr.core.MockQuerySenderListenerReqHandler=org.apache.solr.core.MockQuerySenderListenerReqHandler@44f744f7,
spellCheckCompRH_Direct=org.apache.solr.handler.component.SearchHandler@545c545c, /replication=org.apache.solr.core.RequestHandlers$LazyRequestHandlerWrapper@710c710c,
org.apache.solr.handler.UpdateRequestHandler=org.apache.solr.handler.UpdateRequestHandler@55445544,
lazy=org.apache.solr.core.RequestHandlers$LazyRequestHandlerWrapper@20c020c, org.apache.solr.highlight.ScoreOrderFragmentsBuilder=org.apache.solr.highlight.ScoreOrderFragmentsBuilder@5c875c87,
org.apache.solr.highlight.SimpleFragListBuilder=org.apache.solr.highlight.SimpleFragListBuilder@59a259a2,
org.apache.solr.handler.component.TermsComponent=org.apache.solr.handler.component.TermsComponent@59b559b5,
/mlt=org.apache.solr.handler.MoreLikeThisHandler@651d651d, org.apache.solr.handler.component.RealTimeGetComponent=org.apache.solr.handler.component.RealTimeGetComponent@68486848,
documentCache=documentCache{lookups=0,hits=0,hitratio=0.00,inserts=0,evictions=0,size=0,warmupTime=0,cumulative_lookups=0,cumulative_hits=0,cumulative_hitratio=0.00,cumulative_inserts=0,cumulative_evictions=0},
/admin/mbeans=org.apache.solr.handler.admin.SolrInfoMBeanHandler@54f754f7, org.apache.solr.handler.component.MoreLikeThisComponent=org.apache.solr.handler.component.MoreLikeThisComponent@61f961f9,
dismax=org.apache.solr.handler.component.SearchHandler@68906890, org.apache.solr.handler.component.FacetComponent=org.apache.solr.handler.component.FacetComponent@609d609d,
Searcher@2a2a2a2a main=Searcher@2a2a2a2a main{StandardDirectoryReader(segments_1:1)}, org.apache.solr.handler.component.HighlightComponent=org.apache.solr.handler.component.HighlightComponent@5d5e5d5e,
org.apache.solr.handler.component.SpellCheckComponent=org.apache.solr.handler.component.SpellCheckComponent@56645664,
/get=org.apache.solr.handler.RealTimeGetHandler@6cda6cda, fieldValueCache=fieldValueCache{lookups=0,hits=0,hitratio=0.00,inserts=0,evictions=0,size=0,warmupTime=0,cumulative_lookups=0,cumulative_hits=0,cumulative_hitratio=0.00,cumulative_inserts=0,cumulative_evictions=0},
/admin/=org.apache.solr.handler.admin.AdminHandlers@15cd15cd, spellCheckCompRH=org.apache.solr.handler.component.SearchHandler@764d764d,
standard=org.apache.solr.handler.StandardRequestHandler@40ac40ac, org.apache.solr.handler.admin.AdminHandlers=org.apache.solr.handler.admin.AdminHandlers@15cd15cd,
tvrh=org.apache.solr.handler.component.SearchHandler@150d150d, org.apache.solr.handler.DumpRequestHandler=org.apache.solr.handler.DumpRequestHandler@34843484,
org.apache.solr.highlight.SimpleBoundaryScanner=org.apache.solr.highlight.SimpleBoundaryScanner@5dd25dd2,
org.apache.solr.handler.component.StatsComponent=org.apache.solr.handler.component.StatsComponent@63606360,
/admin/properties=org.apache.solr.handler.admin.PropertiesRequestHandler@552d552d, org.apache.solr.handler.component.QueryComponent=org.apache.solr.handler.component.QueryComponent@5eb25eb2,
org.apache.solr.handler.component.SearchHandler=org.apache.solr.handler.component.SearchHandler@150d150d,
org.apache.solr.handler.component.DebugComponent=org.apache.solr.handler.component.DebugComponent@66666666,
/debug/dump=org.apache.solr.handler.DumpRequestHandler@34843484, filterCache=filterCache{lookups=0,hits=0,hitratio=0.00,inserts=0,evictions=0,size=0,warmupTime=0,cumulative_lookups=0,cumulative_hits=0,cumulative_hitratio=0.00,cumulative_inserts=0,cumulative_evictions=0},
updateHandler=DirectUpdateHandler2{commits=0,autocommits=0,soft autocommits=0,optimizes=0,rollbacks=0,expungeDeletes=0,docsPending=0,adds=0,deletesById=0,deletesByQuery=0,errors=0,cumulative_adds=0,cumulative_deletesById=0,cumulative_deletesByQuery=0,cumulative_errors=0}}
[junit4:junit4]   2> 1761 T38 oasc.TestJmxIntegration.testJmxUpdate Mbeans in server: [java.lang:type=MemoryPool,name=JIT
code cache, java.lang:type=Compilation, java.lang:type=Memory, java.lang:type=GarbageCollector,name=MarkSweepCompact,
JMImplementation:type=MBeanServerDelegate, java.lang:type=ClassLoading, java.lang:type=MemoryPool,name=Java
heap, java.lang:type=OperatingSystem, java.lang:type=MemoryPool,name=class storage, java.lang:type=Threading,
java.lang:type=Runtime, java.util.logging:type=Logging, java.lang:type=MemoryManager,name=J9
non-heap manager, java.lang:type=MemoryPool,name=JIT data cache, java.lang:type=MemoryPool,name=miscellaneous
non-heap storage]
[junit4:junit4]   2> 1762 T38 oas.SolrTestCaseJ4.tearDown ###Ending testJmxUpdate
[junit4:junit4]   2> NOTE: reproduce with: ant test  -Dtestcase=TestJmxIntegration -Dtests.method=testJmxUpdate
-Dtests.seed=2E40678C78091803 -Dtests.multiplier=3 -Dtests.slow=true -Dtests.locale=da_DK
-Dtests.timezone=AGT -Dtests.file.encoding=UTF-8
[junit4:junit4] FAILURE 0.10s J1 | TestJmxIntegration.testJmxUpdate <<<
[junit4:junit4]    > Throwable #1: java.lang.AssertionError: No mbean found for SolrIndexSearcher
[junit4:junit4]    > 	at __randomizedtesting.SeedInfo.seed([2E40678C78091803:382755E6E8DFB3A8]:0)
[junit4:junit4]    > 	at org.junit.Assert.fail(Assert.java:93)
[junit4:junit4]    > 	at org.junit.Assert.assertTrue(Assert.java:43)
[junit4:junit4]    > 	at org.junit.Assert.assertFalse(Assert.java:68)
[junit4:junit4]    > 	at org.apache.solr.core.TestJmxIntegration.testJmxUpdate(TestJmxIntegration.java:99)
[junit4:junit4]    > 	at sun.reflect.NativeMethodAccessorImpl.invoke0(Native Method)
[junit4:junit4]    > 	at sun.reflect.NativeMethodAccessorImpl.invoke(NativeMethodAccessorImpl.java:60)
[junit4:junit4]    > 	at sun.reflect.DelegatingMethodAccessorImpl.invoke(DelegatingMethodAccessorImpl.java:37)
[junit4:junit4]    > 	at java.lang.reflect.Method.invoke(Method.java:611)
[junit4:junit4]    > 	at com.carrotsearch.randomizedtesting.RandomizedRunner.invoke(RandomizedRunner.java:1559)
[junit4:junit4]    > 	at com.carrotsearch.randomizedtesting.RandomizedRunner.access$600(RandomizedRunner.java:79)
[junit4:junit4]    > 	at com.carrotsearch.randomizedtesting.RandomizedRunner$6.evaluate(RandomizedRunner.java:737)
[junit4:junit4]    > 	at com.carrotsearch.randomizedtesting.RandomizedRunner$7.evaluate(RandomizedRunner.java:773)
[junit4:junit4]    > 	at com.carrotsearch.randomizedtesting.RandomizedRunner$8.evaluate(RandomizedRunner.java:787)
[junit4:junit4]    > 	at com.carrotsearch.randomizedtesting.rules.SystemPropertiesRestoreRule$1.evaluate(SystemPropertiesRestoreRule.java:53)
[junit4:junit4]    > 	at org.apache.lucene.util.TestRuleSetupTeardownChained$1.evaluate(TestRuleSetupTeardownChained.java:50)
[junit4:junit4]    > 	at org.apache.lucene.util.TestRuleFieldCacheSanity$1.evaluate(TestRuleFieldCacheSanity.java:51)
[junit4:junit4]    > 	at org.apache.lucene.util.AbstractBeforeAfterRule$1.evaluate(AbstractBeforeAfterRule.java:45)
[junit4:junit4]    > 	at com.carrotsearch.randomizedtesting.rules.SystemPropertiesInvariantRule$1.evaluate(SystemPropertiesInvariantRule.java:55)
[junit4:junit4]    > 	at org.apache.lucene.util.TestRuleThreadAndTestName$1.evaluate(TestRuleThreadAndTestName.java:48)
[junit4:junit4]    > 	at org.apache.lucene.util.TestRuleIgnoreAfterMaxFailures$1.evaluate(TestRuleIgnoreAfterMaxFailures.java:70)
[junit4:junit4]    > 	at org.apache.lucene.util.TestRuleMarkFailure$1.evaluate(TestRuleMarkFailure.java:48)
[junit4:junit4]    > 	at com.carrotsearch.randomizedtesting.rules.StatementAdapter.evaluate(StatementAdapter.java:36)
[junit4:junit4]    > 	at com.carrotsearch.randomizedtesting.ThreadLeakControl$StatementRunner.run(ThreadLeakControl.java:358)
[junit4:junit4]    > 	at com.carrotsearch.randomizedtesting.ThreadLeakControl.forkTimeoutingTask(ThreadLeakControl.java:782)
[junit4:junit4]    > 	at com.carrotsearch.randomizedtesting.ThreadLeakControl$3.evaluate(ThreadLeakControl.java:442)
[junit4:junit4]    > 	at com.carrotsearch.randomizedtesting.RandomizedRunner.runSingleTest(RandomizedRunner.java:746)
[junit4:junit4]    > 	at com.carrotsearch.randomizedtesting.RandomizedRunner$3.evaluate(RandomizedRunner.java:648)
[junit4:junit4]    > 	at com.carrotsearch.randomizedtesting.RandomizedRunner$4.evaluate(RandomizedRunner.java:682)
[junit4:junit4]    > 	at com.carrotsearch.randomizedtesting.RandomizedRunner$5.evaluate(RandomizedRunner.java:693)
[junit4:junit4]    > 	at com.carrotsearch.randomizedtesting.rules.StatementAdapter.evaluate(StatementAdapter.java:36)
[junit4:junit4]    > 	at com.carrotsearch.randomizedtesting.rules.SystemPropertiesRestoreRule$1.evaluate(SystemPropertiesRestoreRule.java:53)
[junit4:junit4]    > 	at org.apache.lucene.util.AbstractBeforeAfterRule$1.evaluate(AbstractBeforeAfterRule.java:45)
[junit4:junit4]    > 	at org.apache.lucene.util.TestRuleStoreClassName$1.evaluate(TestRuleStoreClassName.java:42)
[junit4:junit4]    > 	at com.carrotsearch.randomizedtesting.rules.SystemPropertiesInvariantRule$1.evaluate(SystemPropertiesInvariantRule.java:55)
[junit4:junit4]    > 	at com.carrotsearch.randomizedtesting.rules.NoShadowingOrOverridesOnMethodsRule$1.evaluate(NoShadowingOrOverridesOnMethodsRule.java:39)
[junit4:junit4]    > 	at com.carrotsearch.randomizedtesting.rules.NoShadowingOrOverridesOnMethodsRule$1.evaluate(NoShadowingOrOverridesOnMethodsRule.java:39)
[junit4:junit4]    > 	at com.carrotsearch.randomizedtesting.rules.StatementAdapter.evaluate(StatementAdapter.java:36)
[junit4:junit4]    > 	at org.apache.lucene.util.TestRuleAssertionsRequired$1.evaluate(TestRuleAssertionsRequired.java:43)
[junit4:junit4]    > 	at org.apache.lucene.util.TestRuleMarkFailure$1.evaluate(TestRuleMarkFailure.java:48)
[junit4:junit4]    > 	at org.apache.lucene.util.TestRuleIgnoreAfterMaxFailures$1.evaluate(TestRuleIgnoreAfterMaxFailures.java:70)
[junit4:junit4]    > 	at org.apache.lucene.util.TestRuleIgnoreTestSuites$1.evaluate(TestRuleIgnoreTestSuites.java:55)
[junit4:junit4]    > 	at com.carrotsearch.randomizedtesting.rules.StatementAdapter.evaluate(StatementAdapter.java:36)
[junit4:junit4]    > 	at com.carrotsearch.randomizedtesting.ThreadLeakControl$StatementRunner.run(ThreadLeakControl.java:358)
[junit4:junit4]    > 	at java.lang.Thread.run(Thread.java:738)
[junit4:junit4]   2> 1831 T38 oas.SolrTestCaseJ4.deleteCore ###deleteCore
[junit4:junit4]   2> 1832 T38 oasc.CoreContainer.shutdown Shutting down CoreContainer instance=1661231876
[junit4:junit4]   2> 1832 T38 oasc.SolrCore.close [collection1]  CLOSING SolrCore org.apache.solr.core.SolrCore@6f726f72
[junit4:junit4]   2> 1833 T38 oasu.DirectUpdateHandler2.close closing DirectUpdateHandler2{commits=0,autocommits=0,soft
autocommits=0,optimizes=0,rollbacks=0,expungeDeletes=0,docsPending=0,adds=0,deletesById=0,deletesByQuery=0,errors=0,cumulative_adds=0,cumulative_deletesById=0,cumulative_deletesByQuery=0,cumulative_errors=0}
[junit4:junit4]   2> 1833 T38 oasc.SolrCore.decrefSolrCoreState Closing SolrCoreState
[junit4:junit4]   2> 1834 T38 oasu.DefaultSolrCoreState.closeIndexWriter SolrCoreState
ref count has reached 0 - closing IndexWriter
[junit4:junit4]   2> 1834 T38 oasu.DefaultSolrCoreState.closeIndexWriter closing IndexWriter
with IndexWriterCloser
[junit4:junit4]   2> 1835 T38 oasc.SolrCore.closeSearcher [collection1] Closing main searcher
on request.
[junit4:junit4]   2> 1835 T38 oasc.CachingDirectoryFactory.close Releasing directory:/mnt/ssd/jenkins/workspace/Lucene-Solr-trunk-Linux/solr/build/solr-core/test/J1/./solrtest-TestJmxIntegration-1351378587732/index
[junit4:junit4]   2> NOTE: test params are: codec=Lucene41: {}, sim=DefaultSimilarity,
locale=da_DK, timezone=AGT
[junit4:junit4]   2> NOTE: Linux 3.2.0-32-generic amd64/IBM Corporation 1.6.0 (64-bit)/cpus=8,threads=2,free=21171840,total=41766912
[junit4:junit4]   2> NOTE: All tests run in this JVM: [TestWriterPerf, UpdateParamsTest,
TestReversedWildcardFilterFactory, DebugComponentTest, SolrIndexConfigTest, TestSort, XsltUpdateRequestHandlerTest,
TestJmxIntegration]
[junit4:junit4] Completed on J1 in 1.97s, 3 tests, 1 failure, 1 skipped <<< FAILURES!

[...truncated 652 lines...]
BUILD FAILED
/mnt/ssd/jenkins/workspace/Lucene-Solr-trunk-Linux/build.xml:348: The following error occurred
while executing this line:
/mnt/ssd/jenkins/workspace/Lucene-Solr-trunk-Linux/build.xml:39: The following error occurred
while executing this line:
/mnt/ssd/jenkins/workspace/Lucene-Solr-trunk-Linux/solr/build.xml:178: The following error
occurred while executing this line:
/mnt/ssd/jenkins/workspace/Lucene-Solr-trunk-Linux/lucene/module-build.xml:61: The following
error occurred while executing this line:
/mnt/ssd/jenkins/workspace/Lucene-Solr-trunk-Linux/lucene/common-build.xml:1159: The following
error occurred while executing this line:
/mnt/ssd/jenkins/workspace/Lucene-Solr-trunk-Linux/lucene/common-build.xml:827: There were
test failures: 232 suites, 961 tests, 1 failure, 7 ignored (2 assumptions)

Total time: 28 minutes 58 seconds
Build step 'Invoke Ant' marked build as failure
Archiving artifacts
Recording test results
Description set: Java: 64bit/ibm-j9-jdk6 -Xjit:exclude={org/apache/lucene/util/fst/FST.pack(IIF)Lorg/apache/lucene/util/fst/FST;}
Email was triggered for: Failure
Sending email for trigger: Failure



Mime
View raw message