lucene-dev mailing list archives

Site index · List index
Message view « Date » · « Thread »
Top « Date » · « Thread »
From Mark Miller <markrmil...@gmail.com>
Subject Re: Build failed in Jenkins: fast-io-beasting #6178
Date Mon, 29 Oct 2012 00:10:53 GMT
Looks like this happens on setup as well and stems from a failed copy:

[junit4:junit4] ERROR   10.8s J1 | BasicDistributedZk2Test.testDistribSearch <<<
[junit4:junit4]    > Throwable #1: java.io.FileNotFoundException: /home/rmuir/.jenkins/workspace/fast-io-beasting/solr/build/solr-core/test-files/solr/awholynewcollection_3
(No such file or directory)
[junit4:junit4]    > 	at __randomizedtesting.SeedInfo.seed([FD84871E6F70F998:7C620906182F99A4]:0)
[junit4:junit4]    > 	at java.io.FileInputStream.open(Native Method)
[junit4:junit4]    > 	at java.io.FileInputStream.<init>(FileInputStream.java:120)
[junit4:junit4]    > 	at org.apache.commons.io.FileUtils.doCopyFile(FileUtils.java:935)
[junit4:junit4]    > 	at org.apache.commons.io.FileUtils.doCopyDirectory(FileUtils.java:1225)
[junit4:junit4]    > 	at org.apache.commons.io.FileUtils.copyDirectory(FileUtils.java:1186)
[junit4:junit4]    > 	at org.apache.commons.io.FileUtils.copyDirectory(FileUtils.java:1058)
[junit4:junit4]    > 	at org.apache.commons.io.FileUtils.copyDirectory(FileUtils.java:1027)
[junit4:junit4]    > 	at org.apache.solr.cloud.AbstractFullDistribZkTestBase.createJettys(AbstractFullDistribZkTestBase.java:293)
[junit4:junit4]    > 	at org.apache.solr.cloud.AbstractFullDistribZkTestBase.createServers(AbstractFullDistribZkTestBase.java:268)
[junit4:junit4]    > 	at org.apache.solr.BaseDistributedSearchTestCase.testDistribSearch(BaseDistributedSearchTestCase.java:693)



On 10/28/2012 06:57 PM, Charlie Cron wrote:
> See <http://sierranevada.servebeer.com/job/fast-io-beasting/6178/>
>
> ------------------------------------------
> [...truncated 12597 lines...]
> [junit4:junit4]   2> 	        at sun.nio.ch.EPollArrayWrapper.epollWait(Native Method)
> [junit4:junit4]   2> 	        at sun.nio.ch.EPollArrayWrapper.poll(EPollArrayWrapper.java:210)
> [junit4:junit4]   2> 	        at sun.nio.ch.EPollSelectorImpl.doSelect(EPollSelectorImpl.java:65)
> [junit4:junit4]   2> 	        at sun.nio.ch.SelectorImpl.lockAndDoSelect(SelectorImpl.java:69)
> [junit4:junit4]   2> 	        at sun.nio.ch.SelectorImpl.select(SelectorImpl.java:80)
> [junit4:junit4]   2> 	        at org.eclipse.jetty.io.nio.SelectorManager$SelectSet.doSelect(SelectorManager.java:564)
> [junit4:junit4]   2> 	        at org.eclipse.jetty.io.nio.SelectorManager$1.run(SelectorManager.java:285)
> [junit4:junit4]   2> 	        at org.eclipse.jetty.util.thread.QueuedThreadPool.runJob(QueuedThreadPool.java:599)
> [junit4:junit4]   2> 	        at org.eclipse.jetty.util.thread.QueuedThreadPool$3.run(QueuedThreadPool.java:534)
> [junit4:junit4]   2> 	        at java.lang.Thread.run(Thread.java:662)
> [junit4:junit4]   2> 	   3) Thread[id=772, name=qtp1628632972-772 Acceptor1 SelectChannelConnector@0.0.0.0:46194,
state=RUNNABLE, group=TGRP-BasicDistributedZk2Test]
> [junit4:junit4]   2> 	        at org.eclipse.jetty.server.nio.SelectChannelConnector.getConnection(SelectChannelConnector.java:155)
> [junit4:junit4]   2> 	        at org.eclipse.jetty.server.AbstractConnector$Acceptor.run(AbstractConnector.java:929)
> [junit4:junit4]   2> 	        at org.eclipse.jetty.util.thread.QueuedThreadPool.runJob(QueuedThreadPool.java:599)
> [junit4:junit4]   2> 	        at org.eclipse.jetty.util.thread.QueuedThreadPool$3.run(QueuedThreadPool.java:534)
> [junit4:junit4]   2> 	        at java.lang.Thread.run(Thread.java:662)
> [junit4:junit4]   2> 	   4) Thread[id=770, name=qtp1628632972-770 Selector1, state=RUNNABLE,
group=TGRP-BasicDistributedZk2Test]
> [junit4:junit4]   2> 	        at sun.nio.ch.EPollArrayWrapper.epollWait(Native Method)
> [junit4:junit4]   2> 	        at sun.nio.ch.EPollArrayWrapper.poll(EPollArrayWrapper.java:210)
> [junit4:junit4]   2> 	        at sun.nio.ch.EPollSelectorImpl.doSelect(EPollSelectorImpl.java:65)
> [junit4:junit4]   2> 	        at sun.nio.ch.SelectorImpl.lockAndDoSelect(SelectorImpl.java:69)
> [junit4:junit4]   2> 	        at sun.nio.ch.SelectorImpl.select(SelectorImpl.java:80)
> [junit4:junit4]   2> 	        at org.eclipse.jetty.io.nio.SelectorManager$SelectSet.doSelect(SelectorManager.java:564)
> [junit4:junit4]   2> 	        at org.eclipse.jetty.io.nio.SelectorManager$1.run(SelectorManager.java:285)
> [junit4:junit4]   2> 	        at org.eclipse.jetty.util.thread.QueuedThreadPool.runJob(QueuedThreadPool.java:599)
> [junit4:junit4]   2> 	        at org.eclipse.jetty.util.thread.QueuedThreadPool$3.run(QueuedThreadPool.java:534)
> [junit4:junit4]   2> 	        at java.lang.Thread.run(Thread.java:662)
> [junit4:junit4]   2> 	   5) Thread[id=769, name=HashSessionScavenger-11, state=TIMED_WAITING,
group=TGRP-BasicDistributedZk2Test]
> [junit4:junit4]   2> 	        at java.lang.Object.wait(Native Method)
> [junit4:junit4]   2> 	        at java.util.TimerThread.mainLoop(Timer.java:509)
> [junit4:junit4]   2> 	        at java.util.TimerThread.run(Timer.java:462)
> [junit4:junit4]   2> 	   6) Thread[id=778, name=TEST-BasicDistributedZk2Test.testDistribSearch-seed#[FD84871E6F70F998]-SendThread(localhost.localdomain:60440),
state=TIMED_WAITING, group=TGRP-BasicDistributedZk2Test]
> [junit4:junit4]   2> 	        at java.lang.Thread.sleep(Native Method)
> [junit4:junit4]   2> 	        at org.apache.zookeeper.ClientCnxn$SendThread.startConnect(ClientCnxn.java:1045)
> [junit4:junit4]   2> 	        at org.apache.zookeeper.ClientCnxn$SendThread.run(ClientCnxn.java:1101)
> [junit4:junit4]   2> 	   7) Thread[id=771, name=qtp1628632972-771 Acceptor0 SelectChannelConnector@0.0.0.0:46194,
state=RUNNABLE, group=TGRP-BasicDistributedZk2Test]
> [junit4:junit4]   2> 	        at org.eclipse.jetty.server.nio.SelectChannelConnector.getConnection(SelectChannelConnector.java:155)
> [junit4:junit4]   2> 	        at org.eclipse.jetty.server.AbstractConnector$Acceptor.run(AbstractConnector.java:929)
> [junit4:junit4]   2> 	        at org.eclipse.jetty.util.thread.QueuedThreadPool.runJob(QueuedThreadPool.java:599)
> [junit4:junit4]   2> 	        at org.eclipse.jetty.util.thread.QueuedThreadPool$3.run(QueuedThreadPool.java:534)
> [junit4:junit4]   2> 	        at java.lang.Thread.run(Thread.java:662)
> [junit4:junit4]   2> NOTE: test params are: codec=Lucene3x, sim=RandomSimilarityProvider(queryNorm=true,coord=yes):
{}, locale=zh_SG, timezone=Asia/Tel_Aviv
> [junit4:junit4]   2> NOTE: Linux 3.2.0-24-generic amd64/Sun Microsystems Inc. 1.6.0_27
(64-bit)/cpus=8,threads=10,free=81316232,total=343146496
> [junit4:junit4]   2> NOTE: All tests run in this JVM: [NumericFieldsTest, OverseerTest,
HighlighterTest, TestSolrDeletionPolicy2, TestLMDirichletSimilarityFactory, ZkNodePropsTest,
TestGroupingSearch, DistanceFunctionTest, TestCSVLoader, TestCharFilters, StandardRequestHandlerTest,
DebugComponentTest, PluginInfoTest, ReturnFieldsTest, LeaderElectionTest, TestDistributedSearch,
CoreAdminHandlerTest, MBeansHandlerTest, TestQueryTypes, RequiredFieldsTest, SuggesterTest,
TestPropInject, TestUpdate, MultiTermTest, TestDFRSimilarityFactory, SpellingQueryConverterTest,
SystemInfoHandlerTest, BasicDistributedZk2Test]
> [junit4:junit4]   2> NOTE: reproduce with: ant test  -Dtestcase=BasicDistributedZk2Test
-Dtests.seed=FD84871E6F70F998 -Dtests.slow=true -Dtests.locale=zh_SG -Dtests.timezone=Asia/Tel_Aviv
-Dtests.file.encoding=ISO-8859-1
> [junit4:junit4] ERROR   0.00s J1 | BasicDistributedZk2Test (suite) <<<
> [junit4:junit4]    > Throwable #1: java.lang.AssertionError: ERROR: SolrIndexSearcher
opens=2 closes=1
> [junit4:junit4]    > 	at __randomizedtesting.SeedInfo.seed([FD84871E6F70F998]:0)
> [junit4:junit4]    > 	at org.junit.Assert.fail(Assert.java:93)
> [junit4:junit4]    > 	at org.apache.solr.SolrTestCaseJ4.endTrackingSearchers(SolrTestCaseJ4.java:242)
> [junit4:junit4]    > 	at org.apache.solr.SolrTestCaseJ4.afterClass(SolrTestCaseJ4.java:97)
> [junit4:junit4]    > 	at sun.reflect.GeneratedMethodAccessor20.invoke(Unknown Source)
> [junit4:junit4]    > 	at sun.reflect.DelegatingMethodAccessorImpl.invoke(DelegatingMethodAccessorImpl.java:25)
> [junit4:junit4]    > 	at java.lang.reflect.Method.invoke(Method.java:597)
> [junit4:junit4]    > 	at com.carrotsearch.randomizedtesting.RandomizedRunner.invoke(RandomizedRunner.java:1559)
> [junit4:junit4]    > 	at com.carrotsearch.randomizedtesting.RandomizedRunner.access$600(RandomizedRunner.java:79)
> [junit4:junit4]    > 	at com.carrotsearch.randomizedtesting.RandomizedRunner$5.evaluate(RandomizedRunner.java:700)
> [junit4:junit4]    > 	at com.carrotsearch.randomizedtesting.rules.StatementAdapter.evaluate(StatementAdapter.java:36)
> [junit4:junit4]    > 	at com.carrotsearch.randomizedtesting.rules.SystemPropertiesRestoreRule$1.evaluate(SystemPropertiesRestoreRule.java:53)
> [junit4:junit4]    > 	at org.apache.lucene.util.AbstractBeforeAfterRule$1.evaluate(AbstractBeforeAfterRule.java:45)
> [junit4:junit4]    > 	at org.apache.lucene.util.TestRuleStoreClassName$1.evaluate(TestRuleStoreClassName.java:42)
> [junit4:junit4]    > 	at com.carrotsearch.randomizedtesting.rules.SystemPropertiesInvariantRule$1.evaluate(SystemPropertiesInvariantRule.java:55)
> [junit4:junit4]    > 	at com.carrotsearch.randomizedtesting.rules.NoShadowingOrOverridesOnMethodsRule$1.evaluate(NoShadowingOrOverridesOnMethodsRule.java:39)
> [junit4:junit4]    > 	at com.carrotsearch.randomizedtesting.rules.NoShadowingOrOverridesOnMethodsRule$1.evaluate(NoShadowingOrOverridesOnMethodsRule.java:39)
> [junit4:junit4]    > 	at com.carrotsearch.randomizedtesting.rules.StatementAdapter.evaluate(StatementAdapter.java:36)
> [junit4:junit4]    > 	at org.apache.lucene.util.TestRuleAssertionsRequired$1.evaluate(TestRuleAssertionsRequired.java:43)
> [junit4:junit4]    > 	at org.apache.lucene.util.TestRuleMarkFailure$1.evaluate(TestRuleMarkFailure.java:48)
> [junit4:junit4]    > 	at org.apache.lucene.util.TestRuleIgnoreAfterMaxFailures$1.evaluate(TestRuleIgnoreAfterMaxFailures.java:70)
> [junit4:junit4]    > 	at org.apache.lucene.util.TestRuleIgnoreTestSuites$1.evaluate(TestRuleIgnoreTestSuites.java:55)
> [junit4:junit4]    > 	at com.carrotsearch.randomizedtesting.rules.StatementAdapter.evaluate(StatementAdapter.java:36)
> [junit4:junit4]    > 	at com.carrotsearch.randomizedtesting.ThreadLeakControl$StatementRunner.run(ThreadLeakControl.java:358)
> [junit4:junit4]    > 	at java.lang.Thread.run(Thread.java:662)
> [junit4:junit4]    > Throwable #2: com.carrotsearch.randomizedtesting.ThreadLeakError:
12 threads leaked from SUITE scope at org.apache.solr.cloud.BasicDistributedZk2Test:
> [junit4:junit4]    >    1) Thread[id=772, name=qtp1628632972-772 Acceptor1 SelectChannelConnector@0.0.0.0:46194,
state=BLOCKED, group=TGRP-BasicDistributedZk2Test]
> [junit4:junit4]    >         at sun.nio.ch.ServerSocketChannelImpl.accept(ServerSocketChannelImpl.java:136)
> [junit4:junit4]    >         at org.eclipse.jetty.server.nio.SelectChannelConnector.accept(SelectChannelConnector.java:104)
> [junit4:junit4]    >         at org.eclipse.jetty.server.AbstractConnector$Acceptor.run(AbstractConnector.java:933)
> [junit4:junit4]    >         at org.eclipse.jetty.util.thread.QueuedThreadPool.runJob(QueuedThreadPool.java:599)
> [junit4:junit4]    >         at org.eclipse.jetty.util.thread.QueuedThreadPool$3.run(QueuedThreadPool.java:534)
> [junit4:junit4]    >         at java.lang.Thread.run(Thread.java:662)
> [junit4:junit4]    >    2) Thread[id=775, name=qtp1628632972-775, state=TIMED_WAITING,
group=TGRP-BasicDistributedZk2Test]
> [junit4:junit4]    >         at sun.misc.Unsafe.park(Native Method)
> [junit4:junit4]    >         at java.util.concurrent.locks.LockSupport.parkNanos(LockSupport.java:196)
> [junit4:junit4]    >         at java.util.concurrent.locks.AbstractQueuedSynchronizer$ConditionObject.awaitNanos(AbstractQueuedSynchronizer.java:2025)
> [junit4:junit4]    >         at org.eclipse.jetty.util.BlockingArrayQueue.poll(BlockingArrayQueue.java:337)
> [junit4:junit4]    >         at org.eclipse.jetty.util.thread.QueuedThreadPool.idleJobPoll(QueuedThreadPool.java:517)
> [junit4:junit4]    >         at org.eclipse.jetty.util.thread.QueuedThreadPool.access$600(QueuedThreadPool.java:39)
> [junit4:junit4]    >         at org.eclipse.jetty.util.thread.QueuedThreadPool$3.run(QueuedThreadPool.java:563)
> [junit4:junit4]    >         at java.lang.Thread.run(Thread.java:662)
> [junit4:junit4]    >    3) Thread[id=770, name=qtp1628632972-770 Selector1, state=RUNNABLE,
group=TGRP-BasicDistributedZk2Test]
> [junit4:junit4]    >         at sun.nio.ch.EPollArrayWrapper.epollWait(Native Method)
> [junit4:junit4]    >         at sun.nio.ch.EPollArrayWrapper.poll(EPollArrayWrapper.java:210)
> [junit4:junit4]    >         at sun.nio.ch.EPollSelectorImpl.doSelect(EPollSelectorImpl.java:65)
> [junit4:junit4]    >         at sun.nio.ch.SelectorImpl.lockAndDoSelect(SelectorImpl.java:69)
> [junit4:junit4]    >         at sun.nio.ch.SelectorImpl.select(SelectorImpl.java:80)
> [junit4:junit4]    >         at org.eclipse.jetty.io.nio.SelectorManager$SelectSet.doSelect(SelectorManager.java:564)
> [junit4:junit4]    >         at org.eclipse.jetty.io.nio.SelectorManager$1.run(SelectorManager.java:285)
> [junit4:junit4]    >         at org.eclipse.jetty.util.thread.QueuedThreadPool.runJob(QueuedThreadPool.java:599)
> [junit4:junit4]    >         at org.eclipse.jetty.util.thread.QueuedThreadPool$3.run(QueuedThreadPool.java:534)
> [junit4:junit4]    >         at java.lang.Thread.run(Thread.java:662)
> [junit4:junit4]    >    4) Thread[id=769, name=HashSessionScavenger-11, state=TIMED_WAITING,
group=TGRP-BasicDistributedZk2Test]
> [junit4:junit4]    >         at java.lang.Object.wait(Native Method)
> [junit4:junit4]    >         at java.util.TimerThread.mainLoop(Timer.java:509)
> [junit4:junit4]    >         at java.util.TimerThread.run(Timer.java:462)
> [junit4:junit4]    >    5) Thread[id=778, name=TEST-BasicDistributedZk2Test.testDistribSearch-seed#[FD84871E6F70F998]-SendThread(localhost.localdomain:60440),
state=TIMED_WAITING, group=TGRP-BasicDistributedZk2Test]
> [junit4:junit4]    >         at java.lang.Thread.sleep(Native Method)
> [junit4:junit4]    >         at org.apache.zookeeper.ClientCnxn$SendThread.startConnect(ClientCnxn.java:1045)
> [junit4:junit4]    >         at org.apache.zookeeper.ClientCnxn$SendThread.run(ClientCnxn.java:1101)
> [junit4:junit4]    >    6) Thread[id=776, name=qtp1628632972-776, state=TIMED_WAITING,
group=TGRP-BasicDistributedZk2Test]
> [junit4:junit4]    >         at sun.misc.Unsafe.park(Native Method)
> [junit4:junit4]    >         at java.util.concurrent.locks.LockSupport.parkNanos(LockSupport.java:196)
> [junit4:junit4]    >         at java.util.concurrent.locks.AbstractQueuedSynchronizer$ConditionObject.awaitNanos(AbstractQueuedSynchronizer.java:2025)
> [junit4:junit4]    >         at org.eclipse.jetty.util.BlockingArrayQueue.poll(BlockingArrayQueue.java:337)
> [junit4:junit4]    >         at org.eclipse.jetty.util.thread.QueuedThreadPool.idleJobPoll(QueuedThreadPool.java:517)
> [junit4:junit4]    >         at org.eclipse.jetty.util.thread.QueuedThreadPool.access$600(QueuedThreadPool.java:39)
> [junit4:junit4]    >         at org.eclipse.jetty.util.thread.QueuedThreadPool$3.run(QueuedThreadPool.java:563)
> [junit4:junit4]    >         at java.lang.Thread.run(Thread.java:662)
> [junit4:junit4]    >    7) Thread[id=774, name=qtp1628632972-774, state=TIMED_WAITING,
group=TGRP-BasicDistributedZk2Test]
> [junit4:junit4]    >         at sun.misc.Unsafe.park(Native Method)
> [junit4:junit4]    >         at java.util.concurrent.locks.LockSupport.parkNanos(LockSupport.java:196)
> [junit4:junit4]    >         at java.util.concurrent.locks.AbstractQueuedSynchronizer$ConditionObject.awaitNanos(AbstractQueuedSynchronizer.java:2025)
> [junit4:junit4]    >         at org.eclipse.jetty.util.BlockingArrayQueue.poll(BlockingArrayQueue.java:337)
> [junit4:junit4]    >         at org.eclipse.jetty.util.thread.QueuedThreadPool.idleJobPoll(QueuedThreadPool.java:517)
> [junit4:junit4]    >         at org.eclipse.jetty.util.thread.QueuedThreadPool.access$600(QueuedThreadPool.java:39)
> [junit4:junit4]    >         at org.eclipse.jetty.util.thread.QueuedThreadPool$3.run(QueuedThreadPool.java:563)
> [junit4:junit4]    >         at java.lang.Thread.run(Thread.java:662)
> [junit4:junit4]    >    8) Thread[id=780, name=searcherExecutor-265-thread-1, state=WAITING,
group=TGRP-BasicDistributedZk2Test]
> [junit4:junit4]    >         at sun.misc.Unsafe.park(Native Method)
> [junit4:junit4]    >         at java.util.concurrent.locks.LockSupport.park(LockSupport.java:156)
> [junit4:junit4]    >         at java.util.concurrent.locks.AbstractQueuedSynchronizer$ConditionObject.await(AbstractQueuedSynchronizer.java:1987)
> [junit4:junit4]    >         at java.util.concurrent.LinkedBlockingQueue.take(LinkedBlockingQueue.java:399)
> [junit4:junit4]    >         at java.util.concurrent.ThreadPoolExecutor.getTask(ThreadPoolExecutor.java:947)
> [junit4:junit4]    >         at java.util.concurrent.ThreadPoolExecutor$Worker.run(ThreadPoolExecutor.java:907)
> [junit4:junit4]    >         at java.lang.Thread.run(Thread.java:662)
> [junit4:junit4]    >    9) Thread[id=779, name=TEST-BasicDistributedZk2Test.testDistribSearch-seed#[FD84871E6F70F998]-EventThread,
state=WAITING, group=TGRP-BasicDistributedZk2Test]
> [junit4:junit4]    >         at sun.misc.Unsafe.park(Native Method)
> [junit4:junit4]    >         at java.util.concurrent.locks.LockSupport.park(LockSupport.java:156)
> [junit4:junit4]    >         at java.util.concurrent.locks.AbstractQueuedSynchronizer$ConditionObject.await(AbstractQueuedSynchronizer.java:1987)
> [junit4:junit4]    >         at java.util.concurrent.LinkedBlockingQueue.take(LinkedBlockingQueue.java:399)
> [junit4:junit4]    >         at org.apache.zookeeper.ClientCnxn$EventThread.run(ClientCnxn.java:498)
> [junit4:junit4]    >   10) Thread[id=777, name=qtp1628632972-777 Selector0, state=RUNNABLE,
group=TGRP-BasicDistributedZk2Test]
> [junit4:junit4]    >         at sun.nio.ch.EPollArrayWrapper.epollWait(Native Method)
> [junit4:junit4]    >         at sun.nio.ch.EPollArrayWrapper.poll(EPollArrayWrapper.java:210)
> [junit4:junit4]    >         at sun.nio.ch.EPollSelectorImpl.doSelect(EPollSelectorImpl.java:65)
> [junit4:junit4]    >         at sun.nio.ch.SelectorImpl.lockAndDoSelect(SelectorImpl.java:69)
> [junit4:junit4]    >         at sun.nio.ch.SelectorImpl.select(SelectorImpl.java:80)
> [junit4:junit4]    >         at org.eclipse.jetty.io.nio.SelectorManager$SelectSet.doSelect(SelectorManager.java:564)
> [junit4:junit4]    >         at org.eclipse.jetty.io.nio.SelectorManager$1.run(SelectorManager.java:285)
> [junit4:junit4]    >         at org.eclipse.jetty.util.thread.QueuedThreadPool.runJob(QueuedThreadPool.java:599)
> [junit4:junit4]    >         at org.eclipse.jetty.util.thread.QueuedThreadPool$3.run(QueuedThreadPool.java:534)
> [junit4:junit4]    >         at java.lang.Thread.run(Thread.java:662)
> [junit4:junit4]    >   11) Thread[id=771, name=qtp1628632972-771 Acceptor0 SelectChannelConnector@0.0.0.0:46194,
state=RUNNABLE, group=TGRP-BasicDistributedZk2Test]
> [junit4:junit4]    >         at sun.nio.ch.ServerSocketChannelImpl.accept0(Native
Method)
> [junit4:junit4]    >         at sun.nio.ch.ServerSocketChannelImpl.accept(ServerSocketChannelImpl.java:152)
> [junit4:junit4]    >         at org.eclipse.jetty.server.nio.SelectChannelConnector.accept(SelectChannelConnector.java:104)
> [junit4:junit4]    >         at org.eclipse.jetty.server.AbstractConnector$Acceptor.run(AbstractConnector.java:933)
> [junit4:junit4]    >         at org.eclipse.jetty.util.thread.QueuedThreadPool.runJob(QueuedThreadPool.java:599)
> [junit4:junit4]    >         at org.eclipse.jetty.util.thread.QueuedThreadPool$3.run(QueuedThreadPool.java:534)
> [junit4:junit4]    >         at java.lang.Thread.run(Thread.java:662)
> [junit4:junit4]    >   12) Thread[id=773, name=qtp1628632972-773, state=TIMED_WAITING,
group=TGRP-BasicDistributedZk2Test]
> [junit4:junit4]    >         at sun.misc.Unsafe.park(Native Method)
> [junit4:junit4]    >         at java.util.concurrent.locks.LockSupport.parkNanos(LockSupport.java:196)
> [junit4:junit4]    >         at java.util.concurrent.locks.AbstractQueuedSynchronizer$ConditionObject.awaitNanos(AbstractQueuedSynchronizer.java:2025)
> [junit4:junit4]    >         at org.eclipse.jetty.util.BlockingArrayQueue.poll(BlockingArrayQueue.java:337)
> [junit4:junit4]    >         at org.eclipse.jetty.util.thread.QueuedThreadPool.idleJobPoll(QueuedThreadPool.java:517)
> [junit4:junit4]    >         at org.eclipse.jetty.util.thread.QueuedThreadPool.access$600(QueuedThreadPool.java:39)
> [junit4:junit4]    >         at org.eclipse.jetty.util.thread.QueuedThreadPool$3.run(QueuedThreadPool.java:563)
> [junit4:junit4]    >         at java.lang.Thread.run(Thread.java:662)
> [junit4:junit4]    > 	at __randomizedtesting.SeedInfo.seed([FD84871E6F70F998]:0)
> [junit4:junit4]    > Throwable #3: com.carrotsearch.randomizedtesting.ThreadLeakError:
There are still zombie threads that couldn't be terminated:
> [junit4:junit4]    >    1) Thread[id=780, name=searcherExecutor-265-thread-1, state=WAITING,
group=TGRP-BasicDistributedZk2Test]
> [junit4:junit4]    >         at sun.misc.Unsafe.park(Native Method)
> [junit4:junit4]    >         at java.util.concurrent.locks.LockSupport.park(LockSupport.java:156)
> [junit4:junit4]    >         at java.util.concurrent.locks.AbstractQueuedSynchronizer$ConditionObject.await(AbstractQueuedSynchronizer.java:1987)
> [junit4:junit4]    >         at java.util.concurrent.LinkedBlockingQueue.take(LinkedBlockingQueue.java:399)
> [junit4:junit4]    >         at java.util.concurrent.ThreadPoolExecutor.getTask(ThreadPoolExecutor.java:947)
> [junit4:junit4]    >         at java.util.concurrent.ThreadPoolExecutor$Worker.run(ThreadPoolExecutor.java:907)
> [junit4:junit4]    >         at java.lang.Thread.run(Thread.java:662)
> [junit4:junit4]    >    2) Thread[id=777, name=qtp1628632972-777 Selector0, state=RUNNABLE,
group=TGRP-BasicDistributedZk2Test]
> [junit4:junit4]    >         at sun.nio.ch.EPollArrayWrapper.epollWait(Native Method)
> [junit4:junit4]    >         at sun.nio.ch.EPollArrayWrapper.poll(EPollArrayWrapper.java:210)
> [junit4:junit4]    >         at sun.nio.ch.EPollSelectorImpl.doSelect(EPollSelectorImpl.java:65)
> [junit4:junit4]    >         at sun.nio.ch.SelectorImpl.lockAndDoSelect(SelectorImpl.java:69)
> [junit4:junit4]    >         at sun.nio.ch.SelectorImpl.select(SelectorImpl.java:80)
> [junit4:junit4]    >         at org.eclipse.jetty.io.nio.SelectorManager$SelectSet.doSelect(SelectorManager.java:564)
> [junit4:junit4]    >         at org.eclipse.jetty.io.nio.SelectorManager$1.run(SelectorManager.java:285)
> [junit4:junit4]    >         at org.eclipse.jetty.util.thread.QueuedThreadPool.runJob(QueuedThreadPool.java:599)
> [junit4:junit4]    >         at org.eclipse.jetty.util.thread.QueuedThreadPool$3.run(QueuedThreadPool.java:534)
> [junit4:junit4]    >         at java.lang.Thread.run(Thread.java:662)
> [junit4:junit4]    >    3) Thread[id=772, name=qtp1628632972-772 Acceptor1 SelectChannelConnector@0.0.0.0:46194,
state=RUNNABLE, group=TGRP-BasicDistributedZk2Test]
> [junit4:junit4]    >         at org.eclipse.jetty.server.nio.SelectChannelConnector.getConnection(SelectChannelConnector.java:155)
> [junit4:junit4]    >         at org.eclipse.jetty.server.AbstractConnector$Acceptor.run(AbstractConnector.java:929)
> [junit4:junit4]    >         at org.eclipse.jetty.util.thread.QueuedThreadPool.runJob(QueuedThreadPool.java:599)
> [junit4:junit4]    >         at org.eclipse.jetty.util.thread.QueuedThreadPool$3.run(QueuedThreadPool.java:534)
> [junit4:junit4]    >         at java.lang.Thread.run(Thread.java:662)
> [junit4:junit4]    >    4) Thread[id=770, name=qtp1628632972-770 Selector1, state=RUNNABLE,
group=TGRP-BasicDistributedZk2Test]
> [junit4:junit4]    >         at sun.nio.ch.EPollArrayWrapper.epollWait(Native Method)
> [junit4:junit4]    >         at sun.nio.ch.EPollArrayWrapper.poll(EPollArrayWrapper.java:210)
> [junit4:junit4]    >         at sun.nio.ch.EPollSelectorImpl.doSelect(EPollSelectorImpl.java:65)
> [junit4:junit4]    >         at sun.nio.ch.SelectorImpl.lockAndDoSelect(SelectorImpl.java:69)
> [junit4:junit4]    >         at sun.nio.ch.SelectorImpl.select(SelectorImpl.java:80)
> [junit4:junit4]    >         at org.eclipse.jetty.io.nio.SelectorManager$SelectSet.doSelect(SelectorManager.java:564)
> [junit4:junit4]    >         at org.eclipse.jetty.io.nio.SelectorManager$1.run(SelectorManager.java:285)
> [junit4:junit4]    >         at org.eclipse.jetty.util.thread.QueuedThreadPool.runJob(QueuedThreadPool.java:599)
> [junit4:junit4]    >         at org.eclipse.jetty.util.thread.QueuedThreadPool$3.run(QueuedThreadPool.java:534)
> [junit4:junit4]    >         at java.lang.Thread.run(Thread.java:662)
> [junit4:junit4]    >    5) Thread[id=769, name=HashSessionScavenger-11, state=TIMED_WAITING,
group=TGRP-BasicDistributedZk2Test]
> [junit4:junit4]    >         at java.lang.Object.wait(Native Method)
> [junit4:junit4]    >         at java.util.TimerThread.mainLoop(Timer.java:509)
> [junit4:junit4]    >         at java.util.TimerThread.run(Timer.java:462)
> [junit4:junit4]    >    6) Thread[id=778, name=TEST-BasicDistributedZk2Test.testDistribSearch-seed#[FD84871E6F70F998]-SendThread(localhost.localdomain:60440),
state=TIMED_WAITING, group=TGRP-BasicDistributedZk2Test]
> [junit4:junit4]    >         at java.lang.Thread.sleep(Native Method)
> [junit4:junit4]    >         at org.apache.zookeeper.ClientCnxn$SendThread.startConnect(ClientCnxn.java:1045)
> [junit4:junit4]    >         at org.apache.zookeeper.ClientCnxn$SendThread.run(ClientCnxn.java:1101)
> [junit4:junit4]    >    7) Thread[id=771, name=qtp1628632972-771 Acceptor0 SelectChannelConnector@0.0.0.0:46194,
state=RUNNABLE, group=TGRP-BasicDistributedZk2Test]
> [junit4:junit4]    >         at org.eclipse.jetty.server.nio.SelectChannelConnector.getConnection(SelectChannelConnector.java:155)
> [junit4:junit4]    >         at org.eclipse.jetty.server.AbstractConnector$Acceptor.run(AbstractConnector.java:929)
> [junit4:junit4]    >         at org.eclipse.jetty.util.thread.QueuedThreadPool.runJob(QueuedThreadPool.java:599)
> [junit4:junit4]    >         at org.eclipse.jetty.util.thread.QueuedThreadPool$3.run(QueuedThreadPool.java:534)
> [junit4:junit4]    >         at java.lang.Thread.run(Thread.java:662)
> [junit4:junit4]    > 	at __randomizedtesting.SeedInfo.seed([FD84871E6F70F998]:0)
> [junit4:junit4] Completed on J1 in 155.05s, 1 test, 1 failure, 3 errors <<<
FAILURES!
> [junit4:junit4]
> [junit4:junit4]
> [junit4:junit4] Tests with failures:
> [junit4:junit4]   - org.apache.solr.cloud.BasicDistributedZk2Test.testDistribSearch
> [junit4:junit4]   - org.apache.solr.cloud.BasicDistributedZk2Test (suite)
> [junit4:junit4]
> [junit4:junit4]
> [junit4:junit4] JVM J0:     1.10 ..   174.73 =   173.63s
> [junit4:junit4] JVM J1:     0.86 ..   257.03 =   256.17s
> [junit4:junit4] JVM J2:     1.10 ..   124.57 =   123.47s
> [junit4:junit4] JVM J3:     0.86 ..   121.26 =   120.40s
> [junit4:junit4] JVM J4:     1.10 ..   129.97 =   128.87s
> [junit4:junit4] JVM J5:     1.10 ..   126.50 =   125.40s
> [junit4:junit4] JVM J6:     1.10 ..   131.03 =   129.94s
> [junit4:junit4] JVM J7:     0.86 ..   121.55 =   120.69s
> [junit4:junit4] Execution time total: 4 minutes 17 seconds
> [junit4:junit4] Tests summary: 233 suites, 965 tests, 3 suite-level errors, 1 error,
7 ignored (2 assumptions)
>
> BUILD FAILED
> <http://sierranevada.servebeer.com/job/fast-io-beasting/ws/build.xml>:39: The following
error occurred while executing this line:
> <http://sierranevada.servebeer.com/job/fast-io-beasting/ws/solr/build.xml>:178:
The following error occurred while executing this line:
> <http://sierranevada.servebeer.com/job/fast-io-beasting/ws/lucene/module-build.xml>:61:
The following error occurred while executing this line:
> <http://sierranevada.servebeer.com/job/fast-io-beasting/ws/lucene/common-build.xml>:1159:
The following error occurred while executing this line:
> <http://sierranevada.servebeer.com/job/fast-io-beasting/ws/lucene/common-build.xml>:827:
There were test failures: 233 suites, 965 tests, 3 suite-level errors, 1 error, 7 ignored
(2 assumptions)
>
> Total time: 9 minutes 20 seconds
> Build step 'Invoke Ant' marked build as failure
>
> ---------------------------------------------------------------------
> To unsubscribe, e-mail: dev-unsubscribe@lucene.apache.org
> For additional commands, e-mail: dev-help@lucene.apache.org
>


Mime
View raw message