lucene-dev mailing list archives

Site index · List index
Message view « Date » · « Thread »
Top « Date » · « Thread »
From Charlie Cron <hudsonsevilt...@gmail.com>
Subject Build failed in Jenkins: fast-io-beasting #6142
Date Sun, 28 Oct 2012 16:59:53 GMT
See <http://sierranevada.servebeer.com/job/fast-io-beasting/6142/>

------------------------------------------
[...truncated 13397 lines...]
[junit4:junit4]   2> 853653 T92 oaz.ClientCnxn$EventThread.run EventThread shut down
[junit4:junit4]   2> 853652 T15 oaz.ZooKeeper.close Session: 0x13aa84172010007 closed
[junit4:junit4]   2> 853653 T17 oazs.NIOServerCnxn.closeSock Closed socket connection for
client /127.0.0.1:56832 which had sessionid 0x13aa84172010007
[junit4:junit4]   2> 853654 T22 oazs.PrepRequestProcessor.run PrepRequestProcessor exited
loop!
[junit4:junit4]   2> 853654 T21 oazs.SyncRequestProcessor.run SyncRequestProcessor exited!
[junit4:junit4]   2> 853656 T15 oazs.FinalRequestProcessor.shutdown shutdown of request
processor complete
[junit4:junit4]   2> 853718 T15 oazs.NIOServerCnxn.closeSock Closed socket connection for
client /127.0.0.1:56614 which had sessionid 0x13aa84172010005
[junit4:junit4]   2> 853718 T73 oaz.ClientCnxn$SendThread.run Unable to read additional
data from server sessionid 0x13aa84172010005, likely server has closed socket, closing socket
connection and attempting reconnect
[junit4:junit4]   2> 853718 T15 oazs.NIOServerCnxn.closeSock Closed socket connection for
client /127.0.0.1:56610 which had sessionid 0x13aa84172010004
[junit4:junit4]   2> 853719 T61 oaz.ClientCnxn$SendThread.run Unable to read additional
data from server sessionid 0x13aa84172010004, likely server has closed socket, closing socket
connection and attempting reconnect
[junit4:junit4]   2> 853719 T15 oazs.NIOServerCnxn.closeSock Closed socket connection for
client /127.0.0.1:56830 which had sessionid 0x13aa84172010006
[junit4:junit4]   2> 853720 T86 oaz.ClientCnxn$SendThread.run Unable to read additional
data from server sessionid 0x13aa84172010006, likely server has closed socket, closing socket
connection and attempting reconnect
[junit4:junit4]   2> 853720 T15 oazs.NIOServerCnxn.closeSock Closed socket connection for
client /127.0.0.1:56148 which had sessionid 0x13aa84172010002
[junit4:junit4]   2> 853721 T35 oaz.ClientCnxn$SendThread.run Unable to read additional
data from server sessionid 0x13aa84172010002, likely server has closed socket, closing socket
connection and attempting reconnect
[junit4:junit4]   2> 853721 T15 oazs.NIOServerCnxn.closeSock Closed socket connection for
client /127.0.0.1:56156 which had sessionid 0x13aa84172010003
[junit4:junit4]   2> 853721 T49 oaz.ClientCnxn$SendThread.run Unable to read additional
data from server sessionid 0x13aa84172010003, likely server has closed socket, closing socket
connection and attempting reconnect
[junit4:junit4]   2> 853722 T17 oazs.NIOServerCnxn$Factory.run NIOServerCnxn factory exited
run method
[junit4:junit4]   2> 853723 T15 oazs.FinalRequestProcessor.shutdown shutdown of request
processor complete
[junit4:junit4]   2> 853723 T15 oasc.ChaosMonkey.monkeyLog monkey: stop shard! 46385
[junit4:junit4]   2> 853724 T15 oasc.CoreContainer.shutdown Shutting down CoreContainer
instance=79793817
[junit4:junit4]   2> 853724 T15 oasc.SolrCore.close [collection1]  CLOSING SolrCore org.apache.solr.core.SolrCore@59e14a78
[junit4:junit4]   2> 853736 T15 oasu.DirectUpdateHandler2.close closing DirectUpdateHandler2{commits=0,autocommits=0,soft
autocommits=0,optimizes=0,rollbacks=0,expungeDeletes=0,docsPending=0,adds=0,deletesById=0,deletesByQuery=0,errors=0,cumulative_adds=0,cumulative_deletesById=0,cumulative_deletesByQuery=0,cumulative_errors=0}
[junit4:junit4]   2> 853737 T15 oasc.SolrCore.decrefSolrCoreState Closing SolrCoreState
[junit4:junit4]   2> 853737 T15 oasu.DefaultSolrCoreState.closeIndexWriter SolrCoreState
ref count has reached 0 - closing IndexWriter
[junit4:junit4]   2> 853738 T15 oasu.DefaultSolrCoreState.closeIndexWriter closing IndexWriter
with IndexWriterCloser
[junit4:junit4]   2> 853738 T15 oasc.SolrCore.closeSearcher [collection1] Closing main
searcher on request.
[junit4:junit4]   2> 853741 T37 oasc.Overseer$ClusterStateUpdater.amILeader According to
ZK I (id=88568141726154754-127.0.0.1:46385_solr-n_0000000000) am no longer a leader.
[junit4:junit4]   2> 853819 T74 oascc.ConnectionManager.process Watcher org.apache.solr.common.cloud.ConnectionManager@483bead5
name:ZooKeeperConnection Watcher:127.0.0.1:47022/solr got event WatchedEvent state:Disconnected
type:None path:null path:null type:None
[junit4:junit4]   2> 853819 T74 oascc.ConnectionManager.process zkClient has disconnected
[junit4:junit4]   2> 853820 T62 oascc.ConnectionManager.process Watcher org.apache.solr.common.cloud.ConnectionManager@5e8518d4
name:ZooKeeperConnection Watcher:127.0.0.1:47022/solr got event WatchedEvent state:Disconnected
type:None path:null path:null type:None
[junit4:junit4]   2> 853820 T62 oascc.ConnectionManager.process zkClient has disconnected
[junit4:junit4]   2> 853821 T87 oascc.ConnectionManager.process Watcher org.apache.solr.common.cloud.ConnectionManager@5ad89e02
name:ZooKeeperConnection Watcher:127.0.0.1:47022/solr got event WatchedEvent state:Disconnected
type:None path:null path:null type:None
[junit4:junit4]   2> 853821 T87 oascc.ConnectionManager.process zkClient has disconnected
[junit4:junit4]   2> 853821 T36 oascc.ConnectionManager.process Watcher org.apache.solr.common.cloud.ConnectionManager@1a15cd9a
name:ZooKeeperConnection Watcher:127.0.0.1:47022/solr got event WatchedEvent state:Disconnected
type:None path:null path:null type:None
[junit4:junit4]   2> 853822 T36 oascc.ConnectionManager.process zkClient has disconnected
[junit4:junit4]   2> 853821 T15 oaz.ZooKeeper.close Session: 0x13aa84172010002 closed
[junit4:junit4]   2> 853822 T36 oaz.ClientCnxn$EventThread.run EventThread shut down
[junit4:junit4]   2> 853822 T50 oascc.ConnectionManager.process Watcher org.apache.solr.common.cloud.ConnectionManager@6c3744bc
name:ZooKeeperConnection Watcher:127.0.0.1:47022/solr got event WatchedEvent state:Disconnected
type:None path:null path:null type:None
[junit4:junit4]   2> 853823 T50 oascc.ConnectionManager.process zkClient has disconnected
[junit4:junit4]   2> 853845 T15 oejsh.ContextHandler.doStop stopped o.e.j.s.ServletContextHandler{/solr,null}
[junit4:junit4]   2> 853899 T15 oasc.ChaosMonkey.monkeyLog monkey: stop shard! 50052
[junit4:junit4]   2> 853900 T15 oasc.CoreContainer.shutdown Shutting down CoreContainer
instance=1739580512
[junit4:junit4]   2> 853952 T19 oazs.SessionTrackerImpl.run SessionTrackerImpl exited loop!
[junit4:junit4]   2> 855028 T49 oaz.ClientCnxn$SendThread.startConnect Opening socket connection
to server localhost.localdomain/127.0.0.1:47022
[junit4:junit4]   2> 855078 T86 oaz.ClientCnxn$SendThread.startConnect Opening socket connection
to server localhost.localdomain/127.0.0.1:47022
[junit4:junit4]   2> 855078 T86 oaz.ClientCnxn$SendThread.run WARNING Session 0x13aa84172010006
for server null, unexpected error, closing socket connection and attempting reconnect java.net.ConnectException:
Connection refused
[junit4:junit4]   2> 	at sun.nio.ch.SocketChannelImpl.checkConnect(Native Method)
[junit4:junit4]   2> 	at sun.nio.ch.SocketChannelImpl.finishConnect(SocketChannelImpl.java:567)
[junit4:junit4]   2> 	at org.apache.zookeeper.ClientCnxn$SendThread.run(ClientCnxn.java:1143)
[junit4:junit4]   2> 
[junit4:junit4]   2> 855129 T50 oaz.ClientCnxn$EventThread.run EventThread shut down
[junit4:junit4]   2> 855129 T15 oaz.ZooKeeper.close Session: 0x13aa84172010003 closed
[junit4:junit4]   2> 855142 T15 oejsh.ContextHandler.doStop stopped o.e.j.s.ServletContextHandler{/solr,null}
[junit4:junit4]   2> 855195 T15 oasc.ChaosMonkey.monkeyLog monkey: stop shard! 34672
[junit4:junit4]   2> 855195 T15 oasc.CoreContainer.shutdown Shutting down CoreContainer
instance=61646306
[junit4:junit4]   2> 855196 T15 oasc.SolrCore.close [collection1]  CLOSING SolrCore org.apache.solr.core.SolrCore@64135f0a
[junit4:junit4]   2> 855204 T15 oasu.DirectUpdateHandler2.close closing DirectUpdateHandler2{commits=1,autocommits=0,soft
autocommits=0,optimizes=0,rollbacks=0,expungeDeletes=0,docsPending=0,adds=0,deletesById=0,deletesByQuery=0,errors=0,cumulative_adds=0,cumulative_deletesById=0,cumulative_deletesByQuery=0,cumulative_errors=0}
[junit4:junit4]   2> 855204 T15 oasc.SolrCore.decrefSolrCoreState Closing SolrCoreState
[junit4:junit4]   2> 855205 T15 oasu.DefaultSolrCoreState.closeIndexWriter SolrCoreState
ref count has reached 0 - closing IndexWriter
[junit4:junit4]   2> 855205 T15 oasu.DefaultSolrCoreState.closeIndexWriter closing IndexWriter
with IndexWriterCloser
[junit4:junit4]   2> 855206 T15 oasc.SolrCore.closeSearcher [collection1] Closing main
searcher on request.
[junit4:junit4]   2> 855604 T61 oaz.ClientCnxn$SendThread.startConnect Opening socket connection
to server localhost.localdomain/127.0.0.1:47022
[junit4:junit4]   2> 855705 T62 oaz.ClientCnxn$EventThread.run EventThread shut down
[junit4:junit4]   2> 855705 T15 oaz.ZooKeeper.close Session: 0x13aa84172010004 closed
[junit4:junit4]   2> 855717 T73 oaz.ClientCnxn$SendThread.startConnect Opening socket connection
to server localhost.localdomain/127.0.0.1:47022
[junit4:junit4]   2> 855718 T73 oaz.ClientCnxn$SendThread.run WARNING Session 0x13aa84172010005
for server null, unexpected error, closing socket connection and attempting reconnect java.net.ConnectException:
Connection refused
[junit4:junit4]   2> 	at sun.nio.ch.SocketChannelImpl.checkConnect(Native Method)
[junit4:junit4]   2> 	at sun.nio.ch.SocketChannelImpl.finishConnect(SocketChannelImpl.java:567)
[junit4:junit4]   2> 	at org.apache.zookeeper.ClientCnxn$SendThread.run(ClientCnxn.java:1143)
[junit4:junit4]   2> 
[junit4:junit4]   2> 855727 T15 oejsh.ContextHandler.doStop stopped o.e.j.s.ServletContextHandler{/solr,null}
[junit4:junit4]   2> 855780 T15 oasc.ChaosMonkey.monkeyLog monkey: stop shard! 46320
[junit4:junit4]   2> 855780 T15 oasc.CoreContainer.shutdown Shutting down CoreContainer
instance=1223464001
[junit4:junit4]   2> 855780 T15 oasc.SolrCore.close [collection1]  CLOSING SolrCore org.apache.solr.core.SolrCore@6eef9525
[junit4:junit4]   2> 855790 T15 oasu.DirectUpdateHandler2.close closing DirectUpdateHandler2{commits=0,autocommits=0,soft
autocommits=0,optimizes=0,rollbacks=0,expungeDeletes=0,docsPending=0,adds=0,deletesById=0,deletesByQuery=0,errors=0,cumulative_adds=0,cumulative_deletesById=0,cumulative_deletesByQuery=0,cumulative_errors=0}
[junit4:junit4]   2> 855790 T15 oasc.SolrCore.decrefSolrCoreState Closing SolrCoreState
[junit4:junit4]   2> 855790 T15 oasu.DefaultSolrCoreState.closeIndexWriter SolrCoreState
ref count has reached 0 - closing IndexWriter
[junit4:junit4]   2> 855790 T15 oasu.DefaultSolrCoreState.closeIndexWriter closing IndexWriter
with IndexWriterCloser
[junit4:junit4]   2> 855791 T15 oasc.SolrCore.closeSearcher [collection1] Closing main
searcher on request.
[junit4:junit4]   2> 855818 T74 oaz.ClientCnxn$EventThread.run EventThread shut down
[junit4:junit4]   2> 855818 T15 oaz.ZooKeeper.close Session: 0x13aa84172010005 closed
[junit4:junit4]   2> 855841 T15 oejsh.ContextHandler.doStop stopped o.e.j.s.ServletContextHandler{/solr,null}
[junit4:junit4]   2> 855893 T15 oasc.ChaosMonkey.monkeyLog monkey: stop shard! 35019
[junit4:junit4]   2> 855893 T15 oasc.CoreContainer.shutdown Shutting down CoreContainer
instance=1804533116
[junit4:junit4]   2> 855893 T15 oasc.SolrCore.close [collection1]  CLOSING SolrCore org.apache.solr.core.SolrCore@2c453c47
[junit4:junit4]   2> 855909 T15 oasu.DirectUpdateHandler2.close closing DirectUpdateHandler2{commits=1,autocommits=0,soft
autocommits=0,optimizes=0,rollbacks=0,expungeDeletes=0,docsPending=0,adds=0,deletesById=0,deletesByQuery=0,errors=0,cumulative_adds=0,cumulative_deletesById=0,cumulative_deletesByQuery=0,cumulative_errors=0}
[junit4:junit4]   2> 855912 T15 oasc.SolrCore.decrefSolrCoreState Closing SolrCoreState
[junit4:junit4]   2> 855912 T15 oasu.DefaultSolrCoreState.closeIndexWriter SolrCoreState
ref count has reached 0 - closing IndexWriter
[junit4:junit4]   2> 855912 T15 oasu.DefaultSolrCoreState.closeIndexWriter closing IndexWriter
with IndexWriterCloser
[junit4:junit4]   2> 855914 T15 oasc.SolrCore.closeSearcher [collection1] Closing main
searcher on request.
[junit4:junit4]   2> 856190 T86 oaz.ClientCnxn$SendThread.startConnect Opening socket connection
to server localhost.localdomain/127.0.0.1:47022
[junit4:junit4]   2> 856291 T87 oaz.ClientCnxn$EventThread.run EventThread shut down
[junit4:junit4]   2> 856291 T15 oaz.ZooKeeper.close Session: 0x13aa84172010006 closed
[junit4:junit4]   2> 856313 T15 oejsh.ContextHandler.doStop stopped o.e.j.s.ServletContextHandler{/solr,null}
[junit4:junit4]   2> 856381 T15 oas.SolrTestCaseJ4.tearDown ###Ending testDistribSearch
[junit4:junit4]   2> NOTE: reproduce with: ant test  -Dtestcase=BasicDistributedZkTest
-Dtests.method=testDistribSearch -Dtests.seed=A3ED5CA83FB0427A -Dtests.slow=true -Dtests.locale=zh_HK
-Dtests.timezone=America/Knox_IN -Dtests.file.encoding=ISO-8859-1
[junit4:junit4] FAILURE  856s J0 | BasicDistributedZkTest.testDistribSearch <<<
[junit4:junit4]    > Throwable #1: java.lang.AssertionError: There are still nodes recoverying
[junit4:junit4]    > 	at __randomizedtesting.SeedInfo.seed([A3ED5CA83FB0427A:220BD2B048EF2246]:0)
[junit4:junit4]    > 	at org.junit.Assert.fail(Assert.java:93)
[junit4:junit4]    > 	at org.apache.solr.cloud.AbstractDistribZkTestBase.waitForRecoveriesToFinish(AbstractDistribZkTestBase.java:154)
[junit4:junit4]    > 	at org.apache.solr.cloud.AbstractDistribZkTestBase.waitForRecoveriesToFinish(AbstractDistribZkTestBase.java:115)
[junit4:junit4]    > 	at org.apache.solr.cloud.AbstractDistribZkTestBase.waitForRecoveriesToFinish(AbstractDistribZkTestBase.java:110)
[junit4:junit4]    > 	at org.apache.solr.cloud.AbstractFullDistribZkTestBase.waitForRecoveriesToFinish(AbstractFullDistribZkTestBase.java:553)
[junit4:junit4]    > 	at org.apache.solr.cloud.BasicDistributedZkTest.doTest(BasicDistributedZkTest.java:162)
[junit4:junit4]    > 	at org.apache.solr.BaseDistributedSearchTestCase.testDistribSearch(BaseDistributedSearchTestCase.java:695)
[junit4:junit4]    > 	at sun.reflect.NativeMethodAccessorImpl.invoke0(Native Method)
[junit4:junit4]    > 	at sun.reflect.NativeMethodAccessorImpl.invoke(NativeMethodAccessorImpl.java:39)
[junit4:junit4]    > 	at sun.reflect.DelegatingMethodAccessorImpl.invoke(DelegatingMethodAccessorImpl.java:25)
[junit4:junit4]    > 	at java.lang.reflect.Method.invoke(Method.java:597)
[junit4:junit4]    > 	at com.carrotsearch.randomizedtesting.RandomizedRunner.invoke(RandomizedRunner.java:1559)
[junit4:junit4]    > 	at com.carrotsearch.randomizedtesting.RandomizedRunner.access$600(RandomizedRunner.java:79)
[junit4:junit4]    > 	at com.carrotsearch.randomizedtesting.RandomizedRunner$6.evaluate(RandomizedRunner.java:737)
[junit4:junit4]    > 	at com.carrotsearch.randomizedtesting.RandomizedRunner$7.evaluate(RandomizedRunner.java:773)
[junit4:junit4]    > 	at com.carrotsearch.randomizedtesting.RandomizedRunner$8.evaluate(RandomizedRunner.java:787)
[junit4:junit4]    > 	at com.carrotsearch.randomizedtesting.rules.SystemPropertiesRestoreRule$1.evaluate(SystemPropertiesRestoreRule.java:53)
[junit4:junit4]    > 	at org.apache.lucene.util.TestRuleSetupTeardownChained$1.evaluate(TestRuleSetupTeardownChained.java:50)
[junit4:junit4]    > 	at org.apache.lucene.util.TestRuleFieldCacheSanity$1.evaluate(TestRuleFieldCacheSanity.java:51)
[junit4:junit4]    > 	at org.apache.lucene.util.AbstractBeforeAfterRule$1.evaluate(AbstractBeforeAfterRule.java:45)
[junit4:junit4]    > 	at com.carrotsearch.randomizedtesting.rules.SystemPropertiesInvariantRule$1.evaluate(SystemPropertiesInvariantRule.java:55)
[junit4:junit4]    > 	at org.apache.lucene.util.TestRuleThreadAndTestName$1.evaluate(TestRuleThreadAndTestName.java:48)
[junit4:junit4]    > 	at org.apache.lucene.util.TestRuleIgnoreAfterMaxFailures$1.evaluate(TestRuleIgnoreAfterMaxFailures.java:70)
[junit4:junit4]    > 	at org.apache.lucene.util.TestRuleMarkFailure$1.evaluate(TestRuleMarkFailure.java:48)
[junit4:junit4]    > 	at com.carrotsearch.randomizedtesting.rules.StatementAdapter.evaluate(StatementAdapter.java:36)
[junit4:junit4]    > 	at com.carrotsearch.randomizedtesting.ThreadLeakControl$StatementRunner.run(ThreadLeakControl.java:358)
[junit4:junit4]    > 	at com.carrotsearch.randomizedtesting.ThreadLeakControl.forkTimeoutingTask(ThreadLeakControl.java:782)
[junit4:junit4]    > 	at com.carrotsearch.randomizedtesting.ThreadLeakControl$3.evaluate(ThreadLeakControl.java:442)
[junit4:junit4]    > 	at com.carrotsearch.randomizedtesting.RandomizedRunner.runSingleTest(RandomizedRunner.java:746)
[junit4:junit4]    > 	at com.carrotsearch.randomizedtesting.RandomizedRunner$3.evaluate(RandomizedRunner.java:648)
[junit4:junit4]    > 	at com.carrotsearch.randomizedtesting.RandomizedRunner$4.evaluate(RandomizedRunner.java:682)
[junit4:junit4]    > 	at com.carrotsearch.randomizedtesting.RandomizedRunner$5.evaluate(RandomizedRunner.java:693)
[junit4:junit4]    > 	at com.carrotsearch.randomizedtesting.rules.StatementAdapter.evaluate(StatementAdapter.java:36)
[junit4:junit4]    > 	at com.carrotsearch.randomizedtesting.rules.SystemPropertiesRestoreRule$1.evaluate(SystemPropertiesRestoreRule.java:53)
[junit4:junit4]    > 	at org.apache.lucene.util.AbstractBeforeAfterRule$1.evaluate(AbstractBeforeAfterRule.java:45)
[junit4:junit4]    > 	at org.apache.lucene.util.TestRuleStoreClassName$1.evaluate(TestRuleStoreClassName.java:42)
[junit4:junit4]    > 	at com.carrotsearch.randomizedtesting.rules.SystemPropertiesInvariantRule$1.evaluate(SystemPropertiesInvariantRule.java:55)
[junit4:junit4]    > 	at com.carrotsearch.randomizedtesting.rules.NoShadowingOrOverridesOnMethodsRule$1.evaluate(NoShadowingOrOverridesOnMethodsRule.java:39)
[junit4:junit4]    > 	at com.carrotsearch.randomizedtesting.rules.NoShadowingOrOverridesOnMethodsRule$1.evaluate(NoShadowingOrOverridesOnMethodsRule.java:39)
[junit4:junit4]    > 	at com.carrotsearch.randomizedtesting.rules.StatementAdapter.evaluate(StatementAdapter.java:36)
[junit4:junit4]    > 	at org.apache.lucene.util.TestRuleAssertionsRequired$1.evaluate(TestRuleAssertionsRequired.java:43)
[junit4:junit4]    > 	at org.apache.lucene.util.TestRuleMarkFailure$1.evaluate(TestRuleMarkFailure.java:48)
[junit4:junit4]    > 	at org.apache.lucene.util.TestRuleIgnoreAfterMaxFailures$1.evaluate(TestRuleIgnoreAfterMaxFailures.java:70)
[junit4:junit4]    > 	at org.apache.lucene.util.TestRuleIgnoreTestSuites$1.evaluate(TestRuleIgnoreTestSuites.java:55)
[junit4:junit4]    > 	at com.carrotsearch.randomizedtesting.rules.StatementAdapter.evaluate(StatementAdapter.java:36)
[junit4:junit4]    > 	at com.carrotsearch.randomizedtesting.ThreadLeakControl$StatementRunner.run(ThreadLeakControl.java:358)
[junit4:junit4]    > 	at java.lang.Thread.run(Thread.java:662)
[junit4:junit4]   2> 856409 T15 oas.SolrTestCaseJ4.deleteCore ###deleteCore
[junit4:junit4]   2> 977421 T15 oas.SolrTestCaseJ4.endTrackingSearchers SEVERE ERROR: SolrIndexSearcher
opens=7 closes=6
[junit4:junit4]   2> 977427 T14 ccr.ThreadLeakControl.checkThreadLeaks WARNING Will linger
awaiting termination of 1 leaked thread(s).
[junit4:junit4]   2> 997484 T14 ccr.ThreadLeakControl.checkThreadLeaks SEVERE 1 thread
leaked from SUITE scope at org.apache.solr.cloud.BasicDistributedZkTest: 
[junit4:junit4]   2> 	   1) Thread[id=51, name=searcherExecutor-19-thread-1, state=WAITING,
group=TGRP-BasicDistributedZkTest]
[junit4:junit4]   2> 	        at sun.misc.Unsafe.park(Native Method)
[junit4:junit4]   2> 	        at java.util.concurrent.locks.LockSupport.park(LockSupport.java:156)
[junit4:junit4]   2> 	        at java.util.concurrent.locks.AbstractQueuedSynchronizer$ConditionObject.await(AbstractQueuedSynchronizer.java:1987)
[junit4:junit4]   2> 	        at java.util.concurrent.LinkedBlockingQueue.take(LinkedBlockingQueue.java:399)
[junit4:junit4]   2> 	        at java.util.concurrent.ThreadPoolExecutor.getTask(ThreadPoolExecutor.java:947)
[junit4:junit4]   2> 	        at java.util.concurrent.ThreadPoolExecutor$Worker.run(ThreadPoolExecutor.java:907)
[junit4:junit4]   2> 	        at java.lang.Thread.run(Thread.java:662)
[junit4:junit4]   2> 997484 T14 ccr.ThreadLeakControl.tryToInterruptAll Starting to interrupt
leaked threads:
[junit4:junit4]   2> 	   1) Thread[id=51, name=searcherExecutor-19-thread-1, state=WAITING,
group=TGRP-BasicDistributedZkTest]
[junit4:junit4]   2> 1000486 T14 ccr.ThreadLeakControl.tryToInterruptAll SEVERE There are
still zombie threads that couldn't be terminated:
[junit4:junit4]   2> 	   1) Thread[id=51, name=searcherExecutor-19-thread-1, state=WAITING,
group=TGRP-BasicDistributedZkTest]
[junit4:junit4]   2> 	        at sun.misc.Unsafe.park(Native Method)
[junit4:junit4]   2> 	        at java.util.concurrent.locks.LockSupport.park(LockSupport.java:156)
[junit4:junit4]   2> 	        at java.util.concurrent.locks.AbstractQueuedSynchronizer$ConditionObject.await(AbstractQueuedSynchronizer.java:1987)
[junit4:junit4]   2> 	        at java.util.concurrent.LinkedBlockingQueue.take(LinkedBlockingQueue.java:399)
[junit4:junit4]   2> 	        at java.util.concurrent.ThreadPoolExecutor.getTask(ThreadPoolExecutor.java:947)
[junit4:junit4]   2> 	        at java.util.concurrent.ThreadPoolExecutor$Worker.run(ThreadPoolExecutor.java:907)
[junit4:junit4]   2> 	        at java.lang.Thread.run(Thread.java:662)
[junit4:junit4]   2> NOTE: test params are: codec=Lucene3x, sim=RandomSimilarityProvider(queryNorm=true,coord=yes):
{}, locale=zh_HK, timezone=America/Knox_IN
[junit4:junit4]   2> NOTE: Linux 3.2.0-24-generic amd64/Sun Microsystems Inc. 1.6.0_27
(64-bit)/cpus=8,threads=2,free=251603480,total=300548096
[junit4:junit4]   2> NOTE: All tests run in this JVM: [PathHierarchyTokenizerFactoryTest,
TestFastWriter, BasicDistributedZkTest]
[junit4:junit4]   2> NOTE: reproduce with: ant test  -Dtestcase=BasicDistributedZkTest
-Dtests.seed=A3ED5CA83FB0427A -Dtests.slow=true -Dtests.locale=zh_HK -Dtests.timezone=America/Knox_IN
-Dtests.file.encoding=ISO-8859-1
[junit4:junit4] ERROR   0.00s J0 | BasicDistributedZkTest (suite) <<<
[junit4:junit4]    > Throwable #1: java.lang.AssertionError: ERROR: SolrIndexSearcher opens=7
closes=6
[junit4:junit4]    > 	at __randomizedtesting.SeedInfo.seed([A3ED5CA83FB0427A]:0)
[junit4:junit4]    > 	at org.junit.Assert.fail(Assert.java:93)
[junit4:junit4]    > 	at org.apache.solr.SolrTestCaseJ4.endTrackingSearchers(SolrTestCaseJ4.java:242)
[junit4:junit4]    > 	at org.apache.solr.SolrTestCaseJ4.afterClass(SolrTestCaseJ4.java:97)
[junit4:junit4]    > 	at sun.reflect.NativeMethodAccessorImpl.invoke0(Native Method)
[junit4:junit4]    > 	at sun.reflect.NativeMethodAccessorImpl.invoke(NativeMethodAccessorImpl.java:39)
[junit4:junit4]    > 	at sun.reflect.DelegatingMethodAccessorImpl.invoke(DelegatingMethodAccessorImpl.java:25)
[junit4:junit4]    > 	at java.lang.reflect.Method.invoke(Method.java:597)
[junit4:junit4]    > 	at com.carrotsearch.randomizedtesting.RandomizedRunner.invoke(RandomizedRunner.java:1559)
[junit4:junit4]    > 	at com.carrotsearch.randomizedtesting.RandomizedRunner.access$600(RandomizedRunner.java:79)
[junit4:junit4]    > 	at com.carrotsearch.randomizedtesting.RandomizedRunner$5.evaluate(RandomizedRunner.java:700)
[junit4:junit4]    > 	at com.carrotsearch.randomizedtesting.rules.StatementAdapter.evaluate(StatementAdapter.java:36)
[junit4:junit4]    > 	at com.carrotsearch.randomizedtesting.rules.SystemPropertiesRestoreRule$1.evaluate(SystemPropertiesRestoreRule.java:53)
[junit4:junit4]    > 	at org.apache.lucene.util.AbstractBeforeAfterRule$1.evaluate(AbstractBeforeAfterRule.java:45)
[junit4:junit4]    > 	at org.apache.lucene.util.TestRuleStoreClassName$1.evaluate(TestRuleStoreClassName.java:42)
[junit4:junit4]    > 	at com.carrotsearch.randomizedtesting.rules.SystemPropertiesInvariantRule$1.evaluate(SystemPropertiesInvariantRule.java:55)
[junit4:junit4]    > 	at com.carrotsearch.randomizedtesting.rules.NoShadowingOrOverridesOnMethodsRule$1.evaluate(NoShadowingOrOverridesOnMethodsRule.java:39)
[junit4:junit4]    > 	at com.carrotsearch.randomizedtesting.rules.NoShadowingOrOverridesOnMethodsRule$1.evaluate(NoShadowingOrOverridesOnMethodsRule.java:39)
[junit4:junit4]    > 	at com.carrotsearch.randomizedtesting.rules.StatementAdapter.evaluate(StatementAdapter.java:36)
[junit4:junit4]    > 	at org.apache.lucene.util.TestRuleAssertionsRequired$1.evaluate(TestRuleAssertionsRequired.java:43)
[junit4:junit4]    > 	at org.apache.lucene.util.TestRuleMarkFailure$1.evaluate(TestRuleMarkFailure.java:48)
[junit4:junit4]    > 	at org.apache.lucene.util.TestRuleIgnoreAfterMaxFailures$1.evaluate(TestRuleIgnoreAfterMaxFailures.java:70)
[junit4:junit4]    > 	at org.apache.lucene.util.TestRuleIgnoreTestSuites$1.evaluate(TestRuleIgnoreTestSuites.java:55)
[junit4:junit4]    > 	at com.carrotsearch.randomizedtesting.rules.StatementAdapter.evaluate(StatementAdapter.java:36)
[junit4:junit4]    > 	at com.carrotsearch.randomizedtesting.ThreadLeakControl$StatementRunner.run(ThreadLeakControl.java:358)
[junit4:junit4]    > 	at java.lang.Thread.run(Thread.java:662)
[junit4:junit4]    > Throwable #2: com.carrotsearch.randomizedtesting.ThreadLeakError:
1 thread leaked from SUITE scope at org.apache.solr.cloud.BasicDistributedZkTest: 
[junit4:junit4]    >    1) Thread[id=51, name=searcherExecutor-19-thread-1, state=WAITING,
group=TGRP-BasicDistributedZkTest]
[junit4:junit4]    >         at sun.misc.Unsafe.park(Native Method)
[junit4:junit4]    >         at java.util.concurrent.locks.LockSupport.park(LockSupport.java:156)
[junit4:junit4]    >         at java.util.concurrent.locks.AbstractQueuedSynchronizer$ConditionObject.await(AbstractQueuedSynchronizer.java:1987)
[junit4:junit4]    >         at java.util.concurrent.LinkedBlockingQueue.take(LinkedBlockingQueue.java:399)
[junit4:junit4]    >         at java.util.concurrent.ThreadPoolExecutor.getTask(ThreadPoolExecutor.java:947)
[junit4:junit4]    >         at java.util.concurrent.ThreadPoolExecutor$Worker.run(ThreadPoolExecutor.java:907)
[junit4:junit4]    >         at java.lang.Thread.run(Thread.java:662)
[junit4:junit4]    > 	at __randomizedtesting.SeedInfo.seed([A3ED5CA83FB0427A]:0)
[junit4:junit4]    > Throwable #3: com.carrotsearch.randomizedtesting.ThreadLeakError:
There are still zombie threads that couldn't be terminated:
[junit4:junit4]    >    1) Thread[id=51, name=searcherExecutor-19-thread-1, state=WAITING,
group=TGRP-BasicDistributedZkTest]
[junit4:junit4]    >         at sun.misc.Unsafe.park(Native Method)
[junit4:junit4]    >         at java.util.concurrent.locks.LockSupport.park(LockSupport.java:156)
[junit4:junit4]    >         at java.util.concurrent.locks.AbstractQueuedSynchronizer$ConditionObject.await(AbstractQueuedSynchronizer.java:1987)
[junit4:junit4]    >         at java.util.concurrent.LinkedBlockingQueue.take(LinkedBlockingQueue.java:399)
[junit4:junit4]    >         at java.util.concurrent.ThreadPoolExecutor.getTask(ThreadPoolExecutor.java:947)
[junit4:junit4]    >         at java.util.concurrent.ThreadPoolExecutor$Worker.run(ThreadPoolExecutor.java:907)
[junit4:junit4]    >         at java.lang.Thread.run(Thread.java:662)
[junit4:junit4]    > 	at __randomizedtesting.SeedInfo.seed([A3ED5CA83FB0427A]:0)
[junit4:junit4] Completed on J0 in 1000.57s, 1 test, 2 failures, 2 errors <<< FAILURES!
[junit4:junit4] 
[junit4:junit4] 
[junit4:junit4] Tests with failures:
[junit4:junit4]   - org.apache.solr.cloud.BasicDistributedZkTest.testDistribSearch
[junit4:junit4]   - org.apache.solr.cloud.BasicDistributedZkTest (suite)
[junit4:junit4] 
[junit4:junit4] 
[junit4:junit4] JVM J0:     1.11 ..  1009.61 =  1008.50s
[junit4:junit4] JVM J1:     0.87 ..   137.04 =   136.16s
[junit4:junit4] JVM J2:     0.87 ..   112.05 =   111.18s
[junit4:junit4] JVM J3:     1.11 ..   103.66 =   102.55s
[junit4:junit4] JVM J4:     1.11 ..   114.84 =   113.72s
[junit4:junit4] JVM J5:     0.87 ..   110.22 =   109.35s
[junit4:junit4] JVM J6:     0.88 ..   112.42 =   111.55s
[junit4:junit4] JVM J7:     1.11 ..   109.84 =   108.73s
[junit4:junit4] Execution time total: 16 minutes 49 seconds
[junit4:junit4] Tests summary: 233 suites, 965 tests, 3 suite-level errors, 1 failure, 7 ignored
(2 assumptions)

BUILD FAILED
<http://sierranevada.servebeer.com/job/fast-io-beasting/ws/build.xml>:39: The following
error occurred while executing this line:
<http://sierranevada.servebeer.com/job/fast-io-beasting/ws/solr/build.xml>:178: The
following error occurred while executing this line:
<http://sierranevada.servebeer.com/job/fast-io-beasting/ws/lucene/module-build.xml>:61:
The following error occurred while executing this line:
<http://sierranevada.servebeer.com/job/fast-io-beasting/ws/lucene/common-build.xml>:1159:
The following error occurred while executing this line:
<http://sierranevada.servebeer.com/job/fast-io-beasting/ws/lucene/common-build.xml>:827:
There were test failures: 233 suites, 965 tests, 3 suite-level errors, 1 failure, 7 ignored
(2 assumptions)

Total time: 21 minutes 37 seconds
Build step 'Invoke Ant' marked build as failure

---------------------------------------------------------------------
To unsubscribe, e-mail: dev-unsubscribe@lucene.apache.org
For additional commands, e-mail: dev-help@lucene.apache.org


Mime
View raw message