lucene-dev mailing list archives

Site index · List index
Message view « Date » · « Thread »
Top « Date » · « Thread »
From Policeman Jenkins Server <jenk...@sd-datasolutions.de>
Subject [JENKINS] Lucene-Solr-trunk-Linux (32bit/jdk1.7.0_07) - Build # 2094 - Failure!
Date Tue, 30 Oct 2012 14:23:59 GMT
Build: http://jenkins.sd-datasolutions.de/job/Lucene-Solr-trunk-Linux/2094/
Java: 32bit/jdk1.7.0_07 -client -XX:+UseConcMarkSweepGC

4 tests failed.
FAILED:  junit.framework.TestSuite.org.apache.solr.cloud.LeaderElectionIntegrationTest

Error Message:
Suite timeout exceeded (>= 7200000 msec).

Stack Trace:
java.lang.Exception: Suite timeout exceeded (>= 7200000 msec).
	at __randomizedtesting.SeedInfo.seed([7AE0C40E452B3188]:0)


FAILED:  junit.framework.TestSuite.org.apache.solr.cloud.LeaderElectionIntegrationTest

Error Message:
Captured an uncaught exception in thread: Thread[id=1861, name=Thread-744, state=RUNNABLE, group=Overseer state updater.]

Stack Trace:
com.carrotsearch.randomizedtesting.UncaughtExceptionError: Captured an uncaught exception in thread: Thread[id=1861, name=Thread-744, state=RUNNABLE, group=Overseer state updater.]
Caused by: java.util.NoSuchElementException
	at __randomizedtesting.SeedInfo.seed([7AE0C40E452B3188]:0)
	at org.apache.solr.cloud.DistributedQueue.remove(DistributedQueue.java:148)
	at org.apache.solr.cloud.Overseer$ClusterStateUpdater.run(Overseer.java:131)
	at java.lang.Thread.run(Thread.java:722)


FAILED:  junit.framework.TestSuite.org.apache.solr.handler.XmlUpdateRequestHandlerTest

Error Message:
Clean up static fields (in @AfterClass?), your test seems to hang on to approximately 12,409,824 bytes (threshold is 10,485,760). Field reference sizes (counted individually):   - 12,589,136 bytes, protected static org.apache.solr.handler.UpdateRequestHandler org.apache.solr.handler.XmlUpdateRequestHandlerTest.handler   - 3,096 bytes, private static javax.xml.stream.XMLInputFactory org.apache.solr.handler.XmlUpdateRequestHandlerTest.inputFactory   - 264 bytes, public static org.junit.rules.TestRule org.apache.solr.SolrTestCaseJ4.solrClassRules   - 216 bytes, protected static java.lang.String org.apache.solr.SolrTestCaseJ4.testSolrHome   - 120 bytes, private static java.lang.String org.apache.solr.SolrTestCaseJ4.factoryProp   - 64 bytes, private static java.lang.String org.apache.solr.SolrTestCaseJ4.coreName

Stack Trace:
junit.framework.AssertionFailedError: Clean up static fields (in @AfterClass?), your test seems to hang on to approximately 12,409,824 bytes (threshold is 10,485,760). Field reference sizes (counted individually):
  - 12,589,136 bytes, protected static org.apache.solr.handler.UpdateRequestHandler org.apache.solr.handler.XmlUpdateRequestHandlerTest.handler
  - 3,096 bytes, private static javax.xml.stream.XMLInputFactory org.apache.solr.handler.XmlUpdateRequestHandlerTest.inputFactory
  - 264 bytes, public static org.junit.rules.TestRule org.apache.solr.SolrTestCaseJ4.solrClassRules
  - 216 bytes, protected static java.lang.String org.apache.solr.SolrTestCaseJ4.testSolrHome
  - 120 bytes, private static java.lang.String org.apache.solr.SolrTestCaseJ4.factoryProp
  - 64 bytes, private static java.lang.String org.apache.solr.SolrTestCaseJ4.coreName
	at __randomizedtesting.SeedInfo.seed([7AE0C40E452B3188]:0)
	at com.carrotsearch.randomizedtesting.rules.StaticFieldsInvariantRule$1.afterAlways(StaticFieldsInvariantRule.java:127)
	at com.carrotsearch.randomizedtesting.rules.StatementAdapter.evaluate(StatementAdapter.java:43)
	at org.apache.lucene.util.TestRuleAssertionsRequired$1.evaluate(TestRuleAssertionsRequired.java:43)
	at org.apache.lucene.util.TestRuleMarkFailure$1.evaluate(TestRuleMarkFailure.java:48)
	at org.apache.lucene.util.TestRuleIgnoreAfterMaxFailures$1.evaluate(TestRuleIgnoreAfterMaxFailures.java:70)
	at org.apache.lucene.util.TestRuleIgnoreTestSuites$1.evaluate(TestRuleIgnoreTestSuites.java:55)
	at com.carrotsearch.randomizedtesting.rules.StatementAdapter.evaluate(StatementAdapter.java:36)
	at com.carrotsearch.randomizedtesting.ThreadLeakControl$StatementRunner.run(ThreadLeakControl.java:358)
	at java.lang.Thread.run(Thread.java:722)


REGRESSION:  org.apache.solr.cloud.LeaderElectionIntegrationTest.testSimpleSliceLeaderElection

Error Message:
Test abandoned because suite timeout was reached.

Stack Trace:
java.lang.Exception: Test abandoned because suite timeout was reached.
	at __randomizedtesting.SeedInfo.seed([7AE0C40E452B3188]:0)




Build Log:
[...truncated 8904 lines...]
[junit4:junit4] Suite: org.apache.solr.handler.XmlUpdateRequestHandlerTest
[junit4:junit4]   2> 1 T2177 oas.SolrTestCaseJ4.initCore ####initCore
[junit4:junit4]   2> Creating dataDir: /mnt/ssd/jenkins/workspace/Lucene-Solr-trunk-Linux/solr/build/solr-core/test/J0/./solrtest-XmlUpdateRequestHandlerTest-1351600218629
[junit4:junit4]   2> 2 T2177 oasc.SolrResourceLoader.<init> new SolrResourceLoader for directory: '/mnt/ssd/jenkins/workspace/Lucene-Solr-trunk-Linux/solr/build/solr-core/test-files/solr/collection1/'
[junit4:junit4]   2> 3 T2177 oasc.SolrResourceLoader.replaceClassLoader Adding 'file:/mnt/ssd/jenkins/workspace/Lucene-Solr-trunk-Linux/solr/build/solr-core/test-files/solr/collection1/lib/README' to classloader
[junit4:junit4]   2> 4 T2177 oasc.SolrResourceLoader.replaceClassLoader Adding 'file:/mnt/ssd/jenkins/workspace/Lucene-Solr-trunk-Linux/solr/build/solr-core/test-files/solr/collection1/lib/classes/' to classloader
[junit4:junit4]   2> 38 T2177 oasc.SolrConfig.<init> Using Lucene MatchVersion: LUCENE_50
[junit4:junit4]   2> 82 T2177 oasc.SolrConfig.<init> Loaded SolrConfig: solrconfig.xml
[junit4:junit4]   2> 82 T2177 oass.IndexSchema.readSchema Reading Solr Schema
[junit4:junit4]   2> 87 T2177 oass.IndexSchema.readSchema Schema name=test
[junit4:junit4]   2> 460 T2177 oass.OpenExchangeRatesOrgProvider.init Initialized with rates=open-exchange-rates.json, refreshInterval=1440.
[junit4:junit4]   2> 466 T2177 oass.IndexSchema.readSchema default search field in schema is text
[junit4:junit4]   2> 469 T2177 oass.IndexSchema.readSchema unique key field: id
[junit4:junit4]   2> 473 T2177 oass.FileExchangeRateProvider.reload Reloading exchange rates from file currency.xml
[junit4:junit4]   2> 481 T2177 oass.FileExchangeRateProvider.reload Reloading exchange rates from file currency.xml
[junit4:junit4]   2> 483 T2177 oass.OpenExchangeRatesOrgProvider.reload Reloading exchange rates from open-exchange-rates.json
[junit4:junit4]   2> 484 T2177 oass.OpenExchangeRatesOrgProvider.reload Reloading exchange rates from open-exchange-rates.json
[junit4:junit4]   2> 485 T2177 oasc.SolrResourceLoader.locateSolrHome JNDI not configured for solr (NoInitialContextEx)
[junit4:junit4]   2> 485 T2177 oasc.SolrResourceLoader.locateSolrHome using system property solr.solr.home: /mnt/ssd/jenkins/workspace/Lucene-Solr-trunk-Linux/solr/build/solr-core/test-files/solr
[junit4:junit4]   2> 485 T2177 oasc.SolrResourceLoader.<init> new SolrResourceLoader for directory: '/mnt/ssd/jenkins/workspace/Lucene-Solr-trunk-Linux/solr/build/solr-core/test-files/solr/'
[junit4:junit4]   2> 491 T2177 oasc.CoreContainer.<init> New CoreContainer 19990885
[junit4:junit4]   2> 492 T2177 oasc.SolrCore.<init> [collection1] Opening new SolrCore at /mnt/ssd/jenkins/workspace/Lucene-Solr-trunk-Linux/solr/build/solr-core/test-files/solr/collection1/, dataDir=/mnt/ssd/jenkins/workspace/Lucene-Solr-trunk-Linux/solr/build/solr-core/test/J0/./solrtest-XmlUpdateRequestHandlerTest-1351600218629/
[junit4:junit4]   2> 492 T2177 oasc.JmxMonitoredMap.<init> JMX monitoring is enabled. Adding Solr mbeans to JMX Server: com.sun.jmx.mbeanserver.JmxMBeanServer@dec164
[junit4:junit4]   2> 493 T2177 oasc.SolrCore.initDirectoryFactory org.apache.solr.core.MockDirectoryFactory
[junit4:junit4]   2> 493 T2177 oasc.CachingDirectoryFactory.injectLockFactory WARNING No lockType configured for MockDirWrapper(org.apache.lucene.store.RAMDirectory@181ec7f lockFactory=org.apache.lucene.store.SingleInstanceLockFactory@cd89b2) assuming 'simple'
[junit4:junit4]   2> 494 T2177 oasc.CachingDirectoryFactory.get return new directory for /mnt/ssd/jenkins/workspace/Lucene-Solr-trunk-Linux/solr/build/solr-core/test/J0/./solrtest-XmlUpdateRequestHandlerTest-1351600218629 forceNew:false
[junit4:junit4]   2> 494 T2177 oasc.CachingDirectoryFactory.close Releasing directory:/mnt/ssd/jenkins/workspace/Lucene-Solr-trunk-Linux/solr/build/solr-core/test/J0/./solrtest-XmlUpdateRequestHandlerTest-1351600218629
[junit4:junit4]   2> 495 T2177 oasc.SolrCore.getNewIndexDir New index directory detected: old=null new=/mnt/ssd/jenkins/workspace/Lucene-Solr-trunk-Linux/solr/build/solr-core/test/J0/./solrtest-XmlUpdateRequestHandlerTest-1351600218629/index/
[junit4:junit4]   2> 495 T2177 oasc.SolrCore.initIndex WARNING [collection1] Solr index directory '/mnt/ssd/jenkins/workspace/Lucene-Solr-trunk-Linux/solr/build/solr-core/test/J0/./solrtest-XmlUpdateRequestHandlerTest-1351600218629/index' doesn't exist. Creating new index...
[junit4:junit4]   2> 496 T2177 oasc.CachingDirectoryFactory.get return new directory for /mnt/ssd/jenkins/workspace/Lucene-Solr-trunk-Linux/solr/build/solr-core/test/J0/./solrtest-XmlUpdateRequestHandlerTest-1351600218629/index forceNew:false
[junit4:junit4]   2> 497 T2177 oasc.SolrDeletionPolicy.onCommit SolrDeletionPolicy.onCommit: commits:num=1
[junit4:junit4]   2> 		commit{dir=MockDirWrapper(org.apache.lucene.store.RAMDirectory@1a33e6e lockFactory=org.apache.lucene.store.NativeFSLockFactory@183bbdf),segFN=segments_1,generation=1,filenames=[segments_1]
[junit4:junit4]   2> 497 T2177 oasc.SolrDeletionPolicy.updateCommits newest commit = 1[segments_1]
[junit4:junit4]   2> 498 T2177 oasc.CachingDirectoryFactory.close Releasing directory:/mnt/ssd/jenkins/workspace/Lucene-Solr-trunk-Linux/solr/build/solr-core/test/J0/./solrtest-XmlUpdateRequestHandlerTest-1351600218629/index
[junit4:junit4]   2> 498 T2177 oasc.SolrCore.initWriters created xml: solr.XMLResponseWriter
[junit4:junit4]   2> 500 T2177 oasup.UpdateRequestProcessorChain.init inserting DistributedUpdateProcessorFactory into updateRequestProcessorChain "dedupe"
[junit4:junit4]   2> 500 T2177 oasup.UpdateRequestProcessorChain.init inserting DistributedUpdateProcessorFactory into updateRequestProcessorChain "dedupe-allfields"
[junit4:junit4]   2> 501 T2177 oasup.UpdateRequestProcessorChain.init inserting DistributedUpdateProcessorFactory into updateRequestProcessorChain "stored_sig"
[junit4:junit4]   2> 501 T2177 oasup.UpdateRequestProcessorChain.init inserting DistributedUpdateProcessorFactory into updateRequestProcessorChain "uniq-fields"
[junit4:junit4]   2> 502 T2177 oasup.UpdateRequestProcessorChain.init inserting DistributedUpdateProcessorFactory into updateRequestProcessorChain "distrib-dup-test-chain-implicit"
[junit4:junit4]   2> 502 T2177 oasc.RequestHandlers.initHandlersFromConfig adding lazy requestHandler: solr.ReplicationHandler
[junit4:junit4]   2> 502 T2177 oasc.RequestHandlers.initHandlersFromConfig created /replication: solr.ReplicationHandler
[junit4:junit4]   2> 505 T2177 oasc.RequestHandlers.initHandlersFromConfig created standard: solr.StandardRequestHandler
[junit4:junit4]   2> 507 T2177 oasc.RequestHandlers.initHandlersFromConfig created /get: solr.RealTimeGetHandler
[junit4:junit4]   2> 507 T2177 oasc.RequestHandlers.initHandlersFromConfig created dismax: solr.SearchHandler
[junit4:junit4]   2> 508 T2177 oasc.RequestHandlers.initHandlersFromConfig created mock: org.apache.solr.core.MockQuerySenderListenerReqHandler
[junit4:junit4]   2> 509 T2177 oasc.RequestHandlers.initHandlersFromConfig created /admin/: org.apache.solr.handler.admin.AdminHandlers
[junit4:junit4]   2> 510 T2177 oasc.RequestHandlers.initHandlersFromConfig created defaults: solr.StandardRequestHandler
[junit4:junit4]   2> 510 T2177 oasc.RequestHandlers.initHandlersFromConfig adding lazy requestHandler: solr.StandardRequestHandler
[junit4:junit4]   2> 511 T2177 oasc.RequestHandlers.initHandlersFromConfig created lazy: solr.StandardRequestHandler
[junit4:junit4]   2> 511 T2177 oasc.RequestHandlers.initHandlersFromConfig created /update: solr.UpdateRequestHandler
[junit4:junit4]   2> 512 T2177 oasc.RequestHandlers.initHandlersFromConfig created /terms: org.apache.solr.handler.component.SearchHandler
[junit4:junit4]   2> 513 T2177 oasc.RequestHandlers.initHandlersFromConfig created spellCheckCompRH: org.apache.solr.handler.component.SearchHandler
[junit4:junit4]   2> 514 T2177 oasc.RequestHandlers.initHandlersFromConfig created spellCheckCompRH_Direct: org.apache.solr.handler.component.SearchHandler
[junit4:junit4]   2> 515 T2177 oasc.RequestHandlers.initHandlersFromConfig created spellCheckWithWordbreak: org.apache.solr.handler.component.SearchHandler
[junit4:junit4]   2> 516 T2177 oasc.RequestHandlers.initHandlersFromConfig created spellCheckWithWordbreak_Direct: org.apache.solr.handler.component.SearchHandler
[junit4:junit4]   2> 516 T2177 oasc.RequestHandlers.initHandlersFromConfig created spellCheckCompRH1: org.apache.solr.handler.component.SearchHandler
[junit4:junit4]   2> 517 T2177 oasc.RequestHandlers.initHandlersFromConfig created tvrh: org.apache.solr.handler.component.SearchHandler
[junit4:junit4]   2> 518 T2177 oasc.RequestHandlers.initHandlersFromConfig created /mlt: solr.MoreLikeThisHandler
[junit4:junit4]   2> 519 T2177 oasc.RequestHandlers.initHandlersFromConfig created /debug/dump: solr.DumpRequestHandler
[junit4:junit4]   2> 522 T2177 oashl.XMLLoader.init xsltCacheLifetimeSeconds=60
[junit4:junit4]   2> 523 T2177 oasc.SolrCore.initDeprecatedSupport WARNING solrconfig.xml uses deprecated <admin/gettableFiles>, Please update your config to use the ShowFileRequestHandler.
[junit4:junit4]   2> 525 T2177 oasc.SolrCore.initDeprecatedSupport WARNING adding ShowFileRequestHandler with hidden files: [THROW.ERROR.ON.ADD.UPDATEPROCESSOR.JS, SOLRCONFIG-HIGHLIGHT.XML, SCHEMA-REQUIRED-FIELDS.XML, SCHEMA-REPLICATION2.XML, TRIVIAL.UPDATEPROCESSOR1.JS, BAD-SCHEMA-DUP-DYNAMICFIELD.XML, SCHEMA-MINIMAL.XML, SOLRCONFIG-CACHING.XML, SOLRCONFIG-REPEATER.XML, BAD-SCHEMA-NONTEXT-ANALYZER.XML, CURRENCY.XML, SOLRCONFIG-MERGEPOLICY.XML, SOLRCONFIG-TLOG.XML, SOLRCONFIG-MASTER.XML, BAD-SCHEMA-UNIQUEKEY-MULTIVALUED.XML, SCHEMA11.XML, SOLRCONFIG-BASIC.XML, DA_COMPOUNDDICTIONARY.TXT, MISSLEADING.EXTENSION.UPDATEPROCESSOR.JS.TXT, SCHEMA-COPYFIELD-TEST.XML, SOLRCONFIG-SLAVE.XML, ELEVATE.XML, SOLRCONFIG-PROPINJECT-INDEXDEFAULT.XML, TRIVIAL.UPDATEPROCESSOR0.JS, BAD-SOLRCONFIG-BOGUS-SCRIPTENGINE-NAME.XML, SCHEMA-CHARFILTERS.XML, SCHEMA-IB.XML, SOLRCONFIG-QUERYSENDER.XML, SCHEMA-REPLICATION1.XML, DA_UTF8.XML, SOLRCONFIG-SNIPPET-PROCESSOR.XML, CONDITIONAL.UPDATEPROCESSOR.JS, MISSING.FUNCTIONS.UPDATEPROCESSOR.JS, HYPHENATION.DTD, SOLRCONFIG-ENABLEPLUGIN.XML, SCHEMA-PHRASESUGGEST.XML, STEMDICT.TXT, HUNSPELL-TEST.AFF, SCHEMA-SNIPPET-TYPE.XML, STOPTYPES-1.TXT, STOPWORDSWRONGENCODING.TXT, SCHEMA-NUMERIC.XML, SOLRCONFIG-TRANSFORMERS.XML, SOLRCONFIG-PROPINJECT.XML, BAD-SCHEMA-NOT-INDEXED-BUT-TF.XML, SOLRCONFIG-SIMPLELOCK.XML, WDFTYPES.TXT, SCHEMA-REVERSED.XML, STOPTYPES-2.TXT, BAD-SCHEMA-CURRENCY-FT-MULTIVALUED.XML, SOLRCONFIG-SPELLCHECKCOMPONENT.XML, BAD-SCHEMA-CURRENCY-MULTIVALUED.XML, SOLRCONFIG-PHRASESUGGEST.XML, SCHEMA-DFR.XML, BAD-SCHEMA-NOT-INDEXED-BUT-POS.XML, KEEP-1.TXT, OPEN-EXCHANGE-RATES.JSON, SCHEMA-SPATIAL.XML, STOPWITHBOM.TXT, SCHEMA-BINARYFIELD.XML, SOLRCONFIG-SPELLCHECKER.XML, SOLRCONFIG-UPDATE-PROCESSOR-CHAINS.XML, BAD-SCHEMA-OMIT-TF-BUT-NOT-POS.XML, BAD-SCHEMA-DUP-FIELDTYPE.XML, SCHEMA-XINCLUDE.XML, SOLRCONFIG-MASTER1.XML, SYNONYMS.TXT, BAD-SCHEMA-CURRENCY-DYNAMIC-MULTIVALUED.XML, SCHEMA_CODEC.XML, SCHEMA.XML, SOLRCONFIG-SOLR-749.XML, SOLRCONFIG-MASTER1-KEEPONEBACKUP.XML, SOLRCONFIG-FUNCTIONQUERY.XML, STOP-2.TXT, SOLRCONFIG-TERMINDEX.XML, SCHEMA-LMDIRICHLET.XML, SOLRCONFIG-ELEVATE.XML, SCHEMA-FOLDING.XML, STOPWORDS.TXT, SCHEMA-STOP-KEEP.XML, BAD-SCHEMA-NOT-INDEXED-BUT-NORMS.XML, SOLRCONFIG-SOLCOREPROPERTIES.XML, STOP-1.TXT, SOLRCONFIG-MASTER2.XML, SCHEMA-SPELLCHECKER.XML, SOLRCONFIG-RESPONSE-LOG-COMPONENT.XML, SOLRCONFIG-LAZYWRITER.XML, SCHEMA-LUCENEMATCHVERSION.XML, FRENCHARTICLES.TXT, BAD-MP-SOLRCONFIG.XML, SCHEMA15.XML, SOLRCONFIG-REQHANDLER.INCL, SCHEMASURROUND.XML, SOLRCONFIG-MASTER3.XML, HUNSPELL-TEST.DIC, SOLRCONFIG-XINCLUDE.XML, BAD-SCHEMA-CODEC-GLOBAL-VS-FT-MISMATCH.XML, SOLRCONFIG-DELPOLICY1.XML, SOLRCONFIG-SLAVE1.XML, SCHEMA-SIM.XML, SCHEMA-SNIPPET-FIELD.XML, SCHEMA-COLLATE.XML, STOP-SNOWBALL.TXT, BAD-SCHEMA-SIM-GLOBAL-VS-FT-MISMATCH.XML, PROTWORDS.TXT, SCHEMA-TRIE.XML, SOLRCONFIG_CODEC.XML, BAD-SOLRCONFIG-INVALID-SCRIPTFILE.XML, JASUGGEST.TXT, SCHEMA-TFIDF.XML, SOLRCONFIG-SCRIPT-UPDATEPROCESSOR.XML, SCHEMA-LMJELINEKMERCER.XML, PHRASESUGGEST.TXT, BAD-SOLRCONFIG-MISSING-SCRIPTFILE.XML, BAD-SCHEMA-UNIQUEKEY-USES-DEFAULT.XML, OLD_SYNONYMS.TXT, SOLRCONFIG-DELPOLICY2.XML, XSLT, SOLRCONFIG-NATIVELOCK.XML, BAD-SCHEMA-DUP-FIELD.XML, SOLRCONFIG-NOCACHE.XML, SCHEMA-BM25.XML, ADDFIELDS.UPDATEPROCESSOR.JS, SOLRCONFIG-ALTDIRECTORY.XML, SOLRCONFIG-QUERYSENDER-NOQUERY.XML, COMPOUNDDICTIONARY.TXT, SOLRCONFIG_PERF.XML, SOLRCONFIG-INDEXCONFIG.XML, BAD-SCHEMA-ANALYZER-CLASS-AND-NESTED.XML, SCHEMA-NOT-REQUIRED-UNIQUE-KEY.XML, KEEP-2.TXT, BAD-SCHEMA-UNIQUEKEY-IS-COPYFIELD-DEST.XML, SCHEMA12.XML, MAPPING-ISOLATIN1ACCENT.TXT, BAD_SOLRCONFIG.XML, BAD-SCHEMA-EXTERNAL-FILEFIELD.XML]
[junit4:junit4]   2> 527 T2177 oasc.CachingDirectoryFactory.close Releasing directory:/mnt/ssd/jenkins/workspace/Lucene-Solr-trunk-Linux/solr/build/solr-core/test/J0/./solrtest-XmlUpdateRequestHandlerTest-1351600218629
[junit4:junit4]   2> 528 T2177 oass.SolrIndexSearcher.<init> Opening Searcher@14f12a1 main
[junit4:junit4]   2> 528 T2177 oasu.CommitTracker.<init> Hard AutoCommit: disabled
[junit4:junit4]   2> 529 T2177 oasu.CommitTracker.<init> Soft AutoCommit: disabled
[junit4:junit4]   2> 529 T2177 oashc.SpellCheckComponent.inform Initializing spell checkers
[junit4:junit4]   2> 579 T2177 oass.DirectSolrSpellChecker.init init: {name=direct,classname=DirectSolrSpellChecker,field=lowerfilt,minQueryLength=3}
[junit4:junit4]   2> 598 T2177 oashc.HttpShardHandlerFactory.getParameter Setting socketTimeout to: 0
[junit4:junit4]   2> 599 T2177 oashc.HttpShardHandlerFactory.getParameter Setting urlScheme to: http://
[junit4:junit4]   2> 599 T2177 oashc.HttpShardHandlerFactory.getParameter Setting connTimeout to: 0
[junit4:junit4]   2> 600 T2177 oashc.HttpShardHandlerFactory.getParameter Setting maxConnectionsPerHost to: 20
[junit4:junit4]   2> 600 T2177 oashc.HttpShardHandlerFactory.getParameter Setting corePoolSize to: 0
[junit4:junit4]   2> 600 T2177 oashc.HttpShardHandlerFactory.getParameter Setting maximumPoolSize to: 2147483647
[junit4:junit4]   2> 601 T2177 oashc.HttpShardHandlerFactory.getParameter Setting maxThreadIdleTime to: 5
[junit4:junit4]   2> 601 T2177 oashc.HttpShardHandlerFactory.getParameter Setting sizeOfQueue to: -1
[junit4:junit4]   2> 602 T2177 oashc.HttpShardHandlerFactory.getParameter Setting fairnessPolicy to: false
[junit4:junit4]   2> 602 T2177 oascsi.HttpClientUtil.createClient Creating new http client, config:maxConnectionsPerHost=20&maxConnections=10000&socketTimeout=0&connTimeout=0&retry=false
[junit4:junit4]   2> 612 T2178 oasc.SolrCore.registerSearcher [collection1] Registered new searcher Searcher@14f12a1 main{StandardDirectoryReader(segments_1:1)}
[junit4:junit4]   2> 616 T2177 oasc.CoreContainer.register registering core: collection1
[junit4:junit4]   2> 619 T2177 oas.SolrTestCaseJ4.initCore ####initCore end
[junit4:junit4]   2> 622 T2177 oas.SolrTestCaseJ4.setUp ###Starting testNamedEntity
[junit4:junit4]   2> ASYNC  NEW_CORE C236 name=collection1 org.apache.solr.core.SolrCore@5fe43f
[junit4:junit4]   2> 661 T2177 C236 oasc.CachingDirectoryFactory.close Releasing directory:/mnt/ssd/jenkins/workspace/Lucene-Solr-trunk-Linux/solr/build/solr-core/test/J0/./solrtest-XmlUpdateRequestHandlerTest-1351600218629
[junit4:junit4]   2> 663 T2177 C236 oasc.SolrDeletionPolicy.onInit SolrDeletionPolicy.onInit: commits:num=1
[junit4:junit4]   2> 		commit{dir=MockDirWrapper(org.apache.lucene.store.RAMDirectory@1a33e6e lockFactory=org.apache.lucene.store.NativeFSLockFactory@183bbdf),segFN=segments_1,generation=1,filenames=[segments_1]
[junit4:junit4]   2> 664 T2177 C236 oasc.SolrDeletionPolicy.updateCommits newest commit = 1[segments_1]
[junit4:junit4]   2> 665 T2177 C236 UPDATE [collection1] webapp=null path=null params={} {add=[1]} 0 39
[junit4:junit4]   2> 673 T2177 C236 oasu.DirectUpdateHandler2.commit start commit{flags=0,_version_=0,optimize=false,openSearcher=true,waitSearcher=true,expungeDeletes=false,softCommit=false}
[junit4:junit4]   2> 675 T2177 C236 oasc.SolrDeletionPolicy.onCommit SolrDeletionPolicy.onCommit: commits:num=2
[junit4:junit4]   2> 		commit{dir=MockDirWrapper(org.apache.lucene.store.RAMDirectory@1a33e6e lockFactory=org.apache.lucene.store.NativeFSLockFactory@183bbdf),segFN=segments_1,generation=1,filenames=[segments_1]
[junit4:junit4]   2> 		commit{dir=MockDirWrapper(org.apache.lucene.store.RAMDirectory@1a33e6e lockFactory=org.apache.lucene.store.NativeFSLockFactory@183bbdf),segFN=segments_2,generation=2,filenames=[_0.fnm, _0_Lucene41_0.doc, _0_Lucene41_0.pos, _0_nrm.cfe, segments_2, _0.fdx, _0_nrm.cfs, _0.si, _0_Lucene41_0.tim, _0.fdt, _0_Lucene41_0.tip]
[junit4:junit4]   2> 676 T2177 C236 oasc.SolrDeletionPolicy.updateCommits newest commit = 2[_0.fnm, _0_Lucene41_0.doc, _0_Lucene41_0.pos, _0_nrm.cfe, segments_2, _0.fdx, _0_nrm.cfs, _0.si, _0_Lucene41_0.tim, _0.fdt, _0_Lucene41_0.tip]
[junit4:junit4]   2> 677 T2177 C236 oasc.CachingDirectoryFactory.close Releasing directory:/mnt/ssd/jenkins/workspace/Lucene-Solr-trunk-Linux/solr/build/solr-core/test/J0/./solrtest-XmlUpdateRequestHandlerTest-1351600218629
[junit4:junit4]   2> 678 T2177 C236 oass.SolrIndexSearcher.<init> Opening Searcher@12b1e71 main
[junit4:junit4]   2> 679 T2177 C236 oasu.DirectUpdateHandler2.commit end_commit_flush
[junit4:junit4]   2> 680 T2178 oasc.SolrCore.registerSearcher [collection1] Registered new searcher Searcher@12b1e71 main{StandardDirectoryReader(segments_2:3 _0(5.0):C1)}
[junit4:junit4]   2> 681 T2178 oasc.CachingDirectoryFactory.close Releasing directory:/mnt/ssd/jenkins/workspace/Lucene-Solr-trunk-Linux/solr/build/solr-core/test/J0/./solrtest-XmlUpdateRequestHandlerTest-1351600218629/index
[junit4:junit4]   2> 682 T2177 C236 UPDATE [collection1] webapp=null path=null params={} {commit=} 0 8
[junit4:junit4]   2> 684 T2177 C236 REQ [collection1] webapp=null path=null params={start=0&q=foo_s:zzz&qt=standard&rows=20&version=2.2} hits=1 status=0 QTime=1 
[junit4:junit4]   2> 685 T2177 oas.SolrTestCaseJ4.tearDown ###Ending testNamedEntity
[junit4:junit4]   2> 689 T2177 oas.SolrTestCaseJ4.setUp ###Starting testReadDoc
[junit4:junit4]   2> 690 T2177 oas.SolrTestCaseJ4.tearDown ###Ending testReadDoc
[junit4:junit4]   2> 694 T2177 oas.SolrTestCaseJ4.setUp ###Starting testReadDelete
[junit4:junit4]   2> 703 T2177 oas.SolrTestCaseJ4.tearDown ###Ending testReadDelete
[junit4:junit4]   2> 707 T2177 oas.SolrTestCaseJ4.setUp ###Starting testRequestParams
[junit4:junit4]   2> 708 T2177 oas.SolrTestCaseJ4.tearDown ###Ending testRequestParams
[junit4:junit4]   2> 711 T2177 oas.SolrTestCaseJ4.setUp ###Starting testExternalEntities
[junit4:junit4]   2> 715 T2177 oas.SolrTestCaseJ4.tearDown ###Ending testExternalEntities
[junit4:junit4]   2> 716 T2177 oas.SolrTestCaseJ4.deleteCore ###deleteCore
[junit4:junit4]   2> 716 T2177 oasc.CoreContainer.shutdown Shutting down CoreContainer instance=19990885
[junit4:junit4]   2> 717 T2177 oasc.SolrCore.close [collection1]  CLOSING SolrCore org.apache.solr.core.SolrCore@5fe43f
[junit4:junit4]   2> 725 T2177 oasu.DirectUpdateHandler2.close closing DirectUpdateHandler2{commits=1,autocommits=0,soft autocommits=0,optimizes=0,rollbacks=0,expungeDeletes=0,docsPending=0,adds=0,deletesById=0,deletesByQuery=0,errors=0,cumulative_adds=1,cumulative_deletesById=0,cumulative_deletesByQuery=0,cumulative_errors=0}
[junit4:junit4]   2> 726 T2177 oasc.SolrCore.decrefSolrCoreState Closing SolrCoreState
[junit4:junit4]   2> 726 T2177 oasu.DefaultSolrCoreState.closeIndexWriter SolrCoreState ref count has reached 0 - closing IndexWriter
[junit4:junit4]   2> 726 T2177 oasu.DefaultSolrCoreState.closeIndexWriter closing IndexWriter with IndexWriterCloser
[junit4:junit4]   2> 727 T2177 C236 oasc.CachingDirectoryFactory.close Releasing directory:/mnt/ssd/jenkins/workspace/Lucene-Solr-trunk-Linux/solr/build/solr-core/test/J0/./solrtest-XmlUpdateRequestHandlerTest-1351600218629/index
[junit4:junit4]   2> 727 T2177 oasc.SolrCore.closeSearcher [collection1] Closing main searcher on request.
[junit4:junit4]   2> 728 T2177 oasc.CachingDirectoryFactory.close Releasing directory:/mnt/ssd/jenkins/workspace/Lucene-Solr-trunk-Linux/solr/build/solr-core/test/J0/./solrtest-XmlUpdateRequestHandlerTest-1351600218629/index
[junit4:junit4]   2> NOTE: test params are: codec=Compressing(storedFieldsFormat=CompressingStoredFieldsFormat(compressionMode=HIGH_COMPRESSION, chunkSize=47, storedFieldsIndex=MEMORY_DOC)), sim=DefaultSimilarity, locale=ko_KR, timezone=BET
[junit4:junit4]   2> NOTE: Linux 3.2.0-32-generic i386/Oracle Corporation 1.7.0_07 (32-bit)/cpus=8,threads=1,free=207317888,total=518979584
[junit4:junit4]   2> NOTE: All tests run in this JVM: [TestStressReorder, SearchHandlerTest, TestStressLucene, FileBasedSpellCheckerTest, NotRequiredUniqueKeyTest, DistanceFunctionTest, NoCacheHeaderTest, SortByFunctionTest, TestQueryTypes, TestSolrIndexConfig, TestFiltering, FieldAnalysisRequestHandlerTest, FastVectorHighlighterTest, TestConfig, UniqFieldsUpdateProcessorFactoryTest, TestLMDirichletSimilarityFactory, TestSolrQueryParser, RequestHandlersTest, WordBreakSolrSpellCheckerTest, SpatialFilterTest, CopyFieldTest, TestBinaryResponseWriter, BasicDistributedZk2Test, ZkControllerTest, BasicDistributedZkTest, CacheHeaderTest, MinimalSchemaTest, SystemInfoHandlerTest, SolrRequestParserTest, MoreLikeThisHandlerTest, ScriptEngineTest, QueryElevationComponentTest, AlternateDirectoryTest, TestCollationField, TestSuggestSpellingConverter, TestPHPSerializedResponseWriter, DateMathParserTest, JSONWriterTest, TestSearchPerf, DirectUpdateHandlerOptimizeTest, CircularListTest, SpellPossibilityIteratorTest, CoreAdminHandlerTest, ResponseLogComponentTest, TestQuerySenderNoQuery, TestBadConfig, SimplePostToolTest, IndexBasedSpellCheckerTest, CoreContainerCoreInitFailuresTest, CurrencyFieldTest, TestNumberUtils, TestLFUCache, SpellCheckCollatorTest, SuggesterWFSTTest, TestFastWriter, DistributedSpellCheckComponentTest, TestDistributedGrouping, TestRandomFaceting, TestDistributedSearch, TestExtendedDismaxParser, AutoCommitTest, BasicZkTest, ZkSolrClientTest, TestFaceting, TestHashPartitioner, DistributedTermsComponentTest, TestRecovery, TestJoin, TestRangeQuery, SimpleFacetsTest, TestCoreContainer, LukeRequestHandlerTest, TestGroupingSearch, ConvertedLegacyTest, SignatureUpdateProcessorFactoryTest, TestJmxIntegration, SampleTest, HighlighterTest, TestIndexSearcher, TestTrie, DirectSolrConnectionTest, QueryEqualityTest, TestWordDelimiterFilterFactory, TestCSVLoader, PolyFieldTest, TestCSVResponseWriter, MBeansHandlerTest, TestPseudoReturnFields, BinaryUpdateRequestHandlerTest, QueryParsingTest, TermsComponentTest, XmlUpdateRequestHandlerTest]
[junit4:junit4]   2> NOTE: reproduce with: ant test  -Dtestcase=XmlUpdateRequestHandlerTest -Dtests.seed=7AE0C40E452B3188 -Dtests.multiplier=3 -Dtests.slow=true -Dtests.locale=ko_KR -Dtests.timezone=BET -Dtests.file.encoding=UTF-8
[junit4:junit4] ERROR   0.00s J0 | XmlUpdateRequestHandlerTest (suite) <<<
[junit4:junit4]    > Throwable #1: junit.framework.AssertionFailedError: Clean up static fields (in @AfterClass?), your test seems to hang on to approximately 12,409,824 bytes (threshold is 10,485,760). Field reference sizes (counted individually):
[junit4:junit4]    >   - 12,589,136 bytes, protected static org.apache.solr.handler.UpdateRequestHandler org.apache.solr.handler.XmlUpdateRequestHandlerTest.handler
[junit4:junit4]    >   - 3,096 bytes, private static javax.xml.stream.XMLInputFactory org.apache.solr.handler.XmlUpdateRequestHandlerTest.inputFactory
[junit4:junit4]    >   - 264 bytes, public static org.junit.rules.TestRule org.apache.solr.SolrTestCaseJ4.solrClassRules
[junit4:junit4]    >   - 216 bytes, protected static java.lang.String org.apache.solr.SolrTestCaseJ4.testSolrHome
[junit4:junit4]    >   - 120 bytes, private static java.lang.String org.apache.solr.SolrTestCaseJ4.factoryProp
[junit4:junit4]    >   - 64 bytes, private static java.lang.String org.apache.solr.SolrTestCaseJ4.coreName
[junit4:junit4]    > 	at __randomizedtesting.SeedInfo.seed([7AE0C40E452B3188]:0)
[junit4:junit4]    > 	at com.carrotsearch.randomizedtesting.rules.StaticFieldsInvariantRule$1.afterAlways(StaticFieldsInvariantRule.java:127)
[junit4:junit4]    > 	at com.carrotsearch.randomizedtesting.rules.StatementAdapter.evaluate(StatementAdapter.java:43)
[junit4:junit4]    > 	at org.apache.lucene.util.TestRuleAssertionsRequired$1.evaluate(TestRuleAssertionsRequired.java:43)
[junit4:junit4]    > 	at org.apache.lucene.util.TestRuleMarkFailure$1.evaluate(TestRuleMarkFailure.java:48)
[junit4:junit4]    > 	at org.apache.lucene.util.TestRuleIgnoreAfterMaxFailures$1.evaluate(TestRuleIgnoreAfterMaxFailures.java:70)
[junit4:junit4]    > 	at org.apache.lucene.util.TestRuleIgnoreTestSuites$1.evaluate(TestRuleIgnoreTestSuites.java:55)
[junit4:junit4]    > 	at com.carrotsearch.randomizedtesting.rules.StatementAdapter.evaluate(StatementAdapter.java:36)
[junit4:junit4]    > 	at com.carrotsearch.randomizedtesting.ThreadLeakControl$StatementRunner.run(ThreadLeakControl.java:358)
[junit4:junit4]    > 	at java.lang.Thread.run(Thread.java:722)
[junit4:junit4] Completed on J0 in 1.54s, 5 tests, 1 failure <<< FAILURES!

[...truncated 338 lines...]
[junit4:junit4] Suite: org.apache.solr.cloud.LeaderElectionIntegrationTest
[junit4:junit4]   2> 2 T1849 oas.SolrTestCaseJ4.setUp ###Starting testSimpleSliceLeaderElection
[junit4:junit4]   2> Creating dataDir: /mnt/ssd/jenkins/workspace/Lucene-Solr-trunk-Linux/solr/build/solr-core/test/J1/./solrtest-LeaderElectionIntegrationTest-1351599813545
[junit4:junit4]   2> 4 T1849 oasc.ZkTestServer.run STARTING ZK TEST SERVER
[junit4:junit4]   2> 5 T1850 oazs.ZooKeeperServer.setTickTime tickTime set to 1000
[junit4:junit4]   2> 6 T1850 oazs.NIOServerCnxn$Factory.<init> binding to port 0.0.0.0/0.0.0.0:0
[junit4:junit4]   2> 6 T1850 oazsp.FileTxnSnapLog.save Snapshotting: 0
[junit4:junit4]   2> 105 T1849 oasc.ZkTestServer.run start zk server on port:33226
[junit4:junit4]   2> 105 T1849 oaz.ZooKeeper.<init> Initiating client connection, connectString=127.0.0.1:33226 sessionTimeout=10000 watcher=org.apache.solr.common.cloud.ConnectionManager@a609e
[junit4:junit4]   2> 107 T1855 oaz.ClientCnxn$SendThread.startConnect Opening socket connection to server /127.0.0.1:33226
[junit4:junit4]   2> 107 T1849 oascc.ConnectionManager.waitForConnected Waiting for client to connect to ZooKeeper
[junit4:junit4]   2> 108 T1855 oaz.ClientCnxn$SendThread.primeConnection Socket connection established to localhost.localdomain/127.0.0.1:33226, initiating session
[junit4:junit4]   2> 108 T1851 oazs.NIOServerCnxn$Factory.run Accepted socket connection from /127.0.0.1:35367
[junit4:junit4]   2> 109 T1851 oazs.NIOServerCnxn.readConnectRequest Client attempting to establish new session at /127.0.0.1:35367
[junit4:junit4]   2> 109 T1853 oazsp.FileTxnLog.append Creating new log file: log.1
[junit4:junit4]   2> 227 T1853 oazs.NIOServerCnxn.finishSessionInit Established session 0x13ab1a073ad0000 with negotiated timeout 10000 for client /127.0.0.1:35367
[junit4:junit4]   2> 228 T1855 oaz.ClientCnxn$SendThread.readConnectResult Session establishment complete on server localhost.localdomain/127.0.0.1:33226, sessionid = 0x13ab1a073ad0000, negotiated timeout = 10000
[junit4:junit4]   2> 228 T1856 oascc.ConnectionManager.process Watcher org.apache.solr.common.cloud.ConnectionManager@a609e name:ZooKeeperConnection Watcher:127.0.0.1:33226 got event WatchedEvent state:SyncConnected type:None path:null path:null type:None
[junit4:junit4]   2> 228 T1849 oascc.ConnectionManager.waitForConnected Client is connected to ZooKeeper
[junit4:junit4]   2> 229 T1849 oascc.SolrZkClient.makePath makePath: /solr
[junit4:junit4]   2> 233 T1854 oazs.PrepRequestProcessor.pRequest Processed session termination for sessionid: 0x13ab1a073ad0000
[junit4:junit4]   2> 233 T1856 oaz.ClientCnxn$EventThread.run EventThread shut down
[junit4:junit4]   2> 234 T1851 oazs.NIOServerCnxn.closeSock Closed socket connection for client /127.0.0.1:35367 which had sessionid 0x13ab1a073ad0000
[junit4:junit4]   2> 233 T1849 oaz.ZooKeeper.close Session: 0x13ab1a073ad0000 closed
[junit4:junit4]   2> 234 T1849 oaz.ZooKeeper.<init> Initiating client connection, connectString=127.0.0.1:33226/solr sessionTimeout=10000 watcher=org.apache.solr.common.cloud.ConnectionManager@15eedfe
[junit4:junit4]   2> 235 T1857 oaz.ClientCnxn$SendThread.startConnect Opening socket connection to server /127.0.0.1:33226
[junit4:junit4]   2> 235 T1857 oaz.ClientCnxn$SendThread.primeConnection Socket connection established to localhost.localdomain/127.0.0.1:33226, initiating session
[junit4:junit4]   2> 235 T1849 oascc.ConnectionManager.waitForConnected Waiting for client to connect to ZooKeeper
[junit4:junit4]   2> 235 T1851 oazs.NIOServerCnxn$Factory.run Accepted socket connection from /127.0.0.1:35368
[junit4:junit4]   2> 237 T1851 oazs.NIOServerCnxn.readConnectRequest Client attempting to establish new session at /127.0.0.1:35368
[junit4:junit4]   2> 237 T1853 oazs.NIOServerCnxn.finishSessionInit Established session 0x13ab1a073ad0001 with negotiated timeout 10000 for client /127.0.0.1:35368
[junit4:junit4]   2> 237 T1857 oaz.ClientCnxn$SendThread.readConnectResult Session establishment complete on server localhost.localdomain/127.0.0.1:33226, sessionid = 0x13ab1a073ad0001, negotiated timeout = 10000
[junit4:junit4]   2> 238 T1858 oascc.ConnectionManager.process Watcher org.apache.solr.common.cloud.ConnectionManager@15eedfe name:ZooKeeperConnection Watcher:127.0.0.1:33226/solr got event WatchedEvent state:SyncConnected type:None path:null path:null type:None
[junit4:junit4]   2> 238 T1849 oascc.ConnectionManager.waitForConnected Client is connected to ZooKeeper
[junit4:junit4]   2> 238 T1849 oascc.SolrZkClient.makePath makePath: /collections/collection1
[junit4:junit4]   2> 240 T1849 oascc.SolrZkClient.makePath makePath: /collections/collection1/shards
[junit4:junit4]   2> 241 T1849 oascc.SolrZkClient.makePath makePath: /collections/control_collection
[junit4:junit4]   2> 242 T1849 oascc.SolrZkClient.makePath makePath: /collections/control_collection/shards
[junit4:junit4]   2> 243 T1849 oasc.AbstractZkTestCase.putConfig put /mnt/ssd/jenkins/workspace/Lucene-Solr-trunk-Linux/solr/build/solr-core/test-files/solr/collection1/conf/solrconfig.xml to /configs/conf1/solrconfig.xml
[junit4:junit4]   2> 243 T1849 oascc.SolrZkClient.makePath makePath: /configs/conf1/solrconfig.xml
[junit4:junit4]   2> 246 T1849 oasc.AbstractZkTestCase.putConfig put /mnt/ssd/jenkins/workspace/Lucene-Solr-trunk-Linux/solr/build/solr-core/test-files/solr/collection1/conf/schema.xml to /configs/conf1/schema.xml
[junit4:junit4]   2> 247 T1849 oascc.SolrZkClient.makePath makePath: /configs/conf1/schema.xml
[junit4:junit4]   2> 250 T1849 oasc.AbstractZkTestCase.putConfig put /mnt/ssd/jenkins/workspace/Lucene-Solr-trunk-Linux/solr/build/solr-core/test-files/solr/collection1/conf/solrconfig.xml to /configs/conf1/solrconfig.xml
[junit4:junit4]   2> 251 T1849 oascc.SolrZkClient.makePath makePath: /configs/conf1/solrconfig.xml
[junit4:junit4]   2> 252 T1849 oasc.AbstractZkTestCase.putConfig put /mnt/ssd/jenkins/workspace/Lucene-Solr-trunk-Linux/solr/build/solr-core/test-files/solr/collection1/conf/stopwords.txt to /configs/conf1/stopwords.txt
[junit4:junit4]   2> 253 T1849 oascc.SolrZkClient.makePath makePath: /configs/conf1/stopwords.txt
[junit4:junit4]   2> 254 T1849 oasc.AbstractZkTestCase.putConfig put /mnt/ssd/jenkins/workspace/Lucene-Solr-trunk-Linux/solr/build/solr-core/test-files/solr/collection1/conf/protwords.txt to /configs/conf1/protwords.txt
[junit4:junit4]   2> 255 T1849 oascc.SolrZkClient.makePath makePath: /configs/conf1/protwords.txt
[junit4:junit4]   2> 262 T1849 oasc.AbstractZkTestCase.putConfig put /mnt/ssd/jenkins/workspace/Lucene-Solr-trunk-Linux/solr/build/solr-core/test-files/solr/collection1/conf/currency.xml to /configs/conf1/currency.xml
[junit4:junit4]   2> 263 T1849 oascc.SolrZkClient.makePath makePath: /configs/conf1/currency.xml
[junit4:junit4]   2> 264 T1849 oasc.AbstractZkTestCase.putConfig put /mnt/ssd/jenkins/workspace/Lucene-Solr-trunk-Linux/solr/build/solr-core/test-files/solr/collection1/conf/open-exchange-rates.json to /configs/conf1/open-exchange-rates.json
[junit4:junit4]   2> 265 T1849 oascc.SolrZkClient.makePath makePath: /configs/conf1/open-exchange-rates.json
[junit4:junit4]   2> 267 T1849 oasc.AbstractZkTestCase.putConfig put /mnt/ssd/jenkins/workspace/Lucene-Solr-trunk-Linux/solr/build/solr-core/test-files/solr/collection1/conf/mapping-ISOLatin1Accent.txt to /configs/conf1/mapping-ISOLatin1Accent.txt
[junit4:junit4]   2> 268 T1849 oascc.SolrZkClient.makePath makePath: /configs/conf1/mapping-ISOLatin1Accent.txt
[junit4:junit4]   2> 270 T1849 oasc.AbstractZkTestCase.putConfig put /mnt/ssd/jenkins/workspace/Lucene-Solr-trunk-Linux/solr/build/solr-core/test-files/solr/collection1/conf/old_synonyms.txt to /configs/conf1/old_synonyms.txt
[junit4:junit4]   2> 270 T1849 oascc.SolrZkClient.makePath makePath: /configs/conf1/old_synonyms.txt
[junit4:junit4]   2> 275 T1849 oasc.AbstractZkTestCase.putConfig put /mnt/ssd/jenkins/workspace/Lucene-Solr-trunk-Linux/solr/build/solr-core/test-files/solr/collection1/conf/synonyms.txt to /configs/conf1/synonyms.txt
[junit4:junit4]   2> 275 T1849 oascc.SolrZkClient.makePath makePath: /configs/conf1/synonyms.txt
[junit4:junit4]   2> 277 T1854 oazs.PrepRequestProcessor.pRequest Processed session termination for sessionid: 0x13ab1a073ad0001
[junit4:junit4]   2> 278 T1851 oazs.NIOServerCnxn.closeSock Closed socket connection for client /127.0.0.1:35368 which had sessionid 0x13ab1a073ad0001
[junit4:junit4]   2> 278 T1849 oaz.ZooKeeper.close Session: 0x13ab1a073ad0001 closed
[junit4:junit4]   2> 278 T1858 oaz.ClientCnxn$EventThread.run EventThread shut down
[junit4:junit4]   2> 278 T1849 oasc.LeaderElectionIntegrationTest.setUp ####SETUP_START testSimpleSliceLeaderElection
[junit4:junit4]   2> 279 T1849 oasc.SolrResourceLoader.locateSolrHome JNDI not configured for solr (NoInitialContextEx)
[junit4:junit4]   2> 280 T1849 oasc.SolrResourceLoader.locateSolrHome using system property solr.solr.home: /mnt/ssd/jenkins/workspace/Lucene-Solr-trunk-Linux/solr/build/solr-core/test-files/solr
[junit4:junit4]   2> 280 T1849 oasc.CoreContainer$Initializer.initialize looking for solr.xml: /mnt/ssd/jenkins/workspace/Lucene-Solr-trunk-Linux/solr/build/solr-core/test-files/solr/solr.xml
[junit4:junit4]   2> 281 T1849 oasc.CoreContainer.<init> New CoreContainer 14673654
[junit4:junit4]   2> 281 T1849 oasc.CoreContainer.load Loading CoreContainer using Solr Home: '/mnt/ssd/jenkins/workspace/Lucene-Solr-trunk-Linux/solr/build/solr-core/test-files/solr/'
[junit4:junit4]   2> 282 T1849 oasc.SolrResourceLoader.<init> new SolrResourceLoader for directory: '/mnt/ssd/jenkins/workspace/Lucene-Solr-trunk-Linux/solr/build/solr-core/test-files/solr/'
[junit4:junit4]   2> 300 T1849 oasc.CoreContainer.load Registering Log Listener
[junit4:junit4]   2> 311 T1849 oasc.CoreContainer.initZooKeeper Zookeeper client=127.0.0.1:33226/solr
[junit4:junit4]   2> 312 T1849 oaz.ZooKeeper.<init> Initiating client connection, connectString=127.0.0.1:33226/solr sessionTimeout=3000 watcher=org.apache.solr.common.cloud.ConnectionManager@1f736af
[junit4:junit4]   2> 312 T1859 oaz.ClientCnxn$SendThread.startConnect Opening socket connection to server /127.0.0.1:33226
[junit4:junit4]   2> 312 T1849 oascc.ConnectionManager.waitForConnected Waiting for client to connect to ZooKeeper
[junit4:junit4]   2> 313 T1859 oaz.ClientCnxn$SendThread.primeConnection Socket connection established to localhost.localdomain/127.0.0.1:33226, initiating session
[junit4:junit4]   2> 314 T1851 oazs.NIOServerCnxn$Factory.run Accepted socket connection from /127.0.0.1:35369
[junit4:junit4]   2> 314 T1851 oazs.NIOServerCnxn.readConnectRequest Client attempting to establish new session at /127.0.0.1:35369
[junit4:junit4]   2> 328 T1859 oaz.ClientCnxn$SendThread.readConnectResult Session establishment complete on server localhost.localdomain/127.0.0.1:33226, sessionid = 0x13ab1a073ad0002, negotiated timeout = 3000
[junit4:junit4]   2> 328 T1853 oazs.NIOServerCnxn.finishSessionInit Established session 0x13ab1a073ad0002 with negotiated timeout 3000 for client /127.0.0.1:35369
[junit4:junit4]   2> 329 T1860 oascc.ConnectionManager.process Watcher org.apache.solr.common.cloud.ConnectionManager@1f736af name:ZooKeeperConnection Watcher:127.0.0.1:33226/solr got event WatchedEvent state:SyncConnected type:None path:null path:null type:None
[junit4:junit4]   2> 329 T1849 oascc.ConnectionManager.waitForConnected Client is connected to ZooKeeper
[junit4:junit4]   2> 347 T1854 oazs.PrepRequestProcessor.pRequest Got user-level KeeperException when processing sessionid:0x13ab1a073ad0002 type:create cxid:0x2 zxid:0xfffffffffffffffe txntype:unknown reqpath:n/a Error Path:/solr/overseer Error:KeeperErrorCode = NodeExists for /solr/overseer
[junit4:junit4]   2> 367 T1849 oascc.SolrZkClient.makePath makePath: /live_nodes
[junit4:junit4]   2> 368 T1849 oasc.ZkController.createEphemeralLiveNode Register node as live in ZooKeeper:/live_nodes/127.0.0.1:7000_solr
[junit4:junit4]   2> 369 T1854 oazs.PrepRequestProcessor.pRequest Got user-level KeeperException when processing sessionid:0x13ab1a073ad0002 type:delete cxid:0x7 zxid:0xfffffffffffffffe txntype:unknown reqpath:n/a Error Path:/solr/live_nodes/127.0.0.1:7000_solr Error:KeeperErrorCode = NoNode for /solr/live_nodes/127.0.0.1:7000_solr
[junit4:junit4]   2> 369 T1849 oascc.SolrZkClient.makePath makePath: /live_nodes/127.0.0.1:7000_solr
[junit4:junit4]   2> 371 T1849 oashc.HttpShardHandlerFactory.getParameter Setting socketTimeout to: 0
[junit4:junit4]   2> 371 T1849 oashc.HttpShardHandlerFactory.getParameter Setting urlScheme to: http://
[junit4:junit4]   2> 371 T1849 oashc.HttpShardHandlerFactory.getParameter Setting connTimeout to: 0
[junit4:junit4]   2> 372 T1849 oashc.HttpShardHandlerFactory.getParameter Setting maxConnectionsPerHost to: 20
[junit4:junit4]   2> 372 T1849 oashc.HttpShardHandlerFactory.getParameter Setting corePoolSize to: 0
[junit4:junit4]   2> 373 T1849 oashc.HttpShardHandlerFactory.getParameter Setting maximumPoolSize to: 2147483647
[junit4:junit4]   2> 373 T1849 oashc.HttpShardHandlerFactory.getParameter Setting maxThreadIdleTime to: 5
[junit4:junit4]   2> 374 T1849 oashc.HttpShardHandlerFactory.getParameter Setting sizeOfQueue to: -1
[junit4:junit4]   2> 374 T1849 oashc.HttpShardHandlerFactory.getParameter Setting fairnessPolicy to: false
[junit4:junit4]   2> 375 T1849 oascsi.HttpClientUtil.createClient Creating new http client, config:maxConnectionsPerHost=20&maxConnections=10000&socketTimeout=0&connTimeout=0&retry=false
[junit4:junit4]   2> 378 T1849 oascc.SolrZkClient.makePath makePath: /overseer_elect/election
[junit4:junit4]   2> 381 T1854 oazs.PrepRequestProcessor.pRequest Got user-level KeeperException when processing sessionid:0x13ab1a073ad0002 type:delete cxid:0x15 zxid:0xfffffffffffffffe txntype:unknown reqpath:n/a Error Path:/solr/overseer_elect/leader Error:KeeperErrorCode = NoNode for /solr/overseer_elect/leader
[junit4:junit4]   2> 382 T1849 oascc.SolrZkClient.makePath makePath: /overseer_elect/leader
[junit4:junit4]   2> 384 T1849 oasc.Overseer.start Overseer (id=88578445380747266-127.0.0.1:7000_solr-n_0000000000) starting
[junit4:junit4]   2> 385 T1854 oazs.PrepRequestProcessor.pRequest Got user-level KeeperException when processing sessionid:0x13ab1a073ad0002 type:create cxid:0x1a zxid:0xfffffffffffffffe txntype:unknown reqpath:n/a Error Path:/solr/overseer Error:KeeperErrorCode = NodeExists for /solr/overseer
[junit4:junit4]   2> 385 T1854 oazs.PrepRequestProcessor.pRequest Got user-level KeeperException when processing sessionid:0x13ab1a073ad0002 type:create cxid:0x1b zxid:0xfffffffffffffffe txntype:unknown reqpath:n/a Error Path:/solr/overseer Error:KeeperErrorCode = NodeExists for /solr/overseer
[junit4:junit4]   2> 387 T1854 oazs.PrepRequestProcessor.pRequest Got user-level KeeperException when processing sessionid:0x13ab1a073ad0002 type:create cxid:0x1c zxid:0xfffffffffffffffe txntype:unknown reqpath:n/a Error Path:/solr/overseer Error:KeeperErrorCode = NodeExists for /solr/overseer
[junit4:junit4]   2> 637 T1854 oazs.PrepRequestProcessor.pRequest Got user-level KeeperException when processing sessionid:0x13ab1a073ad0002 type:create cxid:0x1d zxid:0xfffffffffffffffe txntype:unknown reqpath:n/a Error Path:/solr/overseer Error:KeeperErrorCode = NodeExists for /solr/overseer
[junit4:junit4]   2> 638 T1862 oasc.OverseerCollectionProcessor.run Process current queue of collection messages
[junit4:junit4]   2> 638 T1849 oascc.SolrZkClient.makePath makePath: /clusterstate.json
[junit4:junit4]   2> 677 T1849 oascc.ZkStateReader.createClusterStateWatchersAndUpdate Updating cluster state from ZooKeeper... 
[junit4:junit4]   2> 679 T1861 oasc.Overseer$ClusterStateUpdater.run Starting to work on the main queue
[junit4:junit4]   2> 686 T1849 oasc.CoreContainer.create Creating SolrCore 'collection1' using instanceDir: /mnt/ssd/jenkins/workspace/Lucene-Solr-trunk-Linux/solr/build/solr-core/test-files/solr/collection1
[junit4:junit4]   2> 687 T1849 oasc.ZkController.createCollectionZkNode Check for collection zkNode:collection1
[junit4:junit4]   2> 688 T1849 oasc.ZkController.createCollectionZkNode Collection zkNode exists
[junit4:junit4]   2> 689 T1849 oasc.ZkController.readConfigName Load collection config from:/collections/collection1
[junit4:junit4]   2> 690 T1849 oasc.SolrResourceLoader.<init> new SolrResourceLoader for directory: '/mnt/ssd/jenkins/workspace/Lucene-Solr-trunk-Linux/solr/build/solr-core/test-files/solr/collection1/'
[junit4:junit4]   2> 691 T1849 oasc.SolrResourceLoader.replaceClassLoader Adding 'file:/mnt/ssd/jenkins/workspace/Lucene-Solr-trunk-Linux/solr/build/solr-core/test-files/solr/collection1/lib/README' to classloader
[junit4:junit4]   2> 692 T1849 oasc.SolrResourceLoader.replaceClassLoader Adding 'file:/mnt/ssd/jenkins/workspace/Lucene-Solr-trunk-Linux/solr/build/solr-core/test-files/solr/collection1/lib/classes/' to classloader
[junit4:junit4]   2> 732 T1849 oasc.SolrConfig.<init> Using Lucene MatchVersion: LUCENE_50
[junit4:junit4]   2> 791 T1849 oasc.SolrConfig.<init> Loaded SolrConfig: solrconfig.xml
[junit4:junit4]   2> 792 T1849 oass.IndexSchema.readSchema Reading Solr Schema
[junit4:junit4]   2> 797 T1849 oass.IndexSchema.readSchema Schema name=test
[junit4:junit4]   2> 1255 T1849 oass.OpenExchangeRatesOrgProvider.init Initialized with rates=open-exchange-rates.json, refreshInterval=1440.
[junit4:junit4]   2> 1261 T1849 oass.IndexSchema.readSchema default search field in schema is text
[junit4:junit4]   2> 1264 T1849 oass.IndexSchema.readSchema unique key field: id
[junit4:junit4]   2> 1270 T1849 oass.FileExchangeRateProvider.reload Reloading exchange rates from file currency.xml
[junit4:junit4]   2> 1273 T1849 oass.FileExchangeRateProvider.reload Reloading exchange rates from file currency.xml
[junit4:junit4]   2> 1276 T1849 oass.OpenExchangeRatesOrgProvider.reload Reloading exchange rates from open-exchange-rates.json
[junit4:junit4]   2> 1276 T1849 oass.OpenExchangeRatesOrgProvider.reload Reloading exchange rates from open-exchange-rates.json
[junit4:junit4]   2> 1277 T1849 oasc.SolrCore.<init> [collection1] Opening new SolrCore at /mnt/ssd/jenkins/workspace/Lucene-Solr-trunk-Linux/solr/build/solr-core/test-files/solr/collection1/, dataDir=/mnt/ssd/jenkins/workspace/Lucene-Solr-trunk-Linux/solr/build/solr-core/test/J1/./solrtest-LeaderElectionIntegrationTest-1351599813545/data_7000/
[junit4:junit4]   2> 1278 T1849 oasc.JmxMonitoredMap.<init> JMX monitoring is enabled. Adding Solr mbeans to JMX Server: com.sun.jmx.mbeanserver.JmxMBeanServer@151dc28
[junit4:junit4]   2> 1278 T1849 oasc.SolrCore.initDirectoryFactory org.apache.solr.core.MockDirectoryFactory
[junit4:junit4]   2> 1279 T1849 oasc.CachingDirectoryFactory.injectLockFactory WARNING No lockType configured for MockDirWrapper(NRTCachingDirectory(org.apache.lucene.store.RAMDirectory@1ef7c14 lockFactory=org.apache.lucene.store.SingleInstanceLockFactory@1bb060a; maxCacheMB=0.6015625 maxMergeSizeMB=0.873046875)) assuming 'simple'
[junit4:junit4]   2> 1279 T1849 oasc.CachingDirectoryFactory.get return new directory for /mnt/ssd/jenkins/workspace/Lucene-Solr-trunk-Linux/solr/build/solr-core/test/J1/./solrtest-LeaderElectionIntegrationTest-1351599813545/data_7000 forceNew:false
[junit4:junit4]   2> 1280 T1849 oasc.CachingDirectoryFactory.close Releasing directory:/mnt/ssd/jenkins/workspace/Lucene-Solr-trunk-Linux/solr/build/solr-core/test/J1/./solrtest-LeaderElectionIntegrationTest-1351599813545/data_7000
[junit4:junit4]   2> 1280 T1849 oasc.SolrCore.getNewIndexDir New index directory detected: old=null new=/mnt/ssd/jenkins/workspace/Lucene-Solr-trunk-Linux/solr/build/solr-core/test/J1/./solrtest-LeaderElectionIntegrationTest-1351599813545/data_7000/index/
[junit4:junit4]   2> 1280 T1849 oasc.SolrCore.initIndex WARNING [collection1] Solr index directory '/mnt/ssd/jenkins/workspace/Lucene-Solr-trunk-Linux/solr/build/solr-core/test/J1/./solrtest-LeaderElectionIntegrationTest-1351599813545/data_7000/index' doesn't exist. Creating new index...
[junit4:junit4]   2> 1281 T1849 oasc.CachingDirectoryFactory.get return new directory for /mnt/ssd/jenkins/workspace/Lucene-Solr-trunk-Linux/solr/build/solr-core/test/J1/./solrtest-LeaderElectionIntegrationTest-1351599813545/data_7000/index forceNew:false
[junit4:junit4]   2> 1282 T1849 oasc.SolrDeletionPolicy.onCommit SolrDeletionPolicy.onCommit: commits:num=1
[junit4:junit4]   2> 		commit{dir=MockDirWrapper(NRTCachingDirectory(org.apache.lucene.store.RAMDirectory@1a6754d lockFactory=org.apache.lucene.store.NativeFSLockFactory@197c246; maxCacheMB=0.630859375 maxMergeSizeMB=0.98046875)),segFN=segments_1,generation=1,filenames=[segments_1]
[junit4:junit4]   2> 1282 T1849 oasc.SolrDeletionPolicy.updateCommits newest commit = 1[segments_1]
[junit4:junit4]   2> 1283 T1849 oasc.CachingDirectoryFactory.close Releasing directory:/mnt/ssd/jenkins/workspace/Lucene-Solr-trunk-Linux/solr/build/solr-core/test/J1/./solrtest-LeaderElectionIntegrationTest-1351599813545/data_7000/index
[junit4:junit4]   2> 1283 T1849 oasc.SolrCore.initWriters created xml: solr.XMLResponseWriter
[junit4:junit4]   2> 1285 T1849 oasup.UpdateRequestProcessorChain.init inserting DistributedUpdateProcessorFactory into updateRequestProcessorChain "dedupe"
[junit4:junit4]   2> 1285 T1849 oasup.UpdateRequestProcessorChain.init inserting DistributedUpdateProcessorFactory into updateRequestProcessorChain "dedupe-allfields"
[junit4:junit4]   2> 1285 T1849 oasup.UpdateRequestProcessorChain.init inserting DistributedUpdateProcessorFactory into updateRequestProcessorChain "stored_sig"
[junit4:junit4]   2> 1286 T1849 oasup.UpdateRequestProcessorChain.init inserting DistributedUpdateProcessorFactory into updateRequestProcessorChain "uniq-fields"
[junit4:junit4]   2> 1286 T1849 oasup.UpdateRequestProcessorChain.init inserting DistributedUpdateProcessorFactory into updateRequestProcessorChain "distrib-dup-test-chain-implicit"
[junit4:junit4]   2> 1287 T1849 oasc.RequestHandlers.initHandlersFromConfig adding lazy requestHandler: solr.ReplicationHandler
[junit4:junit4]   2> 1287 T1849 oasc.RequestHandlers.initHandlersFromConfig created /replication: solr.ReplicationHandler
[junit4:junit4]   2> 1288 T1849 oasc.RequestHandlers.initHandlersFromConfig created standard: solr.StandardRequestHandler
[junit4:junit4]   2> 1289 T1849 oasc.RequestHandlers.initHandlersFromConfig created /get: solr.RealTimeGetHandler
[junit4:junit4]   2> 1290 T1849 oasc.RequestHandlers.initHandlersFromConfig created dismax: solr.SearchHandler
[junit4:junit4]   2> 1290 T1849 oasc.RequestHandlers.initHandlersFromConfig created mock: org.apache.solr.core.MockQuerySenderListenerReqHandler
[junit4:junit4]   2> 1291 T1849 oasc.RequestHandlers.initHandlersFromConfig created /admin/: org.apache.solr.handler.admin.AdminHandlers
[junit4:junit4]   2> 1291 T1849 oasc.RequestHandlers.initHandlersFromConfig created defaults: solr.StandardRequestHandler
[junit4:junit4]   2> 1292 T1849 oasc.RequestHandlers.initHandlersFromConfig adding lazy requestHandler: solr.StandardRequestHandler
[junit4:junit4]   2> 1292 T1849 oasc.RequestHandlers.initHandlersFromConfig created lazy: solr.StandardRequestHandler
[junit4:junit4]   2> 1293 T1849 oasc.RequestHandlers.initHandlersFromConfig created /update: solr.UpdateRequestHandler
[junit4:junit4]   2> 1294 T1849 oasc.RequestHandlers.initHandlersFromConfig created /terms: org.apache.solr.handler.component.SearchHandler
[junit4:junit4]   2> 1294 T1849 oasc.RequestHandlers.initHandlersFromConfig created spellCheckCompRH: org.apache.solr.handler.component.SearchHandler
[junit4:junit4]   2> 1295 T1849 oasc.RequestHandlers.initHandlersFromConfig created spellCheckCompRH_Direct: org.apache.solr.handler.component.SearchHandler
[junit4:junit4]   2> 1296 T1849 oasc.RequestHandlers.initHandlersFromConfig created spellCheckWithWordbreak: org.apache.solr.handler.component.SearchHandler
[junit4:junit4]   2> 1297 T1849 oasc.RequestHandlers.initHandlersFromConfig created spellCheckWithWordbreak_Direct: org.apache.solr.handler.component.SearchHandler
[junit4:junit4]   2> 1297 T1849 oasc.RequestHandlers.initHandlersFromConfig created spellCheckCompRH1: org.apache.solr.handler.component.SearchHandler
[junit4:junit4]   2> 1298 T1849 oasc.RequestHandlers.initHandlersFromConfig created tvrh: org.apache.solr.handler.component.SearchHandler
[junit4:junit4]   2> 1299 T1849 oasc.RequestHandlers.initHandlersFromConfig created /mlt: solr.MoreLikeThisHandler
[junit4:junit4]   2> 1300 T1849 oasc.RequestHandlers.initHandlersFromConfig created /debug/dump: solr.DumpRequestHandler
[junit4:junit4]   2> 1302 T1849 oashl.XMLLoader.init xsltCacheLifetimeSeconds=60
[junit4:junit4]   2> 1304 T1849 oasc.SolrCore.initDeprecatedSupport WARNING solrconfig.xml uses deprecated <admin/gettableFiles>, Please update your config to use the ShowFileRequestHandler.
[junit4:junit4]   2> 1305 T1849 oasc.SolrCore.initDeprecatedSupport WARNING adding ShowFileRequestHandler with hidden files: [SCHEMA.XML, OLD_SYNONYMS.TXT, STOPWORDS.TXT, PROTWORDS.TXT, OPEN-EXCHANGE-RATES.JSON, SYNONYMS.TXT, CURRENCY.XML, MAPPING-ISOLATIN1ACCENT.TXT]
[junit4:junit4]   2> 1307 T1849 oasc.CachingDirectoryFactory.close Releasing directory:/mnt/ssd/jenkins/workspace/Lucene-Solr-trunk-Linux/solr/build/solr-core/test/J1/./solrtest-LeaderElectionIntegrationTest-1351599813545/data_7000
[junit4:junit4]   2> 1307 T1849 oass.SolrIndexSearcher.<init> Opening Searcher@e4d2d7 main
[junit4:junit4]   2> 1308 T1849 oasu.CommitTracker.<init> Hard AutoCommit: disabled
[junit4:junit4]   2> 1308 T1849 oasu.CommitTracker.<init> Soft AutoCommit: disabled
[junit4:junit4]   2> 1309 T1849 oashc.SpellCheckComponent.inform Initializing spell checkers
[junit4:junit4]   2> 1312 T1849 oass.DirectSolrSpellChecker.init init: {name=direct,classname=DirectSolrSpellChecker,field=lowerfilt,minQueryLength=3}
[junit4:junit4]   2> 1331 T1863 oasc.SolrCore.registerSearcher [collection1] Registered new searcher Searcher@e4d2d7 main{StandardDirectoryReader(segments_1:1)}
[junit4:junit4]   2> 1334 T1849 oasc.ZkController.publish numShards not found on descriptor - reading it from system property
[junit4:junit4]   2> 1335 T1854 oazs.PrepRequestProcessor.pRequest Got user-level KeeperException when processing sessionid:0x13ab1a073ad0002 type:create cxid:0x53 zxid:0xfffffffffffffffe txntype:unknown reqpath:n/a Error Path:/solr/overseer/queue Error:KeeperErrorCode = NoNode for /solr/overseer/queue
[junit4:junit4]   2> 1337 T1849 oasc.CoreContainer.register registering core: collection1
[junit4:junit4]   2> 1337 T1849 oasc.ZkController.register Register shard - core:collection1 address:http://127.0.0.1:7000/solr shardId:shard1
[junit4:junit4]   2> 1338 T1849 oascc.SolrZkClient.makePath makePath: /collections/collection1/leader_elect/shard1/election
[junit4:junit4]   2> 1340 T1854 oazs.PrepRequestProcessor.pRequest Got user-level KeeperException when processing sessionid:0x13ab1a073ad0002 type:delete cxid:0x62 zxid:0xfffffffffffffffe txntype:unknown reqpath:n/a Error Path:/solr/collections/collection1/leaders Error:KeeperErrorCode = NoNode for /solr/collections/collection1/leaders
[junit4:junit4]   2> 1341 T1849 oasc.ShardLeaderElectionContext.runLeaderProcess Running the leader process.
[junit4:junit4]   2> 1341 T1854 oazs.PrepRequestProcessor.pRequest Got user-level KeeperException when processing sessionid:0x13ab1a073ad0002 type:create cxid:0x63 zxid:0xfffffffffffffffe txntype:unknown reqpath:n/a Error Path:/solr/overseer Error:KeeperErrorCode = NodeExists for /solr/overseer
[junit4:junit4]   2> 1683 T1861 oascc.ZkStateReader.updateClusterState Updating cloud state from ZooKeeper... 
[junit4:junit4]   2> 1684 T1861 oasc.Overseer$ClusterStateUpdater.updateState Update state numShards=null message={
[junit4:junit4]   2> 	  "operation":"state",
[junit4:junit4]   2> 	  "numShards":null,
[junit4:junit4]   2> 	  "shard":"shard1",
[junit4:junit4]   2> 	  "roles":null,
[junit4:junit4]   2> 	  "state":"down",
[junit4:junit4]   2> 	  "core":"collection1",
[junit4:junit4]   2> 	  "collection":"collection1",
[junit4:junit4]   2> 	  "node_name":"127.0.0.1:7000_solr",
[junit4:junit4]   2> 	  "base_url":"http://127.0.0.1:7000/solr"}
[junit4:junit4]   2> 1684 T1854 oazs.PrepRequestProcessor.pRequest Got user-level KeeperException when processing sessionid:0x13ab1a073ad0002 type:create cxid:0x6a zxid:0xfffffffffffffffe txntype:unknown reqpath:n/a Error Path:/solr/overseer/queue-work Error:KeeperErrorCode = NoNode for /solr/overseer/queue-work
[junit4:junit4]   2> 1722 T1860 oascc.ZkStateReader$2.process A cluster state change has occurred - updating... (1)
[junit4:junit4]   2> 1842 T1849 oasc.ShardLeaderElectionContext.waitForReplicasToComeUp Enough replicas found to continue.
[junit4:junit4]   2> 1843 T1849 oasc.ShardLeaderElectionContext.runLeaderProcess I may be the new leader - try and sync
[junit4:junit4]   2> 1843 T1849 oasc.ShardLeaderElectionContext.runLeaderProcess I am the new leader: http://127.0.0.1:7000/solr/collection1/
[junit4:junit4]   2> 1844 T1849 oascc.SolrZkClient.makePath makePath: /collections/collection1/leaders/shard1
[junit4:junit4]   2> 1845 T1854 oazs.PrepRequestProcessor.pRequest Got user-level KeeperException when processing sessionid:0x13ab1a073ad0002 type:create cxid:0x89 zxid:0xfffffffffffffffe txntype:unknown reqpath:n/a Error Path:/solr/overseer Error:KeeperErrorCode = NodeExists for /solr/overseer
[junit4:junit4]   2> 2226 T1861 oascc.ZkStateReader.updateClusterState Updating cloud state from ZooKeeper... 
[junit4:junit4]   2> 4228 T1859 oaz.ClientCnxn$SendThread.run Client session timed out, have not heard from server in 2000ms for sessionid 0x13ab1a073ad0002, closing socket connection and attempting reconnect
[junit4:junit4]   2> 4228 T1851 oazs.NIOServerCnxn.doIO WARNING EndOfStreamException: Unable to read additional data from client sessionid 0x13ab1a073ad0002, likely client has closed socket
[junit4:junit4]   2> 4230 T1851 oazs.NIOServerCnxn.closeSock Closed socket connection for client /127.0.0.1:35369 which had sessionid 0x13ab1a073ad0002
[junit4:junit4]   2> 4329 T1860 oascc.ConnectionManager.process Watcher org.apache.solr.common.cloud.ConnectionManager@1f736af name:ZooKeeperConnection Watcher:127.0.0.1:33226/solr got event WatchedEvent state:Disconnected type:None path:null path:null type:None
[junit4:junit4]   2> 4329 T1860 oascc.ConnectionManager.process zkClient has disconnected
[junit4:junit4]   2> 4926 T1853 oazsp.FileTxnLog.commit WARNING fsync-ing the write ahead log in SyncThread:0 took 2698ms which will adversely effect operation latency. See the ZooKeeper troubleshooting guide
[junit4:junit4]   2> 4927 T1853 oazs.NIOServerCnxn.sendBuffer SEVERE Unexpected Exception:  java.nio.channels.CancelledKeyException
[junit4:junit4]   2> 	at sun.nio.ch.SelectionKeyImpl.ensureValid(SelectionKeyImpl.java:73)
[junit4:junit4]   2> 	at sun.nio.ch.SelectionKeyImpl.interestOps(SelectionKeyImpl.java:77)
[junit4:junit4]   2> 	at org.apache.zookeeper.server.NIOServerCnxn.sendBuffer(NIOServerCnxn.java:418)
[junit4:junit4]   2> 	at org.apache.zookeeper.server.NIOServerCnxn.sendResponse(NIOServerCnxn.java:1509)
[junit4:junit4]   2> 	at org.apache.zookeeper.server.FinalRequestProcessor.processRequest(FinalRequestProcessor.java:359)
[junit4:junit4]   2> 	at org.apache.zookeeper.server.SyncRequestProcessor.flush(SyncRequestProcessor.java:163)
[junit4:junit4]   2> 	at org.apache.zookeeper.server.SyncRequestProcessor.run(SyncRequestProcessor.java:98)
[junit4:junit4]   2> 
[junit4:junit4]   2> 4928 T1853 oazs.NIOServerCnxn.sendBuffer SEVERE Unexpected Exception:  java.nio.channels.CancelledKeyException
[junit4:junit4]   2> 	at sun.nio.ch.SelectionKeyImpl.ensureValid(SelectionKeyImpl.java:73)
[junit4:junit4]   2> 	at sun.nio.ch.SelectionKeyImpl.interestOps(SelectionKeyImpl.java:77)
[junit4:junit4]   2> 	at org.apache.zookeeper.server.NIOServerCnxn.sendBuffer(NIOServerCnxn.java:418)
[junit4:junit4]   2> 	at org.apache.zookeeper.server.NIOServerCnxn.sendResponse(NIOServerCnxn.java:1509)
[junit4:junit4]   2> 	at org.apache.zookeeper.server.FinalRequestProcessor.processRequest(FinalRequestProcessor.java:162)
[junit4:junit4]   2> 	at org.apache.zookeeper.server.SyncRequestProcessor.run(SyncRequestProcessor.java:135)
[junit4:junit4]   2> 
[junit4:junit4]   2> 6059 T1859 oaz.ClientCnxn$SendThread.startConnect Opening socket connection to server localhost.localdomain/127.0.0.1:33226
[junit4:junit4]   2> 6060 T1859 oaz.ClientCnxn$SendThread.primeConnection Socket connection established to localhost.localdomain/127.0.0.1:33226, initiating session
[junit4:junit4]   2> 6060 T1851 oazs.NIOServerCnxn$Factory.run Accepted socket connection from /127.0.0.1:35378
[junit4:junit4]   2> 6061 T1851 oazs.NIOServerCnxn.readConnectRequest Client attempting to renew session 0x13ab1a073ad0002 at /127.0.0.1:35378
[junit4:junit4]   2> 6061 T1851 oazs.NIOServerCnxn.finishSessionInit Established session 0x13ab1a073ad0002 with negotiated timeout 3000 for client /127.0.0.1:35378
[junit4:junit4]   2> 6061 T1859 oaz.ClientCnxn$SendThread.readConnectResult Session establishment complete on server localhost.localdomain/127.0.0.1:33226, sessionid = 0x13ab1a073ad0002, negotiated timeout = 3000
[junit4:junit4]   2> 6062 T1854 oazs.PrepRequestProcessor.pRequest Got user-level KeeperException when processing sessionid:0x13ab1a073ad0002 type:delete cxid:0x95 zxid:0xfffffffffffffffe txntype:unknown reqpath:n/a Error Path:/solr/overseer/queue/qn-0000000004 Error:KeeperErrorCode = NoNode for /solr/overseer/queue/qn-0000000004
[junit4:junit4]   2> 6062 T1860 oascc.ConnectionManager.process Watcher org.apache.solr.common.cloud.ConnectionManager@1f736af name:ZooKeeperConnection Watcher:127.0.0.1:33226/solr got event WatchedEvent state:SyncConnected type:None path:null path:null type:None
[junit4:junit4]   2> 6079 T1861 ccr.RandomizedRunner$QueueUncaughtExceptionsHandler.uncaughtException WARNING Uncaught exception in thread: Thread[Thread-744,5,Overseer state updater.] java.util.NoSuchElementException
[junit4:junit4]   2> 	at __randomizedtesting.SeedInfo.seed([7AE0C40E452B3188]:0)
[junit4:junit4]   2> 	at org.apache.solr.cloud.DistributedQueue.remove(DistributedQueue.java:148)
[junit4:junit4]   2> 	at org.apache.solr.cloud.Overseer$ClusterStateUpdater.run(Overseer.java:131)
[junit4:junit4]   2> 	at java.lang.Thread.run(Thread.java:722)
[junit4:junit4]   2> 
[junit4:junit4]   2> 31848 T1849 oasc.ZkController.getLeader SEVERE Error getting leader from zk org.apache.solr.common.SolrException: No registered leader was found, collection:collection1 slice:shard1
[junit4:junit4]   2> 	at org.apache.solr.common.cloud.ZkStateReader.getLeaderProps(ZkStateReader.java:417)
[junit4:junit4]   2> 	at org.apache.solr.common.cloud.ZkStateReader.getLeaderUrl(ZkStateReader.java:394)
[junit4:junit4]   2> 	at org.apache.solr.cloud.ZkController.getLeader(ZkController.java:644)
[junit4:junit4]   2> 	at org.apache.solr.cloud.ZkController.register(ZkController.java:579)
[junit4:junit4]   2> 	at org.apache.solr.cloud.ZkController.register(ZkController.java:534)
[junit4:junit4]   2> 	at org.apache.solr.core.CoreContainer.registerInZk(CoreContainer.java:708)
[junit4:junit4]   2> 	at org.apache.solr.core.CoreContainer.register(CoreContainer.java:692)
[junit4:junit4]   2> 	at org.apache.solr.core.CoreContainer.load(CoreContainer.java:531)
[junit4:junit4]   2> 	at org.apache.solr.core.CoreContainer.load(CoreContainer.java:351)
[junit4:junit4]   2> 	at org.apache.solr.core.CoreContainer$Initializer.initialize(CoreContainer.java:303)
[junit4:junit4]   2> 	at org.apache.solr.cloud.LeaderElectionIntegrationTest.setupContainer(LeaderElectionIntegrationTest.java:152)
[junit4:junit4]   2> 	at org.apache.solr.cloud.LeaderElectionIntegrationTest.setUp(LeaderElectionIntegrationTest.java:100)
[junit4:junit4]   2> 	at sun.reflect.GeneratedMethodAccessor4.invoke(Unknown Source)
[junit4:junit4]   2> 	at sun.reflect.DelegatingMethodAccessorImpl.invoke(DelegatingMethodAccessorImpl.java:43)
[junit4:junit4]   2> 	at java.lang.reflect.Method.invoke(Method.java:601)
[junit4:junit4]   2> 	at com.carrotsearch.randomizedtesting.RandomizedRunner.invoke(RandomizedRunner.java:1559)
[junit4:junit4]   2> 	at com.carrotsearch.randomizedtesting.RandomizedRunner.access$600(RandomizedRunner.java:79)
[junit4:junit4]   2> 	at com.carrotsearch.randomizedtesting.RandomizedRunner$7.evaluate(RandomizedRunner.java:771)
[junit4:junit4]   2> 	at com.carrotsearch.randomizedtesting.RandomizedRunner$8.evaluate(RandomizedRunner.java:787)
[junit4:junit4]   2> 	at com.carrotsearch.randomizedtesting.rules.SystemPropertiesRestoreRule$1.evaluate(SystemPropertiesRestoreRule.java:53)
[junit4:junit4]   2> 	at org.apache.lucene.util.TestRuleSetupTeardownChained$1.evaluate(TestRuleSetupTeardownChained.java:50)
[junit4:junit4]   2> 	at org.apache.lucene.util.TestRuleFieldCacheSanity$1.evaluate(TestRuleFieldCacheSanity.java:51)
[junit4:junit4]   2> 	at org.apache.lucene.util.AbstractBeforeAfterRule$1.evaluate(AbstractBeforeAfterRule.java:45)
[junit4:junit4]   2> 	at com.carrotsearch.randomizedtesting.rules.SystemPropertiesInvariantRule$1.evaluate(SystemPropertiesInvariantRule.java:55)
[junit4:junit4]   2> 	at org.apache.lucene.util.TestRuleThreadAndTestName$1.evaluate(TestRuleThreadAndTestName.java:48)
[junit4:junit4]   2> 	at org.apache.lucene.util.TestRuleIgnoreAfterMaxFailures$1.evaluate(TestRuleIgnoreAfterMaxFailures.java:70)
[junit4:junit4]   2> 	at org.apache.lucene.util.TestRuleMarkFailure$1.evaluate(TestRuleMarkFailure.java:48)
[junit4:junit4]   2> 	at com.carrotsearch.randomizedtesting.rules.StatementAdapter.evaluate(StatementAdapter.java:36)
[junit4:junit4]   2> 	at com.carrotsearch.randomizedtesting.ThreadLeakControl$StatementRunner.run(ThreadLeakControl.java:358)
[junit4:junit4]   2> 	at com.carrotsearch.randomizedtesting.ThreadLeakControl.forkTimeoutingTask(ThreadLeakControl.java:782)
[junit4:junit4]   2> 	at com.carrotsearch.randomizedtesting.ThreadLeakControl$3.evaluate(ThreadLeakControl.java:442)
[junit4:junit4]   2> 	at com.carrotsearch.randomizedtesting.RandomizedRunner.runSingleTest(RandomizedRunner.java:746)
[junit4:junit4]   2> 	at com.carrotsearch.randomizedtesting.RandomizedRunner$3.evaluate(RandomizedRunner.java:648)
[junit4:junit4]   2> 	at com.carrotsearch.randomizedtesting.RandomizedRunner$4.evaluate(RandomizedRunner.java:682)
[junit4:junit4]   2> 	at com.carrotsearch.randomizedtesting.RandomizedRunner$5.evaluate(RandomizedRunner.java:693)
[junit4:junit4]   2> 	at com.carrotsearch.randomizedtesting.rules.StatementAdapter.evaluate(StatementAdapter.java:36)
[junit4:junit4]   2> 	at com.carrotsearch.randomizedtesting.rules.SystemPropertiesRestoreRule$1.evaluate(SystemPropertiesRestoreRule.java:53)
[junit4:junit4]   2> 	at org.apache.lucene.util.AbstractBeforeAfterRule$1.evaluate(AbstractBeforeAfterRule.java:45)
[junit4:junit4]   2> 	at org.apache.lucene.util.TestRuleStoreClassName$1.evaluate(TestRuleStoreClassName.java:42)
[junit4:junit4]   2> 	at com.carrotsearch.randomizedtesting.rules.SystemPropertiesInvariantRule$1.evaluate(SystemPropertiesInvariantRule.java:55)
[junit4:junit4]   2> 	at com.carrotsearch.randomizedtesting.rules.NoShadowingOrOverridesOnMethodsRule$1.evaluate(NoShadowingOrOverridesOnMethodsRule.java:39)
[junit4:junit4]   2> 	at com.carrotsearch.randomizedtesting.rules.NoShadowingOrOverridesOnMethodsRule$1.evaluate(NoShadowingOrOverridesOnMethodsRule.java:39)
[junit4:junit4]   2> 	at com.carrotsearch.randomizedtesting.rules.StatementAdapter.evaluate(StatementAdapter.java:36)
[junit4:junit4]   2> 	at org.apache.lucene.util.TestRuleAssertionsRequired$1.evaluate(TestRuleAssertionsRequired.java:43)
[junit4:junit4]   2> 	at org.apache.lucene.util.TestRuleMarkFailure$1.evaluate(TestRuleMarkFailure.java:48)
[junit4:junit4]   2> 	at org.apache.lucene.util.TestRuleIgnoreAfterMaxFailures$1.evaluate(TestRuleIgnoreAfterMaxFailures.java:70)
[junit4:junit4]   2> 	at org.apache.lucene.util.TestRuleIgnoreTestSuites$1.evaluate(TestRuleIgnoreTestSuites.java:55)
[junit4:junit4]   2> 	at com.carrotsearch.randomizedtesting.rules.StatementAdapter.evaluate(StatementAdapter.java:36)
[junit4:junit4]   2> 	at com.carrotsearch.randomizedtesting.ThreadLeakControl$StatementRunner.run(ThreadLeakControl.java:358)
[junit4:junit4]   2> 	at java.lang.Thread.run(Thread.java:722)
[junit4:junit4]   2> 
[junit4:junit4]   2> 31850 T1849 oasc.ZkController.publish numShards not found on descriptor - reading it from system property
[junit4:junit4]   2> 31852 T1849 oasc.SolrException.log SEVERE :org.apache.solr.common.SolrException: Error getting leader from zk
[junit4:junit4]   2> 		at org.apache.solr.cloud.ZkController.getLeader(ZkController.java:664)
[junit4:junit4]   2> 		at org.apache.solr.cloud.ZkController.register(ZkController.java:579)
[junit4:junit4]   2> 		at org.apache.solr.cloud.ZkController.register(ZkController.java:534)
[junit4:junit4]   2> 		at org.apache.solr.core.CoreContainer.registerInZk(CoreContainer.java:708)
[junit4:junit4]   2> 		at org.apache.solr.core.CoreContainer.register(CoreContainer.java:692)
[junit4:junit4]   2> 		at org.apache.solr.core.CoreContainer.load(CoreContainer.java:531)
[junit4:junit4]   2> 		at org.apache.solr.core.CoreContainer.load(CoreContainer.java:351)
[junit4:junit4]   2> 		at org.apache.solr.core.CoreContainer$Initializer.initialize(CoreContainer.java:303)
[junit4:junit4]   2> 		at org.apache.solr.cloud.LeaderElectionIntegrationTest.setupContainer(LeaderElectionIntegrationTest.java:152)
[junit4:junit4]   2> 		at org.apache.solr.cloud.LeaderElectionIntegrationTest.setUp(LeaderElectionIntegrationTest.java:100)
[junit4:junit4]   2> 		at sun.reflect.GeneratedMethodAccessor4.invoke(Unknown Source)
[junit4:junit4]   2> 		at sun.reflect.DelegatingMethodAccessorImpl.invoke(DelegatingMethodAccessorImpl.java:43)
[junit4:junit4]   2> 		at java.lang.reflect.Method.invoke(Method.java:601)
[junit4:junit4]   2> 		at com.carrotsearch.randomizedtesting.RandomizedRunner.invoke(RandomizedRunner.java:1559)
[junit4:junit4]   2> 		at com.carrotsearch.randomizedtesting.RandomizedRunner.access$600(RandomizedRunner.java:79)
[junit4:junit4]   2> 		at com.carrotsearch.randomizedtesting.RandomizedRunner$7.evaluate(RandomizedRunner.java:771)
[junit4:junit4]   2> 		at com.carrotsearch.randomizedtesting.RandomizedRunner$8.evaluate(RandomizedRunner.java:787)
[junit4:junit4]   2> 		at com.carrotsearch.randomizedtesting.rules.SystemPropertiesRestoreRule$1.evaluate(SystemPropertiesRestoreRule.java:53)
[junit4:junit4]   2> 		at org.apache.lucene.util.TestRuleSetupTeardownChained$1.evaluate(TestRuleSetupTeardownChained.java:50)
[junit4:junit4]   2> 		at org.apache.lucene.util.TestRuleFieldCacheSanity$1.evaluate(TestRuleFieldCacheSanity.java:51)
[junit4:junit4]   2> 		at org.apache.lucene.util.AbstractBeforeAfterRule$1.evaluate(AbstractBeforeAfterRule.java:45)
[junit4:junit4]   2> 		at com.carrotsearch.randomizedtesting.rules.SystemPropertiesInvariantRule$1.evaluate(SystemPropertiesInvariantRule.java:55)
[junit4:junit4]   2> 		at org.apache.lucene.util.TestRuleThreadAndTestName$1.evaluate(TestRuleThreadAndTestName.java:48)
[junit4:junit4]   2> 		at org.apache.lucene.util.TestRuleIgnoreAfterMaxFailures$1.evaluate(TestRuleIgnoreAfterMaxFailures.java:70)
[junit4:junit4]   2> 		at org.apache.lucene.util.TestRuleMarkFailure$1.evaluate(TestRuleMarkFailure.java:48)
[junit4:junit4]   2> 		at com.carrotsearch.randomizedtesting.rules.StatementAdapter.evaluate(StatementAdapter.java:36)
[junit4:junit4]   2> 		at com.carrotsearch.randomizedtesting.ThreadLeakControl$StatementRunner.run(ThreadLeakControl.java:358)
[junit4:junit4]   2> 		at com.carrotsearch.randomizedtesting.ThreadLeakControl.forkTimeoutingTask(ThreadLeakControl.java:782)
[junit4:junit4]   2> 		at com.carrotsearch.randomizedtesting.ThreadLeakControl$3.evaluate(ThreadLeakControl.java:442)
[junit4:junit4]   2> 		at com.carrotsearch.randomizedtesting.RandomizedRunner.runSingleTest(RandomizedRunner.java:746)
[junit4:junit4]   2> 		at com.carrotsearch.randomizedtesting.RandomizedRunner$3.evaluate(RandomizedRunner.java:648)
[junit4:junit4]   2> 		at com.carrotsearch.randomizedtesting.RandomizedRunner$4.evaluate(RandomizedRunner.java:682)
[junit4:junit4]   2> 		at com.carrotsearch.randomizedtesting.RandomizedRunner$5.evaluate(RandomizedRunner.java:693)
[junit4:junit4]   2> 		at com.carrotsearch.randomizedtesting.rules.StatementAdapter.evaluate(StatementAdapter.java:36)
[junit4:junit4]   2> 		at com.carrotsearch.randomizedtesting.rules.SystemPropertiesRestoreRule$1.evaluate(SystemPropertiesRestoreRule.java:53)
[junit4:junit4]   2> 		at org.apache.lucene.util.AbstractBeforeAfterRule$1.evaluate(AbstractBeforeAfterRule.java:45)
[junit4:junit4]   2> 		at org.apache.lucene.util.TestRuleStoreClassName$1.evaluate(TestRuleStoreClassName.java:42)
[junit4:junit4]   2> 		at com.carrotsearch.randomizedtesting.rules.SystemPropertiesInvariantRule$1.evaluate(SystemPropertiesInvariantRule.java:55)
[junit4:junit4]   2> 		at com.carrotsearch.randomizedtesting.rules.NoShadowingOrOverridesOnMethodsRule$1.evaluate(NoShadowingOrOverridesOnMethodsRule.java:39)
[junit4:junit4]   2> 		at com.carrotsearch.randomizedtesting.rules.NoShadowingOrOverridesOnMethodsRule$1.evaluate(NoShadowingOrOverridesOnMethodsRule.java:39)
[junit4:junit4]   2> 		at com.carrotsearch.randomizedtesting.rules.StatementAdapter.evaluate(StatementAdapter.java:36)
[junit4:junit4]   2> 		at org.apache.lucene.util.TestRuleAssertionsRequired$1.evaluate(TestRuleAssertionsRequired.java:43)
[junit4:junit4]   2> 		at org.apache.lucene.util.TestRuleMarkFailure$1.evaluate(TestRuleMarkFailure.java:48)
[junit4:junit4]   2> 		at org.apache.lucene.util.TestRuleIgnoreAfterMaxFailures$1.evaluate(TestRuleIgnoreAfterMaxFailures.java:70)
[junit4:junit4]   2> 		at org.apache.lucene.util.TestRuleIgnoreTestSuites$1.evaluate(TestRuleIgnoreTestSuites.java:55)
[junit4:junit4]   2> 		at com.carrotsearch.randomizedtesting.rules.StatementAdapter.evaluate(StatementAdapter.java:36)
[junit4:junit4]   2> 		at com.carrotsearch.randomizedtesting.ThreadLeakControl$StatementRunner.run(ThreadLeakControl.java:358)
[junit4:junit4]   2> 		at java.lang.Thread.run(Thread.java:722)
[junit4:junit4]   2> 	Caused by: org.apache.solr.common.SolrException: No registered leader was found, collection:collection1 slice:shard1
[junit4:junit4]   2> 		at org.apache.solr.common.cloud.ZkStateReader.getLeaderProps(ZkStateReader.java:417)
[junit4:junit4]   2> 		at org.apache.solr.common.cloud.ZkStateReader.getLeaderUrl(ZkStateReader.java:394)
[junit4:junit4]   2> 		at org.apache.solr.cloud.ZkController.getLeader(ZkController.java:644)
[junit4:junit4]   2> 		... 47 more
[junit4:junit4]   2> 	
[junit4:junit4]   2> 31853 T1849 oasc.SolrException.log SEVERE null:org.apache.solr.common.cloud.ZooKeeperException: 
[junit4:junit4]   2> 		at org.apache.solr.core.CoreContainer.registerInZk(CoreContainer.java:731)
[junit4:junit4]   2> 		at org.apache.solr.core.CoreContainer.register(CoreContainer.java:692)
[junit4:junit4]   2> 		at org.apache.solr.core.CoreContainer.load(CoreContainer.java:531)
[junit4:junit4]   2> 		at org.apache.solr.core.CoreContainer.load(CoreContainer.java:351)
[junit4:junit4]   2> 		at org.apache.solr.core.CoreContainer$Initializer.initialize(CoreContainer.java:303)
[junit4:junit4]   2> 		at org.apache.solr.cloud.LeaderElectionIntegrationTest.setupContainer(LeaderElectionIntegrationTest.java:152)
[junit4:junit4]   2> 		at org.apache.solr.cloud.LeaderElectionIntegrationTest.setUp(LeaderElectionIntegrationTest.java:100)
[junit4:junit4]   2> 		at sun.reflect.GeneratedMethodAccessor4.invoke(Unknown Source)
[junit4:junit4]   2> 		at sun.reflect.DelegatingMethodAccessorImpl.invoke(DelegatingMethodAccessorImpl.java:43)
[junit4:junit4]   2> 		at java.lang.reflect.Method.invoke(Method.java:601)
[junit4:junit4]   2> 		at com.carrotsearch.randomizedtesting.RandomizedRunner.invoke(RandomizedRunner.java:1559)
[junit4:junit4]   2> 		at com.carrotsearch.randomizedtesting.RandomizedRunner.access$600(RandomizedRunner.java:79)
[junit4:junit4]   2> 		at com.carrotsearch.randomizedtesting.RandomizedRunner$7.evaluate(RandomizedRunner.java:771)
[junit4:junit4]   2> 		at com.carrotsearch.randomizedtesting.RandomizedRunner$8.evaluate(RandomizedRunner.java:787)
[junit4:junit4]   2> 		at com.carrotsearch.randomizedtesting.rules.SystemPropertiesRestoreRule$1.evaluate(SystemPropertiesRestoreRule.java:53)
[junit4:junit4]   2> 		at org.apache.lucene.util.TestRuleSetupTeardownChained$1.evaluate(TestRuleSetupTeardownChained.java:50)
[junit4:junit4]   2> 		at org.apache.lucene.util.TestRuleFieldCacheSanity$1.evaluate(TestRuleFieldCacheSanity.java:51)
[junit4:junit4]   2> 		at org.apache.lucene.util.AbstractBeforeAfterRule$1.evaluate(AbstractBeforeAfterRule.java:45)
[junit4:junit4]   2> 		at com.carrotsearch.randomizedtesting.rules.SystemPropertiesInvariantRule$1.evaluate(SystemPropertiesInvariantRule.java:55)
[junit4:junit4]   2> 		at org.apache.lucene.util.TestRuleThreadAndTestName$1.evaluate(TestRuleThreadAndTestName.java:48)
[junit4:junit4]   2> 		at org.apache.lucene.util.TestRuleIgnoreAfterMaxFailures$1.evaluate(TestRuleIgnoreAfterMaxFailures.java:70)
[junit4:junit4]   2> 		at org.apache.lucene.util.TestRuleMarkFailure$1.evaluate(TestRuleMarkFailure.java:48)
[junit4:junit4]   2> 		at com.carrotsearch.randomizedtesting.rules.StatementAdapter.evaluate(StatementAdapter.java:36)
[junit4:junit4]   2> 		at com.carrotsearch.randomizedtesting.ThreadLeakControl$StatementRunner.run(ThreadLeakControl.java:358)
[junit4:junit4]   2> 		at com.carrotsearch.randomizedtesting.ThreadLeakControl.forkTimeoutingTask(ThreadLeakControl.java:782)
[junit4:junit4]   2> 		at com.carrotsearch.randomizedtesting.ThreadLeakControl$3.evaluate(ThreadLeakControl.java:442)
[junit4:junit4]   2> 		at com.carrotsearch.randomizedtesting.RandomizedRunner.runSingleTest(RandomizedRunner.java:746)
[junit4:junit4]   2> 		at com.carrotsearch.randomizedtesting.RandomizedRunner$3.evaluate(RandomizedRunner.java:648)
[junit4:junit4]   2> 		at com.carrotsearch.randomizedtesting.RandomizedRunner$4.evaluate(RandomizedRunner.java:682)
[junit4:junit4]   2> 		at com.carrotsearch.randomizedtesting.RandomizedRunner$5.evaluate(RandomizedRunner.java:693)
[junit4:junit4]   2> 		at com.carrotsearch.randomizedtesting.rules.StatementAdapter.evaluate(StatementAdapter.java:36)
[junit4:junit4]   2> 		at com.carrotsearch.randomizedtesting.rules.SystemPropertiesRestoreRule$1.evaluate(SystemPropertiesRestoreRule.java:53)
[junit4:junit4]   2> 		at org.apache.lucene.util.AbstractBeforeAfterRule$1.evaluate(AbstractBeforeAfterRule.java:45)
[junit4:junit4]   2> 		at org.apache.lucene.util.TestRuleStoreClassName$1.evaluate(TestRuleStoreClassName.java:42)
[junit4:junit4]   2> 		at com.carrotsearch.randomizedtesting.rules.SystemPropertiesInvariantRule$1.evaluate(SystemPropertiesInvariantRule.java:55)
[junit4:junit4]   2> 		at com.carrotsearch.randomizedtesting.rules.NoShadowingOrOverridesOnMethodsRule$1.evaluate(NoShadowingOrOverridesOnMethodsRule.java:39)
[junit4:junit4]   2> 		at com.carrotsearch.randomizedtesting.rules.NoShadowingOrOverridesOnMethodsRule$1.evaluate(NoShadowingOrOverridesOnMethodsRule.java:39)
[junit4:junit4]   2> 		at com.carrotsearch.randomizedtesting.rules.StatementAdapter.evaluate(StatementAdapter.java:36)
[junit4:junit4]   2> 		at org.apache.lucene.util.TestRuleAssertionsRequired$1.evaluate(TestRuleAssertionsRequired.java:43)
[junit4:junit4]   2> 		at org.apache.lucene.util.TestRuleMarkFailure$1.evaluate(TestRuleMarkFailure.java:48)
[junit4:junit4]   2> 		at org.apache.lucene.util.TestRuleIgnoreAfterMaxFailures$1.evaluate(TestRuleIgnoreAfterMaxFailures.java:70)
[junit4:junit4]   2> 		at org.apache.lucene.util.TestRuleIgnoreTestSuites$1.evaluate(TestRuleIgnoreTestSuites.java:55)
[junit4:junit4]   2> 		at com.carrotsearch.randomizedtesting.rules.StatementAdapter.evaluate(StatementAdapter.java:36)
[junit4:junit4]   2> 		at com.carrotsearch.randomizedtesting.ThreadLeakControl$StatementRunner.run(ThreadLeakControl.java:358)
[junit4:junit4]   2> 		at java.lang.Thread.run(Thread.java:722)
[junit4:junit4]   2> 	Caused by: org.apache.solr.common.SolrException: Error getting leader from zk
[junit4:junit4]   2> 		at org.apache.solr.cloud.ZkController.getLeader(ZkController.java:664)
[junit4:junit4]   2> 		at org.apache.solr.cloud.ZkController.register(ZkController.java:579)
[junit4:junit4]   2> 		at org.apache.solr.cloud.ZkController.register(ZkController.java:534)
[junit4:junit4]   2> 		at org.apache.solr.core.CoreContainer.registerInZk(CoreContainer.java:708)
[junit4:junit4]   2> 		... 44 more
[junit4:junit4]   2> 	Caused by: org.apache.solr.common.SolrException: No registered leader was found, collection:collection1 slice:shard1
[junit4:junit4]   2> 		at org.apache.solr.common.cloud.ZkStateReader.getLeaderProps(ZkStateReader.java:417)
[junit4:junit4]   2> 		at org.apache.solr.common.cloud.ZkStateReader.getLeaderUrl(ZkStateReader.java:394)
[junit4:junit4]   2> 		at org.apache.solr.cloud.ZkController.getLeader(ZkController.java:644)
[junit4:junit4]   2> 		... 47 more
[junit4:junit4]   2> 	
[junit4:junit4]   2> 31854 T1849 oasc.SolrCore.close [collection1]  CLOSING SolrCore org.apache.solr.core.SolrCore@1ec9801
[junit4:junit4]   2> 31863 T1849 oasu.DirectUpdateHandler2.close closing DirectUpdateHandler2{commits=0,autocommits=0,soft autocommits=0,optimizes=0,rollbacks=0,expungeDeletes=0,docsPending=0,adds=0,deletesById=0,deletesByQuery=0,errors=0,cumulative_adds=0,cumulative_deletesById=0,cumulative_deletesByQuery=0,cumulative_errors=0}
[junit4:junit4]   2> 31864 T1849 oasc.SolrCore.decrefSolrCoreState Closing SolrCoreState
[junit4:junit4]   2> 31864 T1849 oasu.DefaultSolrCoreState.closeIndexWriter SolrCoreState ref count has reached 0 - closing IndexWriter
[junit4:junit4]   2> 31865 T1849 oasu.DefaultSolrCoreState.closeIndexWriter closing IndexWriter with IndexWriterCloser
[junit4:junit4]   2> 31865 T1849 oasc.SolrCore.closeSearcher [collection1] Closing main searcher on request.
[junit4:junit4]   2> 31866 T1849 oasc.CachingDirectoryFactory.close Releasing directory:/mnt/ssd/jenkins/workspace/Lucene-Solr-trunk-Linux/solr/build/solr-core/test/J1/./solrtest-LeaderElectionIntegrationTest-1351599813545/data_7000/index
[junit4:junit4]   2> 31867 T1849 oasc.SolrResourceLoader.locateSolrHome JNDI not configured for solr (NoInitialContextEx)
[junit4:junit4]   2> 31867 T1849 oasc.SolrResourceLoader.locateSolrHome using system property solr.solr.home: /mnt/ssd/jenkins/workspace/Lucene-Solr-trunk-Linux/solr/build/solr-core/test-files/solr
[junit4:junit4]   2> 31867 T1849 oasc.CoreContainer$Initializer.initialize looking for solr.xml: /mnt/ssd/jenkins/workspace/Lucene-Solr-trunk-Linux/solr/build/solr-core/test-files/solr/solr.xml
[junit4:junit4]   2> 31868 T1849 oasc.CoreContainer.<init> New CoreContainer 29806757
[junit4:junit4]   2> 31868 T1849 oasc.CoreContainer.load Loading CoreContainer using Solr Home: '/mnt/ssd/jenkins/workspace/Lucene-Solr-trunk-Linux/solr/build/solr-core/test-files/solr/'
[junit4:junit4]   2> 31868 T1849 oasc.SolrResourceLoader.<init> new SolrResourceLoader for directory: '/mnt/ssd/jenkins/workspace/Lucene-Solr-trunk-Linux/solr/build/solr-core/test-files/solr/'
[junit4:junit4]   2> 31889 T1849 oasc.CoreContainer.load Registering Log Listener
[junit4:junit4]   2> 31899 T1849 oasc.CoreContainer.initZooKeeper Zookeeper client=127.0.0.1:33226/solr
[junit4:junit4]   2> 31899 T1849 oaz.ZooKeeper.<init> Initiating client connection, connectString=127.0.0.1:33226/solr sessionTimeout=3000 watcher=org.apache.solr.common.cloud.ConnectionManager@18e57
[junit4:junit4]   2> 31907 T1864 oaz.ClientCnxn$SendThread.startConnect Opening socket connection to server /127.0.0.1:33226
[junit4:junit4]   2> 31907 T1849 oascc.ConnectionManager.waitForConnected Waiting for client to connect to ZooKeeper
[junit4:junit4]   2> 31908 T1864 oaz.ClientCnxn$SendThread.primeConnection Socket connection established to localhost.localdomain/127.0.0.1:33226, initiating session
[junit4:junit4]   2> 31908 T1851 oazs.NIOServerCnxn$Factory.run Accepted socket connection from /127.0.0.1:35383
[junit4:junit4]   2> 31908 T1851 oazs.NIOServerCnxn.readConnectRequest Client attempting to establish new session at /127.0.0.1:35383
[junit4:junit4]   2> 31909 T1864 oaz.ClientCnxn$SendThread.readConnectResult Session establishment complete on server localhost.localdomain/127.0.0.1:33226, sessionid = 0x13ab1a073ad0003, negotiated timeout = 3000
[junit4:junit4]   2> 31909 T1853 oazs.NIOServerCnxn.finishSessionInit Established session 0x13ab1a073ad0003 with negotiated timeout 3000 for client /127.0.0.1:35383
[junit4:junit4]   2> 31909 T1865 oascc.ConnectionManager.process Watcher org.apache.solr.common.cloud.ConnectionManager@18e57 name:ZooKeeperConnection Watcher:127.0.0.1:33226/solr got event WatchedEvent state:SyncConnected type:None path:null path:null type:None
[junit4:junit4]   2> 31910 T1849 oascc.ConnectionManager.waitForConnected Client is connected to ZooKeeper
[junit4:junit4]   2> 31910 T1854 oazs.PrepRequestProcessor.pRequest Got user-level KeeperException when processing sessionid:0x13ab1a073ad0003 type:create cxid:0x1 zxid:0xfffffffffffffffe txntype:unknown reqpath:n/a Error Path:/solr/overseer Error:KeeperErrorCode = NodeExists for /solr/overseer
[junit4:junit4]   2> 31911 T1854 oazs.PrepRequestProcessor.pRequest Got user-level KeeperException when processing sessionid:0x13ab1a073ad0003 type:create cxid:0x2 zxid:0xfffffffffffffffe txntype:unknown reqpath:n/a Error Path:/solr/overseer Error:KeeperErrorCode = NodeExists for /solr/overseer
[junit4:junit4]   2> 31911 T1849 oasc.ZkController.createEphemeralLiveNode Register node as live in ZooKeeper:/live_nodes/127.0.0.1:7001_solr
[junit4:junit4]   2> 31912 T1854 oazs.PrepRequestProcessor.pRequest Got user-level KeeperException when processing sessionid:0x13ab1a073ad0003 type:delete cxid:0x4 zxid:0xfffffffffffffffe txntype:unknown reqpath:n/a Error Path:/solr/live_nodes/127.0.0.1:7001_solr Error:KeeperErrorCode = NoNode for /solr/live_nodes/127.0.0.1:7001_solr
[junit4:junit4]   2> 31912 T1849 oascc.SolrZkClient.makePath makePath: /live_nodes/127.0.0.1:7001_solr
[junit4:junit4]   2> 31913 T1860 oascc.ZkStateReader$2.process A cluster state change has occurred - updating... (1)
[junit4:junit4]   2> 31913 T1849 oashc.HttpShardHandlerFactory.getParameter Setting socketTimeout to: 0
[junit4:junit4]   2> 31914 T1860 oascc.ZkStateReader$3.process Updating live nodes... (2)
[junit4:junit4]   2> 31914 T1849 oashc.HttpShardHandlerFactory.getParameter Setting urlScheme to: http://
[junit4:junit4]   2> 31914 T1849 oashc.HttpShardHandlerFactory.getParameter Setting connTimeout to: 0
[junit4:junit4]   2> 31914 T1849 oashc.HttpShardHandlerFactory.getParameter Setting maxConnectionsPerHost to: 20
[junit4:junit4]   2> 31915 T1849 oashc.HttpShardHandlerFactory.getParameter Setting corePoolSize to: 0
[junit4:junit4]   2> 31915 T1849 oashc.HttpShardHandlerFactory.getParameter Setting maximumPoolSize to: 2147483647
[junit4:junit4]   2> 31915 T1849 oashc.HttpShardHandlerFactory.getParameter Setting maxThreadIdleTime to: 5
[junit4:junit4]   2> 31916 T1849 oashc.HttpShardHandlerFactory.getParameter Setting sizeOfQueue to: -1
[junit4:junit4]   2> 31916 T1849 oashc.HttpShardHandlerFactory.getParameter Setting fairnessPolicy to: false
[junit4:junit4]   2> 31916 T1849 oascsi.HttpClientUtil.createClient Creating new http client, config:maxConnectionsPerHost=20&maxConnections=10000&socketTimeout=0&connTimeout=0&retry=false
[junit4:junit4]   2> 31920 T1849 oascc.ZkStateReader.createClusterStateWatchersAndUpdate Updating cluster state from ZooKeeper... 
[junit4:junit4]   2> 31925 T1849 oasc.CoreContainer.create Creating SolrCore 'collection1' using instanceDir: /mnt/ssd/jenkins/workspace/Lucene-Solr-trunk-Linux/solr/build/solr-core/test-files/solr/collection1
[junit4:junit4]   2> 31925 T1849 oasc.ZkController.createCollectionZkNode Check for collection zkNode:collection1
[junit4:junit4]   2> 31926 T1849 oasc.ZkController.createCollectionZkNode Collection zkNode exists
[junit4:junit4]   2> 31926 T1849 oasc.ZkController.readConfigName Load collection config from:/collections/collection1
[junit4:junit4]   2> 31927 T1849 oasc.SolrResourceLoader.<init> new SolrResourceLoader for directory: '/mnt/ssd/jenkins/workspace/Lucene-Solr-trunk-Linux/solr/build/solr-core/test-files/solr/collection1/'
[junit4:junit4]   2> 31928 T1849 oasc.SolrResourceLoader.replaceClassLoader Adding 'file:/mnt/ssd/jenkins/workspace/Lucene-Solr-trunk-Linux/solr/build/solr-core/test-files/solr/collection1/lib/README' to classloader
[junit4:junit4]   2> 31928 T1849 oasc.SolrResourceLoader.replaceClassLoader Adding 'file:/mnt/ssd/jenkins/workspace/Lucene-Solr-trunk-Linux/solr/build/solr-core/test-files/solr/collection1/lib/classes/' to classloader
[junit4:junit4]   2> 31960 T1849 oasc.SolrConfig.<init> Using Lucene MatchVersion: LUCENE_50
[junit4:junit4]   2> 32016 T1849 oasc.SolrConfig.<init> Loaded SolrConfig: solrconfig.xml
[junit4:junit4]   2> 32017 T1849 oass.IndexSchema.readSchema Reading Solr Schema
[junit4:junit4]   2> 32022 T1849 oass.IndexSchema.readSchema Schema name=test
[junit4:junit4]   2> 32500 T1849 oass.OpenExchangeRatesOrgProvider.init Initialized with rates=open-exchange-rates.json, refreshInterval=1440.
[junit4:junit4]   2> 32510 T1849 oass.IndexSchema.readSchema default search field in schema is text
[junit4:junit4]   2> 32513 T1849 oass.IndexSchema.readSchema unique key field: id
[junit4:junit4]   2> 32520 T1849 oass.FileExchangeRateProvider.reload Reloading exchange rates from file currency.xml
[junit4:junit4]   2> 32523 T1849 oass.FileExchangeRateProvider.reload Reloading exchange rates from file currency.xml
[junit4:junit4]   2> 32526 T1849 oass.OpenExchangeRatesOrgProvider.reload Reloading exchange rates from open-exchange-rates.json
[junit4:junit4]   2> 32527 T1849 oass.OpenExchangeRatesOrgProvider.reload Reloading exchange rates from open-exchange-rates.json
[junit4:junit4]   2> 32527 T1849 oasc.SolrCore.<init> [collection1] Opening new SolrCore at /mnt/ssd/jenkins/workspace/Lucene-Solr-trunk-Linux/solr/build/solr-core/test-files/solr/collection1/, dataDir=/mnt/ssd/jenkins/workspace/Lucene-Solr-trunk-Linux/solr/build/solr-core/test/J1/./solrtest-LeaderElectionIntegrationTest-1351599813545/data_7001/
[junit4:junit4]   2> 32528 T1849 oasc.JmxMonitoredMap.<init> JMX monitoring is enabled. Adding Solr mbeans to JMX Server: com.sun.jmx.mbeanserver.JmxMBeanServer@151dc28
[junit4:junit4]   2> 32528 T1849 oasc.SolrCore.initDirectoryFactory org.apache.solr.core.MockDirectoryFactory
[junit4:junit4]   2> 32529 T1849 oasc.CachingDirectoryFactory.injectLockFactory WARNING No lockType configured for MockDirWrapper(org.apache.lucene.store.RAMDirectory@c1b174 lockFactory=org.apache.lucene.store.SingleInstanceLockFactory@694258) assuming 'simple'
[junit4:junit4]   2> 32529 T1849 oasc.CachingDirectoryFactory.get return new directory for /mnt/ssd/jenkins/workspace/Lucene-Solr-trunk-Linux/solr/build/solr-core/test/J1/./solrtest-LeaderElectionIntegrationTest-1351599813545/data_7001 forceNew:false
[junit4:junit4]   2> 32530 T1849 oasc.CachingDirectoryFactory.close Releasing directory:/mnt/ssd/jenkins/workspace/Lucene-Solr-trunk-Linux/solr/build/solr-core/test/J1/./solrtest-LeaderElectionIntegrationTest-1351599813545/data_7001
[junit4:junit4]   2> 32530 T1849 oasc.SolrCore.getNewIndexDir New index directory detected: old=null new=/mnt/ssd/jenkins/workspace/Lucene-Solr-trunk-Linux/solr/build/solr-core/test/J1/./solrtest-LeaderElectionIntegrationTest-1351599813545/data_7001/index/
[junit4:junit4]   2> 32530 T1849 oasc.SolrCore.initIndex WARNING [collection1] Solr index directory '/mnt/ssd/jenkins/workspace/Lucene-Solr-trunk-Linux/solr/build/solr-core/test/J1/./solrtest-LeaderElectionIntegrationTest-1351599813545/data_7001/index' doesn't exist. Creating new index...
[junit4:junit4]   2> 32531 T1849 oasc.CachingDirectoryFactory.get return new directory for /mnt/ssd/jenkins/workspace/Lucene-Solr-trunk-Linux/solr/build/solr-core/test/J1/./solrtest-LeaderElectionIntegrationTest-1351599813545/data_7001/index forceNew:false
[junit4:junit4]   2> 32532 T1849 oasc.SolrDeletionPolicy.onCommit SolrDeletionPolicy.onCommit: commits:num=1
[junit4:junit4]   2> 		commit{dir=MockDirWrapper(org.apache.lucene.store.RAMDirectory@18c817f lockFactory=org.apache.lucene.store.NativeFSLockFactory@23016b),segFN=segments_1,generation=1,filenames=[segments_1]
[junit4:junit4]   2> 32532 T1849 oasc.SolrDeletionPolicy.updateCommits newest commit = 1[segments_1]
[junit4:junit4]   2> 32533 T1849 oasc.CachingDirectoryFactory.close Releasing directory:/mnt/ssd/jenkins/workspace/Lucene-Solr-trunk-Linux/solr/build/solr-core/test/J1/./solrtest-LeaderElectionIntegrationTest-1351599813545/data_7001/index
[junit4:junit4]   2> 32533 T1849 oasc.SolrCore.initWriters created xml: solr.XMLResponseWriter
[junit4:junit4]   2> 32534 T1849 oasup.UpdateRequestProcessorChain.init inserting DistributedUpdateProcessorFactory into updateRequestProcessorChain "dedupe"
[junit4:junit4]   2> 32535 T1849 oasup.UpdateRequestProcessorChain.init inserting DistributedUpdateProcessorFactory into updateRequestProcessorChain "dedupe-allfields"
[junit4:junit4]   2> 32535 T1849 oasup.UpdateRequestProcessorChain.init inserting DistributedUpdateProcessorFactory into updateRequestProcessorChain "stored_sig"
[junit4:junit4]   2> 32536 T1849 oasup.UpdateRequestProcessorChain.init inserting DistributedUpdateProcessorFactory into updateRequestProcessorChain "uniq-fields"
[junit4:junit4]   2> 32536 T1849 oasup.UpdateRequestProcessorChain.init inserting DistributedUpdateProcessorFactory into updateRequestProcessorChain "distrib-dup-test-chain-implicit"
[junit4:junit4]   2> 32537 T1849 oasc.RequestHandlers.initHandlersFromConfig adding lazy requestHandler: solr.ReplicationHandler
[junit4:junit4]   2> 32537 T1849 oasc.RequestHandlers.initHandlersFromConfig created /replication: solr.ReplicationHandler
[junit4:junit4]   2> 32538 T1849 oasc.RequestHandlers.initHandlersFromConfig created standard: solr.StandardRequestHandler
[junit4:junit4]   2> 32538 T1849 oasc.RequestHandlers.initHandlersFromConfig created /get: solr.RealTimeGetHandler
[junit4:junit4]   2> 32539 T1849 oasc.RequestHandlers.initHandlersFromConfig created dismax: solr.SearchHandler
[junit4:junit4]   2> 32540 T1849 oasc.RequestHandlers.initHandlersFromConfig created mock: org.apache.solr.core.MockQuerySenderListenerReqHandler
[junit4:junit4]   2> 32540 T1849 oasc.RequestHandlers.initHandlersFromConfig created /admin/: org.apache.solr.handler.admin.AdminHandlers
[junit4:junit4]   2> 32541 T1849 oasc.RequestHandlers.initHandlersFromConfig created defaults: solr.StandardRequestHandler
[junit4:junit4]   2> 32541 T1849 oasc.RequestHandlers.initHandlersFromConfig adding lazy requestHandler: solr.StandardRequestHandler
[junit4:junit4]   2> 32542 T1849 oasc.RequestHandlers.initHandlersFromConfig created lazy: solr.StandardRequestHandler
[junit4:junit4]   2> 32542 T1849 oasc.RequestHandlers.initHandlersFromConfig created /update: solr.UpdateRequestHandler
[junit4:junit4]   2> 32543 T1849 oasc.RequestHandlers.initHandlersFromConfig created /terms: org.apache.solr.handler.component.SearchHandler
[junit4:junit4]   2> 32544 T1849 oasc.RequestHandlers.initHandlersFromConfig created spellCheckCompRH: org.apache.solr.handler.component.SearchHandler
[junit4:junit4]   2> 32545 T1849 oasc.RequestHandlers.initHandlersFromConfig created spellCheckCompRH_Direct: org.apache.solr.handler.component.SearchHandler
[junit4:junit4]   2> 32545 T1849 oasc.RequestHandlers.initHandlersFromConfig created spellCheckWithWordbreak: org.apache.solr.handler.component.SearchHandler
[junit4:junit4]   2> 32546 T1849 oasc.RequestHandlers.initHandlersFromConfig created spellCheckWithWordbreak_Direct: org.apache.solr.handler.component.SearchHandler
[junit4:junit4]   2> 32547 T1849 oasc.RequestHandlers.initHandlersFromConfig created spellCheckCompRH1: org.apache.solr.handler.component.SearchHandler
[junit4:junit4]   2> 32548 T1849 oasc.RequestHandlers.initHandlersFromConfig created tvrh: org.apache.solr.handler.component.SearchHandler
[junit4:junit4]   2> 32548 T1849 oasc.RequestHandlers.initHandlersFromConfig created /mlt: solr.MoreLikeThisHandler
[junit4:junit4]   2> 32549 T1849 oasc.RequestHandlers.initHandlersFromConfig created /debug/dump: solr.DumpRequestHandler
[junit4:junit4]   2> 32552 T1849 oashl.XMLLoader.init xsltCacheLifetimeSeconds=60
[junit4:junit4]   2> 32553 T1849 oasc.SolrCore.initDeprecatedSupport WARNING solrconfig.xml uses deprecated <admin/gettableFiles>, Please update your config to use the ShowFileRequestHandler.
[junit4:junit4]   2> 32554 T1849 oasc.SolrCore.initDeprecatedSupport WARNING adding ShowFileRequestHandler with hidden files: [SCHEMA.XML, OLD_SYNONYMS.TXT, STOPWORDS.TXT, PROTWORDS.TXT, OPEN-EXCHANGE-RATES.JSON, SYNONYMS.TXT, CURRENCY.XML, MAPPING-ISOLATIN1ACCENT.TXT]
[junit4:junit4]   2> 32556 T1849 oasc.CachingDirectoryFactory.close Releasing directory:/mnt/ssd/jenkins/workspace/Lucene-Solr-trunk-Linux/solr/build/solr-core/test/J1/./solrtest-LeaderElectionIntegrationTest-1351599813545/data_7001
[junit4:junit4]   2> 32556 T1849 oass.SolrIndexSearcher.<init> Opening Searcher@377001 main
[junit4:junit4]   2> 32557 T1849 oasu.CommitTracker.<init> Hard AutoCommit: disabled
[junit4:junit4]   2> 32557 T1849 oasu.CommitTracker.<init> Soft AutoCommit: disabled
[junit4:junit4]   2> 32558 T1849 oashc.SpellCheckComponent.inform Initializing spell checkers
[junit4:junit4]   2> 32561 T1849 oass.DirectSolrSpellChecker.init init: {name=direct,classname=DirectSolrSpellChecker,field=lowerfilt,minQueryLength=3}
[junit4:junit4]   2> 32583 T1866 oasc.SolrCore.registerSearcher [collection1] Registered new searcher Searcher@377001 main{StandardDirectoryReader(segments_1:1)}
[junit4:junit4]   2> 32586 T1849 oasc.ZkController.publish numShards not found on descriptor - reading it from system property
[junit4:junit4]   2> 32587 T1849 oasc.CoreContainer.register registering core: collection1
[junit4:junit4]   2> 32587 T1849 oasc.ZkController.register Register shard - core:collection1 address:http://127.0.0.1:7001/solr shardId:shard1
[junit4:junit4]   2> 62592 T1849 oasc.ZkController.getLeader SEVERE Error getting leader from zk org.apache.solr.common.SolrException: No registered leader was found, collection:collection1 slice:shard1
[junit4:junit4]   2> 	at org.apache.solr.common.cloud.ZkStateReader.getLeaderProps(ZkStateReader.java:417)
[junit4:junit4]   2> 	at org.apache.solr.common.cloud.ZkStateReader.getLeaderUrl(ZkStateReader.java:394)
[junit4:junit4]   2> 	at org.apache.solr.cloud.ZkController.getLeader(ZkController.java:644)
[junit4:junit4]   2> 	at org.apache.solr.cloud.ZkController.register(ZkController.java:579)
[junit4:junit4]   2> 	at org.apache.solr.cloud.ZkController.register(ZkController.java:534)
[junit4:junit4]   2> 	at org.apache.solr.core.CoreContainer.registerInZk(CoreContainer.java:708)
[junit4:junit4]   2> 	at org.apache.solr.core.CoreContainer.register(CoreContainer.java:692)
[junit4:junit4]   2> 	at org.apache.solr.core.CoreContainer.load(CoreContainer.java:531)
[junit4:junit4]   2> 	at org.apache.solr.core.CoreContainer.load(CoreContainer.java:351)
[junit4:junit4]   2> 	at org.apache.solr.core.CoreContainer$Initializer.initialize(CoreContainer.java:303)
[junit4:junit4]   2> 	at org.apache.solr.cloud.LeaderElectionIntegrationTest.setupContainer(LeaderElectionIntegrationTest.java:152)
[junit4:junit4]   2> 	at org.apache.solr.cloud.LeaderElectionIntegrationTest.setUp(LeaderElectionIntegrationTest.java:100)
[junit4:junit4]   2> 	at sun.reflect.GeneratedMethodAccessor4.invoke(Unknown Source)
[junit4:junit4]   2> 	at sun.reflect.DelegatingMethodAccessorImpl.invoke(DelegatingMethodAccessorImpl.java:43)
[junit4:junit4]   2> 	at java.lang.reflect.Method.invoke(Method.java:601)
[junit4:junit4]   2> 	at com.carrotsearch.randomizedtesting.RandomizedRunner.invoke(RandomizedRunner.java:1559)
[junit4:junit4]   2> 	at com.carrotsearch.randomizedtesting.RandomizedRunner.access$600(RandomizedRunner.java:79)
[junit4:junit4]   2> 	at com.carrotsearch.randomizedtesting.RandomizedRunner$7.evaluate(RandomizedRunner.java:771)
[junit4:junit4]   2> 	at com.carrotsearch.randomizedtesting.RandomizedRunner$8.evaluate(RandomizedRunner.java:787)
[junit4:junit4]   2> 	at com.carrotsearch.randomizedtesting.rules.SystemPropertiesRestoreRule$1.evaluate(SystemPropertiesRestoreRule.java:53)
[junit4:junit4]   2> 	at org.apache.lucene.util.TestRuleSetupTeardownChained$1.evaluate(TestRuleSetupTeardownChained.java:50)
[junit4:junit4]   2> 	at org.apache.lucene.util.TestRuleFieldCacheSanity$1.evaluate(TestRuleFieldCacheSanity.java:51)
[junit4:junit4]   2> 	at org.apache.lucene.util.AbstractBeforeAfterRule$1.evaluate(AbstractBeforeAfterRule.java:45)
[junit4:junit4]   2> 	at com.carrotsearch.randomizedtesting.rules.SystemPropertiesInvariantRule$1.evaluate(SystemPropertiesInvariantRule.java:55)
[junit4:junit4]   2> 	at org.apache.lucene.util.TestRuleThreadAndTestName$1.evaluate(TestRuleThreadAndTestName.java:48)
[junit4:junit4]   2> 	at org.apache.lucene.util.TestRuleIgnoreAfterMaxFailures$1.evaluate(TestRuleIgnoreAfterMaxFailures.java:70)
[junit4:junit4]   2> 	at org.apache.lucene.util.TestRuleMarkFailure$1.evaluate(TestRuleMarkFailure.java:48)
[junit4:junit4]   2> 	at com.carrotsearch.randomizedtesting.rules.StatementAdapter.evaluate(StatementAdapter.java:36)
[junit4:junit4]   2> 	at com.carrotsearch.randomizedtesting.ThreadLeakControl$StatementRunner.run(ThreadLeakControl.java:358)
[junit4:junit4]   2> 	at com.carrotsearch.randomizedtesting.ThreadLeakControl.forkTimeoutingTask(ThreadLeakControl.java:782)
[junit4:junit4]   2> 	at com.carrotsearch.randomizedtesting.ThreadLeakControl$3.evaluate(ThreadLeakControl.java:442)
[junit4:junit4]   2> 	at com.carrotsearch.randomizedtesting.RandomizedRunner.runSingleTest(RandomizedRunner.java:746)
[junit4:junit4]   2> 	at com.carrotsearch.randomizedtesting.RandomizedRunner$3.evaluate(RandomizedRunner.java:648)
[junit4:junit4]   2> 	at com.carrotsearch.randomizedtesting.RandomizedRunner$4.evaluate(RandomizedRunner.java:682)
[junit4:junit4]   2> 	at com.carrotsearch.randomizedtesting.RandomizedRunner$5.evaluate(RandomizedRunner.java:693)
[junit4:junit4]   2> 	at com.carrotsearch.randomizedtesting.rules.StatementAdapter.evaluate(StatementAdapter.java:36)
[junit4:junit4]   2> 	at com.carrotsearch.randomizedtesting.rules.SystemPropertiesRestoreRule$1.evaluate(SystemPropertiesRestoreRule.java:53)
[junit4:junit4]   2> 	at org.apache.lucene.util.AbstractBeforeAfterRule$1.evaluate(AbstractBeforeAfterRule.java:45)
[junit4:junit4]   2> 	at org.apache.lucene.util.TestRuleStoreClassName$1.evaluate(TestRuleStoreClassName.java:42)
[junit4:junit4]   2> 	at com.carrotsearch.randomizedtesting.rules.SystemPropertiesInvariantRule$1.evaluate(SystemPropertiesInvariantRule.java:55)
[junit4:junit4]   2> 	at com.carrotsearch.randomizedtesting.rules.NoShadowingOrOverridesOnMethodsRule$1.evaluate(NoShadowingOrOverridesOnMethodsRule.java:39)
[junit4:junit4]   2> 	at com.carrotsearch.randomizedtesting.rules.NoShadowingOrOverridesOnMethodsRule$1.evaluate(NoShadowingOrOverridesOnMethodsRule.java:39)
[junit4:junit4]   2> 	at com.carrotsearch.randomizedtesting.rules.StatementAdapter.evaluate(StatementAdapter.java:36)
[junit4:junit4]   2> 	at org.apache.lucene.util.TestRuleAssertionsRequired$1.evaluate(TestRuleAssertionsRequired.java:43)
[junit4:junit4]   2> 	at org.apache.lucene.util.TestRuleMarkFailure$1.evaluate(TestRuleMarkFailure.java:48)
[junit4:junit4]   2> 	at org.apache.lucene.util.TestRuleIgnoreAfterMaxFailures$1.evaluate(TestRuleIgnoreAfterMaxFailures.java:70)
[junit4:junit4]   2> 	at org.apache.lucene.util.TestRuleIgnoreTestSuites$1.evaluate(TestRuleIgnoreTestSuites.java:55)
[junit4:junit4]   2> 	at com.carrotsearch.randomizedtesting.rules.StatementAdapter.evaluate(StatementAdapter.java:36)
[junit4:junit4]   2> 	at com.carrotsearch.randomizedtesting.ThreadLeakControl$StatementRunner.run(ThreadLeakControl.java:358)
[junit4:junit4]   2> 	at java.lang.Thread.run(Thread.java:722)
[junit4:junit4]   2> 
[junit4:junit4]   2> 62594 T1849 oasc.ZkController.publish numShards not found on descriptor - reading it from system property
[junit4:junit4]   2> 62595 T1849 oasc.SolrException.log SEVERE :org.apache.solr.common.SolrException: Error getting leader from zk
[junit4:junit4]   2> 		at org.apache.solr.cloud.ZkController.getLeader(ZkController.java:664)
[junit4:junit4]   2> 		at org.apache.solr.cloud.ZkController.register(ZkController.java:579)
[junit4:junit4]   2> 		at org.apache.solr.cloud.ZkController.register(ZkController.java:534)
[junit4:junit4]   2> 		at org.apache.solr.core.CoreContainer.registerInZk(CoreContainer.java:708)
[junit4:junit4]   2> 		at org.apache.solr.core.CoreContainer.register(CoreContainer.java:692)
[junit4:junit4]   2> 		at org.apache.solr.core.CoreContainer.load(CoreContainer.java:531)
[junit4:junit4]   2> 		at org.apache.solr.core.CoreContainer.load(CoreContainer.java:351)
[junit4:junit4]   2> 		at org.apache.solr.core.CoreContainer$Initializer.initialize(CoreContainer.java:303)
[junit4:junit4]   2> 		at org.apache.solr.cloud.LeaderElectionIntegrationTest.setupContainer(LeaderElectionIntegrationTest.java:152)
[junit4:junit4]   2> 		at org.apache.solr.cloud.LeaderElectionIntegrationTest.setUp(LeaderElectionIntegrationTest.java:100)
[junit4:junit4]   2> 		at sun.reflect.GeneratedMethodAccessor4.invoke(Unknown Source)
[junit4:junit4]   2> 		at sun.reflect.DelegatingMethodAccessorImpl.invoke(DelegatingMethodAccessorImpl.java:43)
[junit4:junit4]   2> 		at java.lang.reflect.Method.invoke(Method.java:601)
[junit4:junit4]   2> 		at com.carrotsearch.randomizedtesting.RandomizedRunner.invoke(RandomizedRunner.java:1559)
[junit4:junit4]   2> 		at com.carrotsearch.randomizedtesting.RandomizedRunner.access$600(RandomizedRunner.java:79)
[junit4:junit4]   2> 		at com.carrotsearch.randomizedtesting.RandomizedRunner$7.evaluate(RandomizedRunner.java:771)
[junit4:junit4]   2> 		at com.carrotsearch.randomizedtesting.RandomizedRunner$8.evaluate(RandomizedRunner.java:787)
[junit4:junit4]   2> 		at com.carrotsearch.randomizedtesting.rules.SystemPropertiesRestoreRule$1.evaluate(SystemPropertiesRestoreRule.java:53)
[junit4:junit4]   2> 		at org.apache.lucene.util.TestRuleSetupTeardownChained$1.evaluate(TestRuleSetupTeardownChained.java:50)
[junit4:junit4]   2> 		at org.apache.lucene.util.TestRuleFieldCacheSanity$1.evaluate(TestRuleFieldCacheSanity.java:51)
[junit4:junit4]   2> 		at org.apache.lucene.util.AbstractBeforeAfterRule$1.evaluate(AbstractBeforeAfterRule.java:45)
[junit4:junit4]   2> 		at com.carrotsearch.randomizedtesting.rules.SystemPropertiesInvariantRule$1.evaluate(SystemPropertiesInvariantRule.java:55)
[junit4:junit4]   2> 		at org.apache.lucene.util.TestRuleThreadAndTestName$1.evaluate(TestRuleThreadAndTestName.java:48)
[junit4:junit4]   2> 		at org.apache.lucene.util.TestRuleIgnoreAfterMaxFailures$1.evaluate(TestRuleIgnoreAfterMaxFailures.java:70)
[junit4:junit4]   2> 		at org.apache.lucene.util.TestRuleMarkFailure$1.evaluate(TestRuleMarkFailure.java:48)
[junit4:junit4]   2> 		at com.carrotsearch.randomizedtesting.rules.StatementAdapter.evaluate(StatementAdapter.java:36)
[junit4:junit4]   2> 		at com.carrotsearch.randomizedtesting.ThreadLeakControl$StatementRunner.run(ThreadLeakControl.java:358)
[junit4:junit4]   2> 		at com.carrotsearch.randomizedtesting.ThreadLeakControl.forkTimeoutingTask(ThreadLeakControl.java:782)
[junit4:junit4]   2> 		at com.carrotsearch.randomizedtesting.ThreadLeakControl$3.evaluate(ThreadLeakControl.java:442)
[junit4:junit4]   2> 		at com.carrotsearch.randomizedtesting.RandomizedRunner.runSingleTest(RandomizedRunner.java:746)
[junit4:junit4]   2> 		at com.carrotsearch.randomizedtesting.RandomizedRunner$3.evaluate(RandomizedRunner.java:648)
[junit4:junit4]   2> 		at com.carrotsearch.randomizedtesting.RandomizedRunner$4.evaluate(RandomizedRunner.java:682)
[junit4:junit4]   2> 		at com.carrotsearch.randomizedtesting.RandomizedRunner$5.evaluate(RandomizedRunner.java:693)
[junit4:junit4]   2> 		at com.carrotsearch.randomizedtesting.rules.StatementAdapter.evaluate(StatementAdapter.java:36)
[junit4:junit4]   2> 		at com.carrotsearch.randomizedtesting.rules.SystemPropertiesRestoreRule$1.evaluate(SystemPropertiesRestoreRule.java:53)
[junit4:junit4]   2> 		at org.apache.lucene.util.AbstractBeforeAfterRule$1.evaluate(AbstractBeforeAfterRule.java:45)
[junit4:junit4]   2> 		at org.apache.lucene.util.TestRuleStoreClassName$1.evaluate(TestRuleStoreClassName.java:42)
[junit4:junit4]   2> 		at com.carrotsearch.randomizedtesting.rules.SystemPropertiesInvariantRule$1.evaluate(SystemPropertiesInvariantRule.java:55)
[junit4:junit4]   2> 		at com.carrotsearch.randomizedtesting.rules.NoShadowingOrOverridesOnMethodsRule$1.evaluate(NoShadowingOrOverridesOnMethodsRule.java:39)
[junit4:junit4]   2> 		at com.carrotsearch.randomizedtesting.rules.NoShadowingOrOverridesOnMethodsRule$1.evaluate(NoShadowingOrOverridesOnMethodsRule.java:39)
[junit4:junit4]   2> 		at com.carrotsearch.randomizedtesting.rules.StatementAdapter.evaluate(StatementAdapter.java:36)
[junit4:junit4]   2> 		at org.apache.lucene.util.TestRuleAssertionsRequired$1.evaluate(TestRuleAssertionsRequired.java:43)
[junit4:junit4]   2> 		at org.apache.lucene.util.TestRuleMarkFailure$1.evaluate(TestRuleMarkFailure.java:48)
[junit4:junit4]   2> 		at org.apache.lucene.util.TestRuleIgnoreAfterMaxFailures$1.evaluate(TestRuleIgnoreAfterMaxFailures.java:70)
[junit4:junit4]   2> 		at org.apache.lucene.util.TestRuleIgnoreTestSuites$1.evaluate(TestRuleIgnoreTestSuites.java:55)
[junit4:junit4]   2> 		at com.carrotsearch.randomizedtesting.rules.StatementAdapter.evaluate(StatementAdapter.java:36)
[junit4:junit4]   2> 		at com.carrotsearch.randomizedtesting.ThreadLeakControl$StatementRunner.run(ThreadLeakControl.java:358)
[junit4:junit4]   2> 		at java.lang.Thread.run(Thread.java:722)
[junit4:junit4]   2> 	Caused by: org.apache.solr.common.SolrException: No registered leader was found, collection:collection1 slice:shard1
[junit4:junit4]   2> 		at org.apache.solr.common.cloud.ZkStateReader.getLeaderProps(ZkStateReader.java:417)
[junit4:junit4]   2> 		at org.apache.solr.common.cloud.ZkStateReader.getLeaderUrl(ZkStateReader.java:394)
[junit4:junit4]   2> 		at org.apache.solr.cloud.ZkController.getLeader(ZkController.java:644)
[junit4:junit4]   2> 		... 47 more
[junit4:junit4]   2> 	
[junit4:junit4]   2> 62597 T1849 oasc.SolrException.log SEVERE null:org.apache.solr.common.cloud.ZooKeeperException: 
[junit4:junit4]   2> 		at org.apache.solr.core.CoreContainer.registerInZk(CoreContainer.java:731)
[junit4:junit4]   2> 		at org.apache.solr.core.CoreContainer.register(CoreContainer.java:692)
[junit4:junit4]   2> 		at org.apache.solr.core.CoreContainer.load(CoreContainer.java:531)
[junit4:junit4]   2> 		at org.apache.solr.core.CoreContainer.load(CoreContainer.java:351)
[junit4:junit4]   2> 		at org.apache.solr.core.CoreContainer$Initializer.initialize(CoreContainer.java:303)
[junit4:junit4]   2> 		at org.apache.solr.cloud.LeaderElectionIntegrationTest.setupContainer(LeaderElectionIntegrationTest.java:152)
[junit4:junit4]   2> 		at org.apache.solr.cloud.LeaderElectionIntegrationTest.setUp(LeaderElectionIntegrationTest.java:100)
[junit4:junit4]   2> 		at sun.reflect.GeneratedMethodAccessor4.invoke(Unknown Source)
[junit4:junit4]   2> 		at sun.reflect.DelegatingMethodAccessorImpl.invoke(DelegatingMethodAccessorImpl.java:43)
[junit4:junit4]   2> 		at java.lang.reflect.Method.invoke(Method.java:601)
[junit4:junit4]   2> 		at com.carrotsearch.randomizedtesting.RandomizedRunner.invoke(RandomizedRunner.java:1559)
[junit4:junit4]   2> 		at com.carrotsearch.randomizedtesting.RandomizedRunner.access$600(RandomizedRunner.java:79)
[junit4:junit4]   2> 		at com.carrotsearch.randomizedtesting.RandomizedRunner$7.evaluate(RandomizedRunner.java:771)
[junit4:junit4]   2> 		at com.carrotsearch.randomizedtesting.RandomizedRunner$8.evaluate(RandomizedRunner.java:787)
[junit4:junit4]   2> 		at com.carrotsearch.randomizedtesting.rules.SystemPropertiesRestoreRule$1.evaluate(SystemPropertiesRestoreRule.java:53)
[junit4:junit4]   2> 		at org.apache.lucene.util.TestRuleSetupTeardownChained$1.evaluate(TestRuleSetupTeardownChained.java:50)
[junit4:junit4]   2> 		at org.apache.lucene.util.TestRuleFieldCacheSanity$1.evaluate(TestRuleFieldCacheSanity.java:51)
[junit4:junit4]   2> 		at org.apache.lucene.util.AbstractBeforeAfterRule$1.evaluate(AbstractBeforeAfterRule.java:45)
[junit4:junit4]   2> 		at com.carrotsearch.randomizedtesting.rules.SystemPropertiesInvariantRule$1.evaluate(SystemPropertiesInvariantRule.java:55)
[junit4:junit4]   2> 		at org.apache.lucene.util.TestRuleThreadAndTestName$1.evaluate(TestRuleThreadAndTestName.java:48)
[junit4:junit4]   2> 		at org.apache.lucene.util.TestRuleIgnoreAfterMaxFailures$1.evaluate(TestRuleIgnoreAfterMaxFailures.java:70)
[junit4:junit4]   2> 		at org.apache.lucene.util.TestRuleMarkFailure$1.evaluate(TestRuleMarkFailure.java:48)
[junit4:junit4]   2> 		at com.carrotsearch.randomizedtesting.rules.StatementAdapter.evaluate(StatementAdapter.java:36)
[junit4:junit4]   2> 		at com.carrotsearch.randomizedtesting.ThreadLeakControl$StatementRunner.run(ThreadLeakControl.java:358)
[junit4:junit4]   2> 		at com.carrotsearch.randomizedtesting.ThreadLeakControl.forkTimeoutingTask(ThreadLeakControl.java:782)
[junit4:junit4]   2> 		at com.carrotsearch.randomizedtesting.ThreadLeakControl$3.evaluate(ThreadLeakControl.java:442)
[junit4:junit4]   2> 		at com.carrotsearch.randomizedtesting.RandomizedRunner.runSingleTest(RandomizedRunner.java:746)
[junit4:junit4]   2> 		at com.carrotsearch.randomizedtesting.RandomizedRunner$3.evaluate(RandomizedRunner.java:648)
[junit4:junit4]   2> 		at com.carrotsearch.randomizedtesting.RandomizedRunner$4.evaluate(RandomizedRunner.java:682)
[junit4:junit4]   2> 		at com.carrotsearch.randomizedtesting.RandomizedRunner$5.evaluate(RandomizedRunner.java:693)
[junit4:junit4]   2> 		at com.carrotsearch.randomizedtesting.rules.StatementAdapter.evaluate(StatementAdapter.java:36)
[junit4:junit4]   2> 		at com.carrotsearch.randomizedtesting.rules.SystemPropertiesRestoreRule$1.evaluate(SystemPropertiesRestoreRule.java:53)
[junit4:junit4]   2> 		at org.apache.lucene.util.AbstractBeforeAfterRule$1.evaluate(AbstractBeforeAfterRule.java:45)
[junit4:junit4]   2> 		at org.apache.lucene.util.TestRuleStoreClassName$1.evaluate(TestRuleStoreClassName.java:42)
[junit4:junit4]   2> 		at com.carrotsearch.randomizedtesting.rules.SystemPropertiesInvariantRule$1.evaluate(SystemPropertiesInvariantRule.java:55)
[junit4:junit4]   2> 		at com.carrotsearch.randomizedtesting.rules.NoShadowingOrOverridesOnMethodsRule$1.evaluate(NoShadowingOrOverridesOnMethodsRule.java:39)
[junit4:junit4]   2> 		at com.carrotsearch.randomizedtesting.rules.NoShadowingOrOverridesOnMethodsRule$1.evaluate(NoShadowingOrOverridesOnMethodsRule.java:39)
[junit4:junit4]   2> 		at com.carrotsearch.randomizedtesting.rules.StatementAdapter.evaluate(StatementAdapter.java:36)
[junit4:junit4]   2> 		at org.apache.lucene.util.TestRuleAssertionsRequired$1.evaluate(TestRuleAssertionsRequired.java:43)
[junit4:junit4]   2> 		at org.apache.lucene.util.TestRuleMarkFailure$1.evaluate(TestRuleMarkFailure.java:48)
[junit4:junit4]   2> 		at org.apache.lucene.util.TestRuleIgnoreAfterMaxFailures$1.evaluate(TestRuleIgnoreAfterMaxFailures.java:70)
[junit4:junit4]   2> 		at org.apache.lucene.util.TestRuleIgnoreTestSuites$1.evaluate(TestRuleIgnoreTestSuites.java:55)
[junit4:junit4]   2> 		at com.carrotsearch.randomizedtesting.rules.StatementAdapter.evaluate(StatementAdapter.java:36)
[junit4:junit4]   2> 		at com.carrotsearch.randomizedtesting.ThreadLeakControl$StatementRunner.run(ThreadLeakControl.java:358)
[junit4:junit4]   2> 		at java.lang.Thread.run(Thread.java:722)
[junit4:junit4]   2> 	Caused by: org.apache.solr.common.SolrException: Error getting leader from zk
[junit4:junit4]   2> 		at org.apache.solr.cloud.ZkController.getLeader(ZkController.java:664)
[junit4:junit4]   2> 		at org.apache.solr.cloud.ZkController.register(ZkController.java:579)
[junit4:junit4]   2> 		at org.apache.solr.cloud.ZkController.register(ZkController.java:534)
[junit4:junit4]   2> 		at org.apache.solr.core.CoreContainer.registerInZk(CoreContainer.java:708)
[junit4:junit4]   2> 		... 44 more
[junit4:junit4]   2> 	Caused by: org.apache.solr.common.SolrException: No registered leader was found, collection:collection1 slice:shard1
[junit4:junit4]   2> 		at org.apache.solr.common.cloud.ZkStateReader.getLeaderProps(ZkStateReader.java:417)
[junit4:junit4]   2> 		at org.apache.solr.common.cloud.ZkStateReader.getLeaderUrl(ZkStateReader.java:394)
[junit4:junit4]   2> 		at org.apache.solr.cloud.ZkController.getLeader(ZkController.java:644)
[junit4:junit4]   2> 		... 47 more
[junit4:junit4]   2> 	
[junit4:junit4]   2> 62598 T1849 oasc.SolrCore.close [collection1]  CLOSING SolrCore org.apache.solr.core.SolrCore@164f90
[junit4:junit4]   2> 62607 T1849 oasu.DirectUpdateHandler2.close closing DirectUpdateHandler2{commits=0,autocommits=0,soft autocommits=0,optimizes=0,rollbacks=0,expungeDeletes=0,docsPending=0,adds=0,deletesById=0,deletesByQuery=0,errors=0,cumulative_adds=0,cumulative_deletesById=0,cumulative_deletesByQuery=0,cumulative_errors=0}
[junit4:junit4]   2> 62608 T1849 oasc.SolrCore.decrefSolrCoreState Closing SolrCoreState
[junit4:junit4]   2> 62608 T1849 oasu.DefaultSolrCoreState.closeIndexWriter SolrCoreState ref count has reached 0 - closing IndexWriter
[junit4:junit4]   2> 62608 T1849 oasu.DefaultSolrCoreState.closeIndexWriter closing IndexWriter with IndexWriterCloser
[junit4:junit4]   2> 62609 T1849 oasc.SolrCore.closeSearcher [collection1] Closing main searcher on request.
[junit4:junit4]   2> 62609 T1849 oasc.CachingDirectoryFactory.close Releasing directory:/mnt/ssd/jenkins/workspace/Lucene-Solr-trunk-Linux/solr/build/solr-core/test/J1/./solrtest-LeaderElectionIntegrationTest-1351599813545/data_7001/index
[junit4:junit4]   2> 62610 T1849 oasc.SolrResourceLoader.locateSolrHome JNDI not configured for solr (NoInitialContextEx)
[junit4:junit4]   2> 62610 T1849 oasc.SolrResourceLoader.locateSolrHome using system property solr.solr.home: /mnt/ssd/jenkins/workspace/Lucene-Solr-trunk-Linux/solr/build/solr-core/test-files/solr
[junit4:junit4]   2> 62611 T1849 oasc.CoreContainer$Initializer.initialize looking for solr.xml: /mnt/ssd/jenkins/workspace/Lucene-Solr-trunk-Linux/solr/build/solr-core/test-files/solr/solr.xml
[junit4:junit4]   2> 62611 T1849 oasc.CoreContainer.<init> New CoreContainer 31487584
[junit4:junit4]   2> 62611 T1849 oasc.CoreContainer.load Loading CoreContainer using Solr Home: '/mnt/ssd/jenkins/workspace/Lucene-Solr-trunk-Linux/solr/build/solr-core/test-files/solr/'
[junit4:junit4]   2> 62612 T1849 oasc.SolrResourceLoader.<init> new SolrResourceLoader for directory: '/mnt/ssd/jenkins/workspace/Lucene-Solr-trunk-Linux/solr/build/solr-core/test-files/solr/'
[junit4:junit4]   2> 62629 T1849 oasc.CoreContainer.load Registering Log Listener
[junit4:junit4]   2> 62638 T1849 oasc.CoreContainer.initZooKeeper Zookeeper client=127.0.0.1:33226/solr
[junit4:junit4]   2> 62639 T1849 oaz.ZooKeeper.<init> Initiating client connection, connectString=127.0.0.1:33226/solr sessionTimeout=3000 watcher=org.apache.solr.common.cloud.ConnectionManager@b3e6aa
[junit4:junit4]   2> 62639 T1867 oaz.ClientCnxn$SendThread.startConnect Opening socket connection to server /127.0.0.1:33226
[junit4:junit4]   2> 62639 T1849 oascc.ConnectionManager.waitForConnected Waiting for client to connect to ZooKeeper
[junit4:junit4]   2> 62640 T1867 oaz.ClientCnxn$SendThread.primeConnection Socket connection established to localhost.localdomain/127.0.0.1:33226, initiating session
[junit4:junit4]   2> 62641 T1851 oazs.NIOServerCnxn$Factory.run Accepted socket connection from /127.0.0.1:35430
[junit4:junit4]   2> 62641 T1851 oazs.NIOServerCnxn.readConnectRequest Client attempting to establish new session at /127.0.0.1:35430
[junit4:junit4]   2> 62642 T1867 oaz.ClientCnxn$SendThread.readConnectResult Session establishment complete on server localhost.localdomain/127.0.0.1:33226, sessionid = 0x13ab1a073ad0004, negotiated timeout = 3000
[junit4:junit4]   2> 62641 T1853 oazs.NIOServerCnxn.finishSessionInit Established session 0x13ab1a073ad0004 with negotiated timeout 3000 for client /127.0.0.1:35430
[junit4:junit4]   2> 62642 T1868 oascc.ConnectionManager.process Watcher org.apache.solr.common.cloud.ConnectionManager@b3e6aa name:ZooKeeperConnection Watcher:127.0.0.1:33226/solr got event WatchedEvent state:SyncConnected type:None path:null path:null type:None
[junit4:junit4]   2> 62642 T1849 oascc.ConnectionManager.waitForConnected Client is connected to ZooKeeper
[junit4:junit4]   2> 62643 T1854 oazs.PrepRequestProcessor.pRequest Got user-level KeeperException when processing sessionid:0x13ab1a073ad0004 type:create cxid:0x1 zxid:0xfffffffffffffffe txntype:unknown reqpath:n/a Error Path:/solr/overseer Error:KeeperErrorCode = NodeExists for /solr/overseer
[junit4:junit4]   2> 62643 T1854 oazs.PrepRequestProcessor.pRequest Got user-level KeeperException when processing sessionid:0x13ab1a073ad0004 type:create cxid:0x2 zxid:0xfffffffffffffffe txntype:unknown reqpath:n/a Error Path:/solr/overseer Error:KeeperErrorCode = NodeExists for /solr/overseer
[junit4:junit4]   2> 62644 T1849 oasc.ZkController.createEphemeralLiveNode Register node as live in ZooKeeper:/live_nodes/127.0.0.1:7002_solr
[junit4:junit4]   2> 62644 T1854 oazs.PrepRequestProcessor.pRequest Got user-level KeeperException when processing sessionid:0x13ab1a073ad0004 type:delete cxid:0x4 zxid:0xfffffffffffffffe txntype:unknown reqpath:n/a Error Path:/solr/live_nodes/127.0.0.1:7002_solr Error:KeeperErrorCode = NoNode for /solr/live_nodes/127.0.0.1:7002_solr
[junit4:junit4]   2> 62645 T1849 oascc.SolrZkClient.makePath makePath: /live_nodes/127.0.0.1:7002_solr
[junit4:junit4]   2> 62646 T1860 oascc.ZkStateReader$2.process A cluster state change has occurred - updating... (2)
[junit4:junit4]   2> 62646 T1865 oascc.ZkStateReader$3.process Updating live nodes... (3)
[junit4:junit4]   2> 62646 T1849 oashc.HttpShardHandlerFactory.getParameter Setting socketTimeout to: 0
[junit4:junit4]   2> 62646 T1860 oascc.ZkStateReader$3.process Updating live nodes... (3)
[junit4:junit4]   2> 62646 T1849 oashc.HttpShardHandlerFactory.getParameter Setting urlScheme to: http://
[junit4:junit4]   2> 62647 T1849 oashc.HttpShardHandlerFactory.getParameter Setting connTimeout to: 0
[junit4:junit4]   2> 62647 T1849 oashc.HttpShardHandlerFactory.getParameter Setting maxConnectionsPerHost to: 20
[junit4:junit4]   2> 62647 T1849 oashc.HttpShardHandlerFactory.getParameter Setting corePoolSize to: 0
[junit4:junit4]   2> 62648 T1849 oashc.HttpShardHandlerFactory.getParameter Setting maximumPoolSize to: 2147483647
[junit4:junit4]   2> 62648 T1849 oashc.HttpShardHandlerFactory.getParameter Setting maxThreadIdleTime to: 5
[junit4:junit4]   2> 62648 T1849 oashc.HttpShardHandlerFactory.getParameter Setting sizeOfQueue to: -1
[junit4:junit4]   2> 62649 T1849 oashc.HttpShardHandlerFactory.getParameter Setting fairnessPolicy to: false
[junit4:junit4]   2> 62649 T1849 oascsi.HttpClientUtil.createClient Creating new http client, config:maxConnectionsPerHost=20&maxConnections=10000&socketTimeout=0&connTimeout=0&retry=false
[junit4:junit4]   2> 62653 T1849 oascc.ZkStateReader.createClusterStateWatchersAndUpdate Updating cluster state from ZooKeeper... 
[junit4:junit4]   2> 62671 T1849 oasc.CoreContainer.create Creating SolrCore 'collection1' using instanceDir: /mnt/ssd/jenkins/workspace/Lucene-Solr-trunk-Linux/solr/build/solr-core/test-files/solr/collection1
[junit4:junit4]   2> 62671 T1849 oasc.ZkController.createCollectionZkNode Check for collection zkNode:collection1
[junit4:junit4]   2> 62672 T1849 oasc.ZkController.createCollectionZkNode Collection zkNode exists
[junit4:junit4]   2> 62673 T1849 oasc.ZkController.readConfigName Load collection config from:/collections/collection1
[junit4:junit4]   2> 62674 T1849 oasc.SolrResourceLoader.<init> new SolrResourceLoader for directory: '/mnt/ssd/jenkins/workspace/Lucene-Solr-trunk-Linux/solr/build/solr-core/test-files/solr/collection1/'
[junit4:junit4]   2> 62675 T1849 oasc.SolrResourceLoader.replaceClassLoader Adding 'file:/mnt/ssd/jenkins/workspace/Lucene-Solr-trunk-Linux/solr/build/solr-core/test-files/solr/collection1/lib/README' to classloader
[junit4:junit4]   2> 62675 T1849 oasc.SolrResourceLoader.replaceClassLoader Adding 'file:/mnt/ssd/jenkins/workspace/Lucene-Solr-trunk-Linux/solr/build/solr-core/test-files/solr/collection1/lib/classes/' to classloader
[junit4:junit4]   2> 62713 T1849 oasc.SolrConfig.<init> Using Lucene MatchVersion: LUCENE_50
[junit4:junit4]   2> 62767 T1849 oasc.SolrConfig.<init> Loaded SolrConfig: solrconfig.xml
[junit4:junit4]   2> 62770 T1849 oass.IndexSchema.readSchema Reading Solr Schema
[junit4:junit4]   2> 62787 T1849 oass.IndexSchema.readSchema Schema name=test
[junit4:junit4]   2> 63323 T1849 oass.OpenExchangeRatesOrgProvider.init Initialized with rates=open-exchange-rates.json, refreshInterval=1440.
[junit4:junit4]   2> 63335 T1849 oass.IndexSchema.readSchema default search field in schema is text
[junit4:junit4]   2> 63339 T1849 oass.IndexSchema.readSchema unique key field: id
[junit4:junit4]   2> 63345 T1849 oass.FileExchangeRateProvider.reload Reloading exchange rates from file currency.xml
[junit4:junit4]   2> 63348 T1849 oass.FileExchangeRateProvider.reload Reloading exchange rates from file currency.xml
[junit4:junit4]   2> 63351 T1849 oass.OpenExchangeRatesOrgProvider.reload Reloading exchange rates from open-exchange-rates.json
[junit4:junit4]   2> 63352 T1849 oass.OpenExchangeRatesOrgProvider.reload Reloading exchange rates from open-exchange-rates.json
[junit4:junit4]   2> 63353 T1849 oasc.SolrCore.<init> [collection1] Opening new SolrCore at /mnt/ssd/jenkins/workspace/Lucene-Solr-trunk-Linux/solr/build/solr-core/test-files/solr/collection1/, dataDir=/mnt/ssd/jenkins/workspace/Lucene-Solr-trunk-Linux/solr/build/solr-core/test/J1/./solrtest-LeaderElectionIntegrationTest-1351599813545/data_7002/
[junit4:junit4]   2> 63353 T1849 oasc.JmxMonitoredMap.<init> JMX monitoring is enabled. Adding Solr mbeans to JMX Server: com.sun.jmx.mbeanserver.JmxMBeanServer@151dc28
[junit4:junit4]   2> 63354 T1849 oasc.SolrCore.initDirectoryFactory org.apache.solr.core.MockDirectoryFactory
[junit4:junit4]   2> 63354 T1849 oasc.CachingDirectoryFactory.injectLockFactory WARNING No lockType configured for BaseDirectoryWrapper(org.apache.lucene.store.RAMDirectory@353343 lockFactory=org.apache.lucene.store.SingleInstanceLockFactory@b8a614) assuming 'simple'
[junit4:junit4]   2> 63355 T1849 oasc.CachingDirectoryFactory.get return new directory for /mnt/ssd/jenkins/workspace/Lucene-Solr-trunk-Linux/solr/build/solr-core/test/J1/./solrtest-LeaderElectionIntegrationTest-1351599813545/data_7002 forceNew:false
[junit4:junit4]   2> 63355 T1849 oasc.CachingDirectoryFactory.close Releasing directory:/mnt/ssd/jenkins/workspace/Lucene-Solr-trunk-Linux/solr/build/solr-core/test/J1/./solrtest-LeaderElectionIntegrationTest-1351599813545/data_7002
[junit4:junit4]   2> 63355 T1849 oasc.SolrCore.getNewIndexDir New index directory detected: old=null new=/mnt/ssd/jenkins/workspace/Lucene-Solr-trunk-Linux/solr/build/solr-core/test/J1/./solrtest-LeaderElectionIntegrationTest-1351599813545/data_7002/index/
[junit4:junit4]   2> 63356 T1849 oasc.SolrCore.initIndex WARNING [collection1] Solr index directory '/mnt/ssd/jenkins/workspace/Lucene-Solr-trunk-Linux/solr/build/solr-core/test/J1/./solrtest-LeaderElectionIntegrationTest-1351599813545/data_7002/index' doesn't exist. Creating new index...
[junit4:junit4]   2> 63356 T1849 oasc.CachingDirectoryFactory.get return new directory for /mnt/ssd/jenkins/workspace/Lucene-Solr-trunk-Linux/solr/build/solr-core/test/J1/./solrtest-LeaderElectionIntegrationTest-1351599813545/data_7002/index forceNew:false
[junit4:junit4]   2> 63357 T1849 oasc.SolrDeletionPolicy.onCommit SolrDeletionPolicy.onCommit: commits:num=1
[junit4:junit4]   2> 		commit{dir=MockDirWrapper(org.apache.lucene.store.RAMDirectory@8b90c8 lockFactory=org.apache.lucene.store.NativeFSLockFactory@49ffe9),segFN=segments_1,generation=1,filenames=[segments_1]
[junit4:junit4]   2> 63358 T1849 oasc.SolrDeletionPolicy.updateCommits newest commit = 1[segments_1]
[junit4:junit4]   2> 63358 T1849 oasc.CachingDirectoryFactory.close Releasing directory:/mnt/ssd/jenkins/workspace/Lucene-Solr-trunk-Linux/solr/build/solr-core/test/J1/./solrtest-LeaderElectionIntegrationTest-1351599813545/data_7002/index
[junit4:junit4]   2> 63359 T1849 oasc.SolrCore.initWriters created xml: solr.XMLResponseWriter
[junit4:junit4]   2> 63360 T1849 oasup.UpdateRequestProcessorChain.init inserting DistributedUpdateProcessorFactory into updateRequestProcessorChain "dedupe"
[junit4:junit4]   2> 63361 T1849 oasup.UpdateRequestProcessorChain.init inserting DistributedUpdateProcessorFactory into updateRequestProcessorChain "dedupe-allfields"
[junit4:junit4]   2> 63361 T1849 oasup.UpdateRequestProcessorChain.init inserting DistributedUpdateProcessorFactory into updateRequestProcessorChain "stored_sig"
[junit4:junit4]   2> 63361 T1849 oasup.UpdateRequestProcessorChain.init inserting DistributedUpdateProcessorFactory into updateRequestProcessorChain "uniq-fields"
[junit4:junit4]   2> 63362 T1849 oasup.UpdateRequestProcessorChain.init inserting DistributedUpdateProcessorFactory into updateRequestProcessorChain "distrib-dup-test-chain-implicit"
[junit4:junit4]   2> 63362 T1849 oasc.RequestHandlers.initHandlersFromConfig adding lazy requestHandler: solr.ReplicationHandler
[junit4:junit4]   2> 63363 T1849 oasc.RequestHandlers.initHandlersFromConfig created /replication: solr.ReplicationHandler
[junit4:junit4]   2> 63364 T1849 oasc.RequestHandlers.initHandlersFromConfig created standard: solr.StandardRequestHandler
[junit4:junit4]   2> 63364 T1849 oasc.RequestHandlers.initHandlersFromConfig created /get: solr.RealTimeGetHandler
[junit4:junit4]   2> 63365 T1849 oasc.RequestHandlers.initHandlersFromConfig created dismax: solr.SearchHandler
[junit4:junit4]   2> 63366 T1849 oasc.RequestHandlers.initHandlersFromConfig created mock: org.apache.solr.core.MockQuerySenderListenerReqHandler
[junit4:junit4]   2> 63366 T1849 oasc.RequestHandlers.initHandlersFromConfig created /admin/: org.apache.solr.handler.admin.AdminHandlers
[junit4:junit4]   2> 63367 T1849 oasc.RequestHandlers.initHandlersFromConfig created defaults: solr.StandardRequestHandler
[junit4:junit4]   2> 63367 T1849 oasc.RequestHandlers.initHandlersFromConfig adding lazy requestHandler: solr.StandardRequestHandler
[junit4:junit4]   2> 63368 T1849 oasc.RequestHandlers.initHandlersFromConfig created lazy: solr.StandardRequestHandler
[junit4:junit4]   2> 63369 T1849 oasc.RequestHandlers.initHandlersFromConfig created /update: solr.UpdateRequestHandler
[junit4:junit4]   2> 63369 T1849 oasc.RequestHandlers.initHandlersFromConfig created /terms: org.apache.solr.handler.component.SearchHandler
[junit4:junit4]   2> 63370 T1849 oasc.RequestHandlers.initHandlersFromConfig created spellCheckCompRH: org.apache.solr.handler.component.SearchHandler
[junit4:junit4]   2> 63371 T1849 oasc.RequestHandlers.initHandlersFromConfig created spellCheckCompRH_Direct: org.apache.solr.handler.component.SearchHandler
[junit4:junit4]   2> 63372 T1849 oasc.RequestHandlers.initHandlersFromConfig created spellCheckWithWordbreak: org.apache.solr.handler.component.SearchHandler
[junit4:junit4]   2> 63373 T1849 oasc.RequestHandlers.initHandlersFromConfig created spellCheckWithWordbreak_Direct: org.apache.solr.handler.component.SearchHandler
[junit4:junit4]   2> 63374 T1849 oasc.RequestHandlers.initHandlersFromConfig created spellCheckCompRH1: org.apache.solr.handler.component.SearchHandler
[junit4:junit4]   2> 63375 T1849 oasc.RequestHandlers.initHandlersFromConfig created tvrh: org.apache.solr.handler.component.SearchHandler
[junit4:junit4]   2> 63377 T1849 oasc.RequestHandlers.initHandlersFromConfig created /mlt: solr.MoreLikeThisHandler
[junit4:junit4]   2> 63378 T1849 oasc.RequestHandlers.initHandlersFromConfig created /debug/dump: solr.DumpRequestHandler
[junit4:junit4]   2> 63382 T1849 oashl.XMLLoader.init xsltCacheLifetimeSeconds=60
[junit4:junit4]   2> 63384 T1849 oasc.SolrCore.initDeprecatedSupport WARNING solrconfig.xml uses deprecated <admin/gettableFiles>, Please update your config to use the ShowFileRequestHandler.
[junit4:junit4]   2> 63385 T1849 oasc.SolrCore.initDeprecatedSupport WARNING adding ShowFileRequestHandler with hidden files: [SCHEMA.XML, OLD_SYNONYMS.TXT, STOPWORDS.TXT, PROTWORDS.TXT, OPEN-EXCHANGE-RATES.JSON, SYNONYMS.TXT, CURRENCY.XML, MAPPING-ISOLATIN1ACCENT.TXT]
[junit4:junit4]   2> 63387 T1849 oasc.CachingDirectoryFactory.close Releasing directory:/mnt/ssd/jenkins/workspace/Lucene-Solr-trunk-Linux/solr/build/solr-core/test/J1/./solrtest-LeaderElectionIntegrationTest-1351599813545/data_7002
[junit4:junit4]   2> 63387 T1849 oass.SolrIndexSearcher.<init> Opening Searcher@146d795 main
[junit4:junit4]   2> 63388 T1849 oasu.CommitTracker.<init> Hard AutoCommit: disabled
[junit4:junit4]   2> 63388 T1849 oasu.CommitTracker.<init> Soft AutoCommit: disabled
[junit4:junit4]   2> 63389 T1849 oashc.SpellCheckComponent.inform Initializing spell checkers
[junit4:junit4]   2> 63394 T1849 oass.DirectSolrSpellChecker.init init: {name=direct,classname=DirectSolrSpellChecker,field=lowerfilt,minQueryLength=3}
[junit4:junit4]   2> 63417 T1869 oasc.SolrCore.registerSearcher [collection1] Registered new searcher Searcher@146d795 main{StandardDirectoryReader(segments_1:1)}
[junit4:junit4]   2> 63420 T1849 oasc.ZkController.publish numShards not found on descriptor - reading it from system property
[junit4:junit4]   2> 63421 T1849 oasc.CoreContainer.register registering core: collection1
[junit4:junit4]   2> 63421 T1849 oasc.ZkController.register Register shard - core:collection1 address:http://127.0.0.1:7002/solr shardId:shard1
[junit4:junit4]   2> 93425 T1849 oasc.ZkController.getLeader SEVERE Error getting leader from zk org.apache.solr.common.SolrException: No registered leader was found, collection:collection1 slice:shard1
[junit4:junit4]   2> 	at org.apache.solr.common.cloud.ZkStateReader.getLeaderProps(ZkStateReader.java:417)
[junit4:junit4]   2> 	at org.apache.solr.common.cloud.ZkStateReader.getLeaderUrl(ZkStateReader.java:394)
[junit4:junit4]   2> 	at org.apache.solr.cloud.ZkController.getLeader(ZkController.java:644)
[junit4:junit4]   2> 	at org.apache.solr.cloud.ZkController.register(ZkController.java:579)
[junit4:junit4]   2> 	at org.apache.solr.cloud.ZkController.register(ZkController.java:534)
[junit4:junit4]   2> 	at org.apache.solr.core.CoreContainer.registerInZk(CoreContainer.java:708)
[junit4:junit4]   2> 	at org.apache.solr.core.CoreContainer.register(CoreContainer.java:692)
[junit4:junit4]   2> 	at org.apache.solr.core.CoreContainer.load(CoreContainer.java:531)
[junit4:junit4]   2> 	at org.apache.solr.core.CoreContainer.load(CoreContainer.java:351)
[junit4:junit4]   2> 	at org.apache.solr.core.CoreContainer$Initializer.initialize(CoreContainer.java:303)
[junit4:junit4]   2> 	at org.apache.solr.cloud.LeaderElectionIntegrationTest.setupContainer(LeaderElectionIntegrationTest.java:152)
[junit4:junit4]   2> 	at org.apache.solr.cloud.LeaderElectionIntegrationTest.setUp(LeaderElectionIntegrationTest.java:100)
[junit4:junit4]   2> 	at sun.reflect.GeneratedMethodAccessor4.invoke(Unknown Source)
[junit4:junit4]   2> 	at sun.reflect.DelegatingMethodAccessorImpl.invoke(DelegatingMethodAccessorImpl.java:43)
[junit4:junit4]   2> 	at java.lang.reflect.Method.invoke(Method.java:601)
[junit4:junit4]   2> 	at com.carrotsearch.randomizedtesting.RandomizedRunner.invoke(RandomizedRunner.java:1559)
[junit4:junit4]   2> 	at com.carrotsearch.randomizedtesting.RandomizedRunner.access$600(RandomizedRunner.java:79)
[junit4:junit4]   2> 	at com.carrotsearch.randomizedtesting.RandomizedRunner$7.evaluate(RandomizedRunner.java:771)
[junit4:junit4]   2> 	at com.carrotsearch.randomizedtesting.RandomizedRunner$8.evaluate(RandomizedRunner.java:787)
[junit4:junit4]   2> 	at com.carrotsearch.randomizedtesting.rules.SystemPropertiesRestoreRule$1.evaluate(SystemPropertiesRestoreRule.java:53)
[junit4:junit4]   2> 	at org.apache.lucene.util.TestRuleSetupTeardownChained$1.evaluate(TestRuleSetupTeardownChained.java:50)
[junit4:junit4]   2> 	at org.apache.lucene.util.TestRuleFieldCacheSanity$1.evaluate(TestRuleFieldCacheSanity.java:51)
[junit4:junit4]   2> 	at org.apache.lucene.util.AbstractBeforeAfterRule$1.evaluate(AbstractBeforeAfterRule.java:45)
[junit4:junit4]   2> 	at com.carrotsearch.randomizedtesting.rules.SystemPropertiesInvariantRule$1.evaluate(SystemPropertiesInvariantRule.java:55)
[junit4:junit4]   2> 	at org.apache.lucene.util.TestRuleThreadAndTestName$1.evaluate(TestRuleThreadAndTestName.java:48)
[junit4:junit4]   2> 	at org.apache.lucene.util.TestRuleIgnoreAfterMaxFailures$1.evaluate(TestRuleIgnoreAfterMaxFailures.java:70)
[junit4:junit4]   2> 	at org.apache.lucene.util.TestRuleMarkFailure$1.evaluate(TestRuleMarkFailure.java:48)
[junit4:junit4]   2> 	at com.carrotsearch.randomizedtesting.rules.StatementAdapter.evaluate(StatementAdapter.java:36)
[junit4:junit4]   2> 	at com.carrotsearch.randomizedtesting.ThreadLeakControl$StatementRunner.run(ThreadLeakControl.java:358)
[junit4:junit4]   2> 	at com.carrotsearch.randomizedtesting.ThreadLeakControl.forkTimeoutingTask(ThreadLeakControl.java:782)
[junit4:junit4]   2> 	at com.carrotsearch.randomizedtesting.ThreadLeakControl$3.evaluate(ThreadLeakControl.java:442)
[junit4:junit4]   2> 	at com.carrotsearch.randomizedtesting.RandomizedRunner.runSingleTest(RandomizedRunner.java:746)
[junit4:junit4]   2> 	at com.carrotsearch.randomizedtesting.RandomizedRunner$3.evaluate(RandomizedRunner.java:648)
[junit4:junit4]   2> 	at com.carrotsearch.randomizedtesting.RandomizedRunner$4.evaluate(RandomizedRunner.java:682)
[junit4:junit4]   2> 	at com.carrotsearch.randomizedtesting.RandomizedRunner$5.evaluate(RandomizedRunner.java:693)
[junit4:junit4]   2> 	at com.carrotsearch.randomizedtesting.rules.StatementAdapter.evaluate(StatementAdapter.java:36)
[junit4:junit4]   2> 	at com.carrotsearch.randomizedtesting.rules.SystemPropertiesRestoreRule$1.evaluate(SystemPropertiesRestoreRule.java:53)
[junit4:junit4]   2> 	at org.apache.lucene.util.AbstractBeforeAfterRule$1.evaluate(AbstractBeforeAfterRule.java:45)
[junit4:junit4]   2> 	at org.apache.lucene.util.TestRuleStoreClassName$1.evaluate(TestRuleStoreClassName.java:42)
[junit4:junit4]   2> 	at com.carrotsearch.randomizedtesting.rules.SystemPropertiesInvariantRule$1.evaluate(SystemPropertiesInvariantRule.java:55)
[junit4:junit4]   2> 	at com.carrotsearch.randomizedtesting.rules.NoShadowingOrOverridesOnMethodsRule$1.evaluate(NoShadowingOrOverridesOnMethodsRule.java:39)
[junit4:junit4]   2> 	at com.carrotsearch.randomizedtesting.rules.NoShadowingOrOverridesOnMethodsRule$1.evaluate(NoShadowingOrOverridesOnMethodsRule.java:39)
[junit4:junit4]   2> 	at com.carrotsearch.randomizedtesting.rules.StatementAdapter.evaluate(StatementAdapter.java:36)
[junit4:junit4]   2> 	at org.apache.lucene.util.TestRuleAssertionsRequired$1.evaluate(TestRuleAssertionsRequired.java:43)
[junit4:junit4]   2> 	at org.apache.lucene.util.TestRuleMarkFailure$1.evaluate(TestRuleMarkFailure.java:48)
[junit4:junit4]   2> 	at org.apache.lucene.util.TestRuleIgnoreAfterMaxFailures$1.evaluate(TestRuleIgnoreAfterMaxFailures.java:70)
[junit4:junit4]   2> 	at org.apache.lucene.util.TestRuleIgnoreTestSuites$1.evaluate(TestRuleIgnoreTestSuites.java:55)
[junit4:junit4]   2> 	at com.carrotsearch.randomizedtesting.rules.StatementAdapter.evaluate(StatementAdapter.java:36)
[junit4:junit4]   2> 	at com.carrotsearch.randomizedtesting.ThreadLeakControl$StatementRunner.run(ThreadLeakControl.java:358)
[junit4:junit4]   2> 	at java.lang.Thread.run(Thread.java:722)
[junit4:junit4]   2> 
[junit4:junit4]   2> 93428 T1849 oasc.ZkController.publish numShards not found on descriptor - reading it from system property
[junit4:junit4]   2> 93430 T1849 oasc.SolrException.log SEVERE :org.apache.solr.common.SolrException: Error getting leader from zk
[junit4:junit4]   2> 		at org.apache.solr.cloud.ZkController.getLeader(ZkController.java:664)
[junit4:junit4]   2> 		at org.apache.solr.cloud.ZkController.register(ZkController.java:579)
[junit4:junit4]   2> 		at org.apache.solr.cloud.ZkController.register(ZkController.java:534)
[junit4:junit4]   2> 		at org.apache.solr.core.CoreContainer.registerInZk(CoreContainer.java:708)
[junit4:junit4]   2> 		at org.apache.solr.core.CoreContainer.register(CoreContainer.java:692)
[junit4:junit4]   2> 		at org.apache.solr.core.CoreContainer.load(CoreContainer.java:531)
[junit4:junit4]   2> 		at org.apache.solr.core.CoreContainer.load(CoreContainer.java:351)
[junit4:junit4]   2> 		at org.apache.solr.core.CoreContainer$Initializer.initialize(CoreContainer.java:303)
[junit4:junit4]   2> 		at org.apache.solr.cloud.LeaderElectionIntegrationTest.setupContainer(LeaderElectionIntegrationTest.java:152)
[junit4:junit4]   2> 		at org.apache.solr.cloud.LeaderElectionIntegrationTest.setUp(LeaderElectionIntegrationTest.java:100)
[junit4:junit4]   2> 		at sun.reflect.GeneratedMethodAccessor4.invoke(Unknown Source)
[junit4:junit4]   2> 		at sun.reflect.DelegatingMethodAccessorImpl.invoke(DelegatingMethodAccessorImpl.java:43)
[junit4:junit4]   2> 		at java.lang.reflect.Method.invoke(Method.java:601)
[junit4:junit4]   2> 		at com.carrotsearch.randomizedtesting.RandomizedRunner.invoke(RandomizedRunner.java:1559)
[junit4:junit4]   2> 		at com.carrotsearch.randomizedtesting.RandomizedRunner.access$600(RandomizedRunner.java:79)
[junit4:junit4]   2> 		at com.carrotsearch.randomizedtesting.RandomizedRunner$7.evaluate(RandomizedRunner.java:771)
[junit4:junit4]   2> 		at com.carrotsearch.randomizedtesting.RandomizedRunner$8.evaluate(RandomizedRunner.java:787)
[junit4:junit4]   2> 		at com.carrotsearch.randomizedtesting.rules.SystemPropertiesRestoreRule$1.evaluate(SystemPropertiesRestoreRule.java:53)
[junit4:junit4]   2> 		at org.apache.lucene.util.TestRuleSetupTeardownChained$1.evaluate(TestRuleSetupTeardownChained.java:50)
[junit4:junit4]   2> 		at org.apache.lucene.util.TestRuleFieldCacheSanity$1.evaluate(TestRuleFieldCacheSanity.java:51)
[junit4:junit4]   2> 		at org.apache.lucene.util.AbstractBeforeAfterRule$1.evaluate(AbstractBeforeAfterRule.java:45)
[junit4:junit4]   2> 		at com.carrotsearch.randomizedtesting.rules.SystemPropertiesInvariantRule$1.evaluate(SystemPropertiesInvariantRule.java:55)
[junit4:junit4]   2> 		at org.apache.lucene.util.TestRuleThreadAndTestName$1.evaluate(TestRuleThreadAndTestName.java:48)
[junit4:junit4]   2> 		at org.apache.lucene.util.TestRuleIgnoreAfterMaxFailures$1.evaluate(TestRuleIgnoreAfterMaxFailures.java:70)
[junit4:junit4]   2> 		at org.apache.lucene.util.TestRuleMarkFailure$1.evaluate(TestRuleMarkFailure.java:48)
[junit4:junit4]   2> 		at com.carrotsearch.randomizedtesting.rules.StatementAdapter.evaluate(StatementAdapter.java:36)
[junit4:junit4]   2> 		at com.carrotsearch.randomizedtesting.ThreadLeakControl$StatementRunner.run(ThreadLeakControl.java:358)
[junit4:junit4]   2> 		at com.carrotsearch.randomizedtesting.ThreadLeakControl.forkTimeoutingTask(ThreadLeakControl.java:782)
[junit4:junit4]   2> 		at com.carrotsearch.randomizedtesting.ThreadLeakControl$3.evaluate(ThreadLeakControl.java:442)
[junit4:junit4]   2> 		at com.carrotsearch.randomizedtesting.RandomizedRunner.runSingleTest(RandomizedRunner.java:746)
[junit4:junit4]   2> 		at com.carrotsearch.randomizedtesting.RandomizedRunner$3.evaluate(RandomizedRunner.java:648)
[junit4:junit4]   2> 		at com.carrotsearch.randomizedtesting.RandomizedRunner$4.evaluate(RandomizedRunner.java:682)
[junit4:junit4]   2> 		at com.carrotsearch.randomizedtesting.RandomizedRunner$5.evaluate(RandomizedRunner.java:693)
[junit4:junit4]   2> 		at com.carrotsearch.randomizedtesting.rules.StatementAdapter.evaluate(StatementAdapter.java:36)
[junit4:junit4]   2> 		at com.carrotsearch.randomizedtesting.rules.SystemPropertiesRestoreRule$1.evaluate(SystemPropertiesRestoreRule.java:53)
[junit4:junit4]   2> 		at org.apache.lucene.util.AbstractBeforeAfterRule$1.evaluate(AbstractBeforeAfterRule.java:45)
[junit4:junit4]   2> 		at org.apache.lucene.util.TestRuleStoreClassName$1.evaluate(TestRuleStoreClassName.java:42)
[junit4:junit4]   2> 		at com.carrotsearch.randomizedtesting.rules.SystemPropertiesInvariantRule$1.evaluate(SystemPropertiesInvariantRule.java:55)
[junit4:junit4]   2> 		at com.carrotsearch.randomizedtesting.rules.NoShadowingOrOverridesOnMethodsRule$1.evaluate(NoShadowingOrOverridesOnMethodsRule.java:39)
[junit4:junit4]   2> 		at com.carrotsearch.randomizedtesting.rules.NoShadowingOrOverridesOnMethodsRule$1.evaluate(NoShadowingOrOverridesOnMethodsRule.java:39)
[junit4:junit4]   2> 		at com.carrotsearch.randomizedtesting.rules.StatementAdapter.evaluate(StatementAdapter.java:36)
[junit4:junit4]   2> 		at org.apache.lucene.util.TestRuleAssertionsRequired$1.evaluate(TestRuleAssertionsRequired.java:43)
[junit4:junit4]   2> 		at org.apache.lucene.util.TestRuleMarkFailure$1.evaluate(TestRuleMarkFailure.java:48)
[junit4:junit4]   2> 		at org.apache.lucene.util.TestRuleIgnoreAfterMaxFailures$1.evaluate(TestRuleIgnoreAfterMaxFailures.java:70)
[junit4:junit4]   2> 		at org.apache.lucene.util.TestRuleIgnoreTestSuites$1.evaluate(TestRuleIgnoreTestSuites.java:55)
[junit4:junit4]   2> 		at com.carrotsearch.randomizedtesting.rules.StatementAdapter.evaluate(StatementAdapter.java:36)
[junit4:junit4]   2> 		at com.carrotsearch.randomizedtesting.ThreadLeakControl$StatementRunner.run(ThreadLeakControl.java:358)
[junit4:junit4]   2> 		at java.lang.Thread.run(Thread.java:722)
[junit4:junit4]   2> 	Caused by: org.apache.solr.common.SolrException: No registered leader was found, collection:collection1 slice:shard1
[junit4:junit4]   2> 		at org.apache.solr.common.cloud.ZkStateReader.getLeaderProps(ZkStateReader.java:417)
[junit4:junit4]   2> 		at org.apache.solr.common.cloud.ZkStateReader.getLeaderUrl(ZkStateReader.java:394)
[junit4:junit4]   2> 		at org.apache.solr.cloud.ZkController.getLeader(ZkController.java:644)
[junit4:junit4]   2> 		... 47 more
[junit4:junit4]   2> 	
[junit4:junit4]   2> 93431 T1849 oasc.SolrException.log SEVERE null:org.apache.solr.common.cloud.ZooKeeperException: 
[junit4:junit4]   2> 		at org.apache.solr.core.CoreContainer.registerInZk(CoreContainer.java:731)
[junit4:junit4]   2> 		at org.apache.solr.core.CoreContainer.register(CoreContainer.java:692)
[junit4:junit4]   2> 		at org.apache.solr.core.CoreContainer.load(CoreContainer.java:531)
[junit4:junit4]   2> 		at org.apache.solr.core.CoreContainer.load(CoreContainer.java:351)
[junit4:junit4]   2> 		at org.apache.solr.core.CoreContainer$Initializer.initialize(CoreContainer.java:303)
[junit4:junit4]   2> 		at org.apache.solr.cloud.LeaderElectionIntegrationTest.setupContainer(LeaderElectionIntegrationTest.java:152)
[junit4:junit4]   2> 		at org.apache.solr.cloud.LeaderElectionIntegrationTest.setUp(LeaderElectionIntegrationTest.java:100)
[junit4:junit4]   2> 		at sun.reflect.GeneratedMethodAccessor4.invoke(Unknown Source)
[junit4:junit4]   2> 		at sun.reflect.DelegatingMethodAccessorImpl.invoke(DelegatingMethodAccessorImpl.java:43)
[junit4:junit4]   2> 		at java.lang.reflect.Method.invoke(Method.java:601)
[junit4:junit4]   2> 		at com.carrotsearch.randomizedtesting.RandomizedRunner.invoke(RandomizedRunner.java:1559)
[junit4:junit4]   2> 		at com.carrotsearch.randomizedtesting.RandomizedRunner.access$600(RandomizedRunner.java:79)
[junit4:junit4]   2> 		at com.carrotsearch.randomizedtesting.RandomizedRunner$7.evaluate(RandomizedRunner.java:771)
[junit4:junit4]   2> 		at com.carrotsearch.randomizedtesting.RandomizedRunner$8.evaluate(RandomizedRunner.java:787)
[junit4:junit4]   2> 		at com.carrotsearch.randomizedtesting.rules.SystemPropertiesRestoreRule$1.evaluate(SystemPropertiesRestoreRule.java:53)
[junit4:junit4]   2> 		at org.apache.lucene.util.TestRuleSetupTeardownChained$1.evaluate(TestRuleSetupTeardownChained.java:50)
[junit4:junit4]   2> 		at org.apache.lucene.util.TestRuleFieldCacheSanity$1.evaluate(TestRuleFieldCacheSanity.java:51)
[junit4:junit4]   2> 		at org.apache.lucene.util.AbstractBeforeAfterRule$1.evaluate(AbstractBeforeAfterRule.java:45)
[junit4:junit4]   2> 		at com.carrotsearch.randomizedtesting.rules.SystemPropertiesInvariantRule$1.evaluate(SystemPropertiesInvariantRule.java:55)
[junit4:junit4]   2> 		at org.apache.lucene.util.TestRuleThreadAndTestName$1.evaluate(TestRuleThreadAndTestName.java:48)
[junit4:junit4]   2> 		at org.apache.lucene.util.TestRuleIgnoreAfterMaxFailures$1.evaluate(TestRuleIgnoreAfterMaxFailures.java:70)
[junit4:junit4]   2> 		at org.apache.lucene.util.TestRuleMarkFailure$1.evaluate(TestRuleMarkFailure.java:48)
[junit4:junit4]   2> 		at com.carrotsearch.randomizedtesting.rules.StatementAdapter.evaluate(StatementAdapter.java:36)
[junit4:junit4]   2> 		at com.carrotsearch.randomizedtesting.ThreadLeakControl$StatementRunner.run(ThreadLeakControl.java:358)
[junit4:junit4]   2> 		at com.carrotsearch.randomizedtesting.ThreadLeakControl.forkTimeoutingTask(ThreadLeakControl.java:782)
[junit4:junit4]   2> 		at com.carrotsearch.randomizedtesting.ThreadLeakControl$3.evaluate(ThreadLeakControl.java:442)
[junit4:junit4]   2> 		at com.carrotsearch.randomizedtesting.RandomizedRunner.runSingleTest(RandomizedRunner.java:746)
[junit4:junit4]   2> 		at com.carrotsearch.randomizedtesting.RandomizedRunner$3.evaluate(RandomizedRunner.java:648)
[junit4:junit4]   2> 		at com.carrotsearch.randomizedtesting.RandomizedRunner$4.evaluate(RandomizedRunner.java:682)
[junit4:junit4]   2> 		at com.carrotsearch.randomizedtesting.RandomizedRunner$5.evaluate(RandomizedRunner.java:693)
[junit4:junit4]   2> 		at com.carrotsearch.randomizedtesting.rules.StatementAdapter.evaluate(StatementAdapter.java:36)
[junit4:junit4]   2> 		at com.carrotsearch.randomizedtesting.rules.SystemPropertiesRestoreRule$1.evaluate(SystemPropertiesRestoreRule.java:53)
[junit4:junit4]   2> 		at org.apache.lucene.util.AbstractBeforeAfterRule$1.evaluate(AbstractBeforeAfterRule.java:45)
[junit4:junit4]   2> 		at org.apache.lucene.util.TestRuleStoreClassName$1.evaluate(TestRuleStoreClassName.java:42)
[junit4:junit4]   2> 		at com.carrotsearch.randomizedtesting.rules.SystemPropertiesInvariantRule$1.evaluate(SystemPropertiesInvariantRule.java:55)
[junit4:junit4]   2> 		at com.carrotsearch.randomizedtesting.rules.NoShadowingOrOverridesOnMethodsRule$1.evaluate(NoShadowingOrOverridesOnMethodsRule.java:39)
[junit4:junit4]   2> 		at com.carrotsearch.randomizedtesting.rules.NoShadowingOrOverridesOnMethodsRule$1.evaluate(NoShadowingOrOverridesOnMethodsRule.java:39)
[junit4:junit4]   2> 		at com.carrotsearch.randomizedtesting.rules.StatementAdapter.evaluate(StatementAdapter.java:36)
[junit4:junit4]   2> 		at org.apache.lucene.util.TestRuleAssertionsRequired$1.evaluate(TestRuleAssertionsRequired.java:43)
[junit4:junit4]   2> 		at org.apache.lucene.util.TestRuleMarkFailure$1.evaluate(TestRuleMarkFailure.java:48)
[junit4:junit4]   2> 		at org.apache.lucene.util.TestRuleIgnoreAfterMaxFailures$1.evaluate(TestRuleIgnoreAfterMaxFailures.java:70)
[junit4:junit4]   2> 		at org.apache.lucene.util.TestRuleIgnoreTestSuites$1.evaluate(TestRuleIgnoreTestSuites.java:55)
[junit4:junit4]   2> 		at com.carrotsearch.randomizedtesting.rules.StatementAdapter.evaluate(StatementAdapter.java:36)
[junit4:junit4]   2> 		at com.carrotsearch.randomizedtesting.ThreadLeakControl$StatementRunner.run(ThreadLeakControl.java:358)
[junit4:junit4]   2> 		at java.lang.Thread.run(Thread.java:722)
[junit4:junit4]   2> 	Caused by: org.apache.solr.common.SolrException: Error getting leader from zk
[junit4:junit4]   2> 		at org.apache.solr.cloud.ZkController.getLeader(ZkController.java:664)
[junit4:junit4]   2> 		at org.apache.solr.cloud.ZkController.register(ZkController.java:579)
[junit4:junit4]   2> 		at org.apache.solr.cloud.ZkController.register(ZkController.java:534)
[junit4:junit4]   2> 		at org.apache.solr.core.CoreContainer.registerInZk(CoreContainer.java:708)
[junit4:junit4]   2> 		... 44 more
[junit4:junit4]   2> 	Caused by: org.apache.solr.common.SolrException: No registered leader was found, collection:collection1 slice:shard1
[junit4:junit4]   2> 		at org.apache.solr.common.cloud.ZkStateReader.getLeaderProps(ZkStateReader.java:417)
[junit4:junit4]   2> 		at org.apache.solr.common.cloud.ZkStateReader.getLeaderUrl(ZkStateReader.java:394)
[junit4:junit4]   2> 		at org.apache.solr.cloud.ZkController.getLeader(ZkController.java:644)
[junit4:junit4]   2> 		... 47 more
[junit4:junit4]   2> 	
[junit4:junit4]   2> 93441 T1849 oasc.SolrCore.close [collection1]  CLOSING SolrCore org.apache.solr.core.SolrCore@9f53c7
[junit4:junit4]   2> 93455 T1849 oasu.DirectUpdateHandler2.close closing DirectUpdateHandler2{commits=0,autocommits=0,soft autocommits=0,optimizes=0,rollbacks=0,expungeDeletes=0,docsPending=0,adds=0,deletesById=0,deletesByQuery=0,errors=0,cumulative_adds=0,cumulative_deletesById=0,cumulative_deletesByQuery=0,cumulative_errors=0}
[junit4:junit4]   2> 93456 T1849 oasc.SolrCore.decrefSolrCoreState Closing SolrCoreState
[junit4:junit4]   2> 93456 T1849 oasu.DefaultSolrCoreState.closeIndexWriter SolrCoreState ref count has reached 0 - closing IndexWriter
[junit4:junit4]   2> 93456 T1849 oasu.DefaultSolrCoreState.closeIndexWriter closing IndexWriter with IndexWriterCloser
[junit4:junit4]   2> 93457 T1849 oasc.SolrCore.closeSearcher [collection1] Closing main searcher on request.
[junit4:junit4]   2> 93457 T1849 oasc.CachingDirectoryFactory.close Releasing directory:/mnt/ssd/jenkins/workspace/Lucene-Solr-trunk-Linux/solr/build/solr-core/test/J1/./solrtest-LeaderElectionIntegrationTest-1351599813545/data_7002/index
[junit4:junit4]   2> 93458 T1849 oasc.SolrResourceLoader.locateSolrHome JNDI not configured for solr (NoInitialContextEx)
[junit4:junit4]   2> 93458 T1849 oasc.SolrResourceLoader.locateSolrHome using system property solr.solr.home: /mnt/ssd/jenkins/workspace/Lucene-Solr-trunk-Linux/solr/build/solr-core/test-files/solr
[junit4:junit4]   2> 93459 T1849 oasc.CoreContainer$Initializer.initialize looking for solr.xml: /mnt/ssd/jenkins/workspace/Lucene-Solr-trunk-Linux/solr/build/solr-core/test-files/solr/solr.xml
[junit4:junit4]   2> 93459 T1849 oasc.CoreContainer.<init> New CoreContainer 19168643
[junit4:junit4]   2> 93459 T1849 oasc.CoreContainer.load Loading CoreContainer using Solr Home: '/mnt/ssd/jenkins/workspace/Lucene-Solr-trunk-Linux/solr/build/solr-core/test-files/solr/'
[junit4:junit4]   2> 93460 T1849 oasc.SolrResourceLoader.<init> new SolrResourceLoader for directory: '/mnt/ssd/jenkins/workspace/Lucene-Solr-trunk-Linux/solr/build/solr-core/test-files/solr/'
[junit4:junit4]   2> 93476 T1849 oasc.CoreContainer.load Registering Log Listener
[junit4:junit4]   2> 93485 T1849 oasc.CoreContainer.initZooKeeper Zookeeper client=127.0.0.1:33226/solr
[junit4:junit4]   2> 93485 T1849 oaz.ZooKeeper.<init> Initiating client connection, connectString=127.0.0.1:33226/solr sessionTimeout=3000 watcher=org.apache.solr.common.cloud.ConnectionManager@1faa832
[junit4:junit4]   2> 93486 T1870 oaz.ClientCnxn$SendThread.startConnect Opening socket connection to server /127.0.0.1:33226
[junit4:junit4]   2> 93486 T1849 oascc.ConnectionManager.waitForConnected Waiting for client to connect to ZooKeeper
[junit4:junit4]   2> 93487 T1870 oaz.ClientCnxn$SendThread.primeConnection Socket connection established to localhost.localdomain/127.0.0.1:33226, initiating session
[junit4:junit4]   2> 93487 T1851 oazs.NIOServerCnxn$Factory.run Accepted socket connection from /127.0.0.1:35435
[junit4:junit4]   2> 93487 T1851 oazs.NIOServerCnxn.readConnectRequest Client attempting to establish new session at /127.0.0.1:35435
[junit4:junit4]   2> 93488 T1853 oazs.NIOServerCnxn.finishSessionInit Established session 0x13ab1a073ad0005 with negotiated timeout 3000 for client /127.0.0.1:35435
[junit4:junit4]   2> 93488 T1870 oaz.ClientCnxn$SendThread.readConnectResult Session establishment complete on server localhost.localdomain/127.0.0.1:33226, sessionid = 0x13ab1a073ad0005, negotiated timeout = 3000
[junit4:junit4]   2> 93488 T1871 oascc.ConnectionManager.process Watcher org.apache.solr.common.cloud.ConnectionManager@1faa832 name:ZooKeeperConnection Watcher:127.0.0.1:33226/solr got event WatchedEvent state:SyncConnected type:None path:null path:null type:None
[junit4:junit4]   2> 93488 T1849 oascc.ConnectionManager.waitForConnected Client is connected to ZooKeeper
[junit4:junit4]   2> 93489 T1854 oazs.PrepRequestProcessor.pRequest Got user-level KeeperException when processing sessionid:0x13ab1a073ad0005 type:create cxid:0x1 zxid:0xfffffffffffffffe txntype:unknown reqpath:n/a Error Path:/solr/overseer Error:KeeperErrorCode = NodeExists for /solr/overseer
[junit4:junit4]   2> 93489 T1854 oazs.PrepRequestProcessor.pRequest Got user-level KeeperException when processing sessionid:0x13ab1a073ad0005 type:create cxid:0x2 zxid:0xfffffffffffffffe txntype:unknown reqpath:n/a Error Path:/solr/overseer Error:KeeperErrorCode = NodeExists for /solr/overseer
[junit4:junit4]   2> 93490 T1849 oasc.ZkController.createEphemeralLiveNode Register node as live in ZooKeeper:/live_nodes/127.0.0.1:7003_solr
[junit4:junit4]   2> 93490 T1854 oazs.PrepRequestProcessor.pRequest Got user-level KeeperException when processing sessionid:0x13ab1a073ad0005 type:delete cxid:0x4 zxid:0xfffffffffffffffe txntype:unknown reqpath:n/a Error Path:/solr/live_nodes/127.0.0.1:7003_solr Error:KeeperErrorCode = NoNode for /solr/live_nodes/127.0.0.1:7003_solr
[junit4:junit4]   2> 93491 T1849 oascc.SolrZkClient.makePath makePath: /live_nodes/127.0.0.1:7003_solr
[junit4:junit4]   2> 93492 T1860 oascc.ZkStateReader$2.process A cluster state change has occurred - updating... (3)
[junit4:junit4]   2> 93492 T1865 oascc.ZkStateReader$3.process Updating live nodes... (4)
[junit4:junit4]   2> 93492 T1868 oascc.ZkStateReader$3.process Updating live nodes... (4)
[junit4:junit4]   2> 93492 T1860 oascc.ZkStateReader$3.process Updating live nodes... (4)
[junit4:junit4]   2> 93492 T1849 oashc.HttpShardHandlerFactory.getParameter Setting socketTimeout to: 0
[junit4:junit4]   2> 93493 T1849 oashc.HttpShardHandlerFactory.getParameter Setting urlScheme to: http://
[junit4:junit4]   2> 93493 T1849 oashc.HttpShardHandlerFactory.getParameter Setting connTimeout to: 0
[junit4:junit4]   2> 93494 T1849 oashc.HttpShardHandlerFactory.getParameter Setting maxConnectionsPerHost to: 20
[junit4:junit4]   2> 93494 T1849 oashc.HttpShardHandlerFactory.getParameter Setting corePoolSize to: 0
[junit4:junit4]   2> 93494 T1849 oashc.HttpShardHandlerFactory.getParameter Setting maximumPoolSize to: 2147483647
[junit4:junit4]   2> 93495 T1849 oashc.HttpShardHandlerFactory.getParameter Setting maxThreadIdleTime to: 5
[junit4:junit4]   2> 93495 T1849 oashc.HttpShardHandlerFactory.getParameter Setting sizeOfQueue to: -1
[junit4:junit4]   2> 93495 T1849 oashc.HttpShardHandlerFactory.getParameter Setting fairnessPolicy to: false
[junit4:junit4]   2> 93496 T1849 oascsi.HttpClientUtil.createClient Creating new http client, config:maxConnectionsPerHost=20&maxConnections=10000&socketTimeout=0&connTimeout=0&retry=false
[junit4:junit4]   2> 93500 T1849 oascc.ZkStateReader.createClusterStateWatchersAndUpdate Updating cluster state from ZooKeeper... 
[junit4:junit4]   2> 93505 T1849 oasc.CoreContainer.create Creating SolrCore 'collection1' using instanceDir: /mnt/ssd/jenkins/workspace/Lucene-Solr-trunk-Linux/solr/build/solr-core/test-files/solr/collection1
[junit4:junit4]   2> 93505 T1849 oasc.ZkController.createCollectionZkNode Check for collection zkNode:collection1
[junit4:junit4]   2> 93506 T1849 oasc.ZkController.createCollectionZkNode Collection zkNode exists
[junit4:junit4]   2> 93506 T1849 oasc.ZkController.readConfigName Load collection config from:/collections/collection1
[junit4:junit4]   2> 93507 T1849 oasc.SolrResourceLoader.<init> new SolrResourceLoader for directory: '/mnt/ssd/jenkins/workspace/Lucene-Solr-trunk-Linux/solr/build/solr-core/test-files/solr/collection1/'
[junit4:junit4]   2> 93507 T1849 oasc.SolrResourceLoader.replaceClassLoader Adding 'file:/mnt/ssd/jenkins/workspace/Lucene-Solr-trunk-Linux/solr/build/solr-core/test-files/solr/collection1/lib/README' to classloader
[junit4:junit4]   2> 93508 T1849 oasc.SolrResourceLoader.replaceClassLoader Adding 'file:/mnt/ssd/jenkins/workspace/Lucene-Solr-trunk-Linux/solr/build/solr-core/test-files/solr/collection1/lib/classes/' to classloader
[junit4:junit4]   2> 93548 T1849 oasc.SolrConfig.<init> Using Lucene MatchVersion: LUCENE_50
[junit4:junit4]   2> 93599 T1849 oasc.SolrConfig.<init> Loaded SolrConfig: solrconfig.xml
[junit4:junit4]   2> 93600 T1849 oass.IndexSchema.readSchema Reading Solr Schema
[junit4:junit4]   2> 93604 T1849 oass.IndexSchema.readSchema Schema name=test
[junit4:junit4]   2> 94087 T1849 oass.OpenExchangeRatesOrgProvider.init Initialized with rates=open-exchange-rates.json, refreshInterval=1440.
[junit4:junit4]   2> 94094 T1849 oass.IndexSchema.readSchema default search field in schema is text
[junit4:junit4]   2> 94109 T1849 oass.IndexSchema.readSchema unique key field: id
[junit4:junit4]   2> 94117 T1849 oass.FileExchangeRateProvider.reload Reloading exchange rates from file currency.xml
[junit4:junit4]   2> 94120 T1849 oass.FileExchangeRateProvider.reload Reloading exchange rates from file currency.xml
[junit4:junit4]   2> 94123 T1849 oass.OpenExchangeRatesOrgProvider.reload Reloading exchange rates from open-exchange-rates.json
[junit4:junit4]   2> 94124 T1849 oass.OpenExchangeRatesOrgProvider.reload Reloading exchange rates from open-exchange-rates.json
[junit4:junit4]   2> 94124 T1849 oasc.SolrCore.<init> [collection1] Opening new SolrCore at /mnt/ssd/jenkins/workspace/Lucene-Solr-trunk-Linux/solr/build/solr-core/test-files/solr/collection1/, dataDir=/mnt/ssd/jenkins/workspace/Lucene-Solr-trunk-Linux/solr/build/solr-core/test/J1/./solrtest-LeaderElectionIntegrationTest-1351599813545/data_7003/
[junit4:junit4]   2> 94125 T1849 oasc.JmxMonitoredMap.<init> JMX monitoring is enabled. Adding Solr mbeans to JMX Server: com.sun.jmx.mbeanserver.JmxMBeanServer@151dc28
[junit4:junit4]   2> 94125 T1849 oasc.SolrCore.initDirectoryFactory org.apache.solr.core.MockDirectoryFactory
[junit4:junit4]   2> 94126 T1849 oasc.CachingDirectoryFactory.injectLockFactory WARNING No lockType configured for MockDirWrapper(org.apache.lucene.store.RAMDirectory@19c8593 lockFactory=org.apache.lucene.store.SingleInstanceLockFactory@105a0c7) assuming 'simple'
[junit4:junit4]   2> 94126 T1849 oasc.CachingDirectoryFactory.get return new directory for /mnt/ssd/jenkins/workspace/Lucene-Solr-trunk-Linux/solr/build/solr-core/test/J1/./solrtest-LeaderElectionIntegrationTest-1351599813545/data_7003 forceNew:false
[junit4:junit4]   2> 94127 T1849 oasc.CachingDirectoryFactory.close Releasing directory:/mnt/ssd/jenkins/workspace/Lucene-Solr-trunk-Linux/solr/build/solr-core/test/J1/./solrtest-LeaderElectionIntegrationTest-1351599813545/data_7003
[junit4:junit4]   2> 94127 T1849 oasc.SolrCore.getNewIndexDir New index directory detected: old=null new=/mnt/ssd/jenkins/workspace/Lucene-Solr-trunk-Linux/solr/build/solr-core/test/J1/./solrtest-LeaderElectionIntegrationTest-1351599813545/data_7003/index/
[junit4:junit4]   2> 94127 T1849 oasc.SolrCore.initIndex WARNING [collection1] Solr index directory '/mnt/ssd/jenkins/workspace/Lucene-Solr-trunk-Linux/solr/build/solr-core/test/J1/./solrtest-LeaderElectionIntegrationTest-1351599813545/data_7003/index' doesn't exist. Creating new index...
[junit4:junit4]   2> 94128 T1849 oasc.CachingDirectoryFactory.get return new directory for /mnt/ssd/jenkins/workspace/Lucene-Solr-trunk-Linux/solr/build/solr-core/test/J1/./solrtest-LeaderElectionIntegrationTest-1351599813545/data_7003/index forceNew:false
[junit4:junit4]   2> 94129 T1849 oasc.SolrDeletionPolicy.onCommit SolrDeletionPolicy.onCommit: commits:num=1
[junit4:junit4]   2> 		commit{dir=BaseDirectoryWrapper(org.apache.lucene.store.RAMDirectory@138fdeb lockFactory=org.apache.lucene.store.NativeFSLockFactory@1c8404f),segFN=segments_1,generation=1,filenames=[segments_1]
[junit4:junit4]   2> 94129 T1849 oasc.SolrDeletionPolicy.updateCommits newest commit = 1[segments_1]
[junit4:junit4]   2> 94130 T1849 oasc.CachingDirectoryFactory.close Releasing directory:/mnt/ssd/jenkins/workspace/Lucene-Solr-trunk-Linux/solr/build/solr-core/test/J1/./solrtest-LeaderElectionIntegrationTest-1351599813545/data_7003/index
[junit4:junit4]   2> 94130 T1849 oasc.SolrCore.initWriters created xml: solr.XMLResponseWriter
[junit4:junit4]   2> 94131 T1849 oasup.UpdateRequestProcessorChain.init inserting DistributedUpdateProcessorFactory into updateRequestProcessorChain "dedupe"
[junit4:junit4]   2> 94132 T1849 oasup.UpdateRequestProcessorChain.init inserting DistributedUpdateProcessorFactory into updateRequestProcessorChain "dedupe-allfields"
[junit4:junit4]   2> 94132 T1849 oasup.UpdateRequestProcessorChain.init inserting DistributedUpdateProcessorFactory into updateRequestProcessorChain "stored_sig"
[junit4:junit4]   2> 94133 T1849 oasup.UpdateRequestProcessorChain.init inserting DistributedUpdateProcessorFactory into updateRequestProcessorChain "uniq-fields"
[junit4:junit4]   2> 94133 T1849 oasup.UpdateRequestProcessorChain.init inserting DistributedUpdateProcessorFactory into updateRequestProcessorChain "distrib-dup-test-chain-implicit"
[junit4:junit4]   2> 94133 T1849 oasc.RequestHandlers.initHandlersFromConfig adding lazy requestHandler: solr.ReplicationHandler
[junit4:junit4]   2> 94134 T1849 oasc.RequestHandlers.initHandlersFromConfig created /replication: solr.ReplicationHandler
[junit4:junit4]   2> 94135 T1849 oasc.RequestHandlers.initHandlersFromConfig created standard: solr.StandardRequestHandler
[junit4:junit4]   2> 94135 T1849 oasc.RequestHandlers.initHandlersFromConfig created /get: solr.RealTimeGetHandler
[junit4:junit4]   2> 94136 T1849 oasc.RequestHandlers.initHandlersFromConfig created dismax: solr.SearchHandler
[junit4:junit4]   2> 94137 T1849 oasc.RequestHandlers.initHandlersFromConfig created mock: org.apache.solr.core.MockQuerySenderListenerReqHandler
[junit4:junit4]   2> 94137 T1849 oasc.RequestHandlers.initHandlersFromConfig created /admin/: org.apache.solr.handler.admin.AdminHandlers
[junit4:junit4]   2> 94138 T1849 oasc.RequestHandlers.initHandlersFromConfig created defaults: solr.StandardRequestHandler
[junit4:junit4]   2> 94138 T1849 oasc.RequestHandlers.initHandlersFromConfig adding lazy requestHandler: solr.StandardRequestHandler
[junit4:junit4]   2> 94139 T1849 oasc.RequestHandlers.initHandlersFromConfig created lazy: solr.StandardRequestHandler
[junit4:junit4]   2> 94140 T1849 oasc.RequestHandlers.initHandlersFromConfig created /update: solr.UpdateRequestHandler
[junit4:junit4]   2> 94140 T1849 oasc.RequestHandlers.initHandlersFromConfig created /terms: org.apache.solr.handler.component.SearchHandler
[junit4:junit4]   2> 94141 T1849 oasc.RequestHandlers.initHandlersFromConfig created spellCheckCompRH: org.apache.solr.handler.component.SearchHandler
[junit4:junit4]   2> 94142 T1849 oasc.RequestHandlers.initHandlersFromConfig created spellCheckCompRH_Direct: org.apache.solr.handler.component.SearchHandler
[junit4:junit4]   2> 94142 T1849 oasc.RequestHandlers.initHandlersFromConfig created spellCheckWithWordbreak: org.apache.solr.handler.component.SearchHandler
[junit4:junit4]   2> 94143 T1849 oasc.RequestHandlers.initHandlersFromConfig created spellCheckWithWordbreak_Direct: org.apache.solr.handler.component.SearchHandler
[junit4:junit4]   2> 94144 T1849 oasc.RequestHandlers.initHandlersFromConfig created spellCheckCompRH1: org.apache.solr.handler.component.SearchHandler
[junit4:junit4]   2> 94145 T1849 oasc.RequestHandlers.initHandlersFromConfig created tvrh: org.apache.solr.handler.component.SearchHandler
[junit4:junit4]   2> 94145 T1849 oasc.RequestHandlers.initHandlersFromConfig created /mlt: solr.MoreLikeThisHandler
[junit4:junit4]   2> 94146 T1849 oasc.RequestHandlers.initHandlersFromConfig created /debug/dump: solr.DumpRequestHandler
[junit4:junit4]   2> 94149 T1849 oashl.XMLLoader.init xsltCacheLifetimeSeconds=60
[junit4:junit4]   2> 94150 T1849 oasc.SolrCore.initDeprecatedSupport WARNING solrconfig.xml uses deprecated <admin/gettableFiles>, Please update your config to use the ShowFileRequestHandler.
[junit4:junit4]   2> 94152 T1849 oasc.SolrCore.initDeprecatedSupport WARNING adding ShowFileRequestHandler with hidden files: [SCHEMA.XML, OLD_SYNONYMS.TXT, STOPWORDS.TXT, PROTWORDS.TXT, OPEN-EXCHANGE-RATES.JSON, SYNONYMS.TXT, CURRENCY.XML, MAPPING-ISOLATIN1ACCENT.TXT]
[junit4:junit4]   2> 94153 T1849 oasc.CachingDirectoryFactory.close Releasing directory:/mnt/ssd/jenkins/workspace/Lucene-Solr-trunk-Linux/solr/build/solr-core/test/J1/./solrtest-LeaderElectionIntegrationTest-1351599813545/data_7003
[junit4:junit4]   2> 94153 T1849 oass.SolrIndexSearcher.<init> Opening Searcher@12dca2 main
[junit4:junit4]   2> 94154 T1849 oasu.CommitTracker.<init> Hard AutoCommit: disabled
[junit4:junit4]   2> 94154 T1849 oasu.CommitTracker.<init> Soft AutoCommit: disabled
[junit4:junit4]   2> 94155 T1849 oashc.SpellCheckComponent.inform Initializing spell checkers
[junit4:junit4]   2> 94158 T1849 oass.DirectSolrSpellChecker.init init: {name=direct,classname=DirectSolrSpellChecker,field=lowerfilt,minQueryLength=3}
[junit4:junit4]   2> 94179 T1872 oasc.SolrCore.registerSearcher [collection1] Registered new searcher Searcher@12dca2 main{StandardDirectoryReader(segments_1:1)}
[junit4:junit4]   2> 94182 T1849 oasc.ZkController.publish numShards not found on descriptor - reading it from system property
[junit4:junit4]   2> 94183 T1849 oasc.CoreContainer.register registering core: collection1
[junit4:junit4]   2> 94184 T1849 oasc.ZkController.register Register shard - core:collection1 address:http://127.0.0.1:7003/solr shardId:shard1
[junit4:junit4]   2> 124235 T1849 oasc.ZkController.getLeader SEVERE Error getting leader from zk org.apache.solr.common.SolrException: No registered leader was found, collection:collection1 slice:shard1
[junit4:junit4]   2> 	at org.apache.solr.common.cloud.ZkStateReader.getLeaderProps(ZkStateReader.java:417)
[junit4:junit4]   2> 	at org.apache.solr.common.cloud.ZkStateReader.getLeaderUrl(ZkStateReader.java:394)
[junit4:junit4]   2> 	at org.apache.solr.cloud.ZkController.getLeader(ZkController.java:644)
[junit4:junit4]   2> 	at org.apache.solr.cloud.ZkController.register(ZkController.java:579)
[junit4:junit4]   2> 	at org.apache.solr.cloud.ZkController.register(ZkController.java:534)
[junit4:junit4]   2> 	at org.apache.solr.core.CoreContainer.registerInZk(CoreContainer.java:708)
[junit4:junit4]   2> 	at org.apache.solr.core.CoreContainer.register(CoreContainer.java:692)
[junit4:junit4]   2> 	at org.apache.solr.core.CoreContainer.load(CoreContainer.java:531)
[junit4:junit4]   2> 	at org.apache.solr.core.CoreContainer.load(CoreContainer.java:351)
[junit4:junit4]   2> 	at org.apache.solr.core.CoreContainer$Initializer.initialize(CoreContainer.java:303)
[junit4:junit4]   2> 	at org.apache.solr.cloud.LeaderElectionIntegrationTest.setupContainer(LeaderElectionIntegrationTest.java:152)
[junit4:junit4]   2> 	at org.apache.solr.cloud.LeaderElectionIntegrationTest.setUp(LeaderElectionIntegrationTest.java:100)
[junit4:junit4]   2> 	at sun.reflect.GeneratedMethodAccessor4.invoke(Unknown Source)
[junit4:junit4]   2> 	at sun.reflect.DelegatingMethodAccessorImpl.invoke(DelegatingMethodAccessorImpl.java:43)
[junit4:junit4]   2> 	at java.lang.reflect.Method.invoke(Method.java:601)
[junit4:junit4]   2> 	at com.carrotsearch.randomizedtesting.RandomizedRunner.invoke(RandomizedRunner.java:1559)
[junit4:junit4]   2> 	at com.carrotsearch.randomizedtesting.RandomizedRunner.access$600(RandomizedRunner.java:79)
[junit4:junit4]   2> 	at com.carrotsearch.randomizedtesting.RandomizedRunner$7.evaluate(RandomizedRunner.java:771)
[junit4:junit4]   2> 	at com.carrotsearch.randomizedtesting.RandomizedRunner$8.evaluate(RandomizedRunner.java:787)
[junit4:junit4]   2> 	at com.carrotsearch.randomizedtesting.rules.SystemPropertiesRestoreRule$1.evaluate(SystemPropertiesRestoreRule.java:53)
[junit4:junit4]   2> 	at org.apache.lucene.util.TestRuleSetupTeardownChained$1.evaluate(TestRuleSetupTeardownChained.java:50)
[junit4:junit4]   2> 	at org.apache.lucene.util.TestRuleFieldCacheSanity$1.evaluate(TestRuleFieldCacheSanity.java:51)
[junit4:junit4]   2> 	at org.apache.lucene.util.AbstractBeforeAfterRule$1.evaluate(AbstractBeforeAfterRule.java:45)
[junit4:junit4]   2> 	at com.carrotsearch.randomizedtesting.rules.SystemPropertiesInvariantRule$1.evaluate(SystemPropertiesInvariantRule.java:55)
[junit4:junit4]   2> 	at org.apache.lucene.util.TestRuleThreadAndTestName$1.evaluate(TestRuleThreadAndTestName.java:48)
[junit4:junit4]   2> 	at org.apache.lucene.util.TestRuleIgnoreAfterMaxFailures$1.evaluate(TestRuleIgnoreAfterMaxFailures.java:70)
[junit4:junit4]   2> 	at org.apache.lucene.util.TestRuleMarkFailure$1.evaluate(TestRuleMarkFailure.java:48)
[junit4:junit4]   2> 	at com.carrotsearch.randomizedtesting.rules.StatementAdapter.evaluate(StatementAdapter.java:36)
[junit4:junit4]   2> 	at com.carrotsearch.randomizedtesting.ThreadLeakControl$StatementRunner.run(ThreadLeakControl.java:358)
[junit4:junit4]   2> 	at com.carrotsearch.randomizedtesting.ThreadLeakControl.forkTimeoutingTask(ThreadLeakControl.java:782)
[junit4:junit4]   2> 	at com.carrotsearch.randomizedtesting.ThreadLeakControl$3.evaluate(ThreadLeakControl.java:442)
[junit4:junit4]   2> 	at com.carrotsearch.randomizedtesting.RandomizedRunner.runSingleTest(RandomizedRunner.java:746)
[junit4:junit4]   2> 	at com.carrotsearch.randomizedtesting.RandomizedRunner$3.evaluate(RandomizedRunner.java:648)
[junit4:junit4]   2> 	at com.carrotsearch.randomizedtesting.RandomizedRunner$4.evaluate(RandomizedRunner.java:682)
[junit4:junit4]   2> 	at com.carrotsearch.randomizedtesting.RandomizedRunner$5.evaluate(RandomizedRunner.java:693)
[junit4:junit4]   2> 	at com.carrotsearch.randomizedtesting.rules.StatementAdapter.evaluate(StatementAdapter.java:36)
[junit4:junit4]   2> 	at com.carrotsearch.randomizedtesting.rules.SystemPropertiesRestoreRule$1.evaluate(SystemPropertiesRestoreRule.java:53)
[junit4:junit4]   2> 	at org.apache.lucene.util.AbstractBeforeAfterRule$1.evaluate(AbstractBeforeAfterRule.java:45)
[junit4:junit4]   2> 	at org.apache.lucene.util.TestRuleStoreClassName$1.evaluate(TestRuleStoreClassName.java:42)
[junit4:junit4]   2> 	at com.carrotsearch.randomizedtesting.rules.SystemPropertiesInvariantRule$1.evaluate(SystemPropertiesInvariantRule.java:55)
[junit4:junit4]   2> 	at com.carrotsearch.randomizedtesting.rules.NoShadowingOrOverridesOnMethodsRule$1.evaluate(NoShadowingOrOverridesOnMethodsRule.java:39)
[junit4:junit4]   2> 	at com.carrotsearch.randomizedtesting.rules.NoShadowingOrOverridesOnMethodsRule$1.evaluate(NoShadowingOrOverridesOnMethodsRule.java:39)
[junit4:junit4]   2> 	at com.carrotsearch.randomizedtesting.rules.StatementAdapter.evaluate(StatementAdapter.java:36)
[junit4:junit4]   2> 	at org.apache.lucene.util.TestRuleAssertionsRequired$1.evaluate(TestRuleAssertionsRequired.java:43)
[junit4:junit4]   2> 	at org.apache.lucene.util.TestRuleMarkFailure$1.evaluate(TestRuleMarkFailure.java:48)
[junit4:junit4]   2> 	at org.apache.lucene.util.TestRuleIgnoreAfterMaxFailures$1.evaluate(TestRuleIgnoreAfterMaxFailures.java:70)
[junit4:junit4]   2> 	at org.apache.lucene.util.TestRuleIgnoreTestSuites$1.evaluate(TestRuleIgnoreTestSuites.java:55)
[junit4:junit4]   2> 	at com.carrotsearch.randomizedtesting.rules.StatementAdapter.evaluate(StatementAdapter.java:36)
[junit4:junit4]   2> 	at com.carrotsearch.randomizedtesting.ThreadLeakControl$StatementRunner.run(ThreadLeakControl.java:358)
[junit4:junit4]   2> 	at java.lang.Thread.run(Thread.java:722)
[junit4:junit4]   2> 
[junit4:junit4]   2> 124236 T1849 oasc.ZkController.publish numShards not found on descriptor - reading it from system property
[junit4:junit4]   2> 124237 T1849 oasc.SolrException.log SEVERE :org.apache.solr.common.SolrException: Error getting leader from zk
[junit4:junit4]   2> 		at org.apache.solr.cloud.ZkController.getLeader(ZkController.java:664)
[junit4:junit4]   2> 		at org.apache.solr.cloud.ZkController.register(ZkController.java:579)
[junit4:junit4]   2> 		at org.apache.solr.cloud.ZkController.register(ZkController.java:534)
[junit4:junit4]   2> 		at org.apache.solr.core.CoreContainer.registerInZk(CoreContainer.java:708)
[junit4:junit4]   2> 		at org.apache.solr.core.CoreContainer.register(CoreContainer.java:692)
[junit4:junit4]   2> 		at org.apache.solr.core.CoreContainer.load(CoreContainer.java:531)
[junit4:junit4]   2> 		at org.apache.solr.core.CoreContainer.load(CoreContainer.java:351)
[junit4:junit4]   2> 		at org.apache.solr.core.CoreContainer$Initializer.initialize(CoreContainer.java:303)
[junit4:junit4]   2> 		at org.apache.solr.cloud.LeaderElectionIntegrationTest.setupContainer(LeaderElectionIntegrationTest.java:152)
[junit4:junit4]   2> 		at org.apache.solr.cloud.LeaderElectionIntegrationTest.setUp(LeaderElectionIntegrationTest.java:100)
[junit4:junit4]   2> 		at sun.reflect.GeneratedMethodAccessor4.invoke(Unknown Source)
[junit4:junit4]   2> 		at sun.reflect.DelegatingMethodAccessorImpl.invoke(DelegatingMethodAccessorImpl.java:43)
[junit4:junit4]   2> 		at java.lang.reflect.Method.invoke(Method.java:601)
[junit4:junit4]   2> 		at com.carrotsearch.randomizedtesting.RandomizedRunner.invoke(RandomizedRunner.java:1559)
[junit4:junit4]   2> 		at com.carrotsearch.randomizedtesting.RandomizedRunner.access$600(RandomizedRunner.java:79)
[junit4:junit4]   2> 		at com.carrotsearch.randomizedtesting.RandomizedRunner$7.evaluate(RandomizedRunner.java:771)
[junit4:junit4]   2> 		at com.carrotsearch.randomizedtesting.RandomizedRunner$8.evaluate(RandomizedRunner.java:787)
[junit4:junit4]   2> 		at com.carrotsearch.randomizedtesting.rules.SystemPropertiesRestoreRule$1.evaluate(SystemPropertiesRestoreRule.java:53)
[junit4:junit4]   2> 		at org.apache.lucene.util.TestRuleSetupTeardownChained$1.evaluate(TestRuleSetupTeardownChained.java:50)
[junit4:junit4]   2> 		at org.apache.lucene.util.TestRuleFieldCacheSanity$1.evaluate(TestRuleFieldCacheSanity.java:51)
[junit4:junit4]   2> 		at org.apache.lucene.util.AbstractBeforeAfterRule$1.evaluate(AbstractBeforeAfterRule.java:45)
[junit4:junit4]   2> 		at com.carrotsearch.randomizedtesting.rules.SystemPropertiesInvariantRule$1.evaluate(SystemPropertiesInvariantRule.java:55)
[junit4:junit4]   2> 		at org.apache.lucene.util.TestRuleThreadAndTestName$1.evaluate(TestRuleThreadAndTestName.java:48)
[junit4:junit4]   2> 		at org.apache.lucene.util.TestRuleIgnoreAfterMaxFailures$1.evaluate(TestRuleIgnoreAfterMaxFailures.java:70)
[junit4:junit4]   2> 		at org.apache.lucene.util.TestRuleMarkFailure$1.evaluate(TestRuleMarkFailure.java:48)
[junit4:junit4]   2> 		at com.carrotsearch.randomizedtesting.rules.StatementAdapter.evaluate(StatementAdapter.java:36)
[junit4:junit4]   2> 		at com.carrotsearch.randomizedtesting.ThreadLeakControl$StatementRunner.run(ThreadLeakControl.java:358)
[junit4:junit4]   2> 		at com.carrotsearch.randomizedtesting.ThreadLeakControl.forkTimeoutingTask(ThreadLeakControl.java:782)
[junit4:junit4]   2> 		at com.carrotsearch.randomizedtesting.ThreadLeakControl$3.evaluate(ThreadLeakControl.java:442)
[junit4:junit4]   2> 		at com.carrotsearch.randomizedtesting.RandomizedRunner.runSingleTest(RandomizedRunner.java:746)
[junit4:junit4]   2> 		at com.carrotsearch.randomizedtesting.RandomizedRunner$3.evaluate(RandomizedRunner.java:648)
[junit4:junit4]   2> 		at com.carrotsearch.randomizedtesting.RandomizedRunner$4.evaluate(RandomizedRunner.java:682)
[junit4:junit4]   2> 		at com.carrotsearch.randomizedtesting.RandomizedRunner$5.evaluate(RandomizedRunner.java:693)
[junit4:junit4]   2> 		at com.carrotsearch.randomizedtesting.rules.StatementAdapter.evaluate(StatementAdapter.java:36)
[junit4:junit4]   2> 		at com.carrotsearch.randomizedtesting.rules.SystemPropertiesRestoreRule$1.evaluate(SystemPropertiesRestoreRule.java:53)
[junit4:junit4]   2> 		at org.apache.lucene.util.AbstractBeforeAfterRule$1.evaluate(AbstractBeforeAfterRule.java:45)
[junit4:junit4]   2> 		at org.apache.lucene.util.TestRuleStoreClassName$1.evaluate(TestRuleStoreClassName.java:42)
[junit4:junit4]   2> 		at com.carrotsearch.randomizedtesting.rules.SystemPropertiesInvariantRule$1.evaluate(SystemPropertiesInvariantRule.java:55)
[junit4:junit4]   2> 		at com.carrotsearch.randomizedtesting.rules.NoShadowingOrOverridesOnMethodsRule$1.evaluate(NoShadowingOrOverridesOnMethodsRule.java:39)
[junit4:junit4]   2> 		at com.carrotsearch.randomizedtesting.rules.NoShadowingOrOverridesOnMethodsRule$1.evaluate(NoShadowingOrOverridesOnMethodsRule.java:39)
[junit4:junit4]   2> 		at com.carrotsearch.randomizedtesting.rules.StatementAdapter.evaluate(StatementAdapter.java:36)
[junit4:junit4]   2> 		at org.apache.lucene.util.TestRuleAssertionsRequired$1.evaluate(TestRuleAssertionsRequired.java:43)
[junit4:junit4]   2> 		at org.apache.lucene.util.TestRuleMarkFailure$1.evaluate(TestRuleMarkFailure.java:48)
[junit4:junit4]   2> 		at org.apache.lucene.util.TestRuleIgnoreAfterMaxFailures$1.evaluate(TestRuleIgnoreAfterMaxFailures.java:70)
[junit4:junit4]   2> 		at org.apache.lucene.util.TestRuleIgnoreTestSuites$1.evaluate(TestRuleIgnoreTestSuites.java:55)
[junit4:junit4]   2> 		at com.carrotsearch.randomizedtesting.rules.StatementAdapter.evaluate(StatementAdapter.java:36)
[junit4:junit4]   2> 		at com.carrotsearch.randomizedtesting.ThreadLeakControl$StatementRunner.run(ThreadLeakControl.java:358)
[junit4:junit4]   2> 		at java.lang.Thread.run(Thread.java:722)
[junit4:junit4]   2> 	Caused by: org.apache.solr.common.SolrException: No registered leader was found, collection:collection1 slice:shard1
[junit4:junit4]   2> 		at org.apache.solr.common.cloud.ZkStateReader.getLeaderProps(ZkStateReader.java:417)
[junit4:junit4]   2> 		at org.apache.solr.common.cloud.ZkStateReader.getLeaderUrl(ZkStateReader.java:394)
[junit4:junit4]   2> 		at org.apache.solr.cloud.ZkController.getLeader(ZkController.java:644)
[junit4:junit4]   2> 		... 47 more
[junit4:junit4]   2> 	
[junit4:junit4]   2> 124239 T1849 oasc.SolrException.log SEVERE null:org.apache.solr.common.cloud.ZooKeeperException: 
[junit4:junit4]   2> 		at org.apache.solr.core.CoreContainer.registerInZk(CoreContainer.java:731)
[junit4:junit4]   2> 		at org.apache.solr.core.CoreContainer.register(CoreContainer.java:692)
[junit4:junit4]   2> 		at org.apache.solr.core.CoreContainer.load(CoreContainer.java:531)
[junit4:junit4]   2> 		at org.apache.solr.core.CoreContainer.load(CoreContainer.java:351)
[junit4:junit4]   2> 		at org.apache.solr.core.CoreContainer$Initializer.initialize(CoreContainer.java:303)
[junit4:junit4]   2> 		at org.apache.solr.cloud.LeaderElectionIntegrationTest.setupContainer(LeaderElectionIntegrationTest.java:152)
[junit4:junit4]   2> 		at org.apache.solr.cloud.LeaderElectionIntegrationTest.setUp(LeaderElectionIntegrationTest.java:100)
[junit4:junit4]   2> 		at sun.reflect.GeneratedMethodAccessor4.invoke(Unknown Source)
[junit4:junit4]   2> 		at sun.reflect.DelegatingMethodAccessorImpl.invoke(DelegatingMethodAccessorImpl.java:43)
[junit4:junit4]   2> 		at java.lang.reflect.Method.invoke(Method.java:601)
[junit4:junit4]   2> 		at com.carrotsearch.randomizedtesting.RandomizedRunner.invoke(RandomizedRunner.java:1559)
[junit4:junit4]   2> 		at com.carrotsearch.randomizedtesting.RandomizedRunner.access$600(RandomizedRunner.java:79)
[junit4:junit4]   2> 		at com.carrotsearch.randomizedtesting.RandomizedRunner$7.evaluate(RandomizedRunner.java:771)
[junit4:junit4]   2> 		at com.carrotsearch.randomizedtesting.RandomizedRunner$8.evaluate(RandomizedRunner.java:787)
[junit4:junit4]   2> 		at com.carrotsearch.randomizedtesting.rules.SystemPropertiesRestoreRule$1.evaluate(SystemPropertiesRestoreRule.java:53)
[junit4:junit4]   2> 		at org.apache.lucene.util.TestRuleSetupTeardownChained$1.evaluate(TestRuleSetupTeardownChained.java:50)
[junit4:junit4]   2> 		at org.apache.lucene.util.TestRuleFieldCacheSanity$1.evaluate(TestRuleFieldCacheSanity.java:51)
[junit4:junit4]   2> 		at org.apache.lucene.util.AbstractBeforeAfterRule$1.evaluate(AbstractBeforeAfterRule.java:45)
[junit4:junit4]   2> 		at com.carrotsearch.randomizedtesting.rules.SystemPropertiesInvariantRule$1.evaluate(SystemPropertiesInvariantRule.java:55)
[junit4:junit4]   2> 		at org.apache.lucene.util.TestRuleThreadAndTestName$1.evaluate(TestRuleThreadAndTestName.java:48)
[junit4:junit4]   2> 		at org.apache.lucene.util.TestRuleIgnoreAfterMaxFailures$1.evaluate(TestRuleIgnoreAfterMaxFailures.java:70)
[junit4:junit4]   2> 		at org.apache.lucene.util.TestRuleMarkFailure$1.evaluate(TestRuleMarkFailure.java:48)
[junit4:junit4]   2> 		at com.carrotsearch.randomizedtesting.rules.StatementAdapter.evaluate(StatementAdapter.java:36)
[junit4:junit4]   2> 		at com.carrotsearch.randomizedtesting.ThreadLeakControl$StatementRunner.run(ThreadLeakControl.java:358)
[junit4:junit4]   2> 		at com.carrotsearch.randomizedtesting.ThreadLeakControl.forkTimeoutingTask(ThreadLeakControl.java:782)
[junit4:junit4]   2> 		at com.carrotsearch.randomizedtesting.ThreadLeakControl$3.evaluate(ThreadLeakControl.java:442)
[junit4:junit4]   2> 		at com.carrotsearch.randomizedtesting.RandomizedRunner.runSingleTest(RandomizedRunner.java:746)
[junit4:junit4]   2> 		at com.carrotsearch.randomizedtesting.RandomizedRunner$3.evaluate(RandomizedRunner.java:648)
[junit4:junit4]   2> 		at com.carrotsearch.randomizedtesting.RandomizedRunner$4.evaluate(RandomizedRunner.java:682)
[junit4:junit4]   2> 		at com.carrotsearch.randomizedtesting.RandomizedRunner$5.evaluate(RandomizedRunner.java:693)
[junit4:junit4]   2> 		at com.carrotsearch.randomizedtesting.rules.StatementAdapter.evaluate(StatementAdapter.java:36)
[junit4:junit4]   2> 		at com.carrotsearch.randomizedtesting.rules.SystemPropertiesRestoreRule$1.evaluate(SystemPropertiesRestoreRule.java:53)
[junit4:junit4]   2> 		at org.apache.lucene.util.AbstractBeforeAfterRule$1.evaluate(AbstractBeforeAfterRule.java:45)
[junit4:junit4]   2> 		at org.apache.lucene.util.TestRuleStoreClassName$1.evaluate(TestRuleStoreClassName.java:42)
[junit4:junit4]   2> 		at com.carrotsearch.randomizedtesting.rules.SystemPropertiesInvariantRule$1.evaluate(SystemPropertiesInvariantRule.java:55)
[junit4:junit4]   2> 		at com.carrotsearch.randomizedtesting.rules.NoShadowingOrOverridesOnMethodsRule$1.evaluate(NoShadowingOrOverridesOnMethodsRule.java:39)
[junit4:junit4]   2> 		at com.carrotsearch.randomizedtesting.rules.NoShadowingOrOverridesOnMethodsRule$1.evaluate(NoShadowingOrOverridesOnMethodsRule.java:39)
[junit4:junit4]   2> 		at com.carrotsearch.randomizedtesting.rules.StatementAdapter.evaluate(StatementAdapter.java:36)
[junit4:junit4]   2> 		at org.apache.lucene.util.TestRuleAssertionsRequired$1.evaluate(TestRuleAssertionsRequired.java:43)
[junit4:junit4]   2> 		at org.apache.lucene.util.TestRuleMarkFailure$1.evaluate(TestRuleMarkFailure.java:48)
[junit4:junit4]   2> 		at org.apache.lucene.util.TestRuleIgnoreAfterMaxFailures$1.evaluate(TestRuleIgnoreAfterMaxFailures.java:70)
[junit4:junit4]   2> 		at org.apache.lucene.util.TestRuleIgnoreTestSuites$1.evaluate(TestRuleIgnoreTestSuites.java:55)
[junit4:junit4]   2> 		at com.carrotsearch.randomizedtesting.rules.StatementAdapter.evaluate(StatementAdapter.java:36)
[junit4:junit4]   2> 		at com.carrotsearch.randomizedtesting.T

[...truncated too long message...]

(RandomizedRunner.java:746)
[junit4:junit4]   2> 		at com.carrotsearch.randomizedtesting.RandomizedRunner$3.evaluate(RandomizedRunner.java:648)
[junit4:junit4]   2> 		at com.carrotsearch.randomizedtesting.RandomizedRunner$4.evaluate(RandomizedRunner.java:682)
[junit4:junit4]   2> 		at com.carrotsearch.randomizedtesting.RandomizedRunner$5.evaluate(RandomizedRunner.java:693)
[junit4:junit4]   2> 		at com.carrotsearch.randomizedtesting.rules.StatementAdapter.evaluate(StatementAdapter.java:36)
[junit4:junit4]   2> 		at com.carrotsearch.randomizedtesting.rules.SystemPropertiesRestoreRule$1.evaluate(SystemPropertiesRestoreRule.java:53)
[junit4:junit4]   2> 		at org.apache.lucene.util.AbstractBeforeAfterRule$1.evaluate(AbstractBeforeAfterRule.java:45)
[junit4:junit4]   2> 		at org.apache.lucene.util.TestRuleStoreClassName$1.evaluate(TestRuleStoreClassName.java:42)
[junit4:junit4]   2> 		at com.carrotsearch.randomizedtesting.rules.SystemPropertiesInvariantRule$1.evaluate(SystemPropertiesInvariantRule.java:55)
[junit4:junit4]   2> 		at com.carrotsearch.randomizedtesting.rules.NoShadowingOrOverridesOnMethodsRule$1.evaluate(NoShadowingOrOverridesOnMethodsRule.java:39)
[junit4:junit4]   2> 		at com.carrotsearch.randomizedtesting.rules.NoShadowingOrOverridesOnMethodsRule$1.evaluate(NoShadowingOrOverridesOnMethodsRule.java:39)
[junit4:junit4]   2> 		at com.carrotsearch.randomizedtesting.rules.StatementAdapter.evaluate(StatementAdapter.java:36)
[junit4:junit4]   2> 		at org.apache.lucene.util.TestRuleAssertionsRequired$1.evaluate(TestRuleAssertionsRequired.java:43)
[junit4:junit4]   2> 		at org.apache.lucene.util.TestRuleMarkFailure$1.evaluate(TestRuleMarkFailure.java:48)
[junit4:junit4]   2> 		at org.apache.lucene.util.TestRuleIgnoreAfterMaxFailures$1.evaluate(TestRuleIgnoreAfterMaxFailures.java:70)
[junit4:junit4]   2> 		at org.apache.lucene.util.TestRuleIgnoreTestSuites$1.evaluate(TestRuleIgnoreTestSuites.java:55)
[junit4:junit4]   2> 		at com.carrotsearch.randomizedtesting.rules.StatementAdapter.evaluate(StatementAdapter.java:36)
[junit4:junit4]   2> 		at com.carrotsearch.randomizedtesting.ThreadLeakControl$StatementRunner.run(ThreadLeakControl.java:358)
[junit4:junit4]   2> 		at java.lang.Thread.run(Thread.java:722)
[junit4:junit4]   2> 	Caused by: java.io.IOException: Error opening /configs/conf1/stopwords.txt
[junit4:junit4]   2> 		at org.apache.solr.cloud.ZkSolrResourceLoader.openResource(ZkSolrResourceLoader.java:82)
[junit4:junit4]   2> 		at org.apache.lucene.analysis.util.AbstractAnalysisFactory.getLines(AbstractAnalysisFactory.java:163)
[junit4:junit4]   2> 		at org.apache.lucene.analysis.util.AbstractAnalysisFactory.getWordSet(AbstractAnalysisFactory.java:151)
[junit4:junit4]   2> 		at org.apache.lucene.analysis.core.StopFilterFactory.inform(StopFilterFactory.java:58)
[junit4:junit4]   2> 		at org.apache.solr.core.SolrResourceLoader.inform(SolrResourceLoader.java:611)
[junit4:junit4]   2> 		at org.apache.solr.schema.IndexSchema.<init>(IndexSchema.java:116)
[junit4:junit4]   2> 		... 45 more
[junit4:junit4]   2> 	Caused by: java.lang.InterruptedException
[junit4:junit4]   2> 		at java.lang.Object.wait(Native Method)
[junit4:junit4]   2> 		at java.lang.Object.wait(Object.java:503)
[junit4:junit4]   2> 		at org.apache.zookeeper.ClientCnxn.submitRequest(ClientCnxn.java:1345)
[junit4:junit4]   2> 		at org.apache.zookeeper.ZooKeeper.exists(ZooKeeper.java:810)
[junit4:junit4]   2> 		at org.apache.solr.common.cloud.SolrZkClient$4.execute(SolrZkClient.java:193)
[junit4:junit4]   2> 		at org.apache.solr.common.cloud.SolrZkClient$4.execute(SolrZkClient.java:190)
[junit4:junit4]   2> 		at org.apache.solr.common.cloud.ZkCmdExecutor.retryOperation(ZkCmdExecutor.java:63)
[junit4:junit4]   2> 		at org.apache.solr.common.cloud.SolrZkClient.exists(SolrZkClient.java:190)
[junit4:junit4]   2> 		at org.apache.solr.cloud.ZkController.pathExists(ZkController.java:495)
[junit4:junit4]   2> 		at org.apache.solr.cloud.ZkSolrResourceLoader.openResource(ZkSolrResourceLoader.java:77)
[junit4:junit4]   2> 		... 50 more
[junit4:junit4]   2> 	
[junit4:junit4]   2> 7222730 T1849 oasc.LeaderElectionIntegrationTest.setUp SEVERE !!!Could not start container:7000 The exception thrown was: class java.lang.AssertionError Container 7000 has no cores!
[junit4:junit4]   2> 7222730 T1885 oazs.PrepRequestProcessor.run PrepRequestProcessor exited loop!
[junit4:junit4]   2> 7222730 T1884 oazs.SyncRequestProcessor.run SyncRequestProcessor exited!
[junit4:junit4]   2> 7222731 T1849 oazs.FinalRequestProcessor.shutdown shutdown of request processor complete
[junit4:junit4]   2> 7222733 T1849 oazs.NIOServerCnxn.closeSock Closed socket connection for client /127.0.0.1:53051 which had sessionid 0x13ab20ea6840002
[junit4:junit4]   2> 7222734 T1882 oazs.NIOServerCnxn$Factory.run NIOServerCnxn factory exited run method
[junit4:junit4]   2> 7222734 T1890 oaz.ClientCnxn$SendThread.run Unable to read additional data from server sessionid 0x13ab20ea6840002, likely server has closed socket, closing socket connection and attempting reconnect
[junit4:junit4]   2> 7222734 T1849 oazs.FinalRequestProcessor.shutdown shutdown of request processor complete
[junit4:junit4]   2> 7222734 T1849 oas.SolrTestCaseJ4.tearDown ###Ending testLeaderElectionAfterClientTimeout
[junit4:junit4]   2> 7222834 T1891 oascc.ConnectionManager.process Watcher org.apache.solr.common.cloud.ConnectionManager@1aca88e name:ZooKeeperConnection Watcher:127.0.0.1:59221/solr got event WatchedEvent state:Disconnected type:None path:null path:null type:None
[junit4:junit4]   2> 7222834 T1891 oascc.ConnectionManager.process zkClient has disconnected
[junit4:junit4]   2> 7222871 T1849 oas.SolrTestCaseJ4.deleteCore ###deleteCore
[junit4:junit4]   2> 7222872 T1849 oas.SolrTestCaseJ4.endTrackingZkClients SEVERE ERROR: SolrZkClient opens=11 closes=10
[junit4:junit4]   2> 7222874 T1848 ccr.ThreadLeakControl.tryToInterruptAll All leaked threads terminated.
[junit4:junit4]   2> NOTE: test params are: codec=Lucene41: {}, sim=RandomSimilarityProvider(queryNorm=true,coord=crazy): {}, locale=ar_LB, timezone=Etc/GMT+8
[junit4:junit4]   2> NOTE: Linux 3.2.0-32-generic i386/Oracle Corporation 1.7.0_07 (32-bit)/cpus=8,threads=8,free=211713568,total=378994688
[junit4:junit4]   2> NOTE: All tests run in this JVM: [SolrCoreTest, TestPluginEnable, TermVectorComponentTest, TestPhraseSuggestions, SuggesterTSTTest, TestStressRecovery, TestPropInjectDefaults, MultiTermTest, StandardRequestHandlerTest, TestSort, ShowFileRequestHandlerTest, IndexSchemaRuntimeFieldTest, TestAnalyzedSuggestions, StatsComponentTest, TermVectorComponentDistributedTest, XsltUpdateRequestHandlerTest, TestFunctionQuery, TestWriterPerf, DocumentBuilderTest, ReturnFieldsTest, TestRemoteStreaming, TestMultiCoreConfBootstrap, TestReload, SuggesterTest, DirectUpdateHandlerTest, DirectSolrSpellCheckerTest, TestLRUCache, DisMaxRequestHandlerTest, FieldMutatingUpdateProcessorTest, FullSolrCloudDistribCmdsTest, TestFastOutputStream, TestUpdate, ZkNodePropsTest, TestElisionMultitermQuery, UUIDFieldTest, PeerSyncTest, TestCodecSupport, EchoParamsTest, TestRealTimeGet, TestStressVersions, SpellingQueryConverterTest, BasicFunctionalityTest, DistributedQueryElevationComponentTest, TestDFRSimilarityFactory, OutputWriterTest, LeaderElectionTest, TestReplicationHandler, StatelessScriptUpdateProcessorFactoryTest, DocumentAnalysisRequestHandlerTest, UpdateParamsTest, TestSurroundQueryParser, IndexSchemaTest, BadIndexSchemaTest, RequiredFieldsTest, IndexReaderFactoryTest, SoftAutoCommitTest, SolrInfoMBeanTest, OverseerTest, RecoveryZkTest, SpellCheckComponentTest, LeaderElectionIntegrationTest]
[junit4:junit4]   2> NOTE: reproduce with: ant test  -Dtestcase=LeaderElectionIntegrationTest -Dtests.seed=7AE0C40E452B3188 -Dtests.multiplier=3 -Dtests.slow=true -Dtests.locale=ar_LB -Dtests.timezone=Etc/GMT+8 -Dtests.file.encoding=UTF-8
[junit4:junit4] ERROR   0.00s J1 | LeaderElectionIntegrationTest (suite) <<<
[junit4:junit4]    > Throwable #1: java.lang.Exception: Suite timeout exceeded (>= 7200000 msec).
[junit4:junit4]    > 	at __randomizedtesting.SeedInfo.seed([7AE0C40E452B3188]:0)
[junit4:junit4]    > Throwable #2: com.carrotsearch.randomizedtesting.UncaughtExceptionError: Captured an uncaught exception in thread: Thread[id=1861, name=Thread-744, state=RUNNABLE, group=Overseer state updater.]
[junit4:junit4]    > Caused by: java.util.NoSuchElementException
[junit4:junit4]    > 	at __randomizedtesting.SeedInfo.seed([7AE0C40E452B3188]:0)
[junit4:junit4]    > 	at org.apache.solr.cloud.DistributedQueue.remove(DistributedQueue.java:148)
[junit4:junit4]    > 	at org.apache.solr.cloud.Overseer$ClusterStateUpdater.run(Overseer.java:131)
[junit4:junit4]    > 	at java.lang.Thread.run(Thread.java:722)
[junit4:junit4] Completed on J1 in 7222.92s, 1 test, 3 errors <<< FAILURES!

[...truncated 12 lines...]
BUILD FAILED
/mnt/ssd/jenkins/workspace/Lucene-Solr-trunk-Linux/build.xml:335: The following error occurred while executing this line:
/mnt/ssd/jenkins/workspace/Lucene-Solr-trunk-Linux/build.xml:39: The following error occurred while executing this line:
/mnt/ssd/jenkins/workspace/Lucene-Solr-trunk-Linux/solr/build.xml:178: The following error occurred while executing this line:
/mnt/ssd/jenkins/workspace/Lucene-Solr-trunk-Linux/lucene/module-build.xml:61: The following error occurred while executing this line:
/mnt/ssd/jenkins/workspace/Lucene-Solr-trunk-Linux/lucene/common-build.xml:1159: The following error occurred while executing this line:
/mnt/ssd/jenkins/workspace/Lucene-Solr-trunk-Linux/lucene/common-build.xml:827: There were test failures: 232 suites, 961 tests, 3 suite-level errors, 1 error, 7 ignored (2 assumptions)

Total time: 141 minutes 21 seconds
Build step 'Invoke Ant' marked build as failure
Archiving artifacts
Recording test results
Description set: Java: 32bit/jdk1.7.0_07 -client -XX:+UseConcMarkSweepGC
Email was triggered for: Failure
Sending email for trigger: Failure



Mime
View raw message