lucene-dev mailing list archives

Site index · List index
Message view « Date » · « Thread »
Top « Date » · « Thread »
From Apache Jenkins Server <jenk...@builds.apache.org>
Subject [JENKINS] Lucene-Solr-Tests-4.x-java7 - Build # 548 - Failure
Date Sun, 14 Oct 2012 15:00:49 GMT
Build: https://builds.apache.org/job/Lucene-Solr-Tests-4.x-java7/548/

1 tests failed.
REGRESSION:  org.apache.solr.cloud.BasicDistributedZkTest.testDistribSearch

Error Message:
some core start times did not change on reload

Stack Trace:
java.lang.AssertionError: some core start times did not change on reload
	at __randomizedtesting.SeedInfo.seed([95FC3884B13E5254:141AB69CC6613268]:0)
	at org.junit.Assert.fail(Assert.java:93)
	at org.junit.Assert.assertTrue(Assert.java:43)
	at org.apache.solr.cloud.BasicDistributedZkTest.testCollectionsAPI(BasicDistributedZkTest.java:443)
	at org.apache.solr.cloud.BasicDistributedZkTest.doTest(BasicDistributedZkTest.java:332)
	at org.apache.solr.BaseDistributedSearchTestCase.testDistribSearch(BaseDistributedSearchTestCase.java:695)
	at sun.reflect.NativeMethodAccessorImpl.invoke0(Native Method)
	at sun.reflect.NativeMethodAccessorImpl.invoke(NativeMethodAccessorImpl.java:57)
	at sun.reflect.DelegatingMethodAccessorImpl.invoke(DelegatingMethodAccessorImpl.java:43)
	at java.lang.reflect.Method.invoke(Method.java:601)
	at com.carrotsearch.randomizedtesting.RandomizedRunner.invoke(RandomizedRunner.java:1559)
	at com.carrotsearch.randomizedtesting.RandomizedRunner.access$600(RandomizedRunner.java:79)
	at com.carrotsearch.randomizedtesting.RandomizedRunner$6.evaluate(RandomizedRunner.java:737)
	at com.carrotsearch.randomizedtesting.RandomizedRunner$7.evaluate(RandomizedRunner.java:773)
	at com.carrotsearch.randomizedtesting.RandomizedRunner$8.evaluate(RandomizedRunner.java:787)
	at com.carrotsearch.randomizedtesting.rules.SystemPropertiesRestoreRule$1.evaluate(SystemPropertiesRestoreRule.java:53)
	at org.apache.lucene.util.TestRuleSetupTeardownChained$1.evaluate(TestRuleSetupTeardownChained.java:50)
	at org.apache.lucene.util.TestRuleFieldCacheSanity$1.evaluate(TestRuleFieldCacheSanity.java:51)
	at org.apache.lucene.util.AbstractBeforeAfterRule$1.evaluate(AbstractBeforeAfterRule.java:45)
	at com.carrotsearch.randomizedtesting.rules.SystemPropertiesInvariantRule$1.evaluate(SystemPropertiesInvariantRule.java:55)
	at org.apache.lucene.util.TestRuleThreadAndTestName$1.evaluate(TestRuleThreadAndTestName.java:48)
	at org.apache.lucene.util.TestRuleIgnoreAfterMaxFailures$1.evaluate(TestRuleIgnoreAfterMaxFailures.java:70)
	at org.apache.lucene.util.TestRuleMarkFailure$1.evaluate(TestRuleMarkFailure.java:48)
	at com.carrotsearch.randomizedtesting.rules.StatementAdapter.evaluate(StatementAdapter.java:36)
	at com.carrotsearch.randomizedtesting.ThreadLeakControl$StatementRunner.run(ThreadLeakControl.java:358)
	at com.carrotsearch.randomizedtesting.ThreadLeakControl.forkTimeoutingTask(ThreadLeakControl.java:782)
	at com.carrotsearch.randomizedtesting.ThreadLeakControl$3.evaluate(ThreadLeakControl.java:442)
	at com.carrotsearch.randomizedtesting.RandomizedRunner.runSingleTest(RandomizedRunner.java:746)
	at com.carrotsearch.randomizedtesting.RandomizedRunner$3.evaluate(RandomizedRunner.java:648)
	at com.carrotsearch.randomizedtesting.RandomizedRunner$4.evaluate(RandomizedRunner.java:682)
	at com.carrotsearch.randomizedtesting.RandomizedRunner$5.evaluate(RandomizedRunner.java:693)
	at com.carrotsearch.randomizedtesting.rules.StatementAdapter.evaluate(StatementAdapter.java:36)
	at com.carrotsearch.randomizedtesting.rules.SystemPropertiesRestoreRule$1.evaluate(SystemPropertiesRestoreRule.java:53)
	at org.apache.lucene.util.AbstractBeforeAfterRule$1.evaluate(AbstractBeforeAfterRule.java:45)
	at org.apache.lucene.util.TestRuleStoreClassName$1.evaluate(TestRuleStoreClassName.java:42)
	at com.carrotsearch.randomizedtesting.rules.SystemPropertiesInvariantRule$1.evaluate(SystemPropertiesInvariantRule.java:55)
	at com.carrotsearch.randomizedtesting.rules.NoShadowingOrOverridesOnMethodsRule$1.evaluate(NoShadowingOrOverridesOnMethodsRule.java:39)
	at com.carrotsearch.randomizedtesting.rules.NoShadowingOrOverridesOnMethodsRule$1.evaluate(NoShadowingOrOverridesOnMethodsRule.java:39)
	at com.carrotsearch.randomizedtesting.rules.StatementAdapter.evaluate(StatementAdapter.java:36)
	at org.apache.lucene.util.TestRuleAssertionsRequired$1.evaluate(TestRuleAssertionsRequired.java:43)
	at org.apache.lucene.util.TestRuleMarkFailure$1.evaluate(TestRuleMarkFailure.java:48)
	at org.apache.lucene.util.TestRuleIgnoreAfterMaxFailures$1.evaluate(TestRuleIgnoreAfterMaxFailures.java:70)
	at org.apache.lucene.util.TestRuleIgnoreTestSuites$1.evaluate(TestRuleIgnoreTestSuites.java:55)
	at com.carrotsearch.randomizedtesting.rules.StatementAdapter.evaluate(StatementAdapter.java:36)
	at com.carrotsearch.randomizedtesting.ThreadLeakControl$StatementRunner.run(ThreadLeakControl.java:358)
	at java.lang.Thread.run(Thread.java:722)




Build Log:
[...truncated 8784 lines...]
[junit4:junit4] Suite: org.apache.solr.cloud.BasicDistributedZkTest
[junit4:junit4]   2> 5 T709 oas.SolrTestCaseJ4.setUp ###Starting testDistribSearch
[junit4:junit4]   2> Creating dataDir: /usr/home/hudson/hudson-slave/workspace/Lucene-Solr-Tests-4.x-java7/solr/build/solr-core/test/J0/./solrtest-BasicDistributedZkTest-1350226206313
[junit4:junit4]   2> 6 T709 oasc.ZkTestServer.run STARTING ZK TEST SERVER
[junit4:junit4]   2> 11 T710 oazs.ZooKeeperServer.setTickTime tickTime set to 1000
[junit4:junit4]   2> 12 T710 oazs.NIOServerCnxn$Factory.<init> binding to port 0.0.0.0/0.0.0.0:0
[junit4:junit4]   2> 13 T710 oazsp.FileTxnSnapLog.save Snapshotting: 0
[junit4:junit4]   2> 108 T709 oasc.ZkTestServer.run start zk server on port:44838
[junit4:junit4]   2> 109 T709 oaz.ZooKeeper.<init> Initiating client connection, connectString=127.0.0.1:44838 sessionTimeout=10000 watcher=org.apache.solr.common.cloud.ConnectionManager@d94bfca
[junit4:junit4]   2> 110 T715 oaz.ClientCnxn$SendThread.startConnect Opening socket connection to server /127.0.0.1:44838
[junit4:junit4]   2> 110 T709 oascc.ConnectionManager.waitForConnected Waiting for client to connect to ZooKeeper
[junit4:junit4]   2> 111 T715 oaz.ClientCnxn$SendThread.primeConnection Socket connection established to localhost/127.0.0.1:44838, initiating session
[junit4:junit4]   2> 111 T711 oazs.NIOServerCnxn$Factory.run Accepted socket connection from /140.211.11.196:44839
[junit4:junit4]   2> 112 T711 oazs.NIOServerCnxn.readConnectRequest Client attempting to establish new session at /140.211.11.196:44839
[junit4:junit4]   2> 112 T713 oazsp.FileTxnLog.append Creating new log file: log.1
[junit4:junit4]   2> 114 T713 oazs.NIOServerCnxn.finishSessionInit Established session 0x13a5fc0de710000 with negotiated timeout 10000 for client /140.211.11.196:44839
[junit4:junit4]   2> 114 T715 oaz.ClientCnxn$SendThread.readConnectResult Session establishment complete on server localhost/127.0.0.1:44838, sessionid = 0x13a5fc0de710000, negotiated timeout = 10000
[junit4:junit4]   2> 115 T716 oascc.ConnectionManager.process Watcher org.apache.solr.common.cloud.ConnectionManager@d94bfca name:ZooKeeperConnection Watcher:127.0.0.1:44838 got event WatchedEvent state:SyncConnected type:None path:null path:null type:None
[junit4:junit4]   2> 115 T709 oascc.ConnectionManager.waitForConnected Client is connected to ZooKeeper
[junit4:junit4]   2> 115 T709 oascc.SolrZkClient.makePath makePath: /solr
[junit4:junit4]   2> 126 T714 oazs.PrepRequestProcessor.pRequest Processed session termination for sessionid: 0x13a5fc0de710000
[junit4:junit4]   2> 134 T716 oaz.ClientCnxn$EventThread.run EventThread shut down
[junit4:junit4]   2> 134 T709 oaz.ZooKeeper.close Session: 0x13a5fc0de710000 closed
[junit4:junit4]   2> 135 T711 oazs.NIOServerCnxn.closeSock Closed socket connection for client /140.211.11.196:44839 which had sessionid 0x13a5fc0de710000
[junit4:junit4]   2> 135 T709 oaz.ZooKeeper.<init> Initiating client connection, connectString=127.0.0.1:44838/solr sessionTimeout=10000 watcher=org.apache.solr.common.cloud.ConnectionManager@78d1008d
[junit4:junit4]   2> 137 T717 oaz.ClientCnxn$SendThread.startConnect Opening socket connection to server /127.0.0.1:44838
[junit4:junit4]   2> 137 T709 oascc.ConnectionManager.waitForConnected Waiting for client to connect to ZooKeeper
[junit4:junit4]   2> 137 T717 oaz.ClientCnxn$SendThread.primeConnection Socket connection established to localhost/127.0.0.1:44838, initiating session
[junit4:junit4]   2> 138 T711 oazs.NIOServerCnxn$Factory.run Accepted socket connection from /140.211.11.196:44840
[junit4:junit4]   2> 138 T711 oazs.NIOServerCnxn.readConnectRequest Client attempting to establish new session at /140.211.11.196:44840
[junit4:junit4]   2> 146 T713 oazs.NIOServerCnxn.finishSessionInit Established session 0x13a5fc0de710001 with negotiated timeout 10000 for client /140.211.11.196:44840
[junit4:junit4]   2> 146 T717 oaz.ClientCnxn$SendThread.readConnectResult Session establishment complete on server localhost/127.0.0.1:44838, sessionid = 0x13a5fc0de710001, negotiated timeout = 10000
[junit4:junit4]   2> 147 T718 oascc.ConnectionManager.process Watcher org.apache.solr.common.cloud.ConnectionManager@78d1008d name:ZooKeeperConnection Watcher:127.0.0.1:44838/solr got event WatchedEvent state:SyncConnected type:None path:null path:null type:None
[junit4:junit4]   2> 147 T709 oascc.ConnectionManager.waitForConnected Client is connected to ZooKeeper
[junit4:junit4]   2> 148 T709 oascc.SolrZkClient.makePath makePath: /collections/collection1
[junit4:junit4]   2> 162 T709 oascc.SolrZkClient.makePath makePath: /collections/collection1/shards
[junit4:junit4]   2> 173 T709 oascc.SolrZkClient.makePath makePath: /collections/control_collection
[junit4:junit4]   2> 177 T709 oascc.SolrZkClient.makePath makePath: /collections/control_collection/shards
[junit4:junit4]   2> 186 T709 oasc.AbstractZkTestCase.putConfig put /usr/home/hudson/hudson-slave/workspace/Lucene-Solr-Tests-4.x-java7/solr/build/solr-core/test-files/solr/collection1/conf/solrconfig.xml to /configs/conf1/solrconfig.xml
[junit4:junit4]   2> 187 T709 oascc.SolrZkClient.makePath makePath: /configs/conf1/solrconfig.xml
[junit4:junit4]   2> 214 T709 oasc.AbstractZkTestCase.putConfig put /usr/home/hudson/hudson-slave/workspace/Lucene-Solr-Tests-4.x-java7/solr/build/solr-core/test-files/solr/collection1/conf/schema.xml to /configs/conf1/schema.xml
[junit4:junit4]   2> 215 T709 oascc.SolrZkClient.makePath makePath: /configs/conf1/schema.xml
[junit4:junit4]   2> 321 T709 oasc.AbstractZkTestCase.putConfig put /usr/home/hudson/hudson-slave/workspace/Lucene-Solr-Tests-4.x-java7/solr/build/solr-core/test-files/solr/collection1/conf/solrconfig.xml to /configs/conf1/solrconfig.xml
[junit4:junit4]   2> 322 T709 oascc.SolrZkClient.makePath makePath: /configs/conf1/solrconfig.xml
[junit4:junit4]   2> 335 T709 oasc.AbstractZkTestCase.putConfig put /usr/home/hudson/hudson-slave/workspace/Lucene-Solr-Tests-4.x-java7/solr/build/solr-core/test-files/solr/collection1/conf/stopwords.txt to /configs/conf1/stopwords.txt
[junit4:junit4]   2> 336 T709 oascc.SolrZkClient.makePath makePath: /configs/conf1/stopwords.txt
[junit4:junit4]   2> 350 T709 oasc.AbstractZkTestCase.putConfig put /usr/home/hudson/hudson-slave/workspace/Lucene-Solr-Tests-4.x-java7/solr/build/solr-core/test-files/solr/collection1/conf/protwords.txt to /configs/conf1/protwords.txt
[junit4:junit4]   2> 351 T709 oascc.SolrZkClient.makePath makePath: /configs/conf1/protwords.txt
[junit4:junit4]   2> 361 T709 oasc.AbstractZkTestCase.putConfig put /usr/home/hudson/hudson-slave/workspace/Lucene-Solr-Tests-4.x-java7/solr/build/solr-core/test-files/solr/collection1/conf/currency.xml to /configs/conf1/currency.xml
[junit4:junit4]   2> 362 T709 oascc.SolrZkClient.makePath makePath: /configs/conf1/currency.xml
[junit4:junit4]   2> 369 T709 oasc.AbstractZkTestCase.putConfig put /usr/home/hudson/hudson-slave/workspace/Lucene-Solr-Tests-4.x-java7/solr/build/solr-core/test-files/solr/collection1/conf/open-exchange-rates.json to /configs/conf1/open-exchange-rates.json
[junit4:junit4]   2> 370 T709 oascc.SolrZkClient.makePath makePath: /configs/conf1/open-exchange-rates.json
[junit4:junit4]   2> 377 T709 oasc.AbstractZkTestCase.putConfig put /usr/home/hudson/hudson-slave/workspace/Lucene-Solr-Tests-4.x-java7/solr/build/solr-core/test-files/solr/collection1/conf/mapping-ISOLatin1Accent.txt to /configs/conf1/mapping-ISOLatin1Accent.txt
[junit4:junit4]   2> 378 T709 oascc.SolrZkClient.makePath makePath: /configs/conf1/mapping-ISOLatin1Accent.txt
[junit4:junit4]   2> 384 T709 oasc.AbstractZkTestCase.putConfig put /usr/home/hudson/hudson-slave/workspace/Lucene-Solr-Tests-4.x-java7/solr/build/solr-core/test-files/solr/collection1/conf/old_synonyms.txt to /configs/conf1/old_synonyms.txt
[junit4:junit4]   2> 385 T709 oascc.SolrZkClient.makePath makePath: /configs/conf1/old_synonyms.txt
[junit4:junit4]   2> 403 T709 oasc.AbstractZkTestCase.putConfig put /usr/home/hudson/hudson-slave/workspace/Lucene-Solr-Tests-4.x-java7/solr/build/solr-core/test-files/solr/collection1/conf/synonyms.txt to /configs/conf1/synonyms.txt
[junit4:junit4]   2> 404 T709 oascc.SolrZkClient.makePath makePath: /configs/conf1/synonyms.txt
[junit4:junit4]   2> 417 T714 oazs.PrepRequestProcessor.pRequest Processed session termination for sessionid: 0x13a5fc0de710001
[junit4:junit4]   2> 428 T711 oazs.NIOServerCnxn.closeSock Closed socket connection for client /140.211.11.196:44840 which had sessionid 0x13a5fc0de710001
[junit4:junit4]   2> 428 T718 oaz.ClientCnxn$EventThread.run EventThread shut down
[junit4:junit4]   2> 428 T709 oaz.ZooKeeper.close Session: 0x13a5fc0de710001 closed
[junit4:junit4]   2> 431 T709 oejs.Server.doStart jetty-8.1.2.v20120308
[junit4:junit4]   2> 437 T709 oejs.AbstractConnector.doStart Started SocketConnector@0.0.0.0:44841
[junit4:junit4]   2> 438 T709 oasc.SolrResourceLoader.locateSolrHome JNDI not configured for solr (NoInitialContextEx)
[junit4:junit4]   2> 438 T709 oasc.SolrResourceLoader.locateSolrHome using system property solr.solr.home: /usr/home/hudson/hudson-slave/workspace/Lucene-Solr-Tests-4.x-java7/solr/build/solr-core/test-files/solr
[junit4:junit4]   2> 439 T709 oasc.SolrResourceLoader.<init> new SolrResourceLoader for deduced Solr Home: '/usr/home/hudson/hudson-slave/workspace/Lucene-Solr-Tests-4.x-java7/solr/build/solr-core/test-files/solr/'
[junit4:junit4]   2> 494 T709 oass.SolrDispatchFilter.init SolrDispatchFilter.init()
[junit4:junit4]   2> 495 T709 oasc.SolrResourceLoader.locateSolrHome JNDI not configured for solr (NoInitialContextEx)
[junit4:junit4]   2> 496 T709 oasc.SolrResourceLoader.locateSolrHome using system property solr.solr.home: /usr/home/hudson/hudson-slave/workspace/Lucene-Solr-Tests-4.x-java7/solr/build/solr-core/test-files/solr
[junit4:junit4]   2> 496 T709 oasc.CoreContainer$Initializer.initialize looking for solr.xml: /usr/home/hudson/hudson-slave/workspace/Lucene-Solr-Tests-4.x-java7/solr/build/solr-core/test-files/solr/solr.xml
[junit4:junit4]   2> 497 T709 oasc.CoreContainer.<init> New CoreContainer 1831046078
[junit4:junit4]   2> 497 T709 oasc.CoreContainer.load Loading CoreContainer using Solr Home: '/usr/home/hudson/hudson-slave/workspace/Lucene-Solr-Tests-4.x-java7/solr/build/solr-core/test-files/solr/'
[junit4:junit4]   2> 498 T709 oasc.SolrResourceLoader.<init> new SolrResourceLoader for directory: '/usr/home/hudson/hudson-slave/workspace/Lucene-Solr-Tests-4.x-java7/solr/build/solr-core/test-files/solr/'
[junit4:junit4]   2> 537 T709 oasc.CoreContainer.load Registering Log Listener
[junit4:junit4]   2> 552 T709 oasc.CoreContainer.initZooKeeper Zookeeper client=127.0.0.1:44838/solr
[junit4:junit4]   2> 553 T709 oaz.ZooKeeper.<init> Initiating client connection, connectString=127.0.0.1:44838/solr sessionTimeout=5000 watcher=org.apache.solr.common.cloud.ConnectionManager@42d728e7
[junit4:junit4]   2> 554 T728 oaz.ClientCnxn$SendThread.startConnect Opening socket connection to server /127.0.0.1:44838
[junit4:junit4]   2> 554 T709 oascc.ConnectionManager.waitForConnected Waiting for client to connect to ZooKeeper
[junit4:junit4]   2> 556 T728 oaz.ClientCnxn$SendThread.primeConnection Socket connection established to localhost/127.0.0.1:44838, initiating session
[junit4:junit4]   2> 556 T711 oazs.NIOServerCnxn$Factory.run Accepted socket connection from /140.211.11.196:44842
[junit4:junit4]   2> 556 T711 oazs.NIOServerCnxn.readConnectRequest Client attempting to establish new session at /140.211.11.196:44842
[junit4:junit4]   2> 558 T713 oazs.NIOServerCnxn.finishSessionInit Established session 0x13a5fc0de710002 with negotiated timeout 5000 for client /140.211.11.196:44842
[junit4:junit4]   2> 558 T728 oaz.ClientCnxn$SendThread.readConnectResult Session establishment complete on server localhost/127.0.0.1:44838, sessionid = 0x13a5fc0de710002, negotiated timeout = 5000
[junit4:junit4]   2> 559 T729 oascc.ConnectionManager.process Watcher org.apache.solr.common.cloud.ConnectionManager@42d728e7 name:ZooKeeperConnection Watcher:127.0.0.1:44838/solr got event WatchedEvent state:SyncConnected type:None path:null path:null type:None
[junit4:junit4]   2> 559 T709 oascc.ConnectionManager.waitForConnected Client is connected to ZooKeeper
[junit4:junit4]   2> 562 T714 oazs.PrepRequestProcessor.pRequest Got user-level KeeperException when processing sessionid:0x13a5fc0de710002 type:create cxid:0x2 zxid:0xfffffffffffffffe txntype:unknown reqpath:n/a Error Path:/solr/overseer Error:KeeperErrorCode = NodeExists for /solr/overseer
[junit4:junit4]   2> 563 T709 oascc.SolrZkClient.makePath makePath: /live_nodes
[junit4:junit4]   2> 572 T709 oasc.ZkController.createEphemeralLiveNode Register node as live in ZooKeeper:/live_nodes/127.0.0.1:44841_solr
[junit4:junit4]   2> 573 T714 oazs.PrepRequestProcessor.pRequest Got user-level KeeperException when processing sessionid:0x13a5fc0de710002 type:delete cxid:0x7 zxid:0xfffffffffffffffe txntype:unknown reqpath:n/a Error Path:/solr/live_nodes/127.0.0.1:44841_solr Error:KeeperErrorCode = NoNode for /solr/live_nodes/127.0.0.1:44841_solr
[junit4:junit4]   2> 574 T709 oascc.SolrZkClient.makePath makePath: /live_nodes/127.0.0.1:44841_solr
[junit4:junit4]   2> 579 T709 oashc.HttpShardHandlerFactory.getParameter Setting socketTimeout to: 0
[junit4:junit4]   2> 579 T709 oashc.HttpShardHandlerFactory.getParameter Setting urlScheme to: http://
[junit4:junit4]   2> 580 T709 oashc.HttpShardHandlerFactory.getParameter Setting connTimeout to: 0
[junit4:junit4]   2> 580 T709 oashc.HttpShardHandlerFactory.getParameter Setting maxConnectionsPerHost to: 20
[junit4:junit4]   2> 580 T709 oashc.HttpShardHandlerFactory.getParameter Setting corePoolSize to: 0
[junit4:junit4]   2> 581 T709 oashc.HttpShardHandlerFactory.getParameter Setting maximumPoolSize to: 2147483647
[junit4:junit4]   2> 581 T709 oashc.HttpShardHandlerFactory.getParameter Setting maxThreadIdleTime to: 5
[junit4:junit4]   2> 582 T709 oashc.HttpShardHandlerFactory.getParameter Setting sizeOfQueue to: -1
[junit4:junit4]   2> 582 T709 oashc.HttpShardHandlerFactory.getParameter Setting fairnessPolicy to: false
[junit4:junit4]   2> 583 T709 oascsi.HttpClientUtil.createClient Creating new http client, config:maxConnectionsPerHost=20&maxConnections=10000&socketTimeout=0&connTimeout=0&retry=false
[junit4:junit4]   2> 602 T709 oascc.SolrZkClient.makePath makePath: /overseer_elect/election
[junit4:junit4]   2> 616 T714 oazs.PrepRequestProcessor.pRequest Got user-level KeeperException when processing sessionid:0x13a5fc0de710002 type:delete cxid:0x15 zxid:0xfffffffffffffffe txntype:unknown reqpath:n/a Error Path:/solr/overseer_elect/leader Error:KeeperErrorCode = NoNode for /solr/overseer_elect/leader
[junit4:junit4]   2> 618 T709 oascc.SolrZkClient.makePath makePath: /overseer_elect/leader
[junit4:junit4]   2> 622 T709 oasc.Overseer.start Overseer (id=88488424657453058-127.0.0.1:44841_solr-n_0000000000) starting
[junit4:junit4]   2> 623 T714 oazs.PrepRequestProcessor.pRequest Got user-level KeeperException when processing sessionid:0x13a5fc0de710002 type:create cxid:0x1a zxid:0xfffffffffffffffe txntype:unknown reqpath:n/a Error Path:/solr/overseer Error:KeeperErrorCode = NodeExists for /solr/overseer
[junit4:junit4]   2> 624 T714 oazs.PrepRequestProcessor.pRequest Got user-level KeeperException when processing sessionid:0x13a5fc0de710002 type:create cxid:0x1b zxid:0xfffffffffffffffe txntype:unknown reqpath:n/a Error Path:/solr/overseer Error:KeeperErrorCode = NodeExists for /solr/overseer
[junit4:junit4]   2> 632 T714 oazs.PrepRequestProcessor.pRequest Got user-level KeeperException when processing sessionid:0x13a5fc0de710002 type:create cxid:0x1c zxid:0xfffffffffffffffe txntype:unknown reqpath:n/a Error Path:/solr/overseer Error:KeeperErrorCode = NodeExists for /solr/overseer
[junit4:junit4]   2> 633 T714 oazs.PrepRequestProcessor.pRequest Got user-level KeeperException when processing sessionid:0x13a5fc0de710002 type:create cxid:0x1d zxid:0xfffffffffffffffe txntype:unknown reqpath:n/a Error Path:/solr/overseer Error:KeeperErrorCode = NodeExists for /solr/overseer
[junit4:junit4]   2> 635 T731 oasc.OverseerCollectionProcessor.run Process current queue of collection creations
[junit4:junit4]   2> 636 T709 oascc.SolrZkClient.makePath makePath: /clusterstate.json
[junit4:junit4]   2> 644 T709 oascc.ZkStateReader.createClusterStateWatchersAndUpdate Updating cluster state from ZooKeeper... 
[junit4:junit4]   2> 646 T730 oasc.Overseer$ClusterStateUpdater.run Starting to work on the main queue
[junit4:junit4]   2> 651 T709 oasc.CoreContainer.create Creating SolrCore 'collection1' using instanceDir: /usr/home/hudson/hudson-slave/workspace/Lucene-Solr-Tests-4.x-java7/solr/build/solr-core/test-files/solr/collection1
[junit4:junit4]   2> 652 T709 oasc.ZkController.createCollectionZkNode Check for collection zkNode:control_collection
[junit4:junit4]   2> 653 T709 oasc.ZkController.createCollectionZkNode Collection zkNode exists
[junit4:junit4]   2> 653 T709 oasc.ZkController.readConfigName Load collection config from:/collections/control_collection
[junit4:junit4]   2> 655 T709 oasc.SolrResourceLoader.<init> new SolrResourceLoader for directory: '/usr/home/hudson/hudson-slave/workspace/Lucene-Solr-Tests-4.x-java7/solr/build/solr-core/test-files/solr/collection1/'
[junit4:junit4]   2> 657 T709 oasc.SolrResourceLoader.replaceClassLoader Adding 'file:/usr/home/hudson/hudson-slave/workspace/Lucene-Solr-Tests-4.x-java7/solr/build/solr-core/test-files/solr/collection1/lib/classes/' to classloader
[junit4:junit4]   2> 658 T709 oasc.SolrResourceLoader.replaceClassLoader Adding 'file:/usr/home/hudson/hudson-slave/workspace/Lucene-Solr-Tests-4.x-java7/solr/build/solr-core/test-files/solr/collection1/lib/README' to classloader
[junit4:junit4]   2> 718 T709 oasc.SolrConfig.<init> Using Lucene MatchVersion: LUCENE_41
[junit4:junit4]   2> 796 T709 oasc.SolrConfig.<init> Loaded SolrConfig: solrconfig.xml
[junit4:junit4]   2> 897 T709 oass.IndexSchema.readSchema Reading Solr Schema
[junit4:junit4]   2> 905 T709 oass.IndexSchema.readSchema Schema name=test
[junit4:junit4]   2> 1419 T709 oass.OpenExchangeRatesOrgProvider.init Initialized with rates=open-exchange-rates.json, refreshInterval=1440.
[junit4:junit4]   2> 1431 T709 oass.IndexSchema.readSchema default search field in schema is text
[junit4:junit4]   2> 1436 T709 oass.IndexSchema.readSchema unique key field: id
[junit4:junit4]   2> 1459 T709 oass.FileExchangeRateProvider.reload Reloading exchange rates from file currency.xml
[junit4:junit4]   2> 1465 T709 oass.FileExchangeRateProvider.reload Reloading exchange rates from file currency.xml
[junit4:junit4]   2> 1472 T709 oass.OpenExchangeRatesOrgProvider.reload Reloading exchange rates from open-exchange-rates.json
[junit4:junit4]   2> 1473 T709 oass.OpenExchangeRatesOrgProvider.reload Reloading exchange rates from open-exchange-rates.json
[junit4:junit4]   2> 1475 T709 oasc.SolrCore.<init> [collection1] Opening new SolrCore at /usr/home/hudson/hudson-slave/workspace/Lucene-Solr-Tests-4.x-java7/solr/build/solr-core/test-files/solr/collection1/, dataDir=./org.apache.solr.cloud.BasicDistributedZkTest-1350226206312/control/data/
[junit4:junit4]   2> 1475 T709 oasc.JmxMonitoredMap.<init> JMX monitoring is enabled. Adding Solr mbeans to JMX Server: com.sun.jmx.mbeanserver.JmxMBeanServer@149873b7
[junit4:junit4]   2> 1508 T709 oasc.SolrCore.getNewIndexDir New index directory detected: old=null new=./org.apache.solr.cloud.BasicDistributedZkTest-1350226206312/control/data/index/
[junit4:junit4]   2> 1509 T709 oasc.SolrCore.initIndex WARNING [collection1] Solr index directory './org.apache.solr.cloud.BasicDistributedZkTest-1350226206312/control/data/index' doesn't exist. Creating new index...
[junit4:junit4]   2> 1510 T709 oasc.CachingDirectoryFactory.get return new directory for /usr/home/hudson/hudson-slave/workspace/Lucene-Solr-Tests-4.x-java7/solr/build/solr-core/test/J0/./org.apache.solr.cloud.BasicDistributedZkTest-1350226206312/control/data/index forceNew:false
[junit4:junit4]   2> 1516 T709 oasc.SolrDeletionPolicy.onCommit SolrDeletionPolicy.onCommit: commits:num=1
[junit4:junit4]   2> 		commit{dir=NRTCachingDirectory(org.apache.lucene.store.NIOFSDirectory@/usr/home/hudson/hudson-slave/workspace/Lucene-Solr-Tests-4.x-java7/solr/build/solr-core/test/J0/org.apache.solr.cloud.BasicDistributedZkTest-1350226206312/control/data/index lockFactory=org.apache.lucene.store.NativeFSLockFactory@59975455; maxCacheMB=48.0 maxMergeSizeMB=4.0),segFN=segments_1,generation=1,filenames=[segments_1]
[junit4:junit4]   2> 1516 T709 oasc.SolrDeletionPolicy.updateCommits newest commit = 1
[junit4:junit4]   2> 1518 T709 oasc.SolrCore.initWriters created xml: solr.XMLResponseWriter
[junit4:junit4]   2> 1520 T709 oasup.UpdateRequestProcessorChain.init inserting DistributedUpdateProcessorFactory into updateRequestProcessorChain "dedupe"
[junit4:junit4]   2> 1521 T709 oasup.UpdateRequestProcessorChain.init inserting DistributedUpdateProcessorFactory into updateRequestProcessorChain "dedupe-allfields"
[junit4:junit4]   2> 1521 T709 oasup.UpdateRequestProcessorChain.init inserting DistributedUpdateProcessorFactory into updateRequestProcessorChain "stored_sig"
[junit4:junit4]   2> 1522 T709 oasup.UpdateRequestProcessorChain.init inserting DistributedUpdateProcessorFactory into updateRequestProcessorChain "uniq-fields"
[junit4:junit4]   2> 1523 T709 oasup.UpdateRequestProcessorChain.init inserting DistributedUpdateProcessorFactory into updateRequestProcessorChain "distrib-dup-test-chain-implicit"
[junit4:junit4]   2> 1523 T709 oasc.RequestHandlers.initHandlersFromConfig adding lazy requestHandler: solr.ReplicationHandler
[junit4:junit4]   2> 1523 T709 oasc.RequestHandlers.initHandlersFromConfig created /replication: solr.ReplicationHandler
[junit4:junit4]   2> 1524 T709 oasc.RequestHandlers.initHandlersFromConfig created standard: solr.StandardRequestHandler
[junit4:junit4]   2> 1524 T709 oasc.RequestHandlers.initHandlersFromConfig created /get: solr.RealTimeGetHandler
[junit4:junit4]   2> 1525 T709 oasc.RequestHandlers.initHandlersFromConfig created dismax: solr.SearchHandler
[junit4:junit4]   2> 1525 T709 oasc.RequestHandlers.initHandlersFromConfig created mock: org.apache.solr.core.MockQuerySenderListenerReqHandler
[junit4:junit4]   2> 1526 T709 oasc.RequestHandlers.initHandlersFromConfig created /admin/: org.apache.solr.handler.admin.AdminHandlers
[junit4:junit4]   2> 1526 T709 oasc.RequestHandlers.initHandlersFromConfig created defaults: solr.StandardRequestHandler
[junit4:junit4]   2> 1527 T709 oasc.RequestHandlers.initHandlersFromConfig adding lazy requestHandler: solr.StandardRequestHandler
[junit4:junit4]   2> 1527 T709 oasc.RequestHandlers.initHandlersFromConfig created lazy: solr.StandardRequestHandler
[junit4:junit4]   2> 1527 T709 oasc.RequestHandlers.initHandlersFromConfig created /update: solr.UpdateRequestHandler
[junit4:junit4]   2> 1528 T709 oasc.RequestHandlers.initHandlersFromConfig created /terms: org.apache.solr.handler.component.SearchHandler
[junit4:junit4]   2> 1528 T709 oasc.RequestHandlers.initHandlersFromConfig created spellCheckCompRH: org.apache.solr.handler.component.SearchHandler
[junit4:junit4]   2> 1529 T709 oasc.RequestHandlers.initHandlersFromConfig created spellCheckCompRH_Direct: org.apache.solr.handler.component.SearchHandler
[junit4:junit4]   2> 1529 T709 oasc.RequestHandlers.initHandlersFromConfig created spellCheckWithWordbreak: org.apache.solr.handler.component.SearchHandler
[junit4:junit4]   2> 1530 T709 oasc.RequestHandlers.initHandlersFromConfig created spellCheckWithWordbreak_Direct: org.apache.solr.handler.component.SearchHandler
[junit4:junit4]   2> 1530 T709 oasc.RequestHandlers.initHandlersFromConfig created spellCheckCompRH1: org.apache.solr.handler.component.SearchHandler
[junit4:junit4]   2> 1530 T709 oasc.RequestHandlers.initHandlersFromConfig created tvrh: org.apache.solr.handler.component.SearchHandler
[junit4:junit4]   2> 1531 T709 oasc.RequestHandlers.initHandlersFromConfig created /mlt: solr.MoreLikeThisHandler
[junit4:junit4]   2> 1531 T709 oasc.RequestHandlers.initHandlersFromConfig created /debug/dump: solr.DumpRequestHandler
[junit4:junit4]   2> 1543 T709 oashl.XMLLoader.init xsltCacheLifetimeSeconds=60
[junit4:junit4]   2> 1546 T709 oasc.SolrCore.initDeprecatedSupport WARNING solrconfig.xml uses deprecated <admin/gettableFiles>, Please update your config to use the ShowFileRequestHandler.
[junit4:junit4]   2> 1547 T709 oasc.SolrCore.initDeprecatedSupport WARNING adding ShowFileRequestHandler with hidden files: [SCHEMA.XML, OLD_SYNONYMS.TXT, STOPWORDS.TXT, PROTWORDS.TXT, OPEN-EXCHANGE-RATES.JSON, SYNONYMS.TXT, CURRENCY.XML, MAPPING-ISOLATIN1ACCENT.TXT]
[junit4:junit4]   2> 1550 T709 oass.SolrIndexSearcher.<init> Opening Searcher@57cdc55 main
[junit4:junit4]   2> 1551 T709 oasu.CommitTracker.<init> Hard AutoCommit: disabled
[junit4:junit4]   2> 1552 T709 oasu.CommitTracker.<init> Soft AutoCommit: disabled
[junit4:junit4]   2> 1552 T709 oashc.SpellCheckComponent.inform Initializing spell checkers
[junit4:junit4]   2> 1561 T709 oass.DirectSolrSpellChecker.init init: {name=direct,classname=DirectSolrSpellChecker,field=lowerfilt,minQueryLength=3}
[junit4:junit4]   2> 1612 T732 oasc.SolrCore.registerSearcher [collection1] Registered new searcher Searcher@57cdc55 main{StandardDirectoryReader(segments_1:1)}
[junit4:junit4]   2> 1616 T714 oazs.PrepRequestProcessor.pRequest Got user-level KeeperException when processing sessionid:0x13a5fc0de710002 type:create cxid:0x53 zxid:0xfffffffffffffffe txntype:unknown reqpath:n/a Error Path:/solr/overseer/queue Error:KeeperErrorCode = NoNode for /solr/overseer/queue
[junit4:junit4]   2> 1628 T709 oasc.CoreContainer.register registering core: collection1
[junit4:junit4]   2> 1629 T709 oasc.ZkController.register Register shard - core:collection1 address:http://127.0.0.1:44841/solr shardId:control_shard
[junit4:junit4]   2> 1630 T709 oascc.SolrZkClient.makePath makePath: /collections/control_collection/leader_elect/control_shard/election
[junit4:junit4]   2> 1648 T714 oazs.PrepRequestProcessor.pRequest Got user-level KeeperException when processing sessionid:0x13a5fc0de710002 type:delete cxid:0x62 zxid:0xfffffffffffffffe txntype:unknown reqpath:n/a Error Path:/solr/collections/control_collection/leaders Error:KeeperErrorCode = NoNode for /solr/collections/control_collection/leaders
[junit4:junit4]   2> 1649 T709 oasc.ShardLeaderElectionContext.runLeaderProcess Running the leader process.
[junit4:junit4]   2> 1650 T714 oazs.PrepRequestProcessor.pRequest Got user-level KeeperException when processing sessionid:0x13a5fc0de710002 type:create cxid:0x63 zxid:0xfffffffffffffffe txntype:unknown reqpath:n/a Error Path:/solr/overseer Error:KeeperErrorCode = NodeExists for /solr/overseer
[junit4:junit4]   2> 1659 T730 oascc.ZkStateReader.updateClusterState Updating cloud state from ZooKeeper... 
[junit4:junit4]   2> 1660 T714 oazs.PrepRequestProcessor.pRequest Got user-level KeeperException when processing sessionid:0x13a5fc0de710002 type:create cxid:0x6a zxid:0xfffffffffffffffe txntype:unknown reqpath:n/a Error Path:/solr/overseer/queue-work Error:KeeperErrorCode = NoNode for /solr/overseer/queue-work
[junit4:junit4]   2> 1685 T729 oascc.ZkStateReader$2.process A cluster state change has occurred - updating...
[junit4:junit4]   2> 2159 T709 oasc.ShardLeaderElectionContext.waitForReplicasToComeUp Enough replicas found to continue.
[junit4:junit4]   2> 2160 T709 oasc.ShardLeaderElectionContext.runLeaderProcess I may be the new leader - try and sync
[junit4:junit4]   2> 2161 T709 oasc.SyncStrategy.sync Sync replicas to http://127.0.0.1:44841/solr/collection1/
[junit4:junit4]   2> 2162 T709 oasc.SyncStrategy.syncReplicas Sync Success - now sync replicas to me
[junit4:junit4]   2> 2162 T709 oasc.SyncStrategy.syncToMe http://127.0.0.1:44841/solr/collection1/ has no replicas
[junit4:junit4]   2> 2163 T709 oasc.ShardLeaderElectionContext.runLeaderProcess I am the new leader: http://127.0.0.1:44841/solr/collection1/
[junit4:junit4]   2> 2163 T709 oascc.SolrZkClient.makePath makePath: /collections/control_collection/leaders/control_shard
[junit4:junit4]   2> 2180 T714 oazs.PrepRequestProcessor.pRequest Got user-level KeeperException when processing sessionid:0x13a5fc0de710002 type:create cxid:0x88 zxid:0xfffffffffffffffe txntype:unknown reqpath:n/a Error Path:/solr/overseer Error:KeeperErrorCode = NodeExists for /solr/overseer
[junit4:junit4]   2> 2198 T730 oascc.ZkStateReader.updateClusterState Updating cloud state from ZooKeeper... 
[junit4:junit4]   2> 2206 T729 oascc.ZkStateReader$2.process A cluster state change has occurred - updating...
[junit4:junit4]   2> 2234 T709 oasc.ZkController.register We are http://127.0.0.1:44841/solr/collection1/ and leader is http://127.0.0.1:44841/solr/collection1/
[junit4:junit4]   2> 2234 T709 oasc.ZkController.register No LogReplay needed for core=collection1 baseURL=http://127.0.0.1:44841/solr
[junit4:junit4]   2> 2235 T709 oasc.ZkController.checkRecovery I am the leader, no recovery necessary
[junit4:junit4]   2> 2237 T709 oascc.ZkStateReader.updateClusterState Updating cloud state from ZooKeeper... 
[junit4:junit4]   2> 2238 T709 oass.SolrDispatchFilter.init user.dir=/usr/home/hudson/hudson-slave/workspace/Lucene-Solr-Tests-4.x-java7/solr/build/solr-core/test/J0
[junit4:junit4]   2> 2239 T709 oass.SolrDispatchFilter.init SolrDispatchFilter.init() done
[junit4:junit4]   2> 2239 T709 oascsi.HttpClientUtil.createClient Creating new http client, config:maxConnections=128&maxConnectionsPerHost=32&followRedirects=false
[junit4:junit4]   2> 2360 T709 oejs.Server.doStart jetty-8.1.2.v20120308
[junit4:junit4]   2> 2363 T709 oejs.AbstractConnector.doStart Started SocketConnector@0.0.0.0:44847
[junit4:junit4]   2> 2363 T709 oasc.SolrResourceLoader.locateSolrHome JNDI not configured for solr (NoInitialContextEx)
[junit4:junit4]   2> 2364 T709 oasc.SolrResourceLoader.locateSolrHome using system property solr.solr.home: /usr/home/hudson/hudson-slave/workspace/Lucene-Solr-Tests-4.x-java7/solr/build/solr-core/test/J0/./solrtest-jetty1-1350226208556
[junit4:junit4]   2> 2364 T709 oasc.SolrResourceLoader.<init> new SolrResourceLoader for deduced Solr Home: '/usr/home/hudson/hudson-slave/workspace/Lucene-Solr-Tests-4.x-java7/solr/build/solr-core/test/J0/./solrtest-jetty1-1350226208556/'
[junit4:junit4]   2> 2395 T709 oass.SolrDispatchFilter.init SolrDispatchFilter.init()
[junit4:junit4]   2> 2395 T709 oasc.SolrResourceLoader.locateSolrHome JNDI not configured for solr (NoInitialContextEx)
[junit4:junit4]   2> 2395 T709 oasc.SolrResourceLoader.locateSolrHome using system property solr.solr.home: /usr/home/hudson/hudson-slave/workspace/Lucene-Solr-Tests-4.x-java7/solr/build/solr-core/test/J0/./solrtest-jetty1-1350226208556
[junit4:junit4]   2> 2396 T709 oasc.CoreContainer$Initializer.initialize looking for solr.xml: /usr/home/hudson/hudson-slave/workspace/Lucene-Solr-Tests-4.x-java7/solr/build/solr-core/test/J0/./solrtest-jetty1-1350226208556/solr.xml
[junit4:junit4]   2> 2396 T709 oasc.CoreContainer.<init> New CoreContainer 1090698330
[junit4:junit4]   2> 2396 T709 oasc.CoreContainer.load Loading CoreContainer using Solr Home: '/usr/home/hudson/hudson-slave/workspace/Lucene-Solr-Tests-4.x-java7/solr/build/solr-core/test/J0/./solrtest-jetty1-1350226208556/'
[junit4:junit4]   2> 2397 T709 oasc.SolrResourceLoader.<init> new SolrResourceLoader for directory: '/usr/home/hudson/hudson-slave/workspace/Lucene-Solr-Tests-4.x-java7/solr/build/solr-core/test/J0/./solrtest-jetty1-1350226208556/'
[junit4:junit4]   2> 2421 T709 oasc.CoreContainer.load Registering Log Listener
[junit4:junit4]   2> 2432 T709 oasc.CoreContainer.initZooKeeper Zookeeper client=127.0.0.1:44838/solr
[junit4:junit4]   2> 2433 T709 oaz.ZooKeeper.<init> Initiating client connection, connectString=127.0.0.1:44838/solr sessionTimeout=5000 watcher=org.apache.solr.common.cloud.ConnectionManager@22bb3c02
[junit4:junit4]   2> 2434 T742 oaz.ClientCnxn$SendThread.startConnect Opening socket connection to server /127.0.0.1:44838
[junit4:junit4]   2> 2434 T709 oascc.ConnectionManager.waitForConnected Waiting for client to connect to ZooKeeper
[junit4:junit4]   2> 2435 T742 oaz.ClientCnxn$SendThread.primeConnection Socket connection established to localhost/127.0.0.1:44838, initiating session
[junit4:junit4]   2> 2435 T711 oazs.NIOServerCnxn$Factory.run Accepted socket connection from /140.211.11.196:44848
[junit4:junit4]   2> 2436 T711 oazs.NIOServerCnxn.readConnectRequest Client attempting to establish new session at /140.211.11.196:44848
[junit4:junit4]   2> 2438 T713 oazs.NIOServerCnxn.finishSessionInit Established session 0x13a5fc0de710003 with negotiated timeout 5000 for client /140.211.11.196:44848
[junit4:junit4]   2> 2438 T742 oaz.ClientCnxn$SendThread.readConnectResult Session establishment complete on server localhost/127.0.0.1:44838, sessionid = 0x13a5fc0de710003, negotiated timeout = 5000
[junit4:junit4]   2> 2439 T743 oascc.ConnectionManager.process Watcher org.apache.solr.common.cloud.ConnectionManager@22bb3c02 name:ZooKeeperConnection Watcher:127.0.0.1:44838/solr got event WatchedEvent state:SyncConnected type:None path:null path:null type:None
[junit4:junit4]   2> 2439 T709 oascc.ConnectionManager.waitForConnected Client is connected to ZooKeeper
[junit4:junit4]   2> 2440 T714 oazs.PrepRequestProcessor.pRequest Got user-level KeeperException when processing sessionid:0x13a5fc0de710003 type:create cxid:0x1 zxid:0xfffffffffffffffe txntype:unknown reqpath:n/a Error Path:/solr/overseer Error:KeeperErrorCode = NodeExists for /solr/overseer
[junit4:junit4]   2> 2453 T714 oazs.PrepRequestProcessor.pRequest Got user-level KeeperException when processing sessionid:0x13a5fc0de710003 type:create cxid:0x2 zxid:0xfffffffffffffffe txntype:unknown reqpath:n/a Error Path:/solr/overseer Error:KeeperErrorCode = NodeExists for /solr/overseer
[junit4:junit4]   2> 2455 T709 oasc.ZkController.createEphemeralLiveNode Register node as live in ZooKeeper:/live_nodes/127.0.0.1:44847_solr
[junit4:junit4]   2> 2456 T714 oazs.PrepRequestProcessor.pRequest Got user-level KeeperException when processing sessionid:0x13a5fc0de710003 type:delete cxid:0x4 zxid:0xfffffffffffffffe txntype:unknown reqpath:n/a Error Path:/solr/live_nodes/127.0.0.1:44847_solr Error:KeeperErrorCode = NoNode for /solr/live_nodes/127.0.0.1:44847_solr
[junit4:junit4]   2> 2461 T709 oascc.SolrZkClient.makePath makePath: /live_nodes/127.0.0.1:44847_solr
[junit4:junit4]   2> 2464 T729 oascc.ZkStateReader$3.process Updating live nodes
[junit4:junit4]   2> 2465 T709 oashc.HttpShardHandlerFactory.getParameter Setting socketTimeout to: 0
[junit4:junit4]   2> 2465 T709 oashc.HttpShardHandlerFactory.getParameter Setting urlScheme to: http://
[junit4:junit4]   2> 2465 T709 oashc.HttpShardHandlerFactory.getParameter Setting connTimeout to: 0
[junit4:junit4]   2> 2465 T709 oashc.HttpShardHandlerFactory.getParameter Setting maxConnectionsPerHost to: 20
[junit4:junit4]   2> 2466 T709 oashc.HttpShardHandlerFactory.getParameter Setting corePoolSize to: 0
[junit4:junit4]   2> 2466 T709 oashc.HttpShardHandlerFactory.getParameter Setting maximumPoolSize to: 2147483647
[junit4:junit4]   2> 2466 T709 oashc.HttpShardHandlerFactory.getParameter Setting maxThreadIdleTime to: 5
[junit4:junit4]   2> 2467 T709 oashc.HttpShardHandlerFactory.getParameter Setting sizeOfQueue to: -1
[junit4:junit4]   2> 2467 T709 oashc.HttpShardHandlerFactory.getParameter Setting fairnessPolicy to: false
[junit4:junit4]   2> 2467 T709 oascsi.HttpClientUtil.createClient Creating new http client, config:maxConnectionsPerHost=20&maxConnections=10000&socketTimeout=0&connTimeout=0&retry=false
[junit4:junit4]   2> 2483 T709 oascc.ZkStateReader.createClusterStateWatchersAndUpdate Updating cluster state from ZooKeeper... 
[junit4:junit4]   2> 2490 T709 oasc.CoreContainer.create Creating SolrCore 'collection1' using instanceDir: /usr/home/hudson/hudson-slave/workspace/Lucene-Solr-Tests-4.x-java7/solr/build/solr-core/test/J0/./solrtest-jetty1-1350226208556/collection1
[junit4:junit4]   2> 2491 T709 oasc.ZkController.createCollectionZkNode Check for collection zkNode:collection1
[junit4:junit4]   2> 2492 T709 oasc.ZkController.createCollectionZkNode Collection zkNode exists
[junit4:junit4]   2> 2492 T709 oasc.ZkController.readConfigName Load collection config from:/collections/collection1
[junit4:junit4]   2> 2494 T709 oasc.SolrResourceLoader.<init> new SolrResourceLoader for directory: '/usr/home/hudson/hudson-slave/workspace/Lucene-Solr-Tests-4.x-java7/solr/build/solr-core/test/J0/./solrtest-jetty1-1350226208556/collection1/'
[junit4:junit4]   2> 2496 T709 oasc.SolrResourceLoader.replaceClassLoader Adding 'file:/usr/home/hudson/hudson-slave/workspace/Lucene-Solr-Tests-4.x-java7/solr/build/solr-core/test/J0/solrtest-jetty1-1350226208556/collection1/lib/README' to classloader
[junit4:junit4]   2> 2497 T709 oasc.SolrResourceLoader.replaceClassLoader Adding 'file:/usr/home/hudson/hudson-slave/workspace/Lucene-Solr-Tests-4.x-java7/solr/build/solr-core/test/J0/solrtest-jetty1-1350226208556/collection1/lib/classes/' to classloader
[junit4:junit4]   2> 2560 T709 oasc.SolrConfig.<init> Using Lucene MatchVersion: LUCENE_41
[junit4:junit4]   2> 2638 T709 oasc.SolrConfig.<init> Loaded SolrConfig: solrconfig.xml
[junit4:junit4]   2> 2719 T730 oascc.ZkStateReader.updateClusterState Updating cloud state from ZooKeeper... 
[junit4:junit4]   2> 2733 T729 oascc.ZkStateReader$2.process A cluster state change has occurred - updating...
[junit4:junit4]   2> 2740 T743 oascc.ZkStateReader$2.process A cluster state change has occurred - updating...
[junit4:junit4]   2> 2740 T709 oass.IndexSchema.readSchema Reading Solr Schema
[junit4:junit4]   2> 2748 T709 oass.IndexSchema.readSchema Schema name=test
[junit4:junit4]   2> 3400 T709 oass.OpenExchangeRatesOrgProvider.init Initialized with rates=open-exchange-rates.json, refreshInterval=1440.
[junit4:junit4]   2> 3411 T709 oass.IndexSchema.readSchema default search field in schema is text
[junit4:junit4]   2> 3415 T709 oass.IndexSchema.readSchema unique key field: id
[junit4:junit4]   2> 3438 T709 oass.FileExchangeRateProvider.reload Reloading exchange rates from file currency.xml
[junit4:junit4]   2> 3444 T709 oass.FileExchangeRateProvider.reload Reloading exchange rates from file currency.xml
[junit4:junit4]   2> 3451 T709 oass.OpenExchangeRatesOrgProvider.reload Reloading exchange rates from open-exchange-rates.json
[junit4:junit4]   2> 3453 T709 oass.OpenExchangeRatesOrgProvider.reload Reloading exchange rates from open-exchange-rates.json
[junit4:junit4]   2> 3455 T709 oasc.SolrCore.<init> [collection1] Opening new SolrCore at /usr/home/hudson/hudson-slave/workspace/Lucene-Solr-Tests-4.x-java7/solr/build/solr-core/test/J0/./solrtest-jetty1-1350226208556/collection1/, dataDir=./org.apache.solr.cloud.BasicDistributedZkTest-1350226206312/jetty1/
[junit4:junit4]   2> 3455 T709 oasc.JmxMonitoredMap.<init> JMX monitoring is enabled. Adding Solr mbeans to JMX Server: com.sun.jmx.mbeanserver.JmxMBeanServer@149873b7
[junit4:junit4]   2> 3457 T709 oasc.SolrCore.getNewIndexDir New index directory detected: old=null new=./org.apache.solr.cloud.BasicDistributedZkTest-1350226206312/jetty1/index/
[junit4:junit4]   2> 3458 T709 oasc.SolrCore.initIndex WARNING [collection1] Solr index directory './org.apache.solr.cloud.BasicDistributedZkTest-1350226206312/jetty1/index' doesn't exist. Creating new index...
[junit4:junit4]   2> 3459 T709 oasc.CachingDirectoryFactory.get return new directory for /usr/home/hudson/hudson-slave/workspace/Lucene-Solr-Tests-4.x-java7/solr/build/solr-core/test/J0/./org.apache.solr.cloud.BasicDistributedZkTest-1350226206312/jetty1/index forceNew:false
[junit4:junit4]   2> 3500 T709 oasc.SolrDeletionPolicy.onCommit SolrDeletionPolicy.onCommit: commits:num=1
[junit4:junit4]   2> 		commit{dir=NRTCachingDirectory(org.apache.lucene.store.NIOFSDirectory@/usr/home/hudson/hudson-slave/workspace/Lucene-Solr-Tests-4.x-java7/solr/build/solr-core/test/J0/org.apache.solr.cloud.BasicDistributedZkTest-1350226206312/jetty1/index lockFactory=org.apache.lucene.store.NativeFSLockFactory@22274f3f; maxCacheMB=48.0 maxMergeSizeMB=4.0),segFN=segments_1,generation=1,filenames=[segments_1]
[junit4:junit4]   2> 3501 T709 oasc.SolrDeletionPolicy.updateCommits newest commit = 1
[junit4:junit4]   2> 3502 T709 oasc.SolrCore.initWriters created xml: solr.XMLResponseWriter
[junit4:junit4]   2> 3505 T709 oasup.UpdateRequestProcessorChain.init inserting DistributedUpdateProcessorFactory into updateRequestProcessorChain "dedupe"
[junit4:junit4]   2> 3505 T709 oasup.UpdateRequestProcessorChain.init inserting DistributedUpdateProcessorFactory into updateRequestProcessorChain "dedupe-allfields"
[junit4:junit4]   2> 3506 T709 oasup.UpdateRequestProcessorChain.init inserting DistributedUpdateProcessorFactory into updateRequestProcessorChain "stored_sig"
[junit4:junit4]   2> 3507 T709 oasup.UpdateRequestProcessorChain.init inserting DistributedUpdateProcessorFactory into updateRequestProcessorChain "uniq-fields"
[junit4:junit4]   2> 3507 T709 oasup.UpdateRequestProcessorChain.init inserting DistributedUpdateProcessorFactory into updateRequestProcessorChain "distrib-dup-test-chain-implicit"
[junit4:junit4]   2> 3508 T709 oasc.RequestHandlers.initHandlersFromConfig adding lazy requestHandler: solr.ReplicationHandler
[junit4:junit4]   2> 3509 T709 oasc.RequestHandlers.initHandlersFromConfig created /replication: solr.ReplicationHandler
[junit4:junit4]   2> 3509 T709 oasc.RequestHandlers.initHandlersFromConfig created standard: solr.StandardRequestHandler
[junit4:junit4]   2> 3510 T709 oasc.RequestHandlers.initHandlersFromConfig created /get: solr.RealTimeGetHandler
[junit4:junit4]   2> 3511 T709 oasc.RequestHandlers.initHandlersFromConfig created dismax: solr.SearchHandler
[junit4:junit4]   2> 3511 T709 oasc.RequestHandlers.initHandlersFromConfig created mock: org.apache.solr.core.MockQuerySenderListenerReqHandler
[junit4:junit4]   2> 3512 T709 oasc.RequestHandlers.initHandlersFromConfig created /admin/: org.apache.solr.handler.admin.AdminHandlers
[junit4:junit4]   2> 3513 T709 oasc.RequestHandlers.initHandlersFromConfig created defaults: solr.StandardRequestHandler
[junit4:junit4]   2> 3513 T709 oasc.RequestHandlers.initHandlersFromConfig adding lazy requestHandler: solr.StandardRequestHandler
[junit4:junit4]   2> 3514 T709 oasc.RequestHandlers.initHandlersFromConfig created lazy: solr.StandardRequestHandler
[junit4:junit4]   2> 3515 T709 oasc.RequestHandlers.initHandlersFromConfig created /update: solr.UpdateRequestHandler
[junit4:junit4]   2> 3515 T709 oasc.RequestHandlers.initHandlersFromConfig created /terms: org.apache.solr.handler.component.SearchHandler
[junit4:junit4]   2> 3516 T709 oasc.RequestHandlers.initHandlersFromConfig created spellCheckCompRH: org.apache.solr.handler.component.SearchHandler
[junit4:junit4]   2> 3517 T709 oasc.RequestHandlers.initHandlersFromConfig created spellCheckCompRH_Direct: org.apache.solr.handler.component.SearchHandler
[junit4:junit4]   2> 3517 T709 oasc.RequestHandlers.initHandlersFromConfig created spellCheckWithWordbreak: org.apache.solr.handler.component.SearchHandler
[junit4:junit4]   2> 3518 T709 oasc.RequestHandlers.initHandlersFromConfig created spellCheckWithWordbreak_Direct: org.apache.solr.handler.component.SearchHandler
[junit4:junit4]   2> 3519 T709 oasc.RequestHandlers.initHandlersFromConfig created spellCheckCompRH1: org.apache.solr.handler.component.SearchHandler
[junit4:junit4]   2> 3519 T709 oasc.RequestHandlers.initHandlersFromConfig created tvrh: org.apache.solr.handler.component.SearchHandler
[junit4:junit4]   2> 3520 T709 oasc.RequestHandlers.initHandlersFromConfig created /mlt: solr.MoreLikeThisHandler
[junit4:junit4]   2> 3521 T709 oasc.RequestHandlers.initHandlersFromConfig created /debug/dump: solr.DumpRequestHandler
[junit4:junit4]   2> 3539 T709 oashl.XMLLoader.init xsltCacheLifetimeSeconds=60
[junit4:junit4]   2> 3547 T709 oasc.SolrCore.initDeprecatedSupport WARNING solrconfig.xml uses deprecated <admin/gettableFiles>, Please update your config to use the ShowFileRequestHandler.
[junit4:junit4]   2> 3549 T709 oasc.SolrCore.initDeprecatedSupport WARNING adding ShowFileRequestHandler with hidden files: [SCHEMA.XML, OLD_SYNONYMS.TXT, STOPWORDS.TXT, PROTWORDS.TXT, OPEN-EXCHANGE-RATES.JSON, SYNONYMS.TXT, CURRENCY.XML, MAPPING-ISOLATIN1ACCENT.TXT]
[junit4:junit4]   2> 3557 T709 oass.SolrIndexSearcher.<init> Opening Searcher@323f0b41 main
[junit4:junit4]   2> 3559 T709 oasu.CommitTracker.<init> Hard AutoCommit: disabled
[junit4:junit4]   2> 3560 T709 oasu.CommitTracker.<init> Soft AutoCommit: disabled
[junit4:junit4]   2> 3561 T709 oashc.SpellCheckComponent.inform Initializing spell checkers
[junit4:junit4]   2> 3609 T709 oass.DirectSolrSpellChecker.init init: {name=direct,classname=DirectSolrSpellChecker,field=lowerfilt,minQueryLength=3}
[junit4:junit4]   2> 3780 T744 oasc.SolrCore.registerSearcher [collection1] Registered new searcher Searcher@323f0b41 main{StandardDirectoryReader(segments_1:1)}
[junit4:junit4]   2> 4243 T730 oascc.ZkStateReader.updateClusterState Updating cloud state from ZooKeeper... 
[junit4:junit4]   2> 4264 T729 oascc.ZkStateReader$2.process A cluster state change has occurred - updating...
[junit4:junit4]   2> 4264 T743 oascc.ZkStateReader$2.process A cluster state change has occurred - updating...
[junit4:junit4]   2> 4287 T709 oasc.CoreContainer.register registering core: collection1
[junit4:junit4]   2> 4287 T709 oasc.ZkController.register Register shard - core:collection1 address:http://127.0.0.1:44847/solr shardId:shard1
[junit4:junit4]   2> 4288 T709 oascc.SolrZkClient.makePath makePath: /collections/collection1/leader_elect/shard1/election
[junit4:junit4]   2> 4306 T714 oazs.PrepRequestProcessor.pRequest Got user-level KeeperException when processing sessionid:0x13a5fc0de710003 type:delete cxid:0x43 zxid:0xfffffffffffffffe txntype:unknown reqpath:n/a Error Path:/solr/collections/collection1/leaders Error:KeeperErrorCode = NoNode for /solr/collections/collection1/leaders
[junit4:junit4]   2> 4307 T709 oasc.ShardLeaderElectionContext.runLeaderProcess Running the leader process.
[junit4:junit4]   2> 4308 T714 oazs.PrepRequestProcessor.pRequest Got user-level KeeperException when processing sessionid:0x13a5fc0de710003 type:create cxid:0x44 zxid:0xfffffffffffffffe txntype:unknown reqpath:n/a Error Path:/solr/overseer Error:KeeperErrorCode = NodeExists for /solr/overseer
[junit4:junit4]   2> 4320 T709 oasc.ShardLeaderElectionContext.waitForReplicasToComeUp Enough replicas found to continue.
[junit4:junit4]   2> 4320 T709 oasc.ShardLeaderElectionContext.runLeaderProcess I may be the new leader - try and sync
[junit4:junit4]   2> 4321 T709 oasc.SyncStrategy.sync Sync replicas to http://127.0.0.1:44847/solr/collection1/
[junit4:junit4]   2> 4321 T709 oasc.SyncStrategy.syncReplicas Sync Success - now sync replicas to me
[junit4:junit4]   2> 4322 T709 oasc.SyncStrategy.syncToMe http://127.0.0.1:44847/solr/collection1/ has no replicas
[junit4:junit4]   2> 4322 T709 oasc.ShardLeaderElectionContext.runLeaderProcess I am the new leader: http://127.0.0.1:44847/solr/collection1/
[junit4:junit4]   2> 4323 T709 oascc.SolrZkClient.makePath makePath: /collections/collection1/leaders/shard1
[junit4:junit4]   2> 4328 T714 oazs.PrepRequestProcessor.pRequest Got user-level KeeperException when processing sessionid:0x13a5fc0de710003 type:create cxid:0x4e zxid:0xfffffffffffffffe txntype:unknown reqpath:n/a Error Path:/solr/overseer Error:KeeperErrorCode = NodeExists for /solr/overseer
[junit4:junit4]   2> 4769 T730 oascc.ZkStateReader.updateClusterState Updating cloud state from ZooKeeper... 
[junit4:junit4]   2> 4791 T729 oascc.ZkStateReader$2.process A cluster state change has occurred - updating...
[junit4:junit4]   2> 4791 T743 oascc.ZkStateReader$2.process A cluster state change has occurred - updating...
[junit4:junit4]   2> 4797 T709 oasc.ZkController.register We are http://127.0.0.1:44847/solr/collection1/ and leader is http://127.0.0.1:44847/solr/collection1/
[junit4:junit4]   2> 4797 T709 oasc.ZkController.register No LogReplay needed for core=collection1 baseURL=http://127.0.0.1:44847/solr
[junit4:junit4]   2> 4798 T709 oasc.ZkController.checkRecovery I am the leader, no recovery necessary
[junit4:junit4]   2> 4805 T709 oascc.ZkStateReader.updateClusterState Updating cloud state from ZooKeeper... 
[junit4:junit4]   2> 4806 T709 oass.SolrDispatchFilter.init user.dir=/usr/home/hudson/hudson-slave/workspace/Lucene-Solr-Tests-4.x-java7/solr/build/solr-core/test/J0
[junit4:junit4]   2> 4806 T709 oass.SolrDispatchFilter.init SolrDispatchFilter.init() done
[junit4:junit4]   2> 4807 T709 oascsi.HttpClientUtil.createClient Creating new http client, config:maxConnections=128&maxConnectionsPerHost=32&followRedirects=false
[junit4:junit4]   2> 4992 T709 oejs.Server.doStart jetty-8.1.2.v20120308
[junit4:junit4]   2> 4995 T709 oejs.AbstractConnector.doStart Started SocketConnector@0.0.0.0:44853
[junit4:junit4]   2> 4996 T709 oasc.SolrResourceLoader.locateSolrHome JNDI not configured for solr (NoInitialContextEx)
[junit4:junit4]   2> 4996 T709 oasc.SolrResourceLoader.locateSolrHome using system property solr.solr.home: /usr/home/hudson/hudson-slave/workspace/Lucene-Solr-Tests-4.x-java7/solr/build/solr-core/test/J0/./solrtest-jetty2-1350226211131
[junit4:junit4]   2> 4997 T709 oasc.SolrResourceLoader.<init> new SolrResourceLoader for deduced Solr Home: '/usr/home/hudson/hudson-slave/workspace/Lucene-Solr-Tests-4.x-java7/solr/build/solr-core/test/J0/./solrtest-jetty2-1350226211131/'
[junit4:junit4]   2> 5043 T709 oass.SolrDispatchFilter.init SolrDispatchFilter.init()
[junit4:junit4]   2> 5043 T709 oasc.SolrResourceLoader.locateSolrHome JNDI not configured for solr (NoInitialContextEx)
[junit4:junit4]   2> 5044 T709 oasc.SolrResourceLoader.locateSolrHome using system property solr.solr.home: /usr/home/hudson/hudson-slave/workspace/Lucene-Solr-Tests-4.x-java7/solr/build/solr-core/test/J0/./solrtest-jetty2-1350226211131
[junit4:junit4]   2> 5044 T709 oasc.CoreContainer$Initializer.initialize looking for solr.xml: /usr/home/hudson/hudson-slave/workspace/Lucene-Solr-Tests-4.x-java7/solr/build/solr-core/test/J0/./solrtest-jetty2-1350226211131/solr.xml
[junit4:junit4]   2> 5045 T709 oasc.CoreContainer.<init> New CoreContainer 1334328500
[junit4:junit4]   2> 5045 T709 oasc.CoreContainer.load Loading CoreContainer using Solr Home: '/usr/home/hudson/hudson-slave/workspace/Lucene-Solr-Tests-4.x-java7/solr/build/solr-core/test/J0/./solrtest-jetty2-1350226211131/'
[junit4:junit4]   2> 5046 T709 oasc.SolrResourceLoader.<init> new SolrResourceLoader for directory: '/usr/home/hudson/hudson-slave/workspace/Lucene-Solr-Tests-4.x-java7/solr/build/solr-core/test/J0/./solrtest-jetty2-1350226211131/'
[junit4:junit4]   2> 5091 T709 oasc.CoreContainer.load Registering Log Listener
[junit4:junit4]   2> 5110 T709 oasc.CoreContainer.initZooKeeper Zookeeper client=127.0.0.1:44838/solr
[junit4:junit4]   2> 5111 T709 oaz.ZooKeeper.<init> Initiating client connection, connectString=127.0.0.1:44838/solr sessionTimeout=5000 watcher=org.apache.solr.common.cloud.ConnectionManager@3618543c
[junit4:junit4]   2> 5112 T754 oaz.ClientCnxn$SendThread.startConnect Opening socket connection to server /127.0.0.1:44838
[junit4:junit4]   2> 5112 T709 oascc.ConnectionManager.waitForConnected Waiting for client to connect to ZooKeeper
[junit4:junit4]   2> 5113 T754 oaz.ClientCnxn$SendThread.primeConnection Socket connection established to localhost/127.0.0.1:44838, initiating session
[junit4:junit4]   2> 5113 T711 oazs.NIOServerCnxn$Factory.run Accepted socket connection from /140.211.11.196:44856
[junit4:junit4]   2> 5114 T711 oazs.NIOServerCnxn.readConnectRequest Client attempting to establish new session at /140.211.11.196:44856
[junit4:junit4]   2> 5115 T713 oazs.NIOServerCnxn.finishSessionInit Established session 0x13a5fc0de710004 with negotiated timeout 5000 for client /140.211.11.196:44856
[junit4:junit4]   2> 5115 T754 oaz.ClientCnxn$SendThread.readConnectResult Session establishment complete on server localhost/127.0.0.1:44838, sessionid = 0x13a5fc0de710004, negotiated timeout = 5000
[junit4:junit4]   2> 5116 T755 oascc.ConnectionManager.process Watcher org.apache.solr.common.cloud.ConnectionManager@3618543c name:ZooKeeperConnection Watcher:127.0.0.1:44838/solr got event WatchedEvent state:SyncConnected type:None path:null path:null type:None
[junit4:junit4]   2> 5116 T709 oascc.ConnectionManager.waitForConnected Client is connected to ZooKeeper
[junit4:junit4]   2> 5117 T714 oazs.PrepRequestProcessor.pRequest Got user-level KeeperException when processing sessionid:0x13a5fc0de710004 type:create cxid:0x1 zxid:0xfffffffffffffffe txntype:unknown reqpath:n/a Error Path:/solr/overseer Error:KeeperErrorCode = NodeExists for /solr/overseer
[junit4:junit4]   2> 5118 T714 oazs.PrepRequestProcessor.pRequest Got user-level KeeperException when processing sessionid:0x13a5fc0de710004 type:create cxid:0x2 zxid:0xfffffffffffffffe txntype:unknown reqpath:n/a Error Path:/solr/overseer Error:KeeperErrorCode = NodeExists for /solr/overseer
[junit4:junit4]   2> 5126 T709 oasc.ZkController.createEphemeralLiveNode Register node as live in ZooKeeper:/live_nodes/127.0.0.1:44853_solr
[junit4:junit4]   2> 5127 T714 oazs.PrepRequestProcessor.pRequest Got user-level KeeperException when processing sessionid:0x13a5fc0de710004 type:delete cxid:0x4 zxid:0xfffffffffffffffe txntype:unknown reqpath:n/a Error Path:/solr/live_nodes/127.0.0.1:44853_solr Error:KeeperErrorCode = NoNode for /solr/live_nodes/127.0.0.1:44853_solr
[junit4:junit4]   2> 5128 T709 oascc.SolrZkClient.makePath makePath: /live_nodes/127.0.0.1:44853_solr
[junit4:junit4]   2> 5131 T729 oascc.ZkStateReader$3.process Updating live nodes
[junit4:junit4]   2> 5131 T743 oascc.ZkStateReader$3.process Updating live nodes
[junit4:junit4]   2> 5132 T709 oashc.HttpShardHandlerFactory.getParameter Setting socketTimeout to: 0
[junit4:junit4]   2> 5132 T709 oashc.HttpShardHandlerFactory.getParameter Setting urlScheme to: http://
[junit4:junit4]   2> 5133 T709 oashc.HttpShardHandlerFactory.getParameter Setting connTimeout to: 0
[junit4:junit4]   2> 5133 T709 oashc.HttpShardHandlerFactory.getParameter Setting maxConnectionsPerHost to: 20
[junit4:junit4]   2> 5133 T709 oashc.HttpShardHandlerFactory.getParameter Setting corePoolSize to: 0
[junit4:junit4]   2> 5134 T709 oashc.HttpShardHandlerFactory.getParameter Setting maximumPoolSize to: 2147483647
[junit4:junit4]   2> 5134 T709 oashc.HttpShardHandlerFactory.getParameter Setting maxThreadIdleTime to: 5
[junit4:junit4]   2> 5134 T709 oashc.HttpShardHandlerFactory.getParameter Setting sizeOfQueue to: -1
[junit4:junit4]   2> 5135 T709 oashc.HttpShardHandlerFactory.getParameter Setting fairnessPolicy to: false
[junit4:junit4]   2> 5135 T709 oascsi.HttpClientUtil.createClient Creating new http client, config:maxConnectionsPerHost=20&maxConnections=10000&socketTimeout=0&connTimeout=0&retry=false
[junit4:junit4]   2> 5148 T709 oascc.ZkStateReader.createClusterStateWatchersAndUpdate Updating cluster state from ZooKeeper... 
[junit4:junit4]   2> 5153 T709 oasc.CoreContainer.create Creating SolrCore 'collection1' using instanceDir: /usr/home/hudson/hudson-slave/workspace/Lucene-Solr-Tests-4.x-java7/solr/build/solr-core/test/J0/./solrtest-jetty2-1350226211131/collection1
[junit4:junit4]   2> 5153 T709 oasc.ZkController.createCollectionZkNode Check for collection zkNode:collection1
[junit4:junit4]   2> 5154 T709 oasc.ZkController.createCollectionZkNode Collection zkNode exists
[junit4:junit4]   2> 5154 T709 oasc.ZkController.readConfigName Load collection config from:/collections/collection1
[junit4:junit4]   2> 5156 T709 oasc.SolrResourceLoader.<init> new SolrResourceLoader for directory: '/usr/home/hudson/hudson-slave/workspace/Lucene-Solr-Tests-4.x-java7/solr/build/solr-core/test/J0/./solrtest-jetty2-1350226211131/collection1/'
[junit4:junit4]   2> 5157 T709 oasc.SolrResourceLoader.replaceClassLoader Adding 'file:/usr/home/hudson/hudson-slave/workspace/Lucene-Solr-Tests-4.x-java7/solr/build/solr-core/test/J0/solrtest-jetty2-1350226211131/collection1/lib/classes/' to classloader
[junit4:junit4]   2> 5157 T709 oasc.SolrResourceLoader.replaceClassLoader Adding 'file:/usr/home/hudson/hudson-slave/workspace/Lucene-Solr-Tests-4.x-java7/solr/build/solr-core/test/J0/solrtest-jetty2-1350226211131/collection1/lib/README' to classloader
[junit4:junit4]   2> 5193 T709 oasc.SolrConfig.<init> Using Lucene MatchVersion: LUCENE_41
[junit4:junit4]   2> 5241 T709 oasc.SolrConfig.<init> Loaded SolrConfig: solrconfig.xml
[junit4:junit4]   2> 5299 T730 oascc.ZkStateReader.updateClusterState Updating cloud state from ZooKeeper... 
[junit4:junit4]   2> 5312 T729 oascc.ZkStateReader$2.process A cluster state change has occurred - updating...
[junit4:junit4]   2> 5312 T743 oascc.ZkStateReader$2.process A cluster state change has occurred - updating...
[junit4:junit4]   2> 5342 T755 oascc.ZkStateReader$2.process A cluster state change has occurred - updating...
[junit4:junit4]   2> 5342 T709 oass.IndexSchema.readSchema Reading Solr Schema
[junit4:junit4]   2> 5347 T709 oass.IndexSchema.readSchema Schema name=test
[junit4:junit4]   2> 5769 T709 oass.OpenExchangeRatesOrgProvider.init Initialized with rates=open-exchange-rates.json, refreshInterval=1440.
[junit4:junit4]   2> 5777 T709 oass.IndexSchema.readSchema default search field in schema is text
[junit4:junit4]   2> 5779 T709 oass.IndexSchema.readSchema unique key field: id
[junit4:junit4]   2> 5793 T709 oass.FileExchangeRateProvider.reload Reloading exchange rates from file currency.xml
[junit4:junit4]   2> 5797 T709 oass.FileExchangeRateProvider.reload Reloading exchange rates from file currency.xml
[junit4:junit4]   2> 5801 T709 oass.OpenExchangeRatesOrgProvider.reload Reloading exchange rates from open-exchange-rates.json
[junit4:junit4]   2> 5802 T709 oass.OpenExchangeRatesOrgProvider.reload Reloading exchange rates from open-exchange-rates.json
[junit4:junit4]   2> 5803 T709 oasc.SolrCore.<init> [collection1] Opening new SolrCore at /usr/home/hudson/hudson-slave/workspace/Lucene-Solr-Tests-4.x-java7/solr/build/solr-core/test/J0/./solrtest-jetty2-1350226211131/collection1/, dataDir=./org.apache.solr.cloud.BasicDistributedZkTest-1350226206312/jetty2/
[junit4:junit4]   2> 5804 T709 oasc.JmxMonitoredMap.<init> JMX monitoring is enabled. Adding Solr mbeans to JMX Server: com.sun.jmx.mbeanserver.JmxMBeanServer@149873b7
[junit4:junit4]   2> 5805 T709 oasc.SolrCore.getNewIndexDir New index directory detected: old=null new=./org.apache.solr.cloud.BasicDistributedZkTest-1350226206312/jetty2/index/
[junit4:junit4]   2> 5805 T709 oasc.SolrCore.initIndex WARNING [collection1] Solr index directory './org.apache.solr.cloud.BasicDistributedZkTest-1350226206312/jetty2/index' doesn't exist. Creating new index...
[junit4:junit4]   2> 5806 T709 oasc.CachingDirectoryFactory.get return new directory for /usr/home/hudson/hudson-slave/workspace/Lucene-Solr-Tests-4.x-java7/solr/build/solr-core/test/J0/./org.apache.solr.cloud.BasicDistributedZkTest-1350226206312/jetty2/index forceNew:false
[junit4:junit4]   2> 5812 T709 oasc.SolrDeletionPolicy.onCommit SolrDeletionPolicy.onCommit: commits:num=1
[junit4:junit4]   2> 		commit{dir=NRTCachingDirectory(org.apache.lucene.store.NIOFSDirectory@/usr/home/hudson/hudson-slave/workspace/Lucene-Solr-Tests-4.x-java7/solr/build/solr-core/test/J0/org.apache.solr.cloud.BasicDistributedZkTest-1350226206312/jetty2/index lockFactory=org.apache.lucene.store.NativeFSLockFactory@4ee209a; maxCacheMB=48.0 maxMergeSizeMB=4.0),segFN=segments_1,generation=1,filenames=[segments_1]
[junit4:junit4]   2> 5813 T709 oasc.SolrDeletionPolicy.updateCommits newest commit = 1
[junit4:junit4]   2> 5813 T709 oasc.SolrCore.initWriters created xml: solr.XMLResponseWriter
[junit4:junit4]   2> 5815 T709 oasup.UpdateRequestProcessorChain.init inserting DistributedUpdateProcessorFactory into updateRequestProcessorChain "dedupe"
[junit4:junit4]   2> 5816 T709 oasup.UpdateRequestProcessorChain.init inserting DistributedUpdateProcessorFactory into updateRequestProcessorChain "dedupe-allfields"
[junit4:junit4]   2> 5816 T709 oasup.UpdateRequestProcessorChain.init inserting DistributedUpdateProcessorFactory into updateRequestProcessorChain "stored_sig"
[junit4:junit4]   2> 5817 T709 oasup.UpdateRequestProcessorChain.init inserting DistributedUpdateProcessorFactory into updateRequestProcessorChain "uniq-fields"
[junit4:junit4]   2> 5817 T709 oasup.UpdateRequestProcessorChain.init inserting DistributedUpdateProcessorFactory into updateRequestProcessorChain "distrib-dup-test-chain-implicit"
[junit4:junit4]   2> 5817 T709 oasc.RequestHandlers.initHandlersFromConfig adding lazy requestHandler: solr.ReplicationHandler
[junit4:junit4]   2> 5818 T709 oasc.RequestHandlers.initHandlersFromConfig created /replication: solr.ReplicationHandler
[junit4:junit4]   2> 5818 T709 oasc.RequestHandlers.initHandlersFromConfig created standard: solr.StandardRequestHandler
[junit4:junit4]   2> 5819 T709 oasc.RequestHandlers.initHandlersFromConfig created /get: solr.RealTimeGetHandler
[junit4:junit4]   2> 5820 T709 oasc.RequestHandlers.initHandlersFromConfig created dismax: solr.SearchHandler
[junit4:junit4]   2> 5820 T709 oasc.RequestHandlers.initHandlersFromConfig created mock: org.apache.solr.core.MockQuerySenderListenerReqHandler
[junit4:junit4]   2> 5821 T709 oasc.RequestHandlers.initHandlersFromConfig created /admin/: org.apache.solr.handler.admin.AdminHandlers
[junit4:junit4]   2> 5821 T709 oasc.RequestHandlers.initHandlersFromConfig created defaults: solr.StandardRequestHandler
[junit4:junit4]   2> 5821 T709 oasc.RequestHandlers.initHandlersFromConfig adding lazy requestHandler: solr.StandardRequestHandler
[junit4:junit4]   2> 5822 T709 oasc.RequestHandlers.initHandlersFromConfig created lazy: solr.StandardRequestHandler
[junit4:junit4]   2> 5822 T709 oasc.RequestHandlers.initHandlersFromConfig created /update: solr.UpdateRequestHandler
[junit4:junit4]   2> 5823 T709 oasc.RequestHandlers.initHandlersFromConfig created /terms: org.apache.solr.handler.component.SearchHandler
[junit4:junit4]   2> 5823 T709 oasc.RequestHandlers.initHandlersFromConfig created spellCheckCompRH: org.apache.solr.handler.component.SearchHandler
[junit4:junit4]   2> 5824 T709 oasc.RequestHandlers.initHandlersFromConfig created spellCheckCompRH_Direct: org.apache.solr.handler.component.SearchHandler
[junit4:junit4]   2> 5824 T709 oasc.RequestHandlers.initHandlersFromConfig created spellCheckWithWordbreak: org.apache.solr.handler.component.SearchHandler
[junit4:junit4]   2> 5825 T709 oasc.RequestHandlers.initHandlersFromConfig created spellCheckWithWordbreak_Direct: org.apache.solr.handler.component.SearchHandler
[junit4:junit4]   2> 5825 T709 oasc.RequestHandlers.initHandlersFromConfig created spellCheckCompRH1: org.apache.solr.handler.component.SearchHandler
[junit4:junit4]   2> 5826 T709 oasc.RequestHandlers.initHandlersFromConfig created tvrh: org.apache.solr.handler.component.SearchHandler
[junit4:junit4]   2> 5826 T709 oasc.RequestHandlers.initHandlersFromConfig created /mlt: solr.MoreLikeThisHandler
[junit4:junit4]   2> 5827 T709 oasc.RequestHandlers.initHandlersFromConfig created /debug/dump: solr.DumpRequestHandler
[junit4:junit4]   2> 5835 T709 oashl.XMLLoader.init xsltCacheLifetimeSeconds=60
[junit4:junit4]   2> 5839 T709 oasc.SolrCore.initDeprecatedSupport WARNING solrconfig.xml uses deprecated <admin/gettableFiles>, Please update your config to use the ShowFileRequestHandler.
[junit4:junit4]   2> 5840 T709 oasc.SolrCore.initDeprecatedSupport WARNING adding ShowFileRequestHandler with hidden files: [SCHEMA.XML, OLD_SYNONYMS.TXT, STOPWORDS.TXT, PROTWORDS.TXT, OPEN-EXCHANGE-RATES.JSON, SYNONYMS.TXT, CURRENCY.XML, MAPPING-ISOLATIN1ACCENT.TXT]
[junit4:junit4]   2> 5842 T709 oass.SolrIndexSearcher.<init> Opening Searcher@6e0f9c7e main
[junit4:junit4]   2> 5843 T709 oasu.CommitTracker.<init> Hard AutoCommit: disabled
[junit4:junit4]   2> 5844 T709 oasu.CommitTracker.<init> Soft AutoCommit: disabled
[junit4:junit4]   2> 5844 T709 oashc.SpellCheckComponent.inform Initializing spell checkers
[junit4:junit4]   2> 5850 T709 oass.DirectSolrSpellChecker.init init: {name=direct,classname=DirectSolrSpellChecker,field=lowerfilt,minQueryLength=3}
[junit4:junit4]   2> 5895 T756 oasc.SolrCore.registerSearcher [collection1] Registered new searcher Searcher@6e0f9c7e main{StandardDirectoryReader(segments_1:1)}
[junit4:junit4]   2> 6320 T730 oascc.ZkStateReader.updateClusterState Updating cloud state from ZooKeeper... 
[junit4:junit4]   2> 6331 T729 oascc.ZkStateReader$2.process A cluster state change has occurred - updating...
[junit4:junit4]   2> 6331 T755 oascc.ZkStateReader$2.process A cluster state change has occurred - updating...
[junit4:junit4]   2> 6331 T743 oascc.ZkStateReader$2.process A cluster state change has occurred - updating...
[junit4:junit4]   2> 6401 T709 oasc.CoreContainer.register registering core: collection1
[junit4:junit4]   2> 6401 T709 oasc.ZkController.register Register shard - core:collection1 address:http://127.0.0.1:44853/solr shardId:shard2
[junit4:junit4]   2> 6402 T709 oascc.SolrZkClient.makePath makePath: /collections/collection1/leader_elect/shard2/election
[junit4:junit4]   2> 6418 T714 oazs.PrepRequestProcessor.pRequest Got user-level KeeperException when processing sessionid:0x13a5fc0de710004 type:delete cxid:0x42 zxid:0xfffffffffffffffe txntype:unknown reqpath:n/a Error Path:/solr/collections/collection1/leaders/shard2 Error:KeeperErrorCode = NoNode for /solr/collections/collection1/leaders/shard2
[junit4:junit4]   2> 6418 T709 oasc.ShardLeaderElectionContext.runLeaderProcess Running the leader process.
[junit4:junit4]   2> 6419 T714 oazs.PrepRequestProcessor.pRequest Got user-level KeeperException when processing sessionid:0x13a5fc0de710004 type:create cxid:0x43 zxid:0xfffffffffffffffe txntype:unknown reqpath:n/a Error Path:/solr/overseer Error:KeeperErrorCode = NodeExists for /solr/overseer
[junit4:junit4]   2> 6421 T709 oasc.ShardLeaderElectionContext.waitForReplicasToComeUp Enough replicas found to continue.
[junit4:junit4]   2> 6422 T709 oasc.ShardLeaderElectionContext.runLeaderProcess I may be the new leader - try and sync
[junit4:junit4]   2> 6422 T709 oasc.SyncStrategy.sync Sync replicas to http://127.0.0.1:44853/solr/collection1/
[junit4:junit4]   2> 6423 T709 oasc.SyncStrategy.syncReplicas Sync Success - now sync replicas to me
[junit4:junit4]   2> 6423 T709 oasc.SyncStrategy.syncToMe http://127.0.0.1:44853/solr/collection1/ has no replicas
[junit4:junit4]   2> 6424 T709 oasc.ShardLeaderElectionContext.runLeaderProcess I am the new leader: http://127.0.0.1:44853/solr/collection1/
[junit4:junit4]   2> 6424 T709 oascc.SolrZkClient.makePath makePath: /collections/collection1/leaders/shard2
[junit4:junit4]   2> 6428 T714 oazs.PrepRequestProcessor.pRequest Got user-level KeeperException when processing sessionid:0x13a5fc0de710004 type:create cxid:0x4c zxid:0xfffffffffffffffe txntype:unknown reqpath:n/a Error Path:/solr/overseer Error:KeeperErrorCode = NodeExists for /solr/overseer
[junit4:junit4]   2> 6837 T730 oascc.ZkStateReader.updateClusterState Updating cloud state from ZooKeeper... 
[junit4:junit4]   2> 6858 T729 oascc.ZkStateReader$2.process A cluster state change has occurred - updating...
[junit4:junit4]   2> 6858 T755 oascc.ZkStateReader$2.process A cluster state change has occurred - updating...
[junit4:junit4]   2> 6858 T743 oascc.ZkStateReader$2.process A cluster state change has occurred - updating...
[junit4:junit4]   2> 6897 T709 oasc.ZkController.register We are http://127.0.0.1:44853/solr/collection1/ and leader is http://127.0.0.1:44853/solr/collection1/
[junit4:junit4]   2> 6897 T709 oasc.ZkController.register No LogReplay needed for core=collection1 baseURL=http://127.0.0.1:44853/solr
[junit4:junit4]   2> 6898 T709 oasc.ZkController.checkRecovery I am the leader, no recovery necessary
[junit4:junit4]   2> 6900 T709 oascc.ZkStateReader.updateClusterState Updating cloud state from ZooKeeper... 
[junit4:junit4]   2> 6901 T709 oass.SolrDispatchFilter.init user.dir=/usr/home/hudson/hudson-slave/workspace/Lucene-Solr-Tests-4.x-java7/solr/build/solr-core/test/J0
[junit4:junit4]   2> 6901 T709 oass.SolrDispatchFilter.init SolrDispatchFilter.init() done
[junit4:junit4]   2> 6902 T709 oascsi.HttpClientUtil.createClient Creating new http client, config:maxConnections=128&maxConnectionsPerHost=32&followRedirects=false
[junit4:junit4]   2> 7078 T709 oejs.Server.doStart jetty-8.1.2.v20120308
[junit4:junit4]   2> 7082 T709 oejs.AbstractConnector.doStart Started SocketConnector@0.0.0.0:44858
[junit4:junit4]   2> 7083 T709 oasc.SolrResourceLoader.locateSolrHome JNDI not configured for solr (NoInitialContextEx)
[junit4:junit4]   2> 7083 T709 oasc.SolrResourceLoader.locateSolrHome using system property solr.solr.home: /usr/home/hudson/hudson-slave/workspace/Lucene-Solr-Tests-4.x-java7/solr/build/solr-core/test/J0/./solrtest-jetty3-1350226213224
[junit4:junit4]   2> 7084 T709 oasc.SolrResourceLoader.<init> new SolrResourceLoader for deduced Solr Home: '/usr/home/hudson/hudson-slave/workspace/Lucene-Solr-Tests-4.x-java7/solr/build/solr-core/test/J0/./solrtest-jetty3-1350226213224/'
[junit4:junit4]   2> 7126 T709 oass.SolrDispatchFilter.init SolrDispatchFilter.init()
[junit4:junit4]   2> 7126 T709 oasc.SolrResourceLoader.locateSolrHome JNDI not configured for solr (NoInitialContextEx)
[junit4:junit4]   2> 7127 T709 oasc.SolrResourceLoader.locateSolrHome using system property solr.solr.home: /usr/home/hudson/hudson-slave/workspace/Lucene-Solr-Tests-4.x-java7/solr/build/solr-core/test/J0/./solrtest-jetty3-1350226213224
[junit4:junit4]   2> 7127 T709 oasc.CoreContainer$Initializer.initialize looking for solr.xml: /usr/home/hudson/hudson-slave/workspace/Lucene-Solr-Tests-4.x-java7/solr/build/solr-core/test/J0/./solrtest-jetty3-1350226213224/solr.xml
[junit4:junit4]   2> 7128 T709 oasc.CoreContainer.<init> New CoreContainer 140717084
[junit4:junit4]   2> 7128 T709 oasc.CoreContainer.load Loading CoreContainer using Solr Home: '/usr/home/hudson/hudson-slave/workspace/Lucene-Solr-Tests-4.x-java7/solr/build/solr-core/test/J0/./solrtest-jetty3-1350226213224/'
[junit4:junit4]   2> 7129 T709 oasc.SolrResourceLoader.<init> new SolrResourceLoader for directory: '/usr/home/hudson/hudson-slave/workspace/Lucene-Solr-Tests-4.x-java7/solr/build/solr-core/test/J0/./solrtest-jetty3-1350226213224/'
[junit4:junit4]   2> 7161 T709 oasc.CoreContainer.load Registering Log Listener
[junit4:junit4]   2> 7177 T709 oasc.CoreContainer.initZooKeeper Zookeeper client=127.0.0.1:44838/solr
[junit4:junit4]   2> 7178 T709 oaz.ZooKeeper.<init> Initiating client connection, connectString=127.0.0.1:44838/solr sessionTimeout=5000 watcher=org.apache.solr.common.cloud.ConnectionManager@4cd89b4e
[junit4:junit4]   2> 7179 T766 oaz.ClientCnxn$SendThread.startConnect Opening socket connection to server /127.0.0.1:44838
[junit4:junit4]   2> 7179 T709 oascc.ConnectionManager.waitForConnected Waiting for client to connect to ZooKeeper
[junit4:junit4]   2> 7180 T766 oaz.ClientCnxn$SendThread.primeConnection Socket connection established to localhost/127.0.0.1:44838, initiating session
[junit4:junit4]   2> 7180 T711 oazs.NIOServerCnxn$Factory.run Accepted socket connection from /140.211.11.196:44859
[junit4:junit4]   2> 7181 T711 oazs.NIOServerCnxn.readConnectRequest Client attempting to establish new session at /140.211.11.196:44859
[junit4:junit4]   2> 7183 T713 oazs.NIOServerCnxn.finishSessionInit Established session 0x13a5fc0de710005 with negotiated timeout 5000 for client /140.211.11.196:44859
[junit4:junit4]   2> 7183 T766 oaz.ClientCnxn$SendThread.readConnectResult Session establishment complete on server localhost/127.0.0.1:44838, sessionid = 0x13a5fc0de710005, negotiated timeout = 5000
[junit4:junit4]   2> 7183 T767 oascc.ConnectionManager.process Watcher org.apache.solr.common.cloud.ConnectionManager@4cd89b4e name:ZooKeeperConnection Watcher:127.0.0.1:44838/solr got event WatchedEvent state:SyncConnected type:None path:null path:null type:None
[junit4:junit4]   2> 7184 T709 oascc.ConnectionManager.waitForConnected Client is connected to ZooKeeper
[junit4:junit4]   2> 7184 T714 oazs.PrepRequestProcessor.pRequest Got user-level KeeperException when processing sessionid:0x13a5fc0de710005 type:create cxid:0x1 zxid:0xfffffffffffffffe txntype:unknown reqpath:n/a Error Path:/solr/overseer Error:KeeperErrorCode = NodeExists for /solr/overseer
[junit4:junit4]   2> 7196 T714 oazs.PrepRequestProcessor.pRequest Got user-level KeeperException when processing sessionid:0x13a5fc0de710005 type:create cxid:0x2 zxid:0xfffffffffffffffe txntype:unknown reqpath:n/a Error Path:/solr/overseer Error:KeeperErrorCode = NodeExists for /solr/overseer
[junit4:junit4]   2> 7197 T709 oasc.ZkController.createEphemeralLiveNode Register node as live in ZooKeeper:/live_nodes/127.0.0.1:44858_solr
[junit4:junit4]   2> 7198 T714 oazs.PrepRequestProcessor.pRequest Got user-level KeeperException when processing sessionid:0x13a5fc0de710005 type:delete cxid:0x4 zxid:0xfffffffffffffffe txntype:unknown reqpath:n/a Error Path:/solr/live_nodes/127.0.0.1:44858_solr Error:KeeperErrorCode = NoNode for /solr/live_nodes/127.0.0.1:44858_solr
[junit4:junit4]   2> 7199 T709 oascc.SolrZkClient.makePath makePath: /live_nodes/127.0.0.1:44858_solr
[junit4:junit4]   2> 7207 T729 oascc.ZkStateReader$3.process Updating live nodes
[junit4:junit4]   2> 7207 T743 oascc.ZkStateReader$3.process Updating live nodes
[junit4:junit4]   2> 7207 T755 oascc.ZkStateReader$3.process Updating live nodes
[junit4:junit4]   2> 7208 T709 oashc.HttpShardHandlerFactory.getParameter Setting socketTimeout to: 0
[junit4:junit4]   2> 7209 T709 oashc.HttpShardHandlerFactory.getParameter Setting urlScheme to: http://
[junit4:junit4]   2> 7209 T709 oashc.HttpShardHandlerFactory.getParameter Setting connTimeout to: 0
[junit4:junit4]   2> 7210 T709 oashc.HttpShardHandlerFactory.getParameter Setting maxConnectionsPerHost to: 20
[junit4:junit4]   2> 7210 T709 oashc.HttpShardHandlerFactory.getParameter Setting corePoolSize to: 0
[junit4:junit4]   2> 7210 T709 oashc.HttpShardHandlerFactory.getParameter Setting maximumPoolSize to: 2147483647
[junit4:junit4]   2> 7211 T709 oashc.HttpShardHandlerFactory.getParameter Setting maxThreadIdleTime to: 5
[junit4:junit4]   2> 7211 T709 oashc.HttpShardHandlerFactory.getParameter Setting sizeOfQueue to: -1
[junit4:junit4]   2> 7212 T709 oashc.HttpShardHandlerFactory.getParameter Setting fairnessPolicy to: false
[junit4:junit4]   2> 7212 T709 oascsi.HttpClientUtil.createClient Creating new http client, config:maxConnectionsPerHost=20&maxConnections=10000&socketTimeout=0&connTimeout=0&retry=false
[junit4:junit4]   2> 7231 T709 oascc.ZkStateReader.createClusterStateWatchersAndUpdate Updating cluster state from ZooKeeper... 
[junit4:junit4]   2> 7238 T709 oasc.CoreContainer.create Creating SolrCore 'collection1' using instanceDir: /usr/home/hudson/hudson-slave/workspace/Lucene-Solr-Tests-4.x-java7/solr/build/solr-core/test/J0/./solrtest-jetty3-1350226213224/collection1
[junit4:junit4]   2> 7238 T709 oasc.ZkController.createCollectionZkNode Check for collection zkNode:collection1
[junit4:junit4]   2> 7239 T709 oasc.ZkController.createCollectionZkNode Collection zkNode exists
[junit4:junit4]   2> 7239 T709 oasc.ZkController.readConfigName Load collection config from:/collections/collection1
[junit4:junit4]   2> 7241 T709 oasc.SolrResourceLoader.<init> new SolrResourceLoader for directory: '/usr/home/hudson/hudson-slave/workspace/Lucene-Solr-Tests-4.x-java7/solr/build/solr-core/test/J0/./solrtest-jetty3-1350226213224/collection1/'
[junit4:junit4]   2> 7243 T709 oasc.SolrResourceLoader.replaceClassLoader Adding 'file:/usr/home/hudson/hudson-slave/workspace/Lucene-Solr-Tests-4.x-java7/solr/build/solr-core/test/J0/solrtest-jetty3-1350226213224/collection1/lib/classes/' to classloader
[junit4:junit4]   2> 7243 T709 oasc.SolrResourceLoader.replaceClassLoader Adding 'file:/usr/home/hudson/hudson-slave/workspace/Lucene-Solr-Tests-4.x-java7/solr/build/solr-core/test/J0/solrtest-jetty3-1350226213224/collection1/lib/README' to classloader
[junit4:junit4]   2> 7319 T709 oasc.SolrConfig.<init> Using Lucene MatchVersion: LUCENE_41
[junit4:junit4]   2> 7372 T730 oascc.ZkStateReader.updateClusterState Updating cloud state from ZooKeeper... 
[junit4:junit4]   2> 7386 T729 oascc.ZkStateReader$2.process A cluster state change has occurred - updating...
[junit4:junit4]   2> 7386 T767 oascc.ZkStateReader$2.process A cluster state change has occurred - updating...
[junit4:junit4]   2> 7386 T743 oascc.ZkStateReader$2.process A cluster state change has occurred - updating...
[junit4:junit4]   2> 7386 T755 oascc.ZkStateReader$2.process A cluster state change has occurred - updating...
[junit4:junit4]   2> 7393 T709 oasc.SolrConfig.<init> Loaded SolrConfig: solrconfig.xml
[junit4:junit4]   2> 7494 T709 oass.IndexSchema.readSchema Reading Solr Schema
[junit4:junit4]   2> 7501 T709 oass.IndexSchema.readSchema Schema name=test
[junit4:junit4]   2> 8123 T709 oass.OpenExchangeRatesOrgProvider.init Initialized with rates=open-exchange-rates.json, refreshInterval=1440.
[junit4:junit4]   2> 8134 T709 oass.IndexSchema.readSchema default search field in schema is text
[junit4:junit4]   2> 8139 T709 oass.IndexSchema.readSchema unique key field: id
[junit4:junit4]   2> 8156 T709 oass.FileExchangeRateProvider.reload Reloading exchange rates from file currency.xml
[junit4:junit4]   2> 8162 T709 oass.FileExchangeRateProvider.reload Reloading exchange rates from file currency.xml
[junit4:junit4]   2> 8168 T709 oass.OpenExchangeRatesOrgProvider.reload Reloading exchange rates from open-exchange-rates.json
[junit4:junit4]   2> 8170 T709 oass.OpenExchangeRatesOrgProvider.reload Reloading exchange rates from open-exchange-rates.json
[junit4:junit4]   2> 8171 T709 oasc.SolrCore.<init> [collection1] Opening new SolrCore at /usr/home/hudson/hudson-slave/workspace/Lucene-Solr-Tests-4.x-java7/solr/build/solr-core/test/J0/./solrtest-jetty3-1350226213224/collection1/, dataDir=./org.apache.solr.cloud.BasicDistributedZkTest-1350226206312/jetty3/
[junit4:junit4]   2> 8172 T709 oasc.JmxMonitoredMap.<init> JMX monitoring is enabled. Adding Solr mbeans to JMX Server: com.sun.jmx.mbeanserver.JmxMBeanServer@149873b7
[junit4:junit4]   2> 8173 T709 oasc.SolrCore.getNewIndexDir New index directory detected: old=null new=./org.apache.solr.cloud.BasicDistributedZkTest-1350226206312/jetty3/index/
[junit4:junit4]   2> 8174 T709 oasc.SolrCore.initIndex WARNING [collection1] Solr index directory './org.apache.solr.cloud.BasicDistributedZkTest-1350226206312/jetty3/index' doesn't exist. Creating new index...
[junit4:junit4]   2> 8175 T709 oasc.CachingDirectoryFactory.get return new directory for /usr/home/hudson/hudson-slave/workspace/Lucene-Solr-Tests-4.x-java7/solr/build/solr-core/test/J0/./org.apache.solr.cloud.BasicDistributedZkTest-1350226206312/jetty3/index forceNew:false
[junit4:junit4]   2> 8224 T709 oasc.SolrDeletionPolicy.onCommit SolrDeletionPolicy.onCommit: commits:num=1
[junit4:junit4]   2> 		commit{dir=NRTCachingDirectory(org.apache.lucene.store.NIOFSDirectory@/usr/home/hudson/hudson-slave/workspace/Lucene-Solr-Tests-4.x-java7/solr/build/solr-core/test/J0/org.apache.solr.cloud.BasicDistributedZkTest-1350226206312/jetty3/index lockFactory=org.apache.lucene.store.NativeFSLockFactory@20d3d6e2; maxCacheMB=48.0 maxMergeSizeMB=4.0),segFN=segments_1,generation=1,filenames=[segments_1]
[junit4:junit4]   2> 8224 T709 oasc.SolrDeletionPolicy.updateCommits newest commit = 1
[junit4:junit4]   2> 8225 T709 oasc.SolrCore.initWriters created xml: solr.XMLResponseWriter
[junit4:junit4]   2> 8228 T709 oasup.UpdateRequestProcessorChain.init inserting DistributedUpdateProcessorFactory into updateRequestProcessorChain "dedupe"
[junit4:junit4]   2> 8229 T709 oasup.UpdateRequestProcessorChain.init inserting DistributedUpdateProcessorFactory into updateRequestProcessorChain "dedupe-allfields"
[junit4:junit4]   2> 8230 T709 oasup.UpdateRequestProcessorChain.init inserting DistributedUpdateProcessorFactory into updateRequestProcessorChain "stored_sig"
[junit4:junit4]   2> 8230 T709 oasup.UpdateRequestProcessorChain.init inserting DistributedUpdateProcessorFactory into updateRequestProcessorChain "uniq-fields"
[junit4:junit4]   2> 8231 T709 oasup.UpdateRequestProcessorChain.init inserting DistributedUpdateProcessorFactory into updateRequestProcessorChain "distrib-dup-test-chain-implicit"
[junit4:junit4]   2> 8232 T709 oasc.RequestHandlers.initHandlersFromConfig adding lazy requestHandler: solr.ReplicationHandler
[junit4:junit4]   2> 8232 T709 oasc.RequestHandlers.initHandlersFromConfig created /replication: solr.ReplicationHandler
[junit4:junit4]   2> 8233 T709 oasc.RequestHandlers.initHandlersFromConfig created standard: solr.StandardRequestHandler
[junit4:junit4]   2> 8234 T709 oasc.RequestHandlers.initHandlersFromConfig created /get: solr.RealTimeGetHandler
[junit4:junit4]   2> 8235 T709 oasc.RequestHandlers.initHandlersFromConfig created dismax: solr.SearchHandler
[junit4:junit4]   2> 8235 T709 oasc.RequestHandlers.initHandlersFromConfig created mock: org.apache.solr.core.MockQuerySenderListenerReqHandler
[junit4:junit4]   2> 8236 T709 oasc.RequestHandlers.initHandlersFromConfig created /admin/: org.apache.solr.handler.admin.AdminHandlers
[junit4:junit4]   2> 8237 T709 oasc.RequestHandlers.initHandlersFromConfig created defaults: solr.StandardRequestHandler
[junit4:junit4]   2> 8237 T709 oasc.RequestHandlers.initHandlersFromConfig adding lazy requestHandler: solr.StandardRequestHandler
[junit4:junit4]   2> 8238 T709 oasc.RequestHandlers.initHandlersFromConfig created lazy: solr.StandardRequestHandler
[junit4:junit4]   2> 8239 T709 oasc.RequestHandlers.initHandlersFromConfig created /update: solr.UpdateRequestHandler
[junit4:junit4]   2> 8240 T709 oasc.RequestHandlers.initHandlersFromConfig created /terms: org.apache.solr.handler.component.SearchHandler
[junit4:junit4]   2> 8240 T709 oasc.RequestHandlers.initHandlersFromConfig created spellCheckCompRH: org.apache.solr.handler.component.SearchHandler
[junit4:junit4]   2> 8241 T709 oasc.RequestHandlers.initHandlersFromConfig created spellCheckCompRH_Direct: org.apache.solr.handler.component.SearchHandler
[junit4:junit4]   2> 8242 T709 oasc.RequestHandlers.initHandlersFromConfig created spellCheckWithWordbreak: org.apache.solr.handler.component.SearchHandler
[junit4:junit4]   2> 8243 T709 oasc.RequestHandlers.initHandlersFromConfig created spellCheckWithWordbreak_Direct: org.apache.solr.handler.component.SearchHandler
[junit4:junit4]   2> 8243 T709 oasc.RequestHandlers.initHandlersFromConfig created spellCheckCompRH1: org.apache.solr.handler.component.SearchHandler
[junit4:junit4]   2> 8244 T709 oasc.RequestHandlers.initHandlersFromConfig created tvrh: org.apache.solr.handler.component.SearchHandler
[junit4:junit4]   2> 8245 T709 oasc.RequestHandlers.initHandlersFromConfig created /mlt: solr.MoreLikeThisHandler
[junit4:junit4]   2> 8246 T709 oasc.RequestHandlers.initHandlersFromConfig created /debug/dump: solr.DumpRequestHandler
[junit4:junit4]   2> 8259 T709 oashl.XMLLoader.init xsltCacheLifetimeSeconds=60
[junit4:junit4]   2> 8264 T709 oasc.SolrCore.initDeprecatedSupport WARNING solrconfig.xml uses deprecated <admin/gettableFiles>, Please update your config to use the ShowFileRequestHandler.
[junit4:junit4]   2> 8265 T709 oasc.SolrCore.initDeprecatedSupport WARNING adding ShowFileRequestHandler with hidden files: [SCHEMA.XML, OLD_SYNONYMS.TXT, STOPWORDS.TXT, PROTWORDS.TXT, OPEN-EXCHANGE-RATES.JSON, SYNONYMS.TXT, CURRENCY.XML, MAPPING-ISOLATIN1ACCENT.TXT]
[junit4:junit4]   2> 8270 T709 oass.SolrIndexSearcher.<init> Opening Searcher@3a4aebd7 main
[junit4:junit4]   2> 8271 T709 oasu.CommitTracker.<init> Hard AutoCommit: disabled
[junit4:junit4]   2> 8272 T709 oasu.CommitTracker.<init> Soft AutoCommit: disabled
[junit4:junit4]   2> 8273 T709 oashc.SpellCheckComponent.inform Initializing spell checkers
[junit4:junit4]   2> 8281 T709 oass.DirectSolrSpellChecker.init init: {name=direct,classname=DirectSolrSpellChecker,field=lowerfilt,minQueryLength=3}
[junit4:junit4]   2> 8334 T768 oasc.SolrCore.registerSearcher [collection1] Registered new searcher Searcher@3a4aebd7 main{StandardDirectoryReader(segments_1:1)}
[junit4:junit4]   2> 8395 T730 oascc.ZkStateReader.updateClusterState Updating cloud state from ZooKeeper... 
[junit4:junit4]   2> 8409 T729 oascc.ZkStateReader$2.process A cluster state change has occurred - updating...
[junit4:junit4]   2> 8409 T767 oascc.ZkStateReader$2.process A cluster state change has occurred - updating...
[junit4:junit4]   2> 8409 T755 oascc.ZkStateReader$2.process A cluster state change has occurred - updating...
[junit4:junit4]   2> 8409 T743 oascc.ZkStateReader$2.process A cluster state change has occurred - updating...
[junit4:junit4]   2> 8843 T709 oasc.CoreContainer.register registering core: collection1
[junit4:junit4]   2> 8843 T709 oasc.ZkController.register Register shard - core:collection1 address:http://127.0.0.1:44858/solr shardId:shard1
[junit4:junit4]   2> 8848 T709 oasc.ZkController.register We are http://127.0.0.1:44858/solr/collection1/ and leader is http://127.0.0.1:44847/solr/collection1/
[junit4:junit4]   2> 8848 T709 oasc.ZkController.register No LogReplay needed for core=collection1 baseURL=http://127.0.0.1:44858/solr
[junit4:junit4]   2> 8849 T709 oasc.ZkController.checkRecovery Core needs to recover:collection1
[junit4:junit4]   2> 8849 T709 oasu.DefaultSolrCoreState.doRecovery Running recovery - first canceling any ongoing recovery
[junit4:junit4]   2> ASYNC  NEW_CORE C51 name=collection1 org.apache.solr.core.SolrCore@6b33bf1e url=http://127.0.0.1:44858/solr/collection1 node=127.0.0.1:44858_solr
[junit4:junit4]   2> 8887 T769 C51 P44858 oasc.RecoveryStrategy.run Starting recovery process.  core=collection1 recoveringAfterStartup=true
[junit4:junit4]   2> 8888 T769 C51 P44858 oasc.RecoveryStrategy.doRecovery ###### startupVersions=[]
[junit4:junit4]   2> 8887 T709 oascc.ZkStateReader.updateClusterState Updating cloud state from ZooKeeper... 
[junit4:junit4]   2> 8889 T709 oass.SolrDispatchFilter.init user.dir=/usr/home/hudson/hudson-slave/workspace/Lucene-Solr-Tests-4.x-java7/solr/build/solr-core/test/J0
[junit4:junit4]   2> 8890 T709 oass.SolrDispatchFilter.init SolrDispatchFilter.init() done
[junit4:junit4]   2> 8890 T769 C51 P44858 oasc.RecoveryStrategy.doRecovery Attempting to PeerSync from http://127.0.0.1:44847/solr/collection1/ core=collection1 - recoveringAfterStartup=true
[junit4:junit4]   2> 8890 T709 oascsi.HttpClientUtil.createClient Creating new http client, config:maxConnections=128&maxConnectionsPerHost=32&followRedirects=false
[junit4:junit4]   2> 8900 T769 C51 P44858 oascsi.HttpClientUtil.createClient Creating new http client, config:maxConnectionsPerHost=20&maxConnections=10000&connTimeout=30000&socketTimeout=30000&retry=false
[junit4:junit4]   2> 8912 T709 oaz.ZooKeeper.<init> Initiating client connection, connectString=127.0.0.1:44838/solr sessionTimeout=10000 watcher=org.apache.solr.common.cloud.ConnectionManager@2dca5af2
[junit4:junit4]   2> 8913 T770 oaz.ClientCnxn$SendThread.startConnect Opening socket connection to server /127.0.0.1:44838
[junit4:junit4]   2> 8913 T709 oascc.ConnectionManager.waitForConnected Waiting for client to connect to ZooKeeper
[junit4:junit4]   2> 8914 T770 oaz.ClientCnxn$SendThread.primeConnection Socket connection established to localhost/127.0.0.1:44838, initiating session
[junit4:junit4]   2> 8915 T711 oazs.NIOServerCnxn$Factory.run Accepted socket connection from /140.211.11.196:44864
[junit4:junit4]   2> 8915 T711 oazs.NIOServerCnxn.readConnectRequest Client attempting to establish new session at /140.211.11.196:44864
[junit4:junit4]   2> 8916 T713 oazs.NIOServerCnxn.finishSessionInit Established session 0x13a5fc0de710006 with negotiated timeout 10000 for client /140.211.11.196:44864
[junit4:junit4]   2> 8917 T770 oaz.ClientCnxn$SendThread.readConnectResult Session establishment complete on server localhost/127.0.0.1:44838, sessionid = 0x13a5fc0de710006, negotiated timeout = 10000
[junit4:junit4]   2> 8917 T771 oascc.ConnectionManager.process Watcher org.apache.solr.common.cloud.ConnectionManager@2dca5af2 name:ZooKeeperConnection Watcher:127.0.0.1:44838/solr got event WatchedEvent state:SyncConnected type:None path:null path:null type:None
[junit4:junit4]   2> 8917 T730 oascc.ZkStateReader.updateClusterState Updating cloud state from ZooKeeper... 
[junit4:junit4]   2> 8917 T709 oascc.ConnectionManager.waitForConnected Client is connected to ZooKeeper
[junit4:junit4]   2> 8918 T709 oascc.ZkStateReader.createClusterStateWatchersAndUpdate Updating cluster state from ZooKeeper... 
[junit4:junit4]   2> 8919 T769 C51 P44858 oasu.PeerSync.sync PeerSync: core=collection1 url=http://127.0.0.1:44858/solr START replicas=[http://127.0.0.1:44847/solr/collection1/] nUpdates=100
[junit4:junit4]   2> 8920 T769 C51 P44858 oasu.PeerSync.sync WARNING no frame of reference to tell of we've missed updates
[junit4:junit4]   2> 8921 T769 C51 P44858 oasc.RecoveryStrategy.doRecovery PeerSync Recovery was not successful - trying replication. core=collection1
[junit4:junit4]   2> 8921 T769 C51 P44858 oasc.RecoveryStrategy.doRecovery Starting Replication Recovery. core=collection1
[junit4:junit4]   2> 8922 T769 C51 P44858 oascsi.HttpClientUtil.createClient Creating new http client, config:maxConnections=128&maxConnectionsPerHost=32&followRedirects=false
[junit4:junit4]   2> ASYNC  NEW_CORE C52 name=collection1 org.apache.solr.core.SolrCore@25123f99 url=http://127.0.0.1:44847/solr/collection1 node=127.0.0.1:44847_solr
[junit4:junit4]   2> 8932 T735 C52 P44847 REQ /get {distrib=false&qt=/get&wt=javabin&version=2&getVersions=100} status=0 QTime=1 
[junit4:junit4]   2> 8933 T729 oascc.ZkStateReader$2.process A cluster state change has occurred - updating...
[junit4:junit4]   2> 8934 T771 oascc.ZkStateReader$2.process A cluster state change has occurred - updating...
[junit4:junit4]   2> 8934 T767 oascc.ZkStateReader$2.process A cluster state change has occurred - updating...
[junit4:junit4]   2> 8934 T743 oascc.ZkStateReader$2.process A cluster state change has occurred - updating...
[junit4:junit4]   2> 8934 T755 oascc.ZkStateReader$2.process A cluster state change has occurred - updating...
[junit4:junit4]   2> 8935 T709 oasc.ChaosMonkey.monkeyLog monkey: init - expire sessions:true cause connection loss:true
[junit4:junit4]   2> 8936 T709 oascsi.HttpClientUtil.createClient Creating new http client, config:
[junit4:junit4]   2> 8949 T709 oascc.ZkStateReader.updateClusterState Updating cloud state from ZooKeeper... 
[junit4:junit4]   2> 8951 T709 oasc.AbstractDistribZkTestBase.waitForRecoveriesToFinish Wait for recoveries to finish - collection: collection1 failOnTimeout:true timeout (sec):1800
[junit4:junit4]   2> 8952 T709 oascc.ZkStateReader.updateClusterState Updating cloud state from ZooKeeper... 
[junit4:junit4]   2> 9954 T709 oascc.ZkStateReader.updateClusterState Updating cloud state from ZooKeeper... 
[junit4:junit4]   2>  C51_STATE=coll:collection1 core:collection1 props:{shard=shard1, roles=null, state=recovering, core=collection1, collection=collection1, node_name=127.0.0.1:44858_solr, base_url=http://127.0.0.1:44858/solr}
[junit4:junit4]   2> 10944 T769 C51 P44858 oasc.RecoveryStrategy.doRecovery Begin buffering updates. core=collection1
[junit4:junit4]   2> 10944 T769 C51 P44858 oasu.UpdateLog.bufferUpdates Starting to buffer updates. FSUpdateLog{state=ACTIVE, tlog=null}
[junit4:junit4]   2> 10945 T769 C51 P44858 oasc.RecoveryStrategy.replicate Attempting to replicate from http://127.0.0.1:44847/solr/collection1/. core=collection1
[junit4:junit4]   2> 10945 T769 C51 P44858 oascsi.HttpClientUtil.createClient Creating new http client, config:maxConnections=128&maxConnectionsPerHost=32&followRedirects=false
[junit4:junit4]   2> 10956 T709 oascc.ZkStateReader.updateClusterState Updating cloud state from ZooKeeper... 
[junit4:junit4]   2> 10973 T737 C52 P44847 oascsi.HttpClientUtil.createClient Creating new http client, config:maxConnections=500&maxConnectionsPerHost=16
[junit4:junit4]   2> 10990 T737 C52 P44847 oasu.DirectUpdateHandler2.commit start commit{flags=0,_version_=0,optimize=false,openSearcher=false,waitSearcher=true,expungeDeletes=false,softCommit=false}
[junit4:junit4]   2> 10995 T737 C52 P44847 oasc.SolrDeletionPolicy.onInit SolrDeletionPolicy.onInit: commits:num=1
[junit4:junit4]   2> 		commit{dir=NRTCachingDirectory(org.apache.lucene.store.NIOFSDirectory@/usr/home/hudson/hudson-slave/workspace/Lucene-Solr-Tests-4.x-java7/solr/build/solr-core/test/J0/org.apache.solr.cloud.BasicDistributedZkTest-1350226206312/jetty1/index lockFactory=org.apache.lucene.store.NativeFSLockFactory@22274f3f; maxCacheMB=48.0 maxMergeSizeMB=4.0),segFN=segments_1,generation=1,filenames=[segments_1]
[junit4:junit4]   2> 10996 T737 C52 P44847 oasc.SolrDeletionPolicy.updateCommits newest commit = 1
[junit4:junit4]   2> 10997 T737 C52 P44847 oass.SolrIndexSearcher.<init> Opening Searcher@294d3679 realtime
[junit4:junit4]   2> 10997 T737 C52 P44847 oasu.DirectUpdateHandler2.commit end_commit_flush
[junit4:junit4]   2> 10998 T737 C52 P44847 /update {waitSearcher=true&openSearcher=false&commit=true&commit_end_point=true&wt=javabin&softCommit=false&version=2} {commit=} 0 39
[junit4:junit4]   2> 11060 T769 C51 P44858 oash.ReplicationHandler.inform Commits will be reserved for  10000
[junit4:junit4]   2> 11060 T769 C51 P44858 oascsi.HttpClientUtil.createClient Creating new http client, config:connTimeout=5000&socketTimeout=20000&allowCompression=false&maxConnections=10000&maxConnectionsPerHost=10000
[junit4:junit4]   2> 11084 T769 C51 P44858 oash.SnapPuller.<init>  No value set for 'pollInterval'. Timer Task not started.
[junit4:junit4]   2> 11087 T738 C52 P44847 oash.ReplicationHandler.inform Commits will be reserved for  10000
[junit4:junit4]   2> 11087 T738 C52 P44847 REQ /replication {command=indexversion&wt=javabin&qt=/replication&version=2} status=0 QTime=2 
[junit4:junit4]   2> 11093 T769 C51 P44858 oasc.SolrDeletionPolicy.onInit SolrDeletionPolicy.onInit: commits:num=1
[junit4:junit4]   2> 		commit{dir=NRTCachingDirectory(org.apache.lucene.store.NIOFSDirectory@/usr/home/hudson/hudson-slave/workspace/Lucene-Solr-Tests-4.x-java7/solr/build/solr-core/test/J0/org.apache.solr.cloud.BasicDistributedZkTest-1350226206312/jetty3/index lockFactory=org.apache.lucene.store.NativeFSLockFactory@20d3d6e2; maxCacheMB=48.0 maxMergeSizeMB=4.0),segFN=segments_1,generation=1,filenames=[segments_1]
[junit4:junit4]   2> 11093 T769 C51 P44858 oasc.SolrDeletionPolicy.updateCommits newest commit = 1
[junit4:junit4]   2> 11094 T769 C51 P44858 oasu.DirectUpdateHandler2.commit start commit{flags=0,_version_=0,optimize=false,openSearcher=true,waitSearcher=true,expungeDeletes=false,softCommit=false}
[junit4:junit4]   2> 11098 T769 C51 P44858 oasc.SolrDeletionPolicy.onCommit SolrDeletionPolicy.onCommit: commits:num=2
[junit4:junit4]   2> 		commit{dir=NRTCachingDirectory(org.apache.lucene.store.NIOFSDirectory@/usr/home/hudson/hudson-slave/workspace/Lucene-Solr-Tests-4.x-java7/solr/build/solr-core/test/J0/org.apache.solr.cloud.BasicDistributedZkTest-1350226206312/jetty3/index lockFactory=org.apache.lucene.store.NativeFSLockFactory@20d3d6e2; maxCacheMB=48.0 maxMergeSizeMB=4.0),segFN=segments_1,generation=1,filenames=[segments_1]
[junit4:junit4]   2> 		commit{dir=NRTCachingDirectory(org.apache.lucene.store.NIOFSDirectory@/usr/home/hudson/hudson-slave/workspace/Lucene-Solr-Tests-4.x-java7/solr/build/solr-core/test/J0/org.apache.solr.cloud.BasicDistributedZkTest-1350226206312/jetty3/index lockFactory=org.apache.lucene.store.NativeFSLockFactory@20d3d6e2; maxCacheMB=48.0 maxMergeSizeMB=4.0),segFN=segments_2,generation=2,filenames=[segments_2]
[junit4:junit4]   2> 11098 T769 C51 P44858 oasc.SolrDeletionPolicy.updateCommits newest commit = 2
[junit4:junit4]   2> 11102 T769 C51 P44858 oass.SolrIndexSearcher.<init> Opening Searcher@2ee8360f main
[junit4:junit4]   2> 11102 T769 C51 P44858 oasu.DirectUpdateHandler2.commit end_commit_flush
[junit4:junit4]   2> 11104 T768 oasc.SolrCore.registerSearcher [collection1] Registered new searcher Searcher@2ee8360f main{StandardDirectoryReader(segments_2:2)}
[junit4:junit4]   2> 11105 T769 C51 P44858 oasc.RecoveryStrategy.replay No replay needed. core=collection1
[junit4:junit4]   2> 11105 T769 C51 P44858 oasc.RecoveryStrategy.doRecovery Replication Recovery was successful - registering as Active. core=collection1
[junit4:junit4]   2> 11107 T769 C51 P44858 oasc.RecoveryStrategy.doRecovery Finished recovery process. core=collection1
[junit4:junit4]   2> 11449 T730 oascc.ZkStateReader.updateClusterState Updating cloud state from ZooKeeper... 
[junit4:junit4]   2> 11464 T729 oascc.ZkStateReader$2.process A cluster state change has occurred - updating...
[junit4:junit4]   2> 11464 T767 oascc.ZkStateReader$2.process A cluster state change has occurred - updating...
[junit4:junit4]   2> 11464 T771 oascc.ZkStateReader$2.process A cluster state change has occurred - updating...
[junit4:junit4]   2> 11464 T743 oascc.ZkStateReader$2.process A cluster state change has occurred - updating...
[junit4:junit4]   2> 11464 T755 oascc.ZkStateReader$2.process A cluster state change has occurred - updating...
[junit4:junit4]   2> 11958 T709 oascc.ZkStateReader.updateClusterState Updating cloud state from ZooKeeper... 
[junit4:junit4]   2> ASYNC  NEW_CORE C53 name=collection1 org.apache.solr.core.SolrCore@2b02434f url=http://127.0.0.1:44841/solr/collection1 node=127.0.0.1:44841_solr
[junit4:junit4]   2> 11987 T721 C53 P44841 oasc.SolrDeletionPolicy.onInit SolrDeletionPolicy.onInit: commits:num=1
[junit4:junit4]   2> 		commit{dir=NRTCachingDirectory(org.apache.lucene.store.NIOFSDirectory@/usr/home/hudson/hudson-slave/workspace/Lucene-Solr-Tests-4.x-java7/solr/build/solr-core/test/J0/org.apache.solr.cloud.BasicDistributedZkTest-1350226206312/control/data/index lockFactory=org.apache.lucene.store.NativeFSLockFactory@59975455; maxCacheMB=48.0 maxMergeSizeMB=4.0),segFN=segments_1,generation=1,filenames=[segments_1]
[junit4:junit4]   2> 11988 T721 C53 P44841 oasc.SolrDeletionPolicy.updateCommits newest commit = 1
[junit4:junit4]   2> 11994 T721 C53 P44841 oass.SolrIndexSearcher.<init> Opening Searcher@2b7de13f realtime
[junit4:junit4]   2> 11994 T721 C53 P44841 /update {wt=javabin&version=2} {deleteByQuery=*:* (-1415814807060217856)} 0 25
[junit4:junit4]   2> 11995 T709 oaz.ZooKeeper.<init> Initiating client connection, connectString=127.0.0.1:44838/solr sessionTimeout=10000 watcher=org.apache.solr.common.cloud.ConnectionManager@554f0567
[junit4:junit4]   2> 11996 T709 oascc.ConnectionManager.waitForConnected Waiting for client to connect to ZooKeeper
[junit4:junit4]   2> 11996 T773 oaz.ClientCnxn$SendThread.startConnect Opening socket connection to server /127.0.0.1:44838
[junit4:junit4]   2> 11998 T773 oaz.ClientCnxn$SendThread.primeConnection Socket connection established to localhost/127.0.0.1:44838, initiating session
[junit4:junit4]   2> 11998 T711 oazs.NIOServerCnxn$Factory.run Accepted socket connection from /140.211.11.196:44876
[junit4:junit4]   2> 11998 T711 oazs.NIOServerCnxn.readConnectRequest Client attempting to establish new session at /140.211.11.196:44876
[junit4:junit4]   2> 12000 T713 oazs.NIOServerCnxn.finishSessionInit Established session 0x13a5fc0de710007 with negotiated timeout 10000 for client /140.211.11.196:44876
[junit4:junit4]   2> 12000 T773 oaz.ClientCnxn$SendThread.readConnectResult Session establishment complete on server localhost/127.0.0.1:44838, sessionid = 0x13a5fc0de710007, negotiated timeout = 10000
[junit4:junit4]   2> 12000 T774 oascc.ConnectionManager.process Watcher org.apache.solr.common.cloud.ConnectionManager@554f0567 name:ZooKeeperConnection Watcher:127.0.0.1:44838/solr got event WatchedEvent state:SyncConnected type:None path:null path:null type:None
[junit4:junit4]   2> 12001 T709 oascc.ConnectionManager.waitForConnected Client is connected to ZooKeeper
[junit4:junit4]   2> 12002 T709 oascc.ZkStateReader.createClusterStateWatchersAndUpdate Updating cluster state from ZooKeeper... 
[junit4:junit4]   2>  C51_STATE=coll:collection1 core:collection1 props:{shard=shard1, roles=null, state=active, core=collection1, collection=collection1, node_name=127.0.0.1:44858_solr, base_url=http://127.0.0.1:44858/solr}
[junit4:junit4]   2> 12054 T759 C51 P44858 oass.SolrIndexSearcher.<init> Opening Searcher@74f00e6d realtime
[junit4:junit4]   2> 12055 T759 C51 P44858 REQ /update {update.distrib=FROMLEADER&_version_=-1415814807105306624&update.from=http://127.0.0.1:44847/solr/collection1/&wt=javabin&version=2} status=0 QTime=3 
[junit4:junit4]   2> ASYNC  NEW_CORE C54 name=collection1 org.apache.solr.core.SolrCore@1858399b url=http://127.0.0.1:44853/solr/collection1 node=127.0.0.1:44853_solr
[junit4:junit4]   2> 12057 T747 C54 P44853 oasc.SolrDeletionPolicy.onInit SolrDeletionPolicy.onInit: commits:num=1
[junit4:junit4]   2> 		commit{dir=NRTCachingDirectory(org.apache.lucene.store.NIOFSDirectory@/usr/home/hudson/hudson-slave/workspace/Lucene-Solr-Tests-4.x-java7/solr/build/solr-core/test/J0/org.apache.solr.cloud.BasicDistributedZkTest-1350226206312/jetty2/index lockFactory=org.apache.lucene.store.NativeFSLockFactory@4ee209a; maxCacheMB=48.0 maxMergeSizeMB=4.0),segFN=segments_1,generation=1,filenames=[segments_1]
[junit4:junit4]   2> 12058 T747 C54 P44853 oasc.SolrDeletionPolicy.updateCommits newest commit = 1
[junit4:junit4]   2> 12060 T747 C54 P44853 oass.SolrIndexSearcher.<init> Opening Searcher@ac2a6fd realtime
[junit4:junit4]   2> 12060 T747 C54 P44853 REQ /update {update.distrib=TOLEADER&wt=javabin&version=2} status=0 QTime=8 
[junit4:junit4]   2> 12061 T739 C52 P44847 /update {wt=javabin&version=2} {deleteByQuery=*:* (-1415814807105306624)} 0 56
[junit4:junit4]   2> 12073 T721 C53 P44841 /update {wt=javabin&version=2} {add=[1 (1415814807159832576)]} 0 5
[junit4:junit4]   2> 12101 T759 C51 P44858 REQ /update {distrib.from=http://127.0.0.1:44847/solr/collection1/&update.distrib=FROMLEADER&wt=javabin&version=2} status=0 QTime=4 
[junit4:junit4]   2> 12103 T739 C52 P44847 /update {wt=javabin&version=2} {add=[1 (1415814807170318336)]} 0 25
[junit4:junit4]   2> 12108 T721 C53 P44841 /update {wt=javabin&version=2} {add=[2 (1415814807199678464)]} 0 2
[junit4:junit4]   2> 12125 T747 C54 P44853 REQ /update {distrib.from=http://127.0.0.1:44847/solr/collection1/&update.distrib=TOLEADER&wt=javabin&version=2} status=0 QTime=4 
[junit4:junit4]   2> 12126 T739 C52 P44847 /update {wt=javabin&version=2} {add=[2]} 0 14
[junit4:junit4]   2> 12132 T721 C53 P44841 /update {wt=javabin&version=2} {add=[3 (1415814807224844288)]} 0 2
[junit4:junit4]   2> 12136 T748 C54 P44853 /update {wt=javabin&version=2} {add=[3 (1415814807229038592)]} 0 2
[junit4:junit4]   2> 12142 T721 C53 P44841 /update {wt=javabin&version=2} {add=[4 (1415814807235330048)]} 0 2
[junit4:junit4]   2> 12151 T759 C51 P44858 REQ /update {distrib.from=http://127.0.0.1:44847/solr/collection1/&update.distrib=FROMLEADER&wt=javabin&version=2} status=0 QTime=2 
[junit4:junit4]   2> 12152 T739 C52 P44847 /update {wt=javabin&version=2} {add=[4 (1415814807240572928)]} 0 7
[junit4:junit4]   2> 12158 T721 C53 P44841 /update {wt=javabin&version=2} {add=[5 (1415814807252107264)]} 0 2
[junit4:junit4]   2> 12166 T747 C54 P44853 REQ /update {distrib.from=http://127.0.0.1:44847/solr/collection1/&update.distrib=TOLEADER&wt=javabin&version=2} status=0 QTime=2 
[junit4:junit4]   2> 12167 T739 C52 P44847 /update {wt=javabin&version=2} {add=[5]} 0 6
[junit4:junit4]   2> 12171 T721 C53 P44841 /update {wt=javabin&version=2} {add=[6 (1415814807265738752)]} 0 1
[junit4:junit4]   2> 12178 T747 C54 P44853 REQ /update {distrib.from=http://127.0.0.1:44847/solr/collection1/&update.distrib=TOLEADER&wt=javabin&version=2} status=0 QTime=1 
[junit4:junit4]   2> 12179 T739 C52 P44847 /update {wt=javabin&version=2} {add=[6]} 0 5
[junit4:junit4]   2> 12183 T721 C53 P44841 /update {wt=javabin&version=2} {add=[7 (1415814807278321664)]} 0 1
[junit4:junit4]   2> 12188 T748 C54 P44853 /update {wt=javabin&version=2} {add=[7 (1415814807282515968)]} 0 2
[junit4:junit4]   2> 12192 T721 C53 P44841 /update {wt=javabin&version=2} {add=[8 (1415814807287758848)]} 0 1
[junit4:junit4]   2> 12205 T759 C51 P44858 REQ /update {distrib.from=http://127.0.0.1:44847/solr/collection1/&update.distrib=FROMLEADER&wt=javabin&version=2} status=0 QTime=2 
[junit4:junit4]   2> 12206 T740 C52 P44847 REQ /update {distrib.from=http://127.0.0.1:44853/solr/collection1/&update.distrib=TOLEADER&wt=javabin&version=2} status=0 QTime=9 
[junit4:junit4]   2> 12207 T748 C54 P44853 /update {wt=javabin&version=2} {add=[8]} 0 12
[junit4:junit4]   2> 12212 T721 C53 P44841 /update {wt=javabin&version=2} {add=[9 (1415814807308730368)]} 0 2
[junit4:junit4]   2> 12216 T748 C54 P44853 /update {wt=javabin&version=2} {add=[9 (1415814807312924672)]} 0 1
[junit4:junit4]   2> 12232 T721 C53 P44841 /update {wt=javabin&version=2} {add=[10 (1415814807318167552)]} 0 13
[junit4:junit4]   2> 12240 T759 C51 P44858 REQ /update {distrib.from=http://127.0.0.1:44847/solr/collection1/&update.distrib=FROMLEADER&wt=javabin&version=2} status=0 QTime=1 
[junit4:junit4]   2> 12241 T739 C52 P44847 /update {wt=javabin&version=2} {add=[10 (1415814807334944768)]} 0 6
[junit4:junit4]   2> 12247 T721 C53 P44841 /update {wt=javabin&version=2} {add=[11 (1415814807344381952)]} 0 3
[junit4:junit4]   2> 12261 T759 C51 P44858 REQ /update {distrib.from=http://127.0.0.1:44847/solr/collection1/&update.distrib=FROMLEADER&wt=javabin&version=2} status=0 QTime=2 
[junit4:junit4]   2> 12262 T740 C52 P44847 REQ /update {distrib.from=http://127.0.0.1:44853/solr/collection1/&update.distrib=TOLEADER&wt=javabin&version=2} status=0 QTime=9 
[junit4:junit4]   2> 12263 T748 C54 P44853 /update {wt=javabin&version=2} {add=[11]} 0 13
[junit4:junit4]   2> 12268 T721 C53 P44841 /update {wt=javabin&version=2} {add=[12 (1415814807367450624)]} 0 2
[junit4:junit4]   2> 12292 T759 C51 P44858 REQ /update {distrib.from=http://127.0.0.1:44847/solr/collection1/&update.distrib=FROMLEADER&wt=javabin&version=2} status=0 QTime=2 
[junit4:junit4]   2> 12293 T740 C52 P44847 REQ /update {distrib.from=http://127.0.0.1:44853/solr/collection1/&update.distrib=TOLEADER&wt=javabin&version=2} status=0 QTime=8 
[junit4:junit4]   2> 12294 T748 C54 P44853 /update {wt=javabin&version=2} {add=[12]} 0 13
[junit4:junit4]   2> 12299 T721 C53 P44841 /update {wt=javabin&version=2} {add=[13 (1415814807399956480)]} 0 2
[junit4:junit4]   2> 12313 T759 C51 P44858 REQ /update {distrib.from=http://127.0.0.1:44847/solr/collection1/&update.distrib=FROMLEADER&wt=javabin&version=2} status=0 QTime=2 
[junit4:junit4]   2> 12315 T740 C52 P44847 REQ /update {distrib.from=http://127.0.0.1:44853/solr/collection1/&update.distrib=TOLEADER&wt=javabin&version=2} status=0 QTime=8 
[junit4:junit4]   2> 12315 T748 C54 P44853 /update {wt=javabin&version=2} {add=[13]} 0 12
[junit4:junit4]   2> 12322 T721 C53 P44841 /update {wt=javabin&version=2} {add=[14 (1415814807423025152)]} 0 2
[junit4:junit4]   2> 12335 T759 C51 P44858 REQ /update {distrib.from=http://127.0.0.1:44847/solr/collection1/&update.distrib=FROMLEADER&wt=javabin&version=2} status=0 QTime=2 
[junit4:junit4]   2> 12336 T740 C52 P44847 REQ /update {distrib.from=http://127.0.0.1:44853/solr/collection1/&update.distrib=TOLEADER&wt=javabin&version=2} status=0 QTime=7 
[junit4:junit4]   2> 12337 T748 C54 P44853 /update {wt=javabin&version=2} {add=[14]} 0 10
[junit4:junit4]   2> 12343 T721 C53 P44841 /update {wt=javabin&version=2} {add=[15 (1415814807445045248)]} 0 3
[junit4:junit4]   2> 12355 T759 C51 P44858 REQ /update {distrib.from=http://127.0.0.1:44847/solr/collection1/&update.distrib=FROMLEADER&wt=javabin&version=2} status=0 QTime=2 
[junit4:junit4]   2> 12356 T740 C52 P44847 REQ /update {distrib.from=http://127.0.0.1:44853/solr/collection1/&update.distrib=TOLEADER&wt=javabin&version=2} status=0 QTime=7 
[junit4:junit4]   2> 12357 T748 C54 P44853 /update {wt=javabin&version=2} {add=[15]} 0 11
[junit4:junit4]   2> 12363 T721 C53 P44841 /update {wt=javabin&version=2} {add=[16 (1415814807466016768)]} 0 3
[junit4:junit4]   2> 12412 T759 C51 P44858 REQ /update {distrib.from=http://127.0.0.1:44847/solr/collection1/&update.distrib=FROMLEADER&wt=javabin&version=2} status=0 QTime=24 
[junit4:junit4]   2> 12413 T739 C52 P44847 /update {wt=javabin&version=2} {add=[16 (1415814807472308224)]} 0 47
[junit4:junit4]   2> 12425 T721 C53 P44841 /update {wt=javabin&version=2} {add=[17 (1415814807527882752)]} 0 7
[junit4:junit4]   2> 12441 T747 C54 P44853 REQ /update {distrib.from=http://127.0.0.1:44847/solr/collection1/&update.distrib=TOLEADER&wt=javabin&version=2} status=0 QTime=5 
[junit4:junit4]   2> 12442 T739 C52 P44847 /update {wt=javabin&version=2} {add=[17]} 0 13
[junit4:junit4]   2> 12447 T721 C53 P44841 /update {wt=javabin&version=2} {add=[100 (1415814807555145728)]} 0 2
[junit4:junit4]   2> 12458 T759 C51 P44858 REQ /update {distrib.from=http://127.0.0.1:44847/solr/collection1/&update.distrib=FROMLEADER&wt=javabin&version=2} status=0 QTime=3 
[junit4:junit4]   2> 12459 T739 C52 P44847 /update {wt=javabin&version=2} {add=[100 (1415814807560388608)]} 0 9
[junit4:junit4]   2> 12465 T721 C53 P44841 /update {wt=javabin&version=2} {add=[101 (1415814807572971520)]} 0 3
[junit4:junit4]   2> 12479 T759 C51 P44858 REQ /update {distrib.from=http://127.0.0.1:44847/solr/collection1/&update.distrib=FROMLEADER&wt=javabin&version=2} status=0 QTime=2 
[junit4:junit4]   2> 12480 T740 C52 P44847 REQ /update {distrib.from=http://127.0.0.1:44853/solr/collection1/&update.distrib=TOLEADER&wt=javabin&version=2} status=0 QTime=8 
[junit4:junit4]   2> 12481 T748 C54 P44853 /update {wt=javabin&version=2} {add=[101]} 0 12
[junit4:junit4]   2> 12511 T721 C53 P44841 /update {wt=javabin&version=2} {add=[102 (1415814807597088768)]} 0 26
[junit4:junit4]   2> 12521 T759 C51 P44858 REQ /update {distrib.from=http://127.0.0.1:44847/solr/collection1/&update.distrib=FROMLEADER&wt=javabin&version=2} status=0 QTime=2 
[junit4:junit4]   2> 12522 T739 C52 P44847 /update {wt=javabin&version=2} {add=[102 (1415814807628546048)]} 0 7
[junit4:junit4]   2> 12529 T721 C53 P44841 /update {wt=javabin&version=2} {add=[103 (1415814807639031808)]} 0 4
[junit4:junit4]   2> 12534 T748 C54 P44853 /update {wt=javabin&version=2} {add=[103 (1415814807646371840)]} 0 2
[junit4:junit4]   2> 12539 T721 C53 P44841 /update {wt=javabin&version=2} {add=[104 (1415814807651614720)]} 0 2
[junit4:junit4]   2> 12544 T748 C54 P44853 /update {wt=javabin&version=2} {add=[104 (1415814807656857600)]} 0 2
[junit4:junit4]   2> 12549 T721 C53 P44841 /update {wt=javabin&version=2} {add=[105 (1415814807662100480)]} 0 2
[junit4:junit4]   2> 12575 T748 C54 P44853 /update {wt=javabin&version=2} {add=[105 (1415814807667343360)]} 0 23
[junit4:junit4]   2> 12580 T721 C53 P44841 /update {wt=javabin&version=2} {add=[106 (1415814807694606336)]} 0 2
[junit4:junit4]   2> 12587 T748 C54 P44853 /update {wt=javabin&version=2} {add=[106 (1415814807699849216)]} 0 4
[junit4:junit4]   2> 12592 T721 C53 P44841 /update {wt=javabin&version=2} {add=[107 (1415814807707189248)]} 0 2
[junit4:junit4]   2> 12600 T759 C51 P44858 REQ /update {distrib.from=http://127.0.0.1:44847/solr/collection1/&update.distrib=FROMLEADER&wt=javabin&version=2} status=0 QTime=1 
[junit4:junit4]   2> 12601 T739 C52 P44847 /update {wt=javabin&version=2} {add=[107 (1415814807712432128)]} 0 6
[junit4:junit4]   2> 12613 T721 C53 P44841 /update {wt=javabin&version=2} {add=[108 (1415814807728160768)]} 0 2
[junit4:junit4]   2> 12621 T759 C51 P44858 REQ /update {distrib.from=http://127.0.0.1:44847/solr/collection1/&update.distrib=FROMLEADER&wt=javabin&version=2} status=0 QTime=1 
[junit4:junit4]   2> 12622 T739 C52 P44847 /update {wt=javabin&version=2} {add=[108 (1415814807734452224)]} 0 6
[junit4:junit4]   2> 12627 T721 C53 P44841 /update {wt=javabin&version=2} {add=[109 (1415814807743889408)]} 0 2
[junit4:junit4]   2> 12636 T759 C51 P44858 REQ /update {distrib.from=http://127.0.0.1:44847/solr/collection1/&update.distrib=FROMLEADER&wt=javabin&version=2} status=0 QTime=2 
[junit4:junit4]   2> 12637 T739 C52 P44847 /update {wt=javabin&version=2} {add=[109 (1415814807749132288)]} 0 7
[junit4:junit4]   2> 12641 T721 C53 P44841 /update {wt=javabin&version=2} {add=[110 (1415814807758569472)]} 0 1
[junit4:junit4]   2> 12650 T759 C51 P44858 REQ /update {distrib.from=http://127.0.0.1:44847/solr/collection1/&update.distrib=FROMLEADER&wt=javabin&version=2} status=0 QTime=2 
[junit4:junit4]   2> 12651 T739 C52 P44847 /update {wt=javabin&version=2} {add=[110 (1415814807763812352)]} 0 7
[junit4:junit4]   2> 12656 T721 C53 P44841 /update {wt=javabin&version=2} {add=[111 (1415814807774298112)]} 0 2
[junit4:junit4]   2> 12664 T759 C51 P44858 REQ /update {distrib.from=http://127.0.0.1:44847/solr/collection1/&update.distrib=FROMLEADER&wt=javabin&version=2} status=0 QTime=2 
[junit4:junit4]   2> 12664 T739 C52 P44847 /update {wt=javabin&version=2} {add=[111 (1415814807777443840)]} 0 6
[junit4:junit4]   2> 12688 T721 C53 P44841 /update {wt=javabin&version=2} {add=[112 (1415814807788978176)]} 0 20
[junit4:junit4]   2> 12693 T748 C54 P44853 /update {wt=javabin&version=2} {add=[112 (1415814807813095424)]} 0 1
[junit4:junit4]   2> 12700 T721 C53 P44841 /update {wt=javabin&version=2} {add=[113 (1415814807819386880)]} 0 3
[junit4:junit4]   2> 12712 T759 C51 P44858 REQ /update {distrib.from=http://127.0.0.1:44847/solr/collection1/&update.distrib=FROMLEADER&wt=javabin&version=2} status=0 QTime=2 
[junit4:junit4]   2> 12713 T740 C52 P44847 REQ /update {distrib.from=http://127.0.0.1:44853/solr/collection1/&update.distrib=TOLEADER&wt=javabin&version=2} status=0 QTime=7 
[junit4:junit4]   2> 12714 T748 C54 P44853 /update {wt=javabin&version=2} {add=[113]} 0 10
[junit4:junit4]   2> 12719 T721 C53 P44841 /update {wt=javabin&version=2} {add=[114 (1415814807840358400)]} 0 2
[junit4:junit4]   2> 12762 T759 C51 P44858 REQ /update {distrib.from=http://127.0.0.1:44847/solr/collection1/&update.distrib=FROMLEADER&wt=javabin&version=2} status=0 QTime=17 
[junit4:junit4]   2> 12763 T739 C52 P44847 /update {wt=javabin&version=2} {add=[114 (1415814807845601280)]} 0 41
[junit4:junit4]   2> 12768 T721 C53 P44841 /update {wt=javabin&version=2} {add=[115 (1415814807891738624)]} 0 1
[junit4:junit4]   2> 12776 T747 C54 P44853 REQ /update {distrib.from=http://127.0.0.1:44847/solr/collection1/&update.distrib=TOLEADER&wt=javabin&version=2} status=0 QTime=2 
[junit4:junit4]   2> 12777 T739 C52 P44847 /update {wt=javabin&version=2} {add=[115]} 0 5
[junit4:junit4]   2> 12782 T721 C53 P44841 /update {wt=javabin&version=2} {add=[116 (1415814807906418688)]} 0 1
[junit4:junit4]   2> 12790 T747 C54 P44853 REQ /update {distrib.from=http://127.0.0.1:44847/solr/collection1/&update.distrib=TOLEADER&wt=javabin&version=2} status=0 QTime=2 
[junit4:junit4]   2> 12791 T739 C52 P44847 /update {wt=javabin&version=2} {add=[116]} 0 6
[junit4:junit4]   2> 12797 T721 C53 P44841 /update {wt=javabin&version=2} {add=[117 (1415814807922147328)]} 0 2
[junit4:junit4]   2> 12802 T748 C54 P44853 /update {wt=javabin&version=2} {add=[117 (1415814807927390208)]} 0 2
[junit4:junit4]   2> 12807 T721 C53 P44841 /update {wt=javabin&version=2} {add=[118 (1415814807932633088)]} 0 1
[junit4:junit4]   2> 12820 T759 C51 P44858 REQ /update {distrib.from=http://127.0.0.1:44847/solr/collection1/&update.distrib=FROMLEADER&wt=javabin&version=2} status=0 QTime=3 
[junit4:junit4]   2> 12821 T739 C52 P44847 /update {wt=javabin&version=2} {add=[118 (1415814807938924544)]} 0 10
[junit4:junit4]   2> 12826 T721 C53 P44841 /update {wt=javabin&version=2} {add=[119 (1415814807952556032)]} 0 2
[junit4:junit4]   2> 12833 T747 C54 P44853 REQ /update {distrib.from=http://127.0.0.1:44847/solr/collection1/&update.distrib=TOLEADER&wt=javabin&version=2} status=0 QTime=1 
[junit4:junit4]   2> 12834 T739 C52 P44847 /update {wt=javabin&version=2} {add=[119]} 0 5
[junit4:junit4]   2> 12838 T721 C53 P44841 /update {wt=javabin&version=2} {add=[120 (1415814807965138944)]} 0 1
[junit4:junit4]   2> 12845 T747 C54 P44853 REQ /update {distrib.from=http://127.0.0.1:44847/solr/collection1/&update.distrib=TOLEADER&wt=javabin&version=2} status=0 QTime=1 
[junit4:junit4]   2> 12846 T739 C52 P44847 /update {wt=javabin&version=2} {add=[120]} 0 5
[junit4:junit4]   2> 12850 T721 C53 P44841 /update {wt=javabin&version=2} {add=[121 (1415814807977721856)]} 0 1
[junit4:junit4]   2> 12859 T747 C54 P44853 REQ /update {distrib.from=http://127.0.0.1:44847/solr/collection1/&update.distrib=TOLEADER&wt=javabin&version=2} status=0 QTime=1 
[junit4:junit4]   2> 12859 T739 C52 P44847 /update {wt=javabin&version=2} {add=[121]} 0 5
[junit4:junit4]   2> 12883 T721 C53 P44841 /update {wt=javabin&version=2} {add=[122 (1415814807992401920)]} 0 21
[junit4:junit4]   2> 12893 T759 C51 P44858 REQ /update {distrib.from=http://127.0.0.1:44847/solr/collection1/&update.distrib=FROMLEADER&wt=javabin&version=2} status=0 QTime=2 
[junit4:junit4]   2> 12894 T739 C52 P44847 /update {wt=javabin&version=2} {add=[122 (1415814808018616320)]} 0 7
[junit4:junit4]   2> 12900 T721 C53 P44841 /update {wt=javabin&version=2} {add=[123 (1415814808029102080)]} 0 3
[junit4:junit4]   2> 12912 T759 C51 P44858 REQ /update {distrib.from=http://127.0.0.1:44847/solr/collection1/&update.distrib=FROMLEADER&wt=javabin&version=2} status=0 QTime=2 
[junit4:junit4]   2> 12913 T740 C52 P44847 REQ /update {distrib.from=http://127.0.0.1:44853/solr/collection1/&update.distrib=TOLEADER&wt=javabin&version=2} status=0 QTime=7 
[junit4:junit4]   2> 12913 T748 C54 P44853 /update {wt=javabin&version=2} {add=[123]} 0 10
[junit4:junit4]   2> 12918 T721 C53 P44841 /update {wt=javabin&version=2} {add=[124 (1415814808049025024)]} 0 2
[junit4:junit4]   2> 12930 T759 C51 P44858 REQ /update {distrib.from=http://127.0.0.1:44847/solr/collection1/&update.distrib=FROMLEADER&wt=javabin&version=2} status=0 QTime=2 
[junit4:junit4]   2> 12931 T740 C52 P44847 REQ /update {distrib.from=http://127.0.0.1:44853/solr/collection1/&update.distrib=TOLEADER&wt=javabin&version=2} status=0 QTime=7 
[junit4:junit4]   2> 12932 T748 C54 P44853 /update {wt=javabin&version=2} {add=[124]} 0 11
[junit4:junit4]   2> 12937 T721 C53 P44841 /update {wt=javabin&version=2} {add=[125 (1415814808068947968)]} 0 2
[junit4:junit4]   2> 12946 T759 C51 P44858 REQ /update {distrib.from=http://127.0.0.1:44847/solr/collection1/&update.distrib=FROMLEADER&wt=javabin&version=2} status=0 QTime=2 
[junit4:junit4]   2> 12947 T739 C52 P44847 /update {wt=javabin&version=2} {add=[125 (1415814808074190848)]} 0 7
[junit4:junit4]   2> 12952 T721 C53 P44841 /update {wt=javabin&version=2} {add=[126 (1415814808084676608)]} 0 2
[junit4:junit4]   2> 12958 T748 C54 P44853 /update {wt=javabin&version=2} {add=[126 (1415814808089919488)]} 0 2
[junit4:junit4]   2> 12964 T721 C53 P44841 /update {wt=javabin&version=2} {add=[127 (1415814808097259520)]} 0 2
[junit4:junit4]   2> 12994 T748 C54 P44853 /update {wt=javabin&version=2} {add=[127 (1415814808102502400)]} 0 26
[junit4:junit4]   2> 13000 T721 C53 P44841 /update {wt=javabin&version=2} {add=[128 (1415814808135008256)]} 0 1
[junit4:junit4]   2> 13011 T747 C54 P44853 REQ /update {distrib.from=http://127.0.0.1:44847/solr/collection1/&update.distrib=TOLEADER&wt=javabin&version=2} status=0 QTime=4 
[junit4:junit4]   2> 13012 T739 C52 P44847 /update {wt=javabin&version=2} {add=[128]} 0 7
[junit4:junit4]   2> 13017 T721 C53 P44841 /update {wt=javabin&version=2} {add=[129 (1415814808152834048)]} 0 2
[junit4:junit4]   2> 13026 T759 C51 P44858 REQ /update {distrib.from=http://127.0.0.1:44847/solr/collection1/&update.distrib=FROMLEADER&wt=javabin&version=2} status=0 QTime=2 
[junit4:junit4]   2> 13026 T739 C52 P44847 /update {wt=javabin&version=2} {add=[129 (1415814808157028352)]} 0 6
[junit4:junit4]   2> 13031 T721 C53 P44841 /update {wt=javabin&version=2} {add=[130 (1415814808167514112)]} 0 2
[junit4:junit4]   2> 13039 T747 C54 P44853 REQ /update {distrib.from=http://127.0.0.1:44847/solr/collection1/&update.distrib=TOLEADER&wt=javabin&version=2} status=0 QTime=2 
[junit4:junit4]   2> 13040 T739 C52 P44847 /update {wt=javabin&version=2} {add=[130]} 0 6
[junit4:junit4]   2> 13044 T721 C53 P44841 /update {wt=javabin&version=2} {add=[131 (1415814808181145600)]} 0 1
[junit4:junit4]   2> 13050 T748 C54 P44853 /update {wt=javabin&version=2} {add=[131 (1415814808186388480)]} 0 3
[junit4:junit4]   2> 13075 T721 C53 P44841 /update {wt=javabin&version=2} {add=[132 (1415814808193728512)]} 0 21
[junit4:junit4]   2> 13083 T759 C51 P44858 REQ /update {distrib.from=http://127.0.0.1:44847/solr/collection1/&update.distrib=FROMLEADER&wt=javabin&version=2} status=0 QTime=1 
[junit4:junit4]   2> 13084 T739 C52 P44847 /update {wt=javabin&version=2} {add=[132 (1415814808218894336)]} 0 6
[junit4:junit4]   2> 13091 T721 C53 P44841 /update {wt=javabin&version=2} {add=[133 (1415814808228331520)]} 0 3
[junit4:junit4]   2> 13100 T759 C51 P44858 REQ /update {distrib.from=http://127.0.0.1:44847/solr/collection1/&update.distrib=FROMLEADER&wt=javabin&version=2} status=0 QTime=2 
[junit4:junit4]   2> 13100 T739 C52 P44847 /update {wt=javabin&version=2} {add=[133 (1415814808235671552)]} 0 6
[junit4:junit4]   2> 13106 T721 C53 P44841 /update {wt=javabin&version=2} {add=[134 (1415814808246157312)]} 0 2
[junit4:junit4]   2> 13112 T748 C54 P44853 /update {wt=javabin&version=2} {add=[134 (1415814808251400192)]} 0 3
[junit4:junit4]   2> 13117 T721 C53 P44841 /update {wt=javabin&version=2} {add=[135 (1415814808257691648)]} 0 2
[junit4:junit4]   2> 13128 T759 C51 P44858 REQ /update {distrib.from=http://127.0.0.1:44847/solr/collection1/&update.distrib=FROMLEADER&wt=javabin&version=2} status=0 QTime=1 
[junit4:junit4]   2> 13129 T740 C52 P44847 REQ /update {distrib.from=http://127.0.0.1:44853/solr/collection1/&update.distrib=TOLEADER&wt=javabin&version=2} status=0 QTime=6 
[junit4:junit4]   2> 13130 T748 C54 P44853 /update {wt=javabin&version=2} {add=[135]} 0 10
[junit4:junit4]   2> 13136 T721 C53 P44841 /update {wt=javabin&version=2} {add=[136 (1415814808277614592)]} 0 2
[junit4:junit4]   2> 13142 T748 C54 P44853 /update {wt=javabin&version=2} {add=[136 (1415814808282857472)]} 0 3
[junit4:junit4]   2> 13147 T721 C53 P44841 /update {wt=javabin&version=2} {add=[137 (1415814808289148928)]} 0 2
[junit4:junit4]   2> 13153 T748 C54 P44853 /update {wt=javabin&version=2} {add=[137 (1415814808294391808)]} 0 3
[junit4:junit4]   2> 13158 T721 C53 P44841 /update {wt=javabin&version=2} {add=[138 (1415814808300683264)]} 0 2
[junit4:junit4]   2> 13201 T759 C51 P44858 REQ /update {distrib.from=http://127.0.0.1:44847/solr/collection1/&update.distrib=FROMLEADER&wt=javabin&version=2} status=0 QTime=18 
[junit4:junit4]   2> 13202 T740 C52 P44847 REQ /update {distrib.from=http://127.0.0.1:44853/solr/collection1/&update.distrib=TOLEADER&wt=javabin&version=2} status=0 QTime=38 
[junit4:junit4]   2> 13203 T748 C54 P44853 /update {wt=javabin&version=2} {add=[138]} 0 42
[junit4:junit4]   2> 13208 T721 C53 P44841 /update {wt=javabin&version=2} {add=[139 (1415814808353112064)]} 0 2
[junit4:junit4]   2> 13213 T748 C54 P44853 /update {wt=javabin&version=2} {add=[139 (1415814808358354944)]} 0 2
[junit4:junit4]   2> 13219 T721 C53 P44841 /update {wt=javabin&version=2} {add=[140 (1415814808364646400)]} 0 2
[junit4:junit4]   2> 13224 T748 C54 P44853 /update {wt=javabin&version=2} {add=[140 (1415814808369889280)]} 0 2
[junit4:junit4]   2> 13230 T721 C53 P44841 /update {wt=javabin&version=2} {add=[141 (1415814808376180736)]} 0 2
[junit4:junit4]   2> 13238 T747 C54 P44853 REQ /update {distrib.from=http://127.0.0.1:44847/solr/collection1/&update.distrib=TOLEADER&wt=javabin&version=2} status=0 QTime=2 
[junit4:junit4]   2> 13239 T739 C52 P44847 /update {wt=javabin&version=2} {add=[141]} 0 6
[junit4:junit4]   2> 13266 T721 C53 P44841 /update {wt=javabin&version=2} {add=[142 (1415814808390860800)]} 0 24
[junit4:junit4]   2> 13287 T748 C54 P44853 /update {wt=javabin&version=2} {add=[142 (1415814808419172352)]} 0 18
[junit4:junit4]   2> 13295 T721 C53 P44841 /update {wt=javabin&version=2} {add=[143 (1415814808442241024)]} 0 3
[junit4:junit4]   2> 13305 T747 C54 P44853 REQ /update {distrib.from=http://127.0.0.1:44847/solr/collection1/&update.distrib=TOLEADER&wt=javabin&version=2} status=0 QTime=3 
[junit4:junit4]   2> 13306 T739 C52 P44847 /update {wt=javabin&version=2} {add=[143]} 0 7
[junit4:junit4]   2> 13311 T721 C53 P44841 /update {wt=javabin&version=2} {add=[144 (1415814808461115392)]} 0 2
[junit4:junit4]   2> 13316 T748 C54 P44853 /update {wt=javabin&version=2} {add=[144 (1415814808466358272)]} 0 2
[junit4:junit4]   2> 13321 T721 C53 P44841 /update {wt=javabin&version=2} {add=[145 (1415814808471601152)]} 0 2
[junit4:junit4]   2> 13326 T748 C54 P44853 /update {wt=javabin&version=2} {add=[145 (1415814808476844032)]} 0 2
[junit4:junit4]   2> 13330 T721 C53 P44841 /update {wt=javabin&version=2} {add=[146 (1415814808481038336)]} 0 1
[junit4:junit4]   2> 13342 T759 C51 P44858 REQ /update {distrib.from=http://127.0.0.1:44847/solr/collection1/&update.distrib=FROMLEADER&wt=javabin&version=2} status=0 QTime=3 
[junit4:junit4]   2> 13343 T739 C52 P44847 /update {wt=javabin&version=2} {add=[146 (1415814808487329792)]} 0 9
[junit4:junit4]   2> 13348 T721 C53 P44841 /update {wt=javabin&version=2} {add=[147 (1415814808499912704)]} 0 2
[junit4:junit4]   2> 13357 T747 C54 P44853 REQ /update {distrib.from=http://127.0.0.1:44847/solr/collection1/&update.distrib=TOLEADER&wt=javabin&version=2} status=0 QTime=3 
[junit4:junit4]   2> 13358 T739 C52 P44847 /update {wt=javabin&version=2} {add=[147]} 0 7
[junit4:junit4]   2> 13363 T721 C53 P44841 /update {wt=javabin&version=2} {add=[148 (1415814808515641344)]} 0 2
[junit4:junit4]   2> 13375 T759 C51 P44858 REQ /update {distrib.from=http://127.0.0.1:44847/solr/collection1/&update.distrib=FROMLEADER&wt=javabin&version=2} status=0 QTime=2 
[junit4:junit4]   2> 13376 T740 C52 P44847 REQ /update {distrib.from=http://127.0.0.1:44853/solr/collection1/&update.distrib=TOLEADER&wt=javabin&version=2} status=0 QTime=7 
[junit4:junit4]   2> 13376 T748 C54 P44853 /update {wt=javabin&version=2} {add=[148]} 0 10
[junit4:junit4]   2> 13382 T721 C53 P44841 /update {wt=javabin&version=2} {add=[149 (1415814808534515712)]} 0 2
[junit4:junit4]   2> 13390 T747 C54 P44853 REQ /update {distrib.from=http://127.0.0.1:44847/solr/collection1/&update.distrib=TOLEADER&wt=javabin&version=2} status=0 QTime=2 
[junit4:junit4]   2> 13391 T739 C52 P44847 /update {wt=javabin&version=2} {add=[149]} 0 6
[junit4:junit4]   2> 13394 T721 C53 P44841 oasu.DirectUpdateHandler2.commit start commit{flags=0,_version_=0,optimize=false,openSearcher=true,waitSearcher=true,expungeDeletes=false,softCommit=false}
[junit4:junit4]   2> 14087 T721 C53 P44841 oasc.SolrDeletionPolicy.onCommit SolrDeletionPolicy.onCommit: commits:num=2
[junit4:junit4]   2> 		commit{dir=NRTCachingDirectory(org.apache.lucene.store.NIOFSDirectory@/usr/home/hudson/hudson-slave/workspace/Lucene-Solr-Tests-4.x-java7/solr/build/solr-core/test/J0/org.apache.solr.cloud.BasicDistributedZkTest-1350226206312/control/data/index lockFactory=org.apache.lucene.store.NativeFSLockFactory@59975455; maxCacheMB=48.0 maxMergeSizeMB=4.0),segFN=segments_1,generation=1,filenames=[segments_1]
[junit4:junit4]   2> 		commit{dir=NRTCachingDirectory(org.apache.lucene.store.NIOFSDirectory@/usr/home/hudson/hudson-slave/workspace/Lucene-Solr-Tests-4.x-java7/solr/build/solr-core/test/J0/org.apache.solr.cloud.BasicDistributedZkTest-1350226206312/control/data/index lockFactory=org.apache.lucene.store.NativeFSLockFactory@59975455; maxCacheMB=48.0 maxMergeSizeMB=4.0),segFN=segments_2,generation=2,filenames=[_5_nrm.cfe, _5_Memory_0.ram, _6_MockFixedIntBlock_0.pyl, _6_MockFixedIntBlock_0.frq, _0_MockRandom_0.prx, _3.fdt, _5_Lucene40WithOrds_0.tib, _0_MockFixedIntBlock_0.tib, _1_MockRandom_0.pos, _6_MockFixedIntBlock_0.skp, _0_Lucene40WithOrds_0.tii, _5_Lucene40WithOrds_0.tii, _0_Lucene40WithOrds_0.frq, _1_Lucene40WithOrds_0.tib, _0_MockFixedIntBlock_0.tii, _3_MockRandom_0.skp, _4_MockRandom_0.pyl, _1_Lucene40WithOrds_0.tii, _0_Lucene40WithOrds_0.tib, _6_MockRandom_0.skp, _1_Lucene40WithOrds_0.frq, _1_MockRandom_0.tiv, _4_MockFixedIntBlock_0.pos, _0_Memory_0.ram, _2.fdt, _1_MockRandom_0.sd, _2.fdx, _1.fdx, _0_MockRandom_0.frq, _1_MockRandom_0.tib, _5_nrm.cfs, _1.fdt, _4_MockRandom_0.sd, _4_MockFixedIntBlock_0.frq, _1_MockRandom_0.doc, _2_MockFixedIntBlock_0.doc, _3.si, _1_MockFixedIntBlock_0.pos, _6.fdt, _5_Lucene40WithOrds_0.prx, _6_Memory_0.ram, _2.si, _4_Lucene40WithOrds_0.tib, _6_MockRandom_0.tip, _4_Lucene40WithOrds_0.tii, _2_MockRandom_0.tip, _3_MockFixedIntBlock_0.frq, _6_MockRandom_0.tim, _6.fdx, _2_MockRandom_0.tim, _1_Lucene40WithOrds_0.prx, _2_MockFixedIntBlock_0.skp, _3_MockRandom_0.frq, _6_MockFixedIntBlock_0.tib, _3.fnm, _6_MockFixedIntBlock_0.tii, _1_Memory_0.ram, _2_nrm.cfe, _0_MockFixedIntBlock_0.pyl, _6_MockRandom_0.pyl, _6_MockRandom_0.doc, _2_nrm.cfs, _4_MockRandom_0.skp, _2_MockRandom_0.prx, _6_MockFixedIntBlock_0.doc, _5_MockFixedIntBlock_0.frq, _2_Lucene40WithOrds_0.frq, _5_MockFixedIntBlock_0.tib, _3_MockFixedIntBlock_0.pos, _2.fnm, _3.fdx, _2_MockRandom_0.sd, _0_MockFixedIntBlock_0.doc, _1.si, _3_MockRandom_0.pyl, _6.si, _6.fnm, _0_Lucene40WithOrds_0.prx, _3_Lucene40WithOrds_0.prx, _3_MockRandom_0.pos, _5_MockFixedIntBlock_0.tii, _6_MockRandom_0.frq, _4_MockRandom_0.pos, _3_nrm.cfe, _5.fdt, _4_MockFixedIntBlock_0.tib, _3_MockFixedIntBlock_0.skp, _3_Lucene40WithOrds_0.tii, _1_MockFixedIntBlock_0.pyl, _6_Lucene40WithOrds_0.prx, _4_nrm.cfe, _4.fnm, _4_MockRandom_0.tib, _1.fnm, _2_MockFixedIntBlock_0.tii, _3_Lucene40WithOrds_0.tib, _4.fdx, _4_MockRandom_0.doc, _3_MockFixedIntBlock_0.pyl, _2_MockFixedIntBlock_0.tib, _2_MockFixedIntBlock_0.pyl, _5_MockRandom_0.sd, _4_MockRandom_0.tiv, _4_MockFixedIntBlock_0.tii, _2_MockFixedIntBlock_0.frq, _6_Lucene40WithOrds_0.frq, _0.fnm, _1_MockFixedIntBlock_0.frq, _5_MockFixedIntBlock_0.pyl, _4_MockFixedIntBlock_0.skp, _0_MockFixedIntBlock_0.pos, _6_Lucene40WithOrds_0.tii, _3_MockRandom_0.tib, _5.si, _5_Lucene40WithOrds_0.frq, _3_nrm.cfs, _6_MockFixedIntBlock_0.pos, _6_MockRandom_0.sd, _5_MockFixedIntBlock_0.skp, _1_MockFixedIntBlock_0.skp, _4_Lucene40WithOrds_0.prx, _2_MockFixedIntBlock_0.pos, _6_Lucene40WithOrds_0.tib, _4_MockFixedIntBlock_0.doc, _4_Memory_0.ram, _4_nrm.cfs, _3_MockRandom_0.tiv, _1_MockRandom_0.frq, _5_MockRandom_0.frq, _1_MockFixedIntBlock_0.doc, _4_Lucene40WithOrds_0.frq, _3_MockRandom_0.doc, _3_MockFixedIntBlock_0.doc, _6_MockRandom_0.pos, _5_MockRandom_0.tip, _6_nrm.cfs, _0_MockFixedIntBlock_0.skp, _5_MockRandom_0.tim, _2_Lucene40WithOrds_0.prx, _2_Memory_0.ram, _4_MockFixedIntBlock_0.pyl, _0.si, _3_Memory_0.ram, _1_nrm.cfs, _1_MockFixedIntBlock_0.tii, _0_MockRandom_0.tib, _5.fnm, _6_nrm.cfe, _5_MockFixedIntBlock_0.pos, _3_MockFixedIntBlock_0.tib, _5_MockFixedIntBlock_0.doc, _4.si, _4.fdt, _1_MockRandom_0.skp, _0_nrm.cfs, _3_Lucene40WithOrds_0.frq, _1_nrm.cfe, _3_MockRandom_0.sd, _0_MockFixedIntBlock_0.frq, _2_Lucene40WithOrds_0.tii, _5_MockRandom_0.prx, _0_MockRandom_0.sd, _1_MockRandom_0.pyl, _0_MockRandom_0.tiv, _4_MockRandom_0.frq, _0_nrm.cfe, _5.fdx, _1_MockFixedIntBlock_0.tib, segments_2, _2_MockRandom_0.frq, _0.fdx, _2_Lucene40WithOrds_0.tib, _0.fdt, _3_MockFixedIntBlock_0.tii]
[junit4:junit4]   2> 14089 T721 C53 P44841 oasc.SolrDeletionPolicy.updateCommits newest commit = 2
[junit4:junit4]   2> 14107 T721 C53 P44841 oass.SolrIndexSearcher.<init> Opening Searcher@5fae52a8 main
[junit4:junit4]   2> 14108 T721 C53 P44841 oasu.DirectUpdateHandler2.commit end_commit_flush
[junit4:junit4]   2> 14110 T732 oasc.SolrCore.registerSearcher [collection1] Registered new searcher Searcher@5fae52a8 main{StandardDirectoryReader(segments_2:15:nrt _0(4.1):C10 _1(4.1):C10 _2(4.1):C10 _3(4.1):C10 _4(4.1):C10 _5(4.1):C10 _6(4.1):C7)}
[junit4:junit4]   2> 14111 T721 C53 P44841 /update {waitSearcher=true&wt=javabin&commit=true&softCommit=false&version=2} {commit=} 0 717
[junit4:junit4]   2> 14114 T739 C52 P44847 oasu.DirectUpdateHandler2.commit start commit{flags=0,_version_=0,optimize=false,openSearcher=true,waitSearcher=true,expungeDeletes=false,softCommit=false}
[junit4:junit4]   2> 14352 T739 C52 P44847 oasc.SolrDeletionPolicy.onCommit SolrDeletionPolicy.onCommit: commits:num=2
[junit4:junit4]   2> 		commit{dir=NRTCachingDirectory(org.apache.lucene.store.NIOFSDirectory@/usr/home/hudson/hudson-slave/workspace/Lucene-Solr-Tests-4.x-java7/solr/build/solr-core/test/J0/org.apache.solr.cloud.BasicDistributedZkTest-1350226206312/jetty1/index lockFactory=org.apache.lucene.store.NativeFSLockFactory@22274f3f; maxCacheMB=48.0 maxMergeSizeMB=4.0),segFN=segments_1,generation=1,filenames=[segments_1]
[junit4:junit4]   2> 		commit{dir=NRTCachingDirectory(org.apache.lucene.store.NIOFSDirectory@/usr/home/hudson/hudson-slave/workspace/Lucene-Solr-Tests-4.x-java7/solr/build/solr-core/test/J0/org.apache.solr.cloud.BasicDistributedZkTest-1350226206312/jetty1/index lockFactory=org.apache.lucene.store.NativeFSLockFactory@22274f3f; maxCacheMB=48.0 maxMergeSizeMB=4.0),segFN=segments_2,generation=2,filenames=[_3_nrm.cfe, _3_MockFixedIntBlock_0.skp, _3_Lucene40WithOrds_0.tii, _0_MockRandom_0.prx, _1_MockFixedIntBlock_0.pyl, _3.fdt, _0_MockFixedIntBlock_0.tib, _2_MockFixedIntBlock_0.tii, _1.fnm, _3_Lucene40WithOrds_0.tib, _3_MockFixedIntBlock_0.pyl, _0_Lucene40WithOrds_0.tii, _2_MockFixedIntBlock_0.tib, _2_MockFixedIntBlock_0.pyl, _0_Lucene40WithOrds_0.frq, _1_Lucene40WithOrds_0.tib, _0_MockFixedIntBlock_0.tii, _3_MockRandom_0.skp, _2_MockFixedIntBlock_0.frq, _1_Lucene40WithOrds_0.tii, _0_Lucene40WithOrds_0.tib, _1_Lucene40WithOrds_0.frq, _0.fnm, _1_MockFixedIntBlock_0.frq, _0_Memory_0.ram, _2.fdt, _0_MockFixedIntBlock_0.pos, _1_MockRandom_0.sd, _2.fdx, _1_MockRandom_0.tii, _3_nrm.cfs, _1.fdx, _0_MockRandom_0.frq, _3_MockRandom_0.tip, _1_MockRandom_0.tib, _1_MockFixedIntBlock_0.skp, _2_MockFixedIntBlock_0.pos, _1.fdt, _3_MockRandom_0.tim, _3.si, _2_MockFixedIntBlock_0.doc, _1_MockFixedIntBlock_0.pos, _1_MockRandom_0.frq, _2.si, _2_MockRandom_0.tip, _3_MockFixedIntBlock_0.frq, _1_MockFixedIntBlock_0.doc, _2_MockRandom_0.tim, _3_MockRandom_0.doc, _2_MockFixedIntBlock_0.skp, _1_Lucene40WithOrds_0.prx, _3_MockFixedIntBlock_0.doc, _3_MockRandom_0.frq, _3.fnm, _2_nrm.cfe, _1_Memory_0.ram, _0_MockFixedIntBlock_0.skp, _0_MockFixedIntBlock_0.pyl, _2_Lucene40WithOrds_0.prx, _2_Memory_0.ram, _3_Memory_0.ram, _2_nrm.cfs, _0.si, _2_MockRandom_0.prx, _0_MockRandom_0.tib, _1_nrm.cfs, _1_MockFixedIntBlock_0.tii, _2_Lucene40WithOrds_0.frq, _3_MockFixedIntBlock_0.tib, _3_Lucene40WithOrds_0.frq, _0_nrm.cfs, _3_MockFixedIntBlock_0.pos, _3_MockRandom_0.sd, _2.fnm, _1_nrm.cfe, _3.fdx, _0_MockFixedIntBlock_0.frq, _2_MockRandom_0.sd, _2_Lucene40WithOrds_0.tii, _0_MockRandom_0.sd, _1_MockRandom_0.prx, _0_MockRandom_0.tiv, _0_MockFixedIntBlock_0.doc, _1.si, _0_nrm.cfe, _3_MockRandom_0.pyl, _2_MockRandom_0.frq, segments_2, _1_MockFixedIntBlock_0.tib, _2_Lucene40WithOrds_0.tib, _0.fdx, _0_Lucene40WithOrds_0.prx, _3_Lucene40WithOrds_0.prx, _3_MockRandom_0.pos, _0.fdt, _3_MockFixedIntBlock_0.tii]
[junit4:junit4]   2> 14353 T739 C52 P44847 oasc.SolrDeletionPolicy.updateCommits newest commit = 2
[junit4:junit4]   2> 14365 T739 C52 P44847 oass.SolrIndexSearcher.<init> Opening Searcher@6f70a25d main
[junit4:junit4]   2> 14366 T739 C52 P44847 oasu.DirectUpdateHandler2.commit end_commit_flush
[junit4:junit4]   2> 14368 T744 oasc.SolrCore.registerSearcher [collection1] Registered new searcher Searcher@6f70a25d main{StandardDirectoryReader(segments_2:9:nrt _0(4.1):C10 _1(4.1):C10 _2(4.1):C10 _3(4.1):C2)}
[junit4:junit4]   2> 14369 T739 C52 P44847 oasu.SolrCmdDistributor.distribCommit Distrib commit to:[StdNode: http://127.0.0.1:44858/solr/collection1/, StdNode: http://127.0.0.1:44853/solr/collection1/]
[junit4:junit4]   2> 14373 T759 C51 P44858 oasu.DirectUpdateHandler2.commit start commit{flags=0,_version_=0,optimize=false,openSearcher=true,waitSearcher=true,expungeDeletes=false,softCommit=false}
[junit4:junit4]   2> 14373 T747 C54 P44853 oasu.DirectUpdateHandler2.commit start commit{flags=0,_version_=0,optimize=false,openSearcher=true,waitSearcher=true,expungeDeletes=false,softCommit=false}
[junit4:junit4]   2> 14616 T759 C51 P44858 oasc.SolrDeletionPolicy.onCommit SolrDeletionPolicy.onCommit: commits:num=2
[junit4:junit4]   2> 		commit{dir=NRTCachingDirectory(org.apache.lucene.store.NIOFSDirectory@/usr/home/hudson/hudson-slave/workspace/Lucene-Solr-Tests-4.x-java7/solr/build/solr-core/test/J0/org.apache.solr.cloud.BasicDistributedZkTest-1350226206312/jetty3/index lockFactory=org.apache.lucene.store.NativeFSLockFactory@20d3d6e2; maxCacheMB=48.0 maxMergeSizeMB=4.0),segFN=segments_2,generation=2,filenames=[segments_2]
[junit4:junit4]   2> 		commit{dir=NRTCachingDirectory(org.apache.lucene.store.NIOFSDirectory@/usr/home/hudson/hudson-slave/workspace/Lucene-Solr-Tests-4.x-java7/solr/build/solr-core/test/J0/org.apache.solr.cloud.BasicDistributedZkTest-1350226206312/jetty3/index lockFactory=org.apache.lucene.store.NativeFSLockFactory@20d3d6e2; maxCacheMB=48.0 maxMergeSizeMB=4.0),segFN=segments_3,generation=3,filenames=[_3_MockRandom_0.prx, _3.fdt, _0_MockFixedIntBlock_0.tib, _0_Lucene40WithOrds_0.tii, _0_Lucene40WithOrds_0.frq, _1_Lucene40WithOrds_0.tib, _0_MockFixedIntBlock_0.tii, _1_Lucene40WithOrds_0.tii, _0_Lucene40WithOrds_0.tib, _1_MockRandom_0.tiv, _1_Lucene40WithOrds_0.frq, _0_Memory_0.ram, _2.fdt, _1_MockRandom_0.sd, _2.fdx, _0_MockRandom_0.skp, _1.fdx, _0_MockRandom_0.frq, _1_MockRandom_0.tib, _1.fdt, _2_MockFixedIntBlock_0.doc, _3.si, _1_MockFixedIntBlock_0.pos, _2.si, _2_MockRandom_0.tip, _3_MockFixedIntBlock_0.frq, _2_MockRandom_0.tim, _1_Lucene40WithOrds_0.prx, _2_MockFixedIntBlock_0.skp, _3_MockRandom_0.frq, _3.fnm, _1_Memory_0.ram, _2_nrm.cfe, _0_MockFixedIntBlock_0.pyl, _2_MockRandom_0.pyl, _2_nrm.cfs, _2_Lucene40WithOrds_0.frq, _3_MockFixedIntBlock_0.pos, _2.fnm, _3.fdx, _2_MockRandom_0.sd, _2_MockRandom_0.skp, _0_MockFixedIntBlock_0.doc, _1.si, _0_Lucene40WithOrds_0.prx, _3_Lucene40WithOrds_0.prx, _2_MockRandom_0.doc, _3_nrm.cfe, _3_MockFixedIntBlock_0.skp, _3_Lucene40WithOrds_0.tii, _1_MockFixedIntBlock_0.pyl, _1.fnm, _2_MockFixedIntBlock_0.tii, _3_Lucene40WithOrds_0.tib, _3_MockFixedIntBlock_0.pyl, _2_MockFixedIntBlock_0.tib, _2_MockFixedIntBlock_0.pyl, _2_MockFixedIntBlock_0.frq, _0.fnm, _1_MockFixedIntBlock_0.frq, _0_MockFixedIntBlock_0.pos, _3_nrm.cfs, _3_MockRandom_0.tip, _1_MockFixedIntBlock_0.skp, _2_MockFixedIntBlock_0.pos, _0_MockRandom_0.doc, _3_MockRandom_0.tim, _0_MockRandom_0.pos, _1_MockRandom_0.frq, _1_MockFixedIntBlock_0.doc, _3_MockFixedIntBlock_0.doc, _0_MockFixedIntBlock_0.skp, _2_Lucene40WithOrds_0.prx, _2_MockRandom_0.pos, _2_Memory_0.ram, _3_Memory_0.ram, _0.si, _1_MockFixedIntBlock_0.tii, _1_nrm.cfs, _3_MockFixedIntBlock_0.tib, _0_nrm.cfs, _3_Lucene40WithOrds_0.frq, _1_nrm.cfe, _3_MockRandom_0.sd, _0_MockFixedIntBlock_0.frq, _2_Lucene40WithOrds_0.tii, _1_MockRandom_0.prx, _0_MockRandom_0.tip, _0_MockRandom_0.sd, _0_nrm.cfe, _1_MockFixedIntBlock_0.tib, _2_MockRandom_0.frq, _0.fdx, _2_Lucene40WithOrds_0.tib, _0_MockRandom_0.pyl, _0_MockRandom_0.tim, _0.fdt, segments_3, _3_MockFixedIntBlock_0.tii]
[junit4:junit4]   2> 14617 T759 C51 P44858 oasc.SolrDeletionPolicy.updateCommits newest commit = 3
[junit4:junit4]   2> 14621 T747 C54 P44853 oasc.SolrDeletionPolicy.onCommit SolrDeletionPolicy.onCommit: commits:num=2
[junit4:junit4]   2> 		commit{dir=NRTCachingDirectory(org.apache.lucene.store.NIOFSDirectory@/usr/home/hudson/hudson-slave/workspace/Lucene-Solr-Tests-4.x-java7/solr/build/solr-core/test/J0/org.apache.solr.cloud.BasicDistributedZkTest-1350226206312/jetty2/index lockFactory=org.apache.lucene.store.NativeFSLockFactory@4ee209a; maxCacheMB=48.0 maxMergeSizeMB=4.0),segFN=segments_1,generation=1,filenames=[segments_1]
[junit4:junit4]   2> 		commit{dir=NRTCachingDirectory(org.apache.lucene.store.NIOFSDirectory@/usr/home/hudson/hudson-slave/workspace/Lucene-Solr-Tests-4.x-java7/solr/build/solr-core/test/J0/org.apache.solr.cloud.BasicDistributedZkTest-1350226206312/jetty2/index lockFactory=org.apache.lucene.store.NativeFSLockFactory@4ee209a; maxCacheMB=48.0 maxMergeSizeMB=4.0),segFN=segments_2,generation=2,filenames=[_0_MockRandom_0.prx, _3.fdt, _0_MockFixedIntBlock_0.tib, _0_Lucene40WithOrds_0.tii, _0_Lucene40WithOrds_0.frq, _1_Lucene40WithOrds_0.tib, _0_MockFixedIntBlock_0.tii, _3_MockRandom_0.skp, _1_Lucene40WithOrds_0.tii, _0_Lucene40WithOrds_0.tib, _1_Lucene40WithOrds_0.frq, _0_Memory_0.ram, _2.fdt, _1_MockRandom_0.sd, _2.fdx, _1_MockRandom_0.tii, _1.fdx, _0_MockRandom_0.frq, _1_MockRandom_0.tib, _1.fdt, _2_MockFixedIntBlock_0.doc, _3.si, _1_MockFixedIntBlock_0.pos, _2.si, _3_MockFixedIntBlock_0.frq, _1_Lucene40WithOrds_0.prx, _2_MockFixedIntBlock_0.skp, _3_MockRandom_0.frq, _3.fnm, _2_MockRandom_0.tiv, _1_Memory_0.ram, _2_nrm.cfe, _0_MockFixedIntBlock_0.pyl, _2_MockRandom_0.pyl, _2_MockRandom_0.tib, _2_nrm.cfs, _2_Lucene40WithOrds_0.frq, _3_MockFixedIntBlock_0.pos, _2.fnm, _3.fdx, _2_MockRandom_0.sd, _2_MockRandom_0.skp, _0_MockFixedIntBlock_0.doc, _1.si, _3_MockRandom_0.pyl, _0_Lucene40WithOrds_0.prx, _3_Lucene40WithOrds_0.prx, _3_MockRandom_0.pos, _2_MockRandom_0.doc, _3_nrm.cfe, _3_MockFixedIntBlock_0.skp, _3_Lucene40WithOrds_0.tii, _1_MockFixedIntBlock_0.pyl, _1.fnm, _2_MockFixedIntBlock_0.tii, _3_Lucene40WithOrds_0.tib, _3_MockFixedIntBlock_0.pyl, _2_MockFixedIntBlock_0.tib, _2_MockFixedIntBlock_0.pyl, _2_MockFixedIntBlock_0.frq, _0.fnm, _1_MockFixedIntBlock_0.frq, _0_MockFixedIntBlock_0.pos, _3_nrm.cfs, _3_MockRandom_0.tip, _1_MockFixedIntBlock_0.skp, _2_MockFixedIntBlock_0.pos, _3_MockRandom_0.tim, _1_MockRandom_0.frq, _1_MockFixedIntBlock_0.doc, _3_MockRandom_0.doc, _3_MockFixedIntBlock_0.doc, _0_MockFixedIntBlock_0.skp, _2_Lucene40WithOrds_0.prx, _2_MockRandom_0.pos, _2_Memory_0.ram, _0.si, _3_Memory_0.ram, _1_MockFixedIntBlock_0.tii, _1_nrm.cfs, _3_MockFixedIntBlock_0.tib, _0_nrm.cfs, _3_Lucene40WithOrds_0.frq, _1_nrm.cfe, _3_MockRandom_0.sd, _0_MockFixedIntBlock_0.frq, _2_Lucene40WithOrds_0.tii, _1_MockRandom_0.prx, _0_MockRandom_0.sd, _0_MockRandom_0.tip, _0_nrm.cfe, _1_MockFixedIntBlock_0.tib, segments_2, _2_MockRandom_0.frq, _0.fdx, _2_Lucene40WithOrds_0.tib, _0_MockRandom_0.tim, _0.fdt, _3_MockFixedIntBlock_0.tii]
[junit4:junit4]   2> 14622 T747 C54 P44853 oasc.SolrDeletionPolicy.updateCommits newest commit = 2
[junit4:junit4]   2> 14632 T759 C51 P44858 oass.SolrIndexSearcher.<init> Opening Searcher@14651e5 main
[junit4:junit4]   2> 14633 T759 C51 P44858 oasu.DirectUpdateHandler2.commit end_commit_flush
[junit4:junit4]   2> 14634 T768 oasc.SolrCore.registerSearcher [collection1] Registered new searcher Searcher@14651e5 main{StandardDirectoryReader(segments_3:10:nrt _0(4.1):C10 _1(4.1):C10 _2(4.1):C10 _3(4.1):C2)}
[junit4:junit4]   2> 14635 T759 C51 P44858 /update {waitSearcher=true&commit=true&commit_end_point=true&expungeDeletes=false&wt=javabin&softCommit=false&version=2} {commit=} 0 262
[junit4:junit4]   2> 14644 T747 C54 P44853 oass.SolrIndexSearcher.<init> Opening Searcher@1d205bfc main
[junit4:junit4]   2> 14646 T747 C54 P44853 oasu.DirectUpdateHandler2.commit end_commit_flush
[junit4:junit4]   2> 14647 T756 oasc.SolrCore.registerSearcher [collection1] Registered new searcher Searcher@1d205bfc main{StandardDirectoryReader(segments_2:9:nrt _0(4.1):C10 _1(4.1):C10 _2(4.1):C10 _3(4.1):C5)}
[junit4:junit4]   2> 14648 T747 C54 P44853 /update {waitSearcher=true&commit=true&commit_end_point=true&expungeDeletes=false&wt=javabin&softCommit=false&version=2} {commit=} 0 275
[junit4:junit4]   2> 14649 T739 C52 P44847 /update {waitSearcher=true&wt=javabin&commit=true&softCommit=false&version=2} {commit=} 0 535
[junit4:junit4]   2> 14655 T721 C53 P44841 REQ /select {distrib=false&sort=n_ti1+desc&wt=javabin&q=*:*&version=2} hits=67 status=0 QTime=3 
[junit4:junit4]   2> 14668 T749 C54 P44853 REQ /select {sort=n_ti1+desc&distrib=false&wt=javabin&rows=10&version=2&fl=id&shard.url=127.0.0.1:44853/solr/collection1/&NOW=1350226220968&start=0&q=*:*&isShard=true&fsv=true} hits=35 status=0 QTime=2 
[junit4:junit4]   2> 14668 T741 C52 P44847 REQ /select {sort=n_ti1+desc&distrib=false&wt=javabin&rows=10&version=2&fl=id&shard.url=127.0.0.1:44847/solr/collection1/|127.0.0.1:44858/solr/collection1/&NOW=1350226220968&start=0&q=*:*&isShard=true&fsv=true} hits=32 status=0 QTime=2 
[junit4:junit4]   2> 14673 T749 C54 P44853 REQ /select {shard.url=127.0.0.1:44853/solr/collection1/&NOW=1350226220968&q=*:*&ids=143,139,137,130&distrib=false&isShard=true&wt=javabin&version=2} status=0 QTime=1 
[junit4:junit4]   2> 14673 T741 C52 P44847 REQ /select {shard.url=127.0.0.1:44847/solr/collection1/|127.0.0.1:44858/solr/collection1/&NOW=1350226220968&q=*:*&ids=114,138,148,109,14,12&distrib=false&isShard=true&wt=javabin&version=2} status=0 QTime=1 
[junit4:junit4]   2> 14675 T748 C54 P44853 REQ /select {sort=n_ti1+desc&wt=javabin&q=*:*&version=2} hits=67 status=0 QTime=14 
[junit4:junit4]   2> 14682 T721 C53 P44841 REQ /select {distrib=false&sort=n_ti1+asc&wt=javabin&q=*:*&version=2} hits=67 status=0 QTime=1 
[junit4:junit4]   2> 14685 T709 oascsi.HttpClientUtil.createClient Creating new http client, config:
[junit4:junit4]   2> 14697 T709 oaz.ZooKeeper.<init> Initiating client connection, connectString=127.0.0.1:44838/solr sessionTimeout=10000 watcher=org.apache.solr.common.cloud.ConnectionManager@678b4e67
[junit4:junit4]   2> 14699 T780 oaz.ClientCnxn$SendThread.startConnect Opening socket connection to server /127.0.0.1:44838
[junit4:junit4]   2> 14698 T709 oascc.ConnectionManager.waitForConnected Waiting for client to connect to ZooKeeper
[junit4:junit4]   2> 14700 T780 oaz.ClientCnxn$SendThread.primeConnection Socket connection established to localhost/127.0.0.1:44838, initiating session
[junit4:junit4]   2> 14700 T711 oazs.NIOServerCnxn$Factory.run Accepted socket connection from /140.211.11.196:44888
[junit4:junit4]   2> 14701 T711 oazs.NIOServerCnxn.readConnectRequest Client attempting to establish new session at /140.211.11.196:44888
[junit4:junit4]   2> 14703 T713 oazs.NIOServerCnxn.finishSessionInit Established session 0x13a5fc0de710008 with negotiated timeout 10000 for client /140.211.11.196:44888
[junit4:junit4]   2> 14703 T780 oaz.ClientCnxn$SendThread.readConnectResult Session establishment complete on server localhost/127.0.0.1:44838, sessionid = 0x13a5fc0de710008, negotiated timeout = 10000
[junit4:junit4]   2> 14703 T781 oascc.ConnectionManager.process Watcher org.apache.solr.common.cloud.ConnectionManager@678b4e67 name:ZooKeeperConnection Watcher:127.0.0.1:44838/solr got event WatchedEvent state:SyncConnected type:None path:null path:null type:None
[junit4:junit4]   2> 14704 T709 oascc.ConnectionManager.waitForConnected Client is connected to ZooKeeper
[junit4:junit4]   2> 14705 T709 oascc.ZkStateReader.createClusterStateWatchersAndUpdate Updating cluster state from ZooKeeper... 
[junit4:junit4]   2> 14718 T750 C54 P44853 REQ /select {sort=n_ti1+asc&distrib=false&wt=javabin&rows=10&version=2&fl=id&shard.url=127.0.0.1:44853/solr/collection1/&NOW=1350226221021&start=0&q=*:*&isShard=true&fsv=true} hits=35 status=0 QTime=0 
[junit4:junit4]   2> 14718 T737 C52 P44847 REQ /select {sort=n_ti1+asc&distrib=false&wt=javabin&rows=10&version=2&fl=id&shard.url=127.0.0.1:44847/solr/collection1/|127.0.0.1:44858/solr/collection1/&NOW=1350226221021&start=0&q=*:*&isShard=true&fsv=true} hits=32 status=0 QTime=0 
[junit4:junit4]   2> 14724 T750 C54 P44853 REQ /select {shard.url=127.0.0.1:44853/solr/collection1/&NOW=1350226221021&q=*:*&ids=2,127,145,112,103,119&distrib=false&isShard=true&wt=javabin&version=2} status=0 QTime=1 
[junit4:junit4]   2> 14725 T737 C52 P44847 REQ /select {shard.url=127.0.0.1:44847/solr/collection1/|127.0.0.1:44858/solr/collection1/&NOW=1350226221021&q=*:*&ids=146,110,107,101&distrib=false&isShard=true&wt=javabin&version=2} status=0 QTime=1 
[junit4:junit4]   2> 14727 T736 C52 P44847 REQ /select {sort=n_ti1+asc&wt=javabin&q=*:*&version=2} hits=67 status=0 QTime=13 
[junit4:junit4]   2> 14735 T721 C53 P44841 REQ /select {distrib=false&sort=n_f1+desc&wt=javabin&q=*:*&version=2} hits=67 status=0 QTime=3 
[junit4:junit4]   2> 14744 T750 C54 P44853 REQ /select {sort=n_f1+desc&distrib=false&wt=javabin&rows=10&version=2&fl=id&shard.url=127.0.0.1:44853/solr/collection1/&NOW=1350226221047&start=0&q=*:*&isShard=true&fsv=true} hits=35 status=0 QTime=1 
[junit4:junit4]   2> 14744 T760 C51 P44858 REQ /select {sort=n_f1+desc&distrib=false&wt=javabin&rows=10&version=2&fl=id&shard.url=127.0.0.1:44847/solr/collection1/|127.0.0.1:44858/solr/collection1/&NOW=1350226221047&start=0&q=*:*&isShard=true&fsv=true} hits=32 status=0 QTime=1 
[junit4:junit4]   2> 14749 T750 C54 P44853 REQ /select {shard.url=127.0.0.1:44853/solr/collection1/&NOW=1350226221047&q=*:*&ids=115,149,137,120,141&distrib=false&isShard=true&wt=javabin&version=2} status=0 QTime=1 
[junit4:junit4]   2> 14749 T760 C51 P44858 REQ /select {shard.url=127.0.0.1:44847/solr/collection1/|127.0.0.1:44858/solr/collection1/&NOW=1350226221047&q=*:*&ids=10,133,138,122,118&distrib=false&isShard=true&wt=javabin&version=2} status=0 QTime=1 
[junit4:junit4]   2> 14751 T739 C52 P44847 REQ /select {sort=n_f1+desc&wt=javabin&q=*:*&version=2} hits=67 status=0 QTime=11 
[junit4:junit4]   2> 14757 T721 C53 P44841 REQ /select {distrib=false&sort=n_f1+asc&wt=javabin&q=*:*&version=2} hits=67 status=0 QTime=1 
[junit4:junit4]   2> 14766 T750 C54 P44853 REQ /select {sort=n_f1+asc&distrib=false&wt=javabin&rows=10&version=2&fl=id&shard.url=127.0.0.1:44853/solr/collection1/&NOW=1350226221069&start=0&q=*:*&isShard=true&fsv=true} hits=35 status=0 QTime=1 
[junit4:junit4]   2> 14766 T760 C51 P44858 REQ /select {sort=n_f1+asc&distrib=false&wt=javabin&rows=10&version=2&fl=id&shard.url=127.0.0.1:44847/solr/collection1/|127.0.0.1:44858/solr/collection1/&NOW=1350226221069&start=0&q=*:*&isShard=true&fsv=true} hits=32 status=0 QTime=1 
[junit4:junit4]   2> 14771 T760 C51 P44858 REQ /select {shard.url=127.0.0.1:44847/solr/collection1/|127.0.0.1:44858/solr/collection1/&NOW=1350226221069&q=*:*&ids=146,123,107,8&distrib=false&isShard=true&wt=javabin&version=2} status=0 QTime=1 
[junit4:junit4]   2> 14771 T750 C54 P44853 REQ /select {shard.url=127.0.0.1:44853/solr/collection1/&NOW=1350226221069&q=*:*&ids=126,144,7,106,104,140&distrib=false&isShard=true&wt=javabin&version=2} status=0 QTime=1 
[junit4:junit4]   2> 14774 T736 C52 P44847 REQ /select {sort=n_f1+asc&wt=javabin&q=*:*&version=2} hits=67 status=0 QTime=12 
[junit4:junit4]   2> 14782 T721 C53 P44841 REQ /select {distrib=false&sort=n_tf1+desc&wt=javabin&q=*:*&version=2} hits=67 status=0 QTime=3 
[junit4:junit4]   2> 14792 T750 C54 P44853 REQ /select {sort=n_tf1+desc&distrib=false&collection=collection1&wt=javabin&rows=10&version=2&NOW=1350226221094&shard.url=127.0.0.1:44853/solr/collection1/&fl=id&start=0&q=*:*&isShard=true&fsv=true} hits=35 status=0 QTime=2 
[junit4:junit4]   2> 14793 T737 C52 P44847 REQ /select {sort=n_tf1+desc&distrib=false&collection=collection1&wt=javabin&rows=10&version=2&NOW=1350226221094&shard.url=127.0.0.1:44847/solr/collection1/|127.0.0.1:44858/solr/collection1/&fl=id&start=0&q=*:*&isShard=true&fsv=true} hits=32 status=0 QTime=2 
[junit4:junit4]   2> 14798 T737 C52 P44847 REQ /select {shard.url=127.0.0.1:44847/solr/collection1/|127.0.0.1:44858/solr/collection1/&NOW=1350226221094&q=*:*&ids=133,102&distrib=false&collection=collection1&isShard=true&wt=javabin&version=2} status=0 QTime=1 
[junit4:junit4]   2> 14798 T750 C54 P44853 REQ /select {shard.url=127.0.0.1:44853/solr/collection1/&NOW=1350226221094&q=*:*&ids=116,143,126,127,5,120,131,140&distrib=false&collection=collection1&isShard=true&wt=javabin&version=2} status=0 QTime=1 
[junit4:junit4]   2> 14801 T736 C52 P44847 REQ /select {collection=collection1&sort=n_tf1+desc&wt=javabin&q=*:*&version=2} hits=67 status=0 QTime=14 
[junit4:junit4]   2> 14807 T721 C53 P44841 REQ /select {distrib=false&sort=n_tf1+asc&wt=javabin&q=*:*&version=2} hits=67 status=0 QTime=1 
[junit4:junit4]   2> 14815 T750 C54 P44853 REQ /select {sort=n_tf1+asc&distrib=false&wt=javabin&rows=10&version=2&fl=id&shard.url=127.0.0.1:44853/solr/collection1/&NOW=1350226221118&start=0&q=*:*&isShard=true&fsv=true} hits=35 status=0 QTime=1 
[junit4:junit4]   2> 14815 T737 C52 P44847 REQ /select {sort=n_tf1+asc&distrib=false&wt=javabin&rows=10&version=2&fl=id&shard.url=127.0.0.1:44847/solr/collection1/|127.0.0.1:44858/solr/collection1/&NOW=1350226221118&start=0&q=*:*&isShard=true&fsv=true} hits=32 status=0 QTime=1 
[junit4:junit4]   2> 14820 T750 C54 P44853 REQ /select {shard.url=127.0.0.1:44853/solr/collection1/&NOW=1350226221118&q=*:*&ids=2,117,147,104,119&distrib=false&isShard=true&wt=javabin&version=2} status=0 QTime=1 
[junit4:junit4]   2> 14820 T737 C52 P44847 REQ /select {shard.url=127.0.0.1:44847/solr/collection1/|127.0.0.1:44858/solr/collection1/&NOW=1350226221118&q=*:*&ids=114,122,148,107,101&distrib=false&isShard=true&wt=javabin&version=2} status=0 QTime=1 
[junit4:junit4]   2> 14823 T736 C52 P44847 REQ /select {sort=n_tf1+asc&wt=javabin&q=*:*&version=2} hits=67 status=0 QTime=12 
[junit4:junit4]   2> 14830 T721 C53 P44841 REQ /select {distrib=false&sort=n_d1+desc&wt=javabin&q=*:*&version=2} hits=67 status=0 QTime=2 
[junit4:junit4]   2> 14840 T741 C52 P44847 REQ /select {sort=n_d1+desc&distrib=false&collection=collection1&wt=javabin&rows=10&version=2&NOW=1350226221142&shard.url=127.0.0.1:44847/solr/collection1/|127.0.0.1:44858/solr/collection1/&fl=id&start=0&q=*:*&isShard=true&fsv=true} hits=32 status=0 QTime=2 
[junit4:junit4]   2> 14840 T749 C54 P44853 REQ /select {sort=n_d1+desc&distrib=false&collection=collection1&wt=javabin&rows=10&version=2&NOW=1350226221142&shard.url=127.0.0.1:44853/solr/collection1/&fl=id&start=0&q=*:*&isShard=true&fsv=true} hits=35 status=0 QTime=2 
[junit4:junit4]   2> 14845 T741 C52 P44847 REQ /select {shard.url=127.0.0.1:44847/solr/collection1/|127.0.0.1:44858/solr/collection1/&NOW=1350226221142&q=*:*&ids=138,110,16,102&distrib=false&collection=collection1&isShard=true&wt=javabin&version=2} status=0 QTime=1 
[junit4:junit4]   2> 14845 T749 C54 P44853 REQ /select {shard.url=127.0.0.1:44853/solr/collection1/&NOW=1350226221142&q=*:*&ids=116,143,3,127,121,141&distrib=false&collection=collection1&isShard=true&wt=javabin&version=2} status=0 QTime=1 
[junit4:junit4]   2> 14847 T748 C54 P44853 REQ /select {collection=collection1&sort=n_d1+desc&wt=javabin&q=*:*&version=2} hits=67 status=0 QTime=12 
[junit4:junit4]   2> 14854 T721 C53 P44841 REQ /select {distrib=false&sort=n_d1+asc&wt=javabin&q=*:*&version=2} hits=67 status=0 QTime=1 
[junit4:junit4]   2> 14863 T741 C52 P44847 REQ /select {sort=n_d1+asc&distrib=false&wt=javabin&rows=10&version=2&fl=id&shard.url=127.0.0.1:44847/solr/collection1/|127.0.0.1:44858/solr/collection1/&NOW=1350226221166&start=0&q=*:*&isShard=true&fsv=true} hits=32 status=0 QTime=1 
[junit4:junit4]   2> 14863 T749 C54 P44853 REQ /select {sort=n_d1+asc&distrib=false&wt=javabin&rows=10&version=2&fl=id&shard.url=127.0.0.1:44853/solr/collection1/&NOW=1350226221166&start=0&q=*:*&isShard=true&fsv=true} hits=35 status=0 QTime=1 
[junit4:junit4]   2> 14867 T741 C52 P44847 REQ /select {shard.url=127.0.0.1:44847/solr/collection1/|127.0.0.1:44858/solr/collection1/&NOW=1350226221166&q=*:*&ids=1,146,133,13&distrib=false&isShard=true&wt=javabin&version=2} status=0 QTime=1 
[junit4:junit4]   2> 14867 T749 C54 P44853 REQ /select {shard.url=127.0.0.1:44853/solr/collection1/&NOW=1350226221166&q=*:*&ids=2,144,145,106,105,130&distrib=false&isShard=true&wt=javabin&version=2} status=0 QTime=1 
[junit4:junit4]   2> 14869 T748 C54 P44853 REQ /select {sort=n_d1+asc&wt=javabin&q=*:*&version=2} hits=67 status=0 QTime=10 
[junit4:junit4]   2> 14876 T721 C53 P44841 REQ /select {distrib=false&sort=n_td1+desc&wt=javabin&q=*:*&version=2} hits=67 status=0 QTime=2 
[junit4:junit4]   2> 14885 T762 C51 P44858 REQ /select {sort=n_td1+desc&distrib=false&wt=javabin&rows=10&version=2&fl=id&shard.url=127.0.0.1:44847/solr/collection1/|127.0.0.1:44858/solr/collection1/&NOW=1350226221187&start=0&q=*:*&isShard=true&fsv=true} hits=32 status=0 QTime=1 
[junit4:junit4]   2> 14886 T751 C54 P44853 REQ /select {sort=n_td1+desc&distrib=false&wt=javabin&rows=10&version=2&fl=id&shard.url=127.0.0.1:44853/solr/collection1/&NOW=1350226221187&start=0&q=*:*&isShard=true&fsv=true} hits=35 status=0 QTime=2 
[junit4:junit4]   2> 14891 T762 C51 P44858 REQ /select {shard.url=127.0.0.1:44847/solr/collection1/|127.0.0.1:44858/solr/collection1/&NOW=1350226221187&q=*:*&ids=114,138,109,4,124,14&distrib=false&isShard=true&wt=javabin&version=2} status=0 QTime=1 
[junit4:junit4]   2> 14891 T751 C54 P44853 REQ /select {shard.url=127.0.0.1:44853/solr/collection1/&NOW=1350226221187&q=*:*&ids=127,137,120,142&distrib=false&isShard=true&wt=javabin&version=2} status=0 QTime=1 
[junit4:junit4]   2> 14894 T761 C51 P44858 REQ /select {sort=n_td1+desc&wt=javabin&q=*:*&version=2} hits=67 status=0 QTime=14 
[junit4:junit4]   2> 14900 T721 C53 P44841 REQ /select {distrib=false&sort=n_td1+asc&wt=javabin&q=*:*&version=2} hits=67 status=0 QTime=1 
[junit4:junit4]   2> 14906 T763 C51 P44858 REQ /select {sort=n_td1+asc&distrib=false&collection=collection1&wt=javabin&rows=10&version=2&NOW=1350226221211&shard.url=127.0.0.1:44847/solr/collection1/|127.0.0.1:44858/solr/collection1/&fl=id&start=0&q=*:*&isShard=true&fsv=true} hits=32 status=0 QTime=0 
[junit4:junit4]   2> 14908 T749 C54 P44853 REQ /select {sort=n_td1+asc&distrib=false&collection=collection1&wt=javabin&rows=10&version=2&fl=id&shard.url=127.0.0.1:44853/solr/collection1/&NOW=1350226221211&start=0&q=*:*&isShard=true&fsv=true} hits=35 status=0 QTime=1 
[junit4:junit4]   2> 14912 T763 C51 P44858 REQ /select {shard.url=127.0.0.1:44847/solr/collection1/|127.0.0.1:44858/solr/collection1/&NOW=1350226221211&q=*:*&ids=132,110,11&distrib=false&collection=collection1&isShard=true&wt=javabin&version=2} status=0 QTime=1 
[junit4:junit4]   2> 14912 T749 C54 P44853 REQ /select {shard.url=127.0.0.1:44853/solr/collection1/&NOW=1350226221211&q=*:*&ids=144,115,7,147,5,149,9&distrib=false&collection=collection1&isShard=true&wt=javabin&version=2} status=0 QTime=1 
[junit4:junit4]   2> 14914 T752 C54 P44853 REQ /select {collection=collection1&sort=n_td1+asc&wt=javabin&q=*:*&version=2} hits=67 status=0 QTime=10 
[junit4:junit4]   2> 14922 T721 C53 P44841 REQ /select {distrib=false&sort=n_l1+desc&wt=javabin&q=*:*&version=2} hits=67 status=0 QTime=2 
[junit4:junit4]   2> 14930 T786 C52 P44847 REQ /select {sort=n_l1+desc&distrib=false&wt=javabin&rows=10&version=2&fl=id&shard.url=127.0.0.1:44847/solr/collection1/|127.0.0.1:44858/solr/collection1/&NOW=1350226221233&start=0&q=*:*&isShard=true&fsv=true} hits=32 status=0 QTime=1 
[junit4:junit4]   2> 14931 T751 C54 P44853 REQ /select {sort=n_l1+desc&distrib=false&wt=javabin&rows=10&version=2&fl=id&shard.url=127.0.0.1:44853/solr/collection1/&NOW=1350226221233&start=0&q=*:*&isShard=true&fsv=true} hits=35 status=0 QTime=2 
[junit4:junit4]   2> 14936 T751 C54 P44853 REQ /select {shard.url=127.0.0.1:44853/solr/collection1/&NOW=1350226221233&q=*:*&ids=3,145,121,136,5,105&distrib=false&isShard=true&wt=javabin&version=2} status=0 QTime=1 
[junit4:junit4]   2> 14936 T786 C52 P44847 REQ /select {shard.url=127.0.0.1:44847/solr/collection1/|127.0.0.1:44858/solr/collection1/&NOW=1350226221233&q=*:*&ids=107,15,129,118&distrib=false&isShard=true&wt=javabin&version=2} status=0 QTime=1 
[junit4:junit4]   2> 14939 T764 C51 P44858 REQ /select {sort=n_l1+desc&wt=javabin&q=*:*&version=2} hits=67 status=0 QTime=13 
[junit4:junit4]   2> 14945 T721 C53 P44841 REQ /select {distrib=false&sort=n_l1+asc&wt=javabin&q=*:*&version=2} hits=67 status=0 QTime=1 
[junit4:junit4]   2> 14954 T750 C54 P44853 REQ /select {sort=n_l1+asc&distrib=false&wt=javabin&rows=10&version=2&fl=id&shard.url=127.0.0.1:44853/solr/collection1/&NOW=1350226221257&start=0&q=*:*&isShard=true&fsv=true} hits=35 status=0 QTime=1 
[junit4:junit4]   2> 14955 T760 C51 P44858 REQ /select {sort=n_l1+asc&distrib=false&wt=javabin&rows=10&version=2&fl=id&shard.url=127.0.0.1:44847/solr/collection1/|127.0.0.1:44858/solr/collection1/&NOW=1350226221257&start=0&q=*:*&isShard=true&fsv=true} hits=32 status=0 QTime=2 
[junit4:junit4]   2> 14961 T760 C51 P44858 REQ /select {shard.url=127.0.0.1:44847/solr/collection1/|127.0.0.1:44858/solr/collection1/&NOW=1350226221257&q=*:*&ids=114,10,8,16,12&distrib=false&isShard=true&wt=javabin&version=2} status=0 QTime=1 
[junit4:junit4]   2> 14961 T750 C54 P44853 REQ /select {shard.url=127.0.0.1:44853/solr/collection1/&NOW=1350226221257&q=*:*&ids=116,144,139,149,130&distrib=false&isShard=true&wt=javabin&version=2} status=0 QTime=1 
[junit4:junit4]   2> 14964 T739 C52 P44847 REQ /select {sort=n_l1+asc&wt=javabin&q=*:*&version=2} hits=67 status=0 QTime=14 
[junit4:junit4]   2> 14972 T721 C53 P44841 REQ /select {distrib=false&sort=n_tl1+desc&wt=javabin&q=*:*&version=2} hits=67 status=0 QTime=2 
[junit4:junit4]   2> 14982 T750 C54 P44853 REQ /select {sort=n_tl1+desc&distrib=false&collection=collection1&wt=javabin&rows=10&version=2&fl=id&shard.url=127.0.0.1:44853/solr/collection1/&NOW=1350226221285&start=0&q=*:*&isShard=true&fsv=true} hits=35 status=0 QTime=1 
[junit4:junit4]   2> 14983 T737 C52 P44847 REQ /select {sort=n_tl1+desc&distrib=false&collection=collection1&wt=javabin&rows=10&version=2&fl=id&shard.url=127.0.0.1:44847/solr/collection1/|127.0.0.1:44858/solr/collection1/&NOW=1350226221285&start=0&q=*:*&isShard=true&fsv=true} hits=32 status=0 QTime=1 
[junit4:junit4]   2> 14989 T750 C54 P44853 REQ /select {shard.url=127.0.0.1:44853/solr/collection1/&NOW=1350226221285&q=*:*&ids=117,137,103&distrib=false&collection=collection1&isShard=true&wt=javabin&version=2} status=0 QTime=1 
[junit4:junit4]   2> 14989 T737 C52 P44847 REQ /select {shard.url=127.0.0.1:44847/solr/collection1/|127.0.0.1:44858/solr/collection1/&NOW=1350226221285&q=*:*&ids=125,146,148,113,16,13,12&distrib=false&collection=collection1&isShard=true&wt=javabin&version=2} status=0 QTime=1 
[junit4:junit4]   2> 14991 T739 C52 P44847 REQ /select {collection=collection1&sort=n_tl1+desc&wt=javabin&q=*:*&version=2} hits=67 status=0 QTime=13 
[junit4:junit4]   2> 14998 T721 C53 P44841 REQ /select {distrib=false&sort=n_tl1+asc&wt=javabin&q=*:*&version=2} hits=67 status=0 QTime=1 
[junit4:junit4]   2> 15007 T737 C52 P44847 REQ /select {sort=n_tl1+asc&distrib=false&collection=collection1&wt=javabin&rows=10&version=2&fl=id&shard.url=127.0.0.1:44847/solr/collection1/|127.0.0.1:44858/solr/collection1/&NOW=1350226221310&start=0&q=*:*&isShard=true&fsv=true} hits=32 status=0 QTime=1 
[junit4:junit4]   2> 15007 T750 C54 P44853 REQ /select {sort=n_tl1+asc&distrib=false&collection=collection1&wt=javabin&rows=10&version=2&fl=id&shard.url=127.0.0.1:44853/solr/collection1/&NOW=1350226221310&start=0&q=*:*&isShard=true&fsv=true} hits=35 status=0 QTime=0 
[junit4:junit4]   2> 15013 T750 C54 P44853 REQ /select {shard.url=127.0.0.1:44853/solr/collection1/&NOW=1350226221310&q=*:*&ids=143,145,121,139,17,142&distrib=false&collection=collection1&isShard=true&wt=javabin&version=2} status=0 QTime=1 
[junit4:junit4]   2> 15014 T737 C52 P44847 REQ /select {shard.url=127.0.0.1:44847/solr/collection1/|127.0.0.1:44858/solr/collection1/&NOW=1350226221310&q=*:*&ids=135,107,118,100&distrib=false&collection=collection1&isShard=true&wt=javabin&version=2} status=0 QTime=1 
[junit4:junit4]   2> 15016 T739 C52 P44847 REQ /select {collection=collection1&sort=n_tl1+asc&wt=javabin&q=*:*&version=2} hits=67 status=0 QTime=13 
[junit4:junit4]   2> 15021 T721 C53 P44841 REQ /select {distrib=false&sort=n_dt1+desc&wt=javabin&q=*:*&version=2} hits=67 status=0 QTime=2 
[junit4:junit4]   2> 15030 T751 C54 P44853 REQ /select {sort=n_dt1+desc&distrib=false&wt=javabin&rows=10&version=2&fl=id&shard.url=127.0.0.1:44853/solr/collection1/&NOW=1350226221332&start=0&q=*:*&isShard=true&fsv=true} hits=35 status=0 QTime=2 
[junit4:junit4]   2> 15030 T786 C52 P44847 REQ /select {sort=n_dt1+desc&distrib=false&wt=javabin&rows=10&version=2&fl=id&shard.url=127.0.0.1:44847/solr/collection1/|127.0.0.1:44858/solr/collection1/&NOW=1350226221332&start=0&q=*:*&isShard=true&fsv=true} hits=32 status=0 QTime=1 
[junit4:junit4]   2> 15035 T786 C52 P44847 REQ /select {shard.url=127.0.0.1:44847/solr/collection1/|127.0.0.1:44858/solr/collection1/&NOW=1350226221332&q=*:*&ids=148,109,107,111&distrib=false&isShard=true&wt=javabin&version=2} status=0 QTime=1 
[junit4:junit4]   2> 15036 T751 C54 P44853 REQ /select {shard.url=127.0.0.1:44853/solr/collection1/&NOW=1350226221332&q=*:*&ids=2,126,139,106,103,131&distrib=false&isShard=true&wt=javabin&version=2} status=0 QTime=2 
[junit4:junit4]   2> 15039 T761 C51 P44858 REQ /select {sort=n_dt1+desc&wt=javabin&q=*:*&version=2} hits=67 status=0 QTime=14 
[junit4:junit4]   2> 15045 T721 C53 P44841 REQ /select {distrib=false&sort=n_dt1+asc&wt=javabin&q=*:*&version=2} hits=67 status=0 QTime=1 
[junit4:junit4]   2> 15053 T786 C52 P44847 REQ /select {sort=n_dt1+asc&distrib=false&collection=collection1&wt=javabin&rows=10&version=2&NOW=1350226221356&shard.url=127.0.0.1:44847/solr/collection1/|127.0.0.1:44858/solr/collection1/&fl=id&start=0&q=*:*&isShard=true&fsv=true} hits=32 status=0 QTime=0 
[junit4:junit4]   2> 15053 T751 C54 P44853 REQ /select {sort=n_dt1+asc&distrib=false&collection=collection1&wt=javabin&rows=10&version=2&NOW=1350226221356&shard.url=127.0.0.1:44853/solr/collection1/&fl=id&start=0&q=*:*&isShard=true&fsv=true} hits=35 status=0 QTime=0 
[junit4:junit4]   2> 15059 T786 C52 P44847 REQ /select {shard.url=127.0.0.1:44847/solr/collection1/|127.0.0.1:44858/solr/collection1/&NOW=1350226221356&q=*:*&ids=132,10,124,13,12&distrib=false&collection=collection1&isShard=true&wt=javabin&version=2} status=0 QTime=1 
[junit4:junit4]   2> 15060 T751 C54 P44853 REQ /select {shard.url=127.0.0.1:44853/solr/collection1/&NOW=1350226221356&q=*:*&ids=144,121,136,149,141&distrib=false&collection=collection1&isShard=true&wt=javabin&version=2} status=0 QTime=2 
[junit4:junit4]   2> 15064 T764 C51 P44858 REQ /select {collection=collection1&sort=n_dt1+asc&wt=javabin&q=*:*&version=2} hits=67 status=0 QTime=15 
[junit4:junit4]   2> 15071 T721 C53 P44841 REQ /select {distrib=false&sort=n_tdt1+desc&wt=javabin&q=*:*&version=2} hits=67 status=0 QTime=2 
[junit4:junit4]   2> 15080 T751 C54 P44853 REQ /select {sort=n_tdt1+desc&distrib=false&collection=collection1&wt=javabin&rows=10&version=2&fl=id&shard.url=127.0.0.1:44853/solr/collection1/&NOW=1350226221382&start=0&q=*:*&isShard=true&fsv=true} hits=35 status=0 QTime=2 
[junit4:junit4]   2> 15080 T762 C51 P44858 REQ /select {sort=n_tdt1+desc&distrib=false&collection=collection1&wt=javabin&rows=10&version=2&NOW=1350226221382&shard.url=127.0.0.1:44847/solr/collection1/|127.0.0.1:44858/solr/collection1/&fl=id&start=0&q=*:*&isShard=true&fsv=true} hits=32 status=0 QTime=1 
[junit4:junit4]   2> 15085 T762 C51 P44858 REQ /select {shard.url=127.0.0.1:44847/solr/collection1/|127.0.0.1:44858/solr/collection1/&NOW=1350226221382&q=*:*&ids=111,129,13,14&distrib=false&collection=collection1&isShard=true&wt=javabin&version=2} status=0 QTime=1 
[junit4:junit4]   2> 15085 T751 C54 P44853 REQ /select {shard.url=127.0.0.1:44853/solr/collection1/&NOW=1350226221382&q=*:*&ids=3,115,121,17,120,103&distrib=false&collection=collection1&isShard=true&wt=javabin&version=2} status=0 QTime=1 
[junit4:junit4]   2> 15087 T764 C51 P44858 REQ /select {collection=collection1&sort=n_tdt1+desc&wt=javabin&q=*:*&version=2} hits=67 status=0 QTime=12 
[junit4:junit4]   2> 15094 T721 C53 P44841 REQ /select {distrib=false&sort=n_tdt1+asc&wt=javabin&q=*:*&version=2} hits=67 status=0 QTime=1 
[junit4:junit4]   2> 15103 T749 C54 P44853 REQ /select {sort=n_tdt1+asc&distrib=false&wt=javabin&rows=10&version=2&fl=id&shard.url=127.0.0.1:44853/solr/collection1/&NOW=1350226221406&start=0&q=*:*&isShard=true&fsv=true} hits=35 status=0 QTime=1 
[junit4:junit4]   2> 15103 T741 C52 P44847 REQ /select {sort=n_tdt1+asc&distrib=false&wt=javabin&rows=10&version=2&fl=id&shard.url=127.0.0.1:44847/solr/collection1/|127.0.0.1:44858/solr/collection1/&NOW=1350226221406&start=0&q=*:*&isShard=true&fsv=true} hits=32 status=0 QTime=1 
[junit4:junit4]   2> 15108 T741 C52 P44847 REQ /select {shard.url=127.0.0.1:44847/solr/collection1/|127.0.0.1:44858/solr/collection1/&NOW=1350226221406&q=*:*&ids=132,138,107,100&distrib=false&isShard=true&wt=javabin&version=2} status=0 QTime=1 
[junit4:junit4]   2> 15108 T749 C54 P44853 REQ /select {shard.url=127.0.0.1:44853/solr/collection1/&NOW=1350226221406&q=*:*&ids=116,144,127,112,137,106&distrib=false&isShard=true&wt=javabin&version=2} status=0 QTime=1 
[junit4:junit4]   2> 15110 T752 C54 P44853 REQ /select {sort=n_tdt1+asc&wt=javabin&q=*:*&version=2} hits=67 status=0 QTime=11 
[junit4:junit4]   2> 15144 T721 C53 P44841 REQ /select {distrib=false&sort=a_si+desc&wt=javabin&q=*:*&version=2} hits=67 status=0 QTime=28 
[junit4:junit4]   2> 15153 T750 C54 P44853 REQ /select {sort=a_si+desc&distrib=false&wt=javabin&rows=10&version=2&fl=id&shard.url=127.0.0.1:44853/solr/collection1/&NOW=1350226221456&start=0&q=*:*&isShard=true&fsv=true} hits=35 status=0 QTime=1 
[junit4:junit4]   2> 15154 T760 C51 P44858 REQ /select {sort=a_si+desc&distrib=false&wt=javabin&rows=10&version=2&fl=id&shard.url=127.0.0.1:44847/solr/collection1/|127.0.0.1:44858/solr/collection1/&NOW=1350226221456&start=0&q=*:*&isShard=true&fsv=true} hits=32 status=0 QTime=2 
[junit4:junit4]   2> 15159 T750 C54 P44853 REQ /select {shard.url=127.0.0.1:44853/solr/collection1/&NOW=1350226221456&q=*:*&ids=3,2,7,5,9&distrib=false&isShard=true&wt=javabin&version=2} status=0 QTime=1 
[junit4:junit4]   2> 15159 T760 C51 P44858 REQ /select {shard.url=127.0.0.1:44847/solr/collection1/|127.0.0.1:44858/solr/collection1/&NOW=1350226221456&q=*:*&ids=10,1,8,13,12&distrib=false&isShard=true&wt=javabin&version=2} status=0 QTime=1 
[junit4:junit4]   2> 15162 T739 C52 P44847 REQ /select {sort=a_si+desc&wt=javabin&q=*:*&version=2} hits=67 status=0 QTime=13 
[junit4:junit4]   2> 15169 T721 C53 P44841 REQ /select {distrib=false&sort=a_si+asc&wt=javabin&q=*:*&version=2} hits=67 status=0 QTime=1 
[junit4:junit4]   2> 15178 T763 C51 P44858 REQ /select {sort=a_si+asc&distrib=false&wt=javabin&rows=10&version=2&fl=id&shard.url=127.0.0.1:44847/solr/collection1/|127.0.0.1:44858/solr/collection1/&NOW=1350226221481&start=0&q=*:*&isShard=true&fsv=true} hits=32 status=0 QTime=1 
[junit4:junit4]   2> 15178 T749 C54 P44853 REQ /select {sort=a_si+asc&distrib=false&wt=javabin&rows=10&version=2&fl=id&shard.url=127.0.0.1:44853/solr/collection1/&NOW=1350226221481&start=0&q=*:*&isShard=true&fsv=true} hits=35 status=0 QTime=1 
[junit4:junit4]   2> 15189 T763 C51 P44858 REQ /select {shard.url=127.0.0.1:44847/solr/collection1/|127.0.0.1:44858/solr/collection1/&NOW=1350226221481&q=*:*&ids=1,4,13,11,12&distrib=false&isShard=true&wt=javabin&version=2} status=0 QTime=1 
[junit4:junit4]   2> 15189 T749 C54 P44853 REQ /select {shard.url=127.0.0.1:44853/solr/collection1/&NOW=1350226221481&q=*:*&ids=3,2,7,6,9&distrib=false&isShard=true&wt=javabin&version=2} status=0 QTime=0 
[junit4:junit4]   2> 15192 T748 C54 P44853 REQ /select {sort=a_si+asc&wt=javabin&q=*:*&version=2} hits=67 status=0 QTime=18 
[junit4:junit4]   2> 15199 T721 C53 P44841 REQ /select {sort=a_si+desc&fl=*,score&q=*:*&distrib=false&wt=javabin&version=2} hits=67 status=0 QTime=1 
[junit4:junit4]   2> 15208 T751 C54 P44853 REQ /select {sort=a_si+desc&distrib=false&collection=collection1&wt=javabin&rows=10&version=2&fl=id,score&shard.url=127.0.0.1:44853/solr/collection1/&NOW=1350226221511&start=0&q=*:*&isShard=true&fsv=true} hits=35 status=0 QTime=1 
[junit4:junit4]   2> 15208 T762 C51 P44858 REQ /select {sort=a_si+desc&distrib=false&collection=collection1&wt=javabin&rows=10&version=2&fl=id,score&shard.url=127.0.0.1:44847/solr/collection1/|127.0.0.1:44858/solr/collection1/&NOW=1350226221511&start=0&q=*:*&isShard=true&fsv=true} hits=32 status=0 QTime=1 
[junit4:junit4]   2> 15214 T762 C51 P44858 REQ /select {fl=*,score&shard.url=127.0.0.1:44847/solr/collection1/|127.0.0.1:44858/solr/collection1/&NOW=1350226221511&q=*:*&ids=10,1,8,13,12&distrib=false&collection=collection1&isShard=true&wt=javabin&version=2} status=0 QTime=1 
[junit4:junit4]   2> 15214 T751 C54 P44853 REQ /select {fl=*,score&shard.url=127.0.0.1:44853/solr/collection1/&NOW=1350226221511&q=*:*&ids=3,2,7,5,9&distrib=false&collection=collection1&isShard=true&wt=javabin&version=2} status=0 QTime=1 
[junit4:junit4]   2> 15216 T764 C51 P44858 REQ /select {sort=a_si+desc&fl=*,score&q=*:*&collection=collection1&wt=javabin&version=2} hits=67 status=0 QTime=12 
[junit4:junit4]   2> 15225 T721 C53 P44841 REQ /select {sort=n_tl1+asc&fl=*,score&q=*:*&distrib=false&wt=javabin&version=2} hits=67 status=0 QTime=1 
[junit4:junit4]   2> 15233 T751 C54 P44853 REQ /select {sort=n_tl1+asc&distrib=false&wt=javabin&rows=10&version=2&fl=id,score&shard.url=127.0.0.1:44853/solr/collection1/&NOW=1350226221536&start=0&q=*:*&isShard=true&fsv=true} hits=35 status=0 QTime=1 
[junit4:junit4]   2> 15233 T786 C52 P44847 REQ /select {sort=n_tl1+asc&distrib=false&wt=javabin&rows=10&version=2&fl=id,score&shard.url=127.0.0.1:44847/solr/collection1/|127.0.0.1:44858/solr/collection1/&NOW=1350226221536&start=0&q=*:*&isShard=true&fsv=true} hits=32 status=0 QTime=0 
[junit4:junit4]   2> 15238 T751 C54 P44853 REQ /select {fl=*,score&shard.url=127.0.0.1:44853/solr/collection1/&NOW=1350226221536&q=*:*&ids=143,145,121,139,17,142&distrib=false&isShard=true&wt=javabin&version=2} status=0 QTime=1 
[junit4:junit4]   2> 15238 T786 C52 P44847 REQ /select {fl=*,score&shard.url=127.0.0.1:44847/solr/collection1/|127.0.0.1:44858/solr/collection1/&NOW=1350226221536&q=*:*&ids=135,107,118,100&distrib=false&isShard=true&wt=javabin&version=2} status=0 QTime=0 
[junit4:junit4]   2> 15241 T764 C51 P44858 REQ /select {sort=n_tl1+asc&fl=*,score&wt=javabin&q=*:*&version=2} hits=67 status=0 QTime=12 
[junit4:junit4]   2> 15247 T721 C53 P44841 REQ /select {distrib=false&sort=n_tl1+desc&wt=javabin&q=*:*&version=2} hits=67 status=0 QTime=0 
[junit4:junit4]   2> 15257 T750 C54 P44853 REQ /select {sort=n_tl1+desc&distrib=false&wt=javabin&rows=10&version=2&fl=id&shard.url=127.0.0.1:44853/solr/collection1/&NOW=1350226221560&start=0&q=*:*&isShard=true&fsv=true} hits=35 status=0 QTime=1 
[junit4:junit4]   2> 15257 T737 C52 P44847 REQ /select {sort=n_tl1+desc&distrib=false&wt=javabin&rows=10&version=2&fl=id&shard.url=127.0.0.1:44847/solr/collection1/|127.0.0.1:44858/solr/collection1/&NOW=1350226221560&start=0&q=*:*&isShard=true&fsv=true} hits=32 status=0 QTime=1 
[junit4:junit4]   2> 15262 T750 C54 P44853 REQ /select {shard.url=127.0.0.1:44853/solr/collection1/&NOW=1350226221560&q=*:*&ids=117,137,103&distrib=false&isShard=true&wt=javabin&version=2} status=0 QTime=1 
[junit4:junit4]   2> 15263 T737 C52 P44847 REQ /select {shard.url=127.0.0.1:44847/solr/collection1/|127.0.0.1:44858/solr/collection1/&NOW=1350226221560&q=*:*&ids=125,146,148,113,16,13,12&distrib=false&isShard=true&wt=javabin&version=2} status=0 QTime=2 
[junit4:junit4]   2> 15265 T739 C52 P44847 REQ /select {sort=n_tl1+desc&wt=javabin&q=*:*&version=2} hits=67 status=0 QTime=12 
[junit4:junit4]   2> 15289 T721 C53 P44841 REQ /select {distrib=false&wt=javabin&q={!func}a_si&version=2} hits=67 status=0 QTime=19 
[junit4:junit4]   2> 15298 T749 C54 P44853 REQ /select {fl=id,score&shard.url=127.0.0.1:44853/solr/collection1/&NOW=1350226221601&start=0&q={!func}a_si&distrib=false&isShard=true&wt=javabin&fsv=true&rows=10&version=2} hits=35 status=0 QTime=1 
[junit4:junit4]   2> 15298 T741 C52 P44847 REQ /select {fl=id,score&shard.url=127.0.0.1:44847/solr/collection1/|127.0.0.1:44858/solr/collection1/&NOW=1350226221601&start=0&q={!func}a_si&distrib=false&isShard=true&wt=javabin&fsv=true&rows=10&version=2} hits=32 status=0 QTime=1 
[junit4:junit4]   2> 15303 T749 C54 P44853 REQ /select {shard.url=127.0.0.1:44853/solr/collection1/&NOW=1350226221601&q={!func}a_si&ids=3,2,7,5,9&distrib=false&isShard=true&wt=javabin&version=2} status=0 QTime=1 
[junit4:junit4]   2> 15303 T741 C52 P44847 REQ /select {shard.url=127.0.0.1:44847/solr/collection1/|127.0.0.1:44858/solr/collection1/&NOW=1350226221601&q={!func}a_si&ids=10,1,8,13,12&distrib=false&isShard=true&wt=javabin&version=2} status=0 QTime=1 
[junit4:junit4]   2> 15305 T752 C54 P44853 REQ /select {wt=javabin&q={!func}a_si&version=2} hits=67 status=0 QTime=11 
[junit4:junit4]   2> 15312 T721 C53 P44841 REQ /select {distrib=false&fl=*,score&wt=javabin&q={!func}a_si&version=2} hits=67 status=0 QTime=1 
[junit4:junit4]   2> 15319 T750 C54 P44853 REQ /select {fl=id,score&shard.url=127.0.0.1:44853/solr/collection1/&NOW=1350226221623&start=0&q={!func}a_si&distrib=false&isShard=true&wt=javabin&fsv=true&rows=10&version=2} hits=35 status=0 QTime=0 
[junit4:junit4]   2> 15320 T760 C51 P44858 REQ /select {fl=id,score&shard.url=127.0.0.1:44847/solr/collection1/|127.0.0.1:44858/solr/collection1/&NOW=1350226221623&start=0&q={!func}a_si&distrib=false&isShard=true&wt=javabin&fsv=true&rows=10&version=2} hits=32 status=0 QTime=1 
[junit4:junit4]   2> 15324 T750 C54 P44853 REQ /select {fl=*,score&shard.url=127.0.0.1:44853/solr/collection1/&NOW=1350226221623&q={!func}a_si&ids=3,2,7,5,9&distrib=false&isShard=true&wt=javabin&version=2} status=0 QTime=1 
[junit4:junit4]   2> 15324 T760 C51 P44858 REQ /select {fl=*,score&shard.url=127.0.0.1:44847/solr/collection1/|127.0.0.1:44858/solr/collection1/&NOW=1350226221623&q={!func}a_si&ids=10,1,8,13,12&distrib=false&isShard=true&wt=javabin&version=2} status=0 QTime=1 
[junit4:junit4]   2> 15326 T739 C52 P44847 REQ /select {fl=*,score&wt=javabin&q={!func}a_si&version=2} hits=67 status=0 QTime=10 
[junit4:junit4]   2> 15333 T721 C53 P44841 REQ /select {distrib=false&wt=javabin&q=quick&version=2} hits=2 status=0 QTime=1 
[junit4:junit4]   2> 15341 T749 C54 P44853 REQ /select {fl=id,score&shard.url=127.0.0.1:44853/solr/collection1/&NOW=1350226221644&start=0&q=quick&distrib=false&isShard=true&wt=javabin&fsv=true&rows=10&version=2} hits=1 status=0 QTime=1 
[junit4:junit4]   2> 15341 T741 C52 P44847 REQ /select {fl=id,score&shard.url=127.0.0.1:44847/solr/collection1/|127.0.0.1:44858/solr/collection1/&NOW=1350226221644&start=0&q=quick&distrib=false&isShard=true&wt=javabin&fsv=true&rows=10&version=2} hits=1 status=0 QTime=1 
[junit4:junit4]   2> 15346 T749 C54 P44853 REQ /select {shard.url=127.0.0.1:44853/solr/collection1/&NOW=1350226221644&q=quick&ids=5&distrib=false&isShard=true&wt=javabin&version=2} status=0 QTime=1 
[junit4:junit4]   2> 15346 T741 C52 P44847 REQ /select {shard.url=127.0.0.1:44847/solr/collection1/|127.0.0.1:44858/solr/collection1/&NOW=1350226221644&q=quick&ids=4&distrib=false&isShard=true&wt=javabin&version=2} status=0 QTime=1 
[junit4:junit4]   2> 15347 T748 C54 P44853 REQ /select {wt=javabin&q=quick&version=2} hits=2 status=0 QTime=10 
[junit4:junit4]   2> 15351 T721 C53 P44841 REQ /select {fl=id&start=0&q=all&distrib=false&wt=javabin&version=2} hits=2 status=0 QTime=1 
[junit4:junit4]   2> 15358 T786 C52 P44847 REQ /select {distrib=false&collection=collection1&wt=javabin&rows=10&version=2&fl=id,score&shard.url=127.0.0.1:44847/solr/collection1/|127.0.0.1:44858/solr/collection1/&NOW=1350226221661&start=0&q=all&isShard=true&fsv=true} hits=2 status=0 QTime=1 
[junit4:junit4]   2> 15358 T751 C54 P44853 REQ /select {distrib=false&collection=collection1&wt=javabin&rows=10&version=2&fl=id,score&shard.url=127.0.0.1:44853/solr/collection1/&NOW=1350226221661&start=0&q=all&isShard=true&fsv=true} hits=0 status=0 QTime=1 
[junit4:junit4]   2> 15363 T786 C52 P44847 REQ /select {fl=id&shard.url=127.0.0.1:44847/solr/collection1/|127.0.0.1:44858/solr/collection1/&NOW=1350226221661&start=0&q=all&ids=1,8&distrib=false&collection=collection1&isShard=true&wt=javabin&version=2} status=0 QTime=1 
[junit4:junit4]   2> 15364 T764 C51 P44858 REQ /select {fl=id&start=0&q=all&collection=collection1&wt=javabin&version=2} hits=2 status=0 QTime=10 
[junit4:junit4]   2> 15368 T721 C53 P44841 REQ /select {fl=foofoofoo&start=0&q=all&distrib=false&wt=javabin&version=2} hits=2 status=0 QTime=1 
[junit4:junit4]   2> 15375 T737 C52 P44847 REQ /select {fl=id,score&shard.url=127.0.0.1:44847/solr/collection1/|127.0.0.1:44858/solr/collection1/&NOW=1350226221678&start=0&q=all&distrib=false&isShard=true&wt=javabin&fsv=true&rows=10&version=2} hits=2 status=0 QTime=1 
[junit4:junit4]   2> 15375 T750 C54 P44853 REQ /select {fl=id,score&shard.url=127.0.0.1:44853/solr/collection1/&NOW=1350226221678&start=0&q=all&distrib=false&isShard=true&wt=javabin&fsv=true&rows=10&version=2} hits=0 status=0 QTime=1 
[junit4:junit4]   2> 15379 T737 C52 P44847 REQ /select {fl=foofoofoo&fl=id&shard.url=127.0.0.1:44847/solr/collection1/|127.0.0.1:44858/solr/collection1/&NOW=1350226221678&start=0&q=all&ids=1,8&distrib=false&isShard=true&wt=javabin&version=2} status=0 QTime=1 
[junit4:junit4]   2> 15379 T736 C52 P44847 REQ /select {fl=foofoofoo&wt=javabin&start=0&q=all&version=2} hits=2 status=0 QTime=8 
[junit4:junit4]   2> 15384 T721 C53 P44841 REQ /select {fl=id&start=100&q=all&distrib=false&wt=javabin&version=2} hits=2 status=0 QTime=1 
[junit4:junit4]   2> 15392 T737 C52 P44847 REQ /select {distrib=false&collection=collection1&wt=javabin&rows=110&version=2&fl=id,score&shard.url=127.0.0.1:44847/solr/collection1/|127.0.0.1:44858/solr/collection1/&NOW=1350226221695&start=0&q=all&isShard=true&fsv=true} hits=2 status=0 QTime=1 
[junit4:junit4]   2> 15392 T750 C54 P44853 REQ /select {distrib=false&collection=collection1&wt=javabin&rows=110&version=2&fl=id,score&shard.url=127.0.0.1:44853/solr/collection1/&NOW=1350226221695&start=0&q=all&isShard=true&fsv=true} hits=0 status=0 QTime=1 
[junit4:junit4]   2> 15394 T739 C52 P44847 REQ /select {fl=id&start=100&q=all&collection=collection1&wt=javabin&version=2} hits=2 status=0 QTime=6 
[junit4:junit4]   2> 15398 T721 C53 P44841 REQ /select {distrib=false&fl=*,score&wt=javabin&q=quick&version=2} hits=2 status=0 QTime=1 
[junit4:junit4]   2> 15405 T749 C54 P44853 REQ /select {distrib=false&collection=collection1&wt=javabin&rows=10&version=2&fl=id,score&shard.url=127.0.0.1:44853/solr/collection1/&NOW=1350226221708&start=0&q=quick&isShard=true&fsv=true} hits=1 status=0 QTime=1 
[junit4:junit4]   2> 15405 T763 C51 P44858 REQ /select {distrib=false&collection=collection1&wt=javabin&rows=10&version=2&fl=id,score&shard.url=127.0.0.1:44847/solr/collection1/|127.0.0.1:44858/solr/collection1/&NOW=1350226221708&start=0&q=quick&isShard=true&fsv=true} hits=1 status=0 QTime=1 
[junit4:junit4]   2> 15410 T763 C51 P44858 REQ /select {fl=*,score&shard.url=127.0.0.1:44847/solr/collection1/|127.0.0.1:44858/solr/collection1/&NOW=1350226221708&q=quick&ids=4&distrib=false&collection=collection1&isShard=true&wt=javabin&version=2} status=0 QTime=1 
[junit4:junit4]   2> 15410 T749 C54 P44853 REQ /select {fl=*,score&shard.url=127.0.0.1:44853/solr/collection1/&NOW=1350226221708&q=quick&ids=5&distrib=false&collection=collection1&isShard=true&wt=javabin&version=2} status=0 QTime=1 
[junit4:junit4]   2> 15411 T752 C54 P44853 REQ /select {collection=collection1&fl=*,score&wt=javabin&q=quick&version=2} hits=2 status=0 QTime=10 
[junit4:junit4]   2> 15417 T721 C53 P44841 REQ /select {fl=*,score&start=1&q=all&distrib=false&wt=javabin&version=2} hits=2 status=0 QTime=1 
[junit4:junit4]   2> 15423 T750 C54 P44853 REQ /select {distrib=false&collection=collection1&wt=javabin&rows=11&version=2&fl=id,score&shard.url=127.0.0.1:44853/solr/collection1/&NOW=1350226221727&start=0&q=all&isShard=true&fsv=true} hits=0 status=0 QTime=0 
[junit4:junit4]   2> 15424 T760 C51 P44858 REQ /select {distrib=false&collection=collection1&wt=javabin&rows=11&version=2&fl=id,score&shard.url=127.0.0.1:44847/solr/collection1/|127.0.0.1:44858/solr/collection1/&NOW=1350226221727&start=0&q=all&isShard=true&fsv=true} hits=2 status=0 QTime=1 
[junit4:junit4]   2> 15428 T760 C51 P44858 REQ /select {fl=*,score&shard.url=127.0.0.1:44847/solr/collection1/|127.0.0.1:44858/solr/collection1/&NOW=1350226221727&start=1&q=all&ids=1&distrib=false&collection=collection1&isShard=true&wt=javabin&version=2} status=0 QTime=1 
[junit4:junit4]   2> 15429 T739 C52 P448

[...truncated too long message...]

e=pt_BR -Dtests.timezone=Atlantic/Cape_Verde -Dtests.file.encoding=US-ASCII
[junit4:junit4] FAILURE  390s J0 | BasicDistributedZkTest.testDistribSearch <<<
[junit4:junit4]    > Throwable #1: java.lang.AssertionError: some core start times did not change on reload
[junit4:junit4]    > 	at __randomizedtesting.SeedInfo.seed([95FC3884B13E5254:141AB69CC6613268]:0)
[junit4:junit4]    > 	at org.junit.Assert.fail(Assert.java:93)
[junit4:junit4]    > 	at org.junit.Assert.assertTrue(Assert.java:43)
[junit4:junit4]    > 	at org.apache.solr.cloud.BasicDistributedZkTest.testCollectionsAPI(BasicDistributedZkTest.java:443)
[junit4:junit4]    > 	at org.apache.solr.cloud.BasicDistributedZkTest.doTest(BasicDistributedZkTest.java:332)
[junit4:junit4]    > 	at org.apache.solr.BaseDistributedSearchTestCase.testDistribSearch(BaseDistributedSearchTestCase.java:695)
[junit4:junit4]    > 	at sun.reflect.NativeMethodAccessorImpl.invoke0(Native Method)
[junit4:junit4]    > 	at sun.reflect.NativeMethodAccessorImpl.invoke(NativeMethodAccessorImpl.java:57)
[junit4:junit4]    > 	at sun.reflect.DelegatingMethodAccessorImpl.invoke(DelegatingMethodAccessorImpl.java:43)
[junit4:junit4]    > 	at java.lang.reflect.Method.invoke(Method.java:601)
[junit4:junit4]    > 	at com.carrotsearch.randomizedtesting.RandomizedRunner.invoke(RandomizedRunner.java:1559)
[junit4:junit4]    > 	at com.carrotsearch.randomizedtesting.RandomizedRunner.access$600(RandomizedRunner.java:79)
[junit4:junit4]    > 	at com.carrotsearch.randomizedtesting.RandomizedRunner$6.evaluate(RandomizedRunner.java:737)
[junit4:junit4]    > 	at com.carrotsearch.randomizedtesting.RandomizedRunner$7.evaluate(RandomizedRunner.java:773)
[junit4:junit4]    > 	at com.carrotsearch.randomizedtesting.RandomizedRunner$8.evaluate(RandomizedRunner.java:787)
[junit4:junit4]    > 	at com.carrotsearch.randomizedtesting.rules.SystemPropertiesRestoreRule$1.evaluate(SystemPropertiesRestoreRule.java:53)
[junit4:junit4]    > 	at org.apache.lucene.util.TestRuleSetupTeardownChained$1.evaluate(TestRuleSetupTeardownChained.java:50)
[junit4:junit4]    > 	at org.apache.lucene.util.TestRuleFieldCacheSanity$1.evaluate(TestRuleFieldCacheSanity.java:51)
[junit4:junit4]    > 	at org.apache.lucene.util.AbstractBeforeAfterRule$1.evaluate(AbstractBeforeAfterRule.java:45)
[junit4:junit4]    > 	at com.carrotsearch.randomizedtesting.rules.SystemPropertiesInvariantRule$1.evaluate(SystemPropertiesInvariantRule.java:55)
[junit4:junit4]    > 	at org.apache.lucene.util.TestRuleThreadAndTestName$1.evaluate(TestRuleThreadAndTestName.java:48)
[junit4:junit4]    > 	at org.apache.lucene.util.TestRuleIgnoreAfterMaxFailures$1.evaluate(TestRuleIgnoreAfterMaxFailures.java:70)
[junit4:junit4]    > 	at org.apache.lucene.util.TestRuleMarkFailure$1.evaluate(TestRuleMarkFailure.java:48)
[junit4:junit4]    > 	at com.carrotsearch.randomizedtesting.rules.StatementAdapter.evaluate(StatementAdapter.java:36)
[junit4:junit4]    > 	at com.carrotsearch.randomizedtesting.ThreadLeakControl$StatementRunner.run(ThreadLeakControl.java:358)
[junit4:junit4]    > 	at com.carrotsearch.randomizedtesting.ThreadLeakControl.forkTimeoutingTask(ThreadLeakControl.java:782)
[junit4:junit4]    > 	at com.carrotsearch.randomizedtesting.ThreadLeakControl$3.evaluate(ThreadLeakControl.java:442)
[junit4:junit4]    > 	at com.carrotsearch.randomizedtesting.RandomizedRunner.runSingleTest(RandomizedRunner.java:746)
[junit4:junit4]    > 	at com.carrotsearch.randomizedtesting.RandomizedRunner$3.evaluate(RandomizedRunner.java:648)
[junit4:junit4]    > 	at com.carrotsearch.randomizedtesting.RandomizedRunner$4.evaluate(RandomizedRunner.java:682)
[junit4:junit4]    > 	at com.carrotsearch.randomizedtesting.RandomizedRunner$5.evaluate(RandomizedRunner.java:693)
[junit4:junit4]    > 	at com.carrotsearch.randomizedtesting.rules.StatementAdapter.evaluate(StatementAdapter.java:36)
[junit4:junit4]    > 	at com.carrotsearch.randomizedtesting.rules.SystemPropertiesRestoreRule$1.evaluate(SystemPropertiesRestoreRule.java:53)
[junit4:junit4]    > 	at org.apache.lucene.util.AbstractBeforeAfterRule$1.evaluate(AbstractBeforeAfterRule.java:45)
[junit4:junit4]    > 	at org.apache.lucene.util.TestRuleStoreClassName$1.evaluate(TestRuleStoreClassName.java:42)
[junit4:junit4]    > 	at com.carrotsearch.randomizedtesting.rules.SystemPropertiesInvariantRule$1.evaluate(SystemPropertiesInvariantRule.java:55)
[junit4:junit4]    > 	at com.carrotsearch.randomizedtesting.rules.NoShadowingOrOverridesOnMethodsRule$1.evaluate(NoShadowingOrOverridesOnMethodsRule.java:39)
[junit4:junit4]    > 	at com.carrotsearch.randomizedtesting.rules.NoShadowingOrOverridesOnMethodsRule$1.evaluate(NoShadowingOrOverridesOnMethodsRule.java:39)
[junit4:junit4]    > 	at com.carrotsearch.randomizedtesting.rules.StatementAdapter.evaluate(StatementAdapter.java:36)
[junit4:junit4]    > 	at org.apache.lucene.util.TestRuleAssertionsRequired$1.evaluate(TestRuleAssertionsRequired.java:43)
[junit4:junit4]    > 	at org.apache.lucene.util.TestRuleMarkFailure$1.evaluate(TestRuleMarkFailure.java:48)
[junit4:junit4]    > 	at org.apache.lucene.util.TestRuleIgnoreAfterMaxFailures$1.evaluate(TestRuleIgnoreAfterMaxFailures.java:70)
[junit4:junit4]    > 	at org.apache.lucene.util.TestRuleIgnoreTestSuites$1.evaluate(TestRuleIgnoreTestSuites.java:55)
[junit4:junit4]    > 	at com.carrotsearch.randomizedtesting.rules.StatementAdapter.evaluate(StatementAdapter.java:36)
[junit4:junit4]    > 	at com.carrotsearch.randomizedtesting.ThreadLeakControl$StatementRunner.run(ThreadLeakControl.java:358)
[junit4:junit4]    > 	at java.lang.Thread.run(Thread.java:722)
[junit4:junit4]   2> 389800 T709 oas.SolrTestCaseJ4.deleteCore ###deleteCore
[junit4:junit4]   2> NOTE: test params are: codec=Lucene40: {n_f1=PostingsFormat(name=MockRandom), foo_b=PostingsFormat(name=Lucene40WithOrds), cat=MockFixedIntBlock(blockSize=606), foo_d=PostingsFormat(name=Memory doPackFST= false), foo_f=PostingsFormat(name=Lucene40WithOrds), n_tl1=PostingsFormat(name=MockRandom), n_d1=MockFixedIntBlock(blockSize=606), rnd_b=PostingsFormat(name=Memory doPackFST= false), intDefault=MockFixedIntBlock(blockSize=606), n_td1=PostingsFormat(name=MockRandom), timestamp=MockFixedIntBlock(blockSize=606), id=PostingsFormat(name=Memory doPackFST= false), range_facet_sl=PostingsFormat(name=Lucene40WithOrds), range_facet_si=PostingsFormat(name=MockRandom), oddField_s=PostingsFormat(name=Lucene40WithOrds), sequence_i=PostingsFormat(name=Lucene40WithOrds), name=PostingsFormat(name=Memory doPackFST= false), foo_i=PostingsFormat(name=MockRandom), regex_dup_B_s=MockFixedIntBlock(blockSize=606), multiDefault=PostingsFormat(name=MockRandom), n_tf1=MockFixedIntBlock(blockSize=606), n_dt1=PostingsFormat(name=MockRandom), genre_s=PostingsFormat(name=Lucene40WithOrds), author_t=PostingsFormat(name=MockRandom), n_ti1=PostingsFormat(name=Memory doPackFST= false), range_facet_l=MockFixedIntBlock(blockSize=606), text=PostingsFormat(name=Lucene40WithOrds), _version_=MockFixedIntBlock(blockSize=606), val_i=PostingsFormat(name=Memory doPackFST= false), SubjectTerms_mfacet=MockFixedIntBlock(blockSize=606), series_t=PostingsFormat(name=MockRandom), a_t=MockFixedIntBlock(blockSize=606), n_tdt1=MockFixedIntBlock(blockSize=606), regex_dup_A_s=PostingsFormat(name=Lucene40WithOrds), price=PostingsFormat(name=Lucene40WithOrds), other_tl1=MockFixedIntBlock(blockSize=606), n_l1=MockFixedIntBlock(blockSize=606), a_si=PostingsFormat(name=MockRandom), inStock=PostingsFormat(name=Lucene40WithOrds)}, sim=RandomSimilarityProvider(queryNorm=false,coord=yes): {}, locale=pt_BR, timezone=Atlantic/Cape_Verde
[junit4:junit4]   2> NOTE: FreeBSD 9.0-RELEASE amd64/Oracle Corporation 1.7.0_06 (64-bit)/cpus=16,threads=1,free=70713104,total=401604608
[junit4:junit4]   2> NOTE: All tests run in this JVM: [FieldAnalysisRequestHandlerTest, TestPseudoReturnFields, AutoCommitTest, TestIndexingPerformance, RequestHandlersTest, TestIBSimilarityFactory, TermVectorComponentDistributedTest, FileBasedSpellCheckerTest, SpatialFilterTest, TestXIncludeConfig, MoreLikeThisHandlerTest, TestSearchPerf, DistanceFunctionTest, DistributedSpellCheckComponentTest, BinaryUpdateRequestHandlerTest, TestQuerySenderNoQuery, FastVectorHighlighterTest, TestNumberUtils, SearchHandlerTest, SpellCheckComponentTest, DirectSolrConnectionTest, TestRandomFaceting, TestPHPSerializedResponseWriter, MBeansHandlerTest, TestJmxMonitoredMap, TestBinaryResponseWriter, TestBadConfig, SimpleFacetsTest, CoreAdminHandlerTest, SolrPluginUtilsTest, JSONWriterTest, SortByFunctionTest, PathHierarchyTokenizerFactoryTest, ScriptEngineTest, SpellCheckCollatorTest, TestFiltering, TestDefaultSimilarityFactory, QueryElevationComponentTest, TestLuceneMatchVersion, TestLFUCache, CircularListTest, TestLMJelinekMercerSimilarityFactory, TestSolrIndexConfig, TestJoin, TestStressRecovery, LoggingHandlerTest, ClusterStateUpdateTest, BasicDistributedZkTest]
[junit4:junit4] Completed on J0 in 390.14s, 1 test, 1 failure <<< FAILURES!

[...truncated 252 lines...]
BUILD FAILED
/usr/home/hudson/hudson-slave/workspace/Lucene-Solr-Tests-4.x-java7/build.xml:38: The following error occurred while executing this line:
/usr/home/hudson/hudson-slave/workspace/Lucene-Solr-Tests-4.x-java7/solr/build.xml:180: The following error occurred while executing this line:
/usr/home/hudson/hudson-slave/workspace/Lucene-Solr-Tests-4.x-java7/lucene/module-build.xml:61: The following error occurred while executing this line:
/usr/home/hudson/hudson-slave/workspace/Lucene-Solr-Tests-4.x-java7/lucene/common-build.xml:1143: The following error occurred while executing this line:
/usr/home/hudson/hudson-slave/workspace/Lucene-Solr-Tests-4.x-java7/lucene/common-build.xml:816: There were test failures: 232 suites, 961 tests, 1 failure, 21 ignored (3 assumptions)

Total time: 34 minutes 43 seconds
Build step 'Invoke Ant' marked build as failure
Archiving artifacts
Recording test results
Email was triggered for: Failure
Sending email for trigger: Failure



Mime
View raw message