lucene-dev mailing list archives

Site index · List index
Message view « Date » · « Thread »
Top « Date » · « Thread »
From Policeman Jenkins Server <jenk...@sd-datasolutions.de>
Subject [JENKINS] Lucene-Solr-trunk-Windows (32bit/jdk1.7.0_07) - Build # 1328 - Still Failing!
Date Sat, 27 Oct 2012 15:05:02 GMT
Build: http://jenkins.sd-datasolutions.de/job/Lucene-Solr-trunk-Windows/1328/
Java: 32bit/jdk1.7.0_07 -server -XX:+UseConcMarkSweepGC

6 tests failed.
FAILED:  junit.framework.TestSuite.org.apache.solr.cloud.SyncSliceTest

Error Message:
ERROR: SolrIndexSearcher opens=8 closes=7

Stack Trace:
java.lang.AssertionError: ERROR: SolrIndexSearcher opens=8 closes=7
	at __randomizedtesting.SeedInfo.seed([C420575F98B7BAD8]:0)
	at org.junit.Assert.fail(Assert.java:93)
	at org.apache.solr.SolrTestCaseJ4.endTrackingSearchers(SolrTestCaseJ4.java:243)
	at org.apache.solr.SolrTestCaseJ4.afterClass(SolrTestCaseJ4.java:97)
	at sun.reflect.GeneratedMethodAccessor17.invoke(Unknown Source)
	at sun.reflect.DelegatingMethodAccessorImpl.invoke(DelegatingMethodAccessorImpl.java:43)
	at java.lang.reflect.Method.invoke(Method.java:601)
	at com.carrotsearch.randomizedtesting.RandomizedRunner.invoke(RandomizedRunner.java:1559)
	at com.carrotsearch.randomizedtesting.RandomizedRunner.access$600(RandomizedRunner.java:79)
	at com.carrotsearch.randomizedtesting.RandomizedRunner$5.evaluate(RandomizedRunner.java:700)
	at com.carrotsearch.randomizedtesting.rules.StatementAdapter.evaluate(StatementAdapter.java:36)
	at com.carrotsearch.randomizedtesting.rules.SystemPropertiesRestoreRule$1.evaluate(SystemPropertiesRestoreRule.java:53)
	at org.apache.lucene.util.AbstractBeforeAfterRule$1.evaluate(AbstractBeforeAfterRule.java:45)
	at org.apache.lucene.util.TestRuleStoreClassName$1.evaluate(TestRuleStoreClassName.java:42)
	at com.carrotsearch.randomizedtesting.rules.SystemPropertiesInvariantRule$1.evaluate(SystemPropertiesInvariantRule.java:55)
	at com.carrotsearch.randomizedtesting.rules.NoShadowingOrOverridesOnMethodsRule$1.evaluate(NoShadowingOrOverridesOnMethodsRule.java:39)
	at com.carrotsearch.randomizedtesting.rules.NoShadowingOrOverridesOnMethodsRule$1.evaluate(NoShadowingOrOverridesOnMethodsRule.java:39)
	at com.carrotsearch.randomizedtesting.rules.StatementAdapter.evaluate(StatementAdapter.java:36)
	at org.apache.lucene.util.TestRuleAssertionsRequired$1.evaluate(TestRuleAssertionsRequired.java:43)
	at org.apache.lucene.util.TestRuleMarkFailure$1.evaluate(TestRuleMarkFailure.java:48)
	at org.apache.lucene.util.TestRuleIgnoreAfterMaxFailures$1.evaluate(TestRuleIgnoreAfterMaxFailures.java:70)
	at org.apache.lucene.util.TestRuleIgnoreTestSuites$1.evaluate(TestRuleIgnoreTestSuites.java:55)
	at com.carrotsearch.randomizedtesting.rules.StatementAdapter.evaluate(StatementAdapter.java:36)
	at com.carrotsearch.randomizedtesting.ThreadLeakControl$StatementRunner.run(ThreadLeakControl.java:358)
	at java.lang.Thread.run(Thread.java:722)


FAILED:  junit.framework.TestSuite.org.apache.solr.cloud.SyncSliceTest

Error Message:
1 thread leaked from SUITE scope at org.apache.solr.cloud.SyncSliceTest:     1) Thread[id=3474, name=searcherExecutor-2239-thread-1, state=WAITING, group=TGRP-SyncSliceTest]         at sun.misc.Unsafe.park(Native Method)         at java.util.concurrent.locks.LockSupport.park(LockSupport.java:186)         at java.util.concurrent.locks.AbstractQueuedSynchronizer$ConditionObject.await(AbstractQueuedSynchronizer.java:2043)         at java.util.concurrent.LinkedBlockingQueue.take(LinkedBlockingQueue.java:442)         at java.util.concurrent.ThreadPoolExecutor.getTask(ThreadPoolExecutor.java:1043)         at java.util.concurrent.ThreadPoolExecutor.runWorker(ThreadPoolExecutor.java:1103)         at java.util.concurrent.ThreadPoolExecutor$Worker.run(ThreadPoolExecutor.java:603)         at java.lang.Thread.run(Thread.java:722)

Stack Trace:
com.carrotsearch.randomizedtesting.ThreadLeakError: 1 thread leaked from SUITE scope at org.apache.solr.cloud.SyncSliceTest: 
   1) Thread[id=3474, name=searcherExecutor-2239-thread-1, state=WAITING, group=TGRP-SyncSliceTest]
        at sun.misc.Unsafe.park(Native Method)
        at java.util.concurrent.locks.LockSupport.park(LockSupport.java:186)
        at java.util.concurrent.locks.AbstractQueuedSynchronizer$ConditionObject.await(AbstractQueuedSynchronizer.java:2043)
        at java.util.concurrent.LinkedBlockingQueue.take(LinkedBlockingQueue.java:442)
        at java.util.concurrent.ThreadPoolExecutor.getTask(ThreadPoolExecutor.java:1043)
        at java.util.concurrent.ThreadPoolExecutor.runWorker(ThreadPoolExecutor.java:1103)
        at java.util.concurrent.ThreadPoolExecutor$Worker.run(ThreadPoolExecutor.java:603)
        at java.lang.Thread.run(Thread.java:722)
	at __randomizedtesting.SeedInfo.seed([C420575F98B7BAD8]:0)


FAILED:  junit.framework.TestSuite.org.apache.solr.cloud.SyncSliceTest

Error Message:
There are still zombie threads that couldn't be terminated:    1) Thread[id=3474, name=searcherExecutor-2239-thread-1, state=WAITING, group=TGRP-SyncSliceTest]         at sun.misc.Unsafe.park(Native Method)         at java.util.concurrent.locks.LockSupport.park(LockSupport.java:186)         at java.util.concurrent.locks.AbstractQueuedSynchronizer$ConditionObject.await(AbstractQueuedSynchronizer.java:2043)         at java.util.concurrent.LinkedBlockingQueue.take(LinkedBlockingQueue.java:442)         at java.util.concurrent.ThreadPoolExecutor.getTask(ThreadPoolExecutor.java:1043)         at java.util.concurrent.ThreadPoolExecutor.runWorker(ThreadPoolExecutor.java:1103)         at java.util.concurrent.ThreadPoolExecutor$Worker.run(ThreadPoolExecutor.java:603)         at java.lang.Thread.run(Thread.java:722)

Stack Trace:
com.carrotsearch.randomizedtesting.ThreadLeakError: There are still zombie threads that couldn't be terminated:
   1) Thread[id=3474, name=searcherExecutor-2239-thread-1, state=WAITING, group=TGRP-SyncSliceTest]
        at sun.misc.Unsafe.park(Native Method)
        at java.util.concurrent.locks.LockSupport.park(LockSupport.java:186)
        at java.util.concurrent.locks.AbstractQueuedSynchronizer$ConditionObject.await(AbstractQueuedSynchronizer.java:2043)
        at java.util.concurrent.LinkedBlockingQueue.take(LinkedBlockingQueue.java:442)
        at java.util.concurrent.ThreadPoolExecutor.getTask(ThreadPoolExecutor.java:1043)
        at java.util.concurrent.ThreadPoolExecutor.runWorker(ThreadPoolExecutor.java:1103)
        at java.util.concurrent.ThreadPoolExecutor$Worker.run(ThreadPoolExecutor.java:603)
        at java.lang.Thread.run(Thread.java:722)
	at __randomizedtesting.SeedInfo.seed([C420575F98B7BAD8]:0)


FAILED:  org.apache.solr.cloud.SyncSliceTest.testDistribSearch

Error Message:
There are still nodes recoverying

Stack Trace:
java.lang.AssertionError: There are still nodes recoverying
	at __randomizedtesting.SeedInfo.seed([C420575F98B7BAD8:45C6D947EFE8DAE4]:0)
	at org.junit.Assert.fail(Assert.java:93)
	at org.apache.solr.cloud.AbstractDistribZkTestBase.waitForRecoveriesToFinish(AbstractDistribZkTestBase.java:155)
	at org.apache.solr.cloud.AbstractFullDistribZkTestBase.waitForRecoveriesToFinish(AbstractFullDistribZkTestBase.java:559)
	at org.apache.solr.cloud.AbstractFullDistribZkTestBase.waitForThingsToLevelOut(AbstractFullDistribZkTestBase.java:1134)
	at org.apache.solr.cloud.SyncSliceTest.doTest(SyncSliceTest.java:92)
	at org.apache.solr.BaseDistributedSearchTestCase.testDistribSearch(BaseDistributedSearchTestCase.java:695)
	at sun.reflect.NativeMethodAccessorImpl.invoke0(Native Method)
	at sun.reflect.NativeMethodAccessorImpl.invoke(NativeMethodAccessorImpl.java:57)
	at sun.reflect.DelegatingMethodAccessorImpl.invoke(DelegatingMethodAccessorImpl.java:43)
	at java.lang.reflect.Method.invoke(Method.java:601)
	at com.carrotsearch.randomizedtesting.RandomizedRunner.invoke(RandomizedRunner.java:1559)
	at com.carrotsearch.randomizedtesting.RandomizedRunner.access$600(RandomizedRunner.java:79)
	at com.carrotsearch.randomizedtesting.RandomizedRunner$6.evaluate(RandomizedRunner.java:737)
	at com.carrotsearch.randomizedtesting.RandomizedRunner$7.evaluate(RandomizedRunner.java:773)
	at com.carrotsearch.randomizedtesting.RandomizedRunner$8.evaluate(RandomizedRunner.java:787)
	at com.carrotsearch.randomizedtesting.rules.SystemPropertiesRestoreRule$1.evaluate(SystemPropertiesRestoreRule.java:53)
	at org.apache.lucene.util.TestRuleSetupTeardownChained$1.evaluate(TestRuleSetupTeardownChained.java:50)
	at org.apache.lucene.util.TestRuleFieldCacheSanity$1.evaluate(TestRuleFieldCacheSanity.java:51)
	at org.apache.lucene.util.AbstractBeforeAfterRule$1.evaluate(AbstractBeforeAfterRule.java:45)
	at com.carrotsearch.randomizedtesting.rules.SystemPropertiesInvariantRule$1.evaluate(SystemPropertiesInvariantRule.java:55)
	at org.apache.lucene.util.TestRuleThreadAndTestName$1.evaluate(TestRuleThreadAndTestName.java:48)
	at org.apache.lucene.util.TestRuleIgnoreAfterMaxFailures$1.evaluate(TestRuleIgnoreAfterMaxFailures.java:70)
	at org.apache.lucene.util.TestRuleMarkFailure$1.evaluate(TestRuleMarkFailure.java:48)
	at com.carrotsearch.randomizedtesting.rules.StatementAdapter.evaluate(StatementAdapter.java:36)
	at com.carrotsearch.randomizedtesting.ThreadLeakControl$StatementRunner.run(ThreadLeakControl.java:358)
	at com.carrotsearch.randomizedtesting.ThreadLeakControl.forkTimeoutingTask(ThreadLeakControl.java:782)
	at com.carrotsearch.randomizedtesting.ThreadLeakControl$3.evaluate(ThreadLeakControl.java:442)
	at com.carrotsearch.randomizedtesting.RandomizedRunner.runSingleTest(RandomizedRunner.java:746)
	at com.carrotsearch.randomizedtesting.RandomizedRunner$3.evaluate(RandomizedRunner.java:648)
	at com.carrotsearch.randomizedtesting.RandomizedRunner$4.evaluate(RandomizedRunner.java:682)
	at com.carrotsearch.randomizedtesting.RandomizedRunner$5.evaluate(RandomizedRunner.java:693)
	at com.carrotsearch.randomizedtesting.rules.StatementAdapter.evaluate(StatementAdapter.java:36)
	at com.carrotsearch.randomizedtesting.rules.SystemPropertiesRestoreRule$1.evaluate(SystemPropertiesRestoreRule.java:53)
	at org.apache.lucene.util.AbstractBeforeAfterRule$1.evaluate(AbstractBeforeAfterRule.java:45)
	at org.apache.lucene.util.TestRuleStoreClassName$1.evaluate(TestRuleStoreClassName.java:42)
	at com.carrotsearch.randomizedtesting.rules.SystemPropertiesInvariantRule$1.evaluate(SystemPropertiesInvariantRule.java:55)
	at com.carrotsearch.randomizedtesting.rules.NoShadowingOrOverridesOnMethodsRule$1.evaluate(NoShadowingOrOverridesOnMethodsRule.java:39)
	at com.carrotsearch.randomizedtesting.rules.NoShadowingOrOverridesOnMethodsRule$1.evaluate(NoShadowingOrOverridesOnMethodsRule.java:39)
	at com.carrotsearch.randomizedtesting.rules.StatementAdapter.evaluate(StatementAdapter.java:36)
	at org.apache.lucene.util.TestRuleAssertionsRequired$1.evaluate(TestRuleAssertionsRequired.java:43)
	at org.apache.lucene.util.TestRuleMarkFailure$1.evaluate(TestRuleMarkFailure.java:48)
	at org.apache.lucene.util.TestRuleIgnoreAfterMaxFailures$1.evaluate(TestRuleIgnoreAfterMaxFailures.java:70)
	at org.apache.lucene.util.TestRuleIgnoreTestSuites$1.evaluate(TestRuleIgnoreTestSuites.java:55)
	at com.carrotsearch.randomizedtesting.rules.StatementAdapter.evaluate(StatementAdapter.java:36)
	at com.carrotsearch.randomizedtesting.ThreadLeakControl$StatementRunner.run(ThreadLeakControl.java:358)
	at java.lang.Thread.run(Thread.java:722)


FAILED:  junit.framework.TestSuite.org.apache.solr.handler.TestReplicationHandler

Error Message:
Resource in scope SUITE failed to close. Resource was registered from thread Thread[id=396, name=TEST-TestReplicationHandler.test-seed#[C420575F98B7BAD8], state=RUNNABLE, group=TGRP-TestReplicationHandler], registration stack trace below.

Stack Trace:
com.carrotsearch.randomizedtesting.ResourceDisposalError: Resource in scope SUITE failed to close. Resource was registered from thread Thread[id=396, name=TEST-TestReplicationHandler.test-seed#[C420575F98B7BAD8], state=RUNNABLE, group=TGRP-TestReplicationHandler], registration stack trace below.
	at java.lang.Thread.getStackTrace(Thread.java:1567)
	at com.carrotsearch.randomizedtesting.RandomizedContext.closeAtEnd(RandomizedContext.java:150)
	at org.apache.lucene.util.LuceneTestCase.closeAfterSuite(LuceneTestCase.java:514)
	at org.apache.lucene.util.LuceneTestCase.wrapDirectory(LuceneTestCase.java:958)
	at org.apache.lucene.util.LuceneTestCase.newDirectory(LuceneTestCase.java:872)
	at org.apache.lucene.util.LuceneTestCase.newDirectory(LuceneTestCase.java:864)
	at org.apache.solr.core.MockDirectoryFactory.create(MockDirectoryFactory.java:33)
	at org.apache.solr.core.CachingDirectoryFactory.get(CachingDirectoryFactory.java:221)
	at org.apache.solr.update.SolrIndexWriter.create(SolrIndexWriter.java:60)
	at org.apache.solr.core.SolrCore.initIndex(SolrCore.java:502)
	at org.apache.solr.core.SolrCore.<init>(SolrCore.java:705)
	at org.apache.solr.core.SolrCore.<init>(SolrCore.java:618)
	at org.apache.solr.core.CoreContainer.create(CoreContainer.java:842)
	at org.apache.solr.core.CoreContainer.load(CoreContainer.java:529)
	at org.apache.solr.core.CoreContainer$Initializer.initialize(CoreContainer.java:306)
	at org.apache.solr.servlet.SolrDispatchFilter.init(SolrDispatchFilter.java:107)
	at org.eclipse.jetty.servlet.FilterHolder.doStart(FilterHolder.java:114)
	at org.eclipse.jetty.util.component.AbstractLifeCycle.start(AbstractLifeCycle.java:59)
	at org.eclipse.jetty.servlet.ServletHandler.initialize(ServletHandler.java:754)
	at org.eclipse.jetty.servlet.ServletHandler.updateMappings(ServletHandler.java:1227)
	at org.eclipse.jetty.servlet.ServletHandler.setFilterMappings(ServletHandler.java:1263)
	at org.eclipse.jetty.servlet.ServletHandler.addFilterWithMapping(ServletHandler.java:965)
	at org.eclipse.jetty.servlet.ServletHandler.addFilterWithMapping(ServletHandler.java:923)
	at org.eclipse.jetty.servlet.ServletContextHandler.addFilter(ServletContextHandler.java:333)
	at org.apache.solr.client.solrj.embedded.JettySolrRunner$1.lifeCycleStarted(JettySolrRunner.java:173)
	at org.eclipse.jetty.util.component.AbstractLifeCycle.setStarted(AbstractLifeCycle.java:169)
	at org.eclipse.jetty.util.component.AbstractLifeCycle.start(AbstractLifeCycle.java:60)
	at org.apache.solr.client.solrj.embedded.JettySolrRunner.start(JettySolrRunner.java:225)
	at org.apache.solr.client.solrj.embedded.JettySolrRunner.start(JettySolrRunner.java:205)
	at org.apache.solr.handler.TestReplicationHandler.createJetty(TestReplicationHandler.java:131)
	at org.apache.solr.handler.TestReplicationHandler.doTestIndexAndConfigReplication(TestReplicationHandler.java:410)
	at org.apache.solr.handler.TestReplicationHandler.test(TestReplicationHandler.java:254)
	at sun.reflect.NativeMethodAccessorImpl.invoke0(Native Method)
	at sun.reflect.NativeMethodAccessorImpl.invoke(NativeMethodAccessorImpl.java:57)
	at sun.reflect.DelegatingMethodAccessorImpl.invoke(DelegatingMethodAccessorImpl.java:43)
	at java.lang.reflect.Method.invoke(Method.java:601)
	at com.carrotsearch.randomizedtesting.RandomizedRunner.invoke(RandomizedRunner.java:1559)
	at com.carrotsearch.randomizedtesting.RandomizedRunner.access$600(RandomizedRunner.java:79)
	at com.carrotsearch.randomizedtesting.RandomizedRunner$6.evaluate(RandomizedRunner.java:737)
	at com.carrotsearch.randomizedtesting.RandomizedRunner$7.evaluate(RandomizedRunner.java:773)
	at com.carrotsearch.randomizedtesting.RandomizedRunner$8.evaluate(RandomizedRunner.java:787)
	at com.carrotsearch.randomizedtesting.rules.SystemPropertiesRestoreRule$1.evaluate(SystemPropertiesRestoreRule.java:53)
	at org.apache.lucene.util.TestRuleSetupTeardownChained$1.evaluate(TestRuleSetupTeardownChained.java:50)
	at org.apache.lucene.util.TestRuleFieldCacheSanity$1.evaluate(TestRuleFieldCacheSanity.java:51)
	at org.apache.lucene.util.AbstractBeforeAfterRule$1.evaluate(AbstractBeforeAfterRule.java:45)
	at com.carrotsearch.randomizedtesting.rules.SystemPropertiesInvariantRule$1.evaluate(SystemPropertiesInvariantRule.java:55)
	at org.apache.lucene.util.TestRuleThreadAndTestName$1.evaluate(TestRuleThreadAndTestName.java:48)
	at org.apache.lucene.util.TestRuleIgnoreAfterMaxFailures$1.evaluate(TestRuleIgnoreAfterMaxFailures.java:70)
	at org.apache.lucene.util.TestRuleMarkFailure$1.evaluate(TestRuleMarkFailure.java:48)
	at com.carrotsearch.randomizedtesting.rules.StatementAdapter.evaluate(StatementAdapter.java:36)
	at com.carrotsearch.randomizedtesting.ThreadLeakControl$StatementRunner.run(ThreadLeakControl.java:358)
	at com.carrotsearch.randomizedtesting.ThreadLeakControl.forkTimeoutingTask(ThreadLeakControl.java:782)
	at com.carrotsearch.randomizedtesting.ThreadLeakControl$3.evaluate(ThreadLeakControl.java:442)
	at com.carrotsearch.randomizedtesting.RandomizedRunner.runSingleTest(RandomizedRunner.java:746)
	at com.carrotsearch.randomizedtesting.RandomizedRunner$3.evaluate(RandomizedRunner.java:648)
	at com.carrotsearch.randomizedtesting.RandomizedRunner$4.evaluate(RandomizedRunner.java:682)
	at com.carrotsearch.randomizedtesting.RandomizedRunner$5.evaluate(RandomizedRunner.java:693)
	at com.carrotsearch.randomizedtesting.rules.StatementAdapter.evaluate(StatementAdapter.java:36)
	at com.carrotsearch.randomizedtesting.rules.SystemPropertiesRestoreRule$1.evaluate(SystemPropertiesRestoreRule.java:53)
	at org.apache.lucene.util.AbstractBeforeAfterRule$1.evaluate(AbstractBeforeAfterRule.java:45)
	at org.apache.lucene.util.TestRuleStoreClassName$1.evaluate(TestRuleStoreClassName.java:42)
	at com.carrotsearch.randomizedtesting.rules.SystemPropertiesInvariantRule$1.evaluate(SystemPropertiesInvariantRule.java:55)
	at com.carrotsearch.randomizedtesting.rules.NoShadowingOrOverridesOnMethodsRule$1.evaluate(NoShadowingOrOverridesOnMethodsRule.java:39)
	at com.carrotsearch.randomizedtesting.rules.NoShadowingOrOverridesOnMethodsRule$1.evaluate(NoShadowingOrOverridesOnMethodsRule.java:39)
	at com.carrotsearch.randomizedtesting.rules.StatementAdapter.evaluate(StatementAdapter.java:36)
	at org.apache.lucene.util.TestRuleAssertionsRequired$1.evaluate(TestRuleAssertionsRequired.java:43)
	at org.apache.lucene.util.TestRuleMarkFailure$1.evaluate(TestRuleMarkFailure.java:48)
	at org.apache.lucene.util.TestRuleIgnoreAfterMaxFailures$1.evaluate(TestRuleIgnoreAfterMaxFailures.java:70)
	at org.apache.lucene.util.TestRuleIgnoreTestSuites$1.evaluate(TestRuleIgnoreTestSuites.java:55)
	at com.carrotsearch.randomizedtesting.rules.StatementAdapter.evaluate(StatementAdapter.java:36)
	at com.carrotsearch.randomizedtesting.ThreadLeakControl$StatementRunner.run(ThreadLeakControl.java:358)
	at java.lang.Thread.run(Thread.java:722)
Caused by: java.lang.AssertionError: Directory not closed: MockDirWrapper(org.apache.lucene.store.RAMDirectory@652594 lockFactory=org.apache.lucene.store.SingleInstanceLockFactory@1fa1df7)
	at org.junit.Assert.fail(Assert.java:93)
	at org.apache.lucene.util.CloseableDirectory.close(CloseableDirectory.java:47)
	at com.carrotsearch.randomizedtesting.RandomizedRunner$2$1.apply(RandomizedRunner.java:602)
	at com.carrotsearch.randomizedtesting.RandomizedRunner$2$1.apply(RandomizedRunner.java:599)
	at com.carrotsearch.randomizedtesting.RandomizedContext.closeResources(RandomizedContext.java:167)
	at com.carrotsearch.randomizedtesting.RandomizedRunner$2.afterAlways(RandomizedRunner.java:615)
	at com.carrotsearch.randomizedtesting.rules.StatementAdapter.evaluate(StatementAdapter.java:43)
	... 2 more


FAILED:  junit.framework.TestSuite.org.apache.solr.handler.TestReplicationHandler

Error Message:
Resource in scope SUITE failed to close. Resource was registered from thread Thread[id=518, name=Thread-216, state=RUNNABLE, group=TGRP-TestReplicationHandler], registration stack trace below.

Stack Trace:
com.carrotsearch.randomizedtesting.ResourceDisposalError: Resource in scope SUITE failed to close. Resource was registered from thread Thread[id=518, name=Thread-216, state=RUNNABLE, group=TGRP-TestReplicationHandler], registration stack trace below.
	at java.lang.Thread.getStackTrace(Thread.java:1567)
	at com.carrotsearch.randomizedtesting.RandomizedContext.closeAtEnd(RandomizedContext.java:150)
	at org.apache.lucene.util.LuceneTestCase.closeAfterSuite(LuceneTestCase.java:514)
	at org.apache.lucene.util.LuceneTestCase.wrapDirectory(LuceneTestCase.java:958)
	at org.apache.lucene.util.LuceneTestCase.newDirectory(LuceneTestCase.java:872)
	at org.apache.lucene.util.LuceneTestCase.newDirectory(LuceneTestCase.java:864)
	at org.apache.solr.core.MockDirectoryFactory.create(MockDirectoryFactory.java:33)
	at org.apache.solr.core.CachingDirectoryFactory.get(CachingDirectoryFactory.java:221)
	at org.apache.solr.core.CachingDirectoryFactory.get(CachingDirectoryFactory.java:181)
	at org.apache.solr.handler.SnapPuller.fetchLatestIndex(SnapPuller.java:373)
	at org.apache.solr.handler.ReplicationHandler.doFetch(ReplicationHandler.java:273)
	at org.apache.solr.handler.ReplicationHandler$1.run(ReplicationHandler.java:181)
Caused by: java.lang.AssertionError: Directory not closed: MockDirWrapper(org.apache.lucene.store.RAMDirectory@17206aa lockFactory=org.apache.lucene.store.SimpleFSLockFactory@c8ef62)
	at org.junit.Assert.fail(Assert.java:93)
	at org.apache.lucene.util.CloseableDirectory.close(CloseableDirectory.java:47)
	at com.carrotsearch.randomizedtesting.RandomizedRunner$2$1.apply(RandomizedRunner.java:602)
	at com.carrotsearch.randomizedtesting.RandomizedRunner$2$1.apply(RandomizedRunner.java:599)
	at com.carrotsearch.randomizedtesting.RandomizedContext.closeResources(RandomizedContext.java:167)
	at com.carrotsearch.randomizedtesting.RandomizedRunner$2.afterAlways(RandomizedRunner.java:615)
	at com.carrotsearch.randomizedtesting.rules.StatementAdapter.evaluate(StatementAdapter.java:43)
	at com.carrotsearch.randomizedtesting.ThreadLeakControl$StatementRunner.run(ThreadLeakControl.java:358)
	at java.lang.Thread.run(Thread.java:722)




Build Log:
[...truncated 8527 lines...]
[junit4:junit4] Suite: org.apache.solr.handler.TestReplicationHandler
[junit4:junit4]   2> 3 T396 oas.SolrTestCaseJ4.setUp ###Starting test
[junit4:junit4]   2> 3 T396 oas.SolrTestCaseJ4.setUp ###Starting test
[junit4:junit4]   2> 16 T396 oejs.Server.doStart jetty-8.1.2.v20120308
[junit4:junit4]   2> 21 T396 oejs.AbstractConnector.doStart Started SelectChannelConnector@0.0.0.0:62538
[junit4:junit4]   2> 21 T396 oasc.SolrResourceLoader.locateSolrHome JNDI not configured for solr (NoInitialContextEx)
[junit4:junit4]   2> 22 T396 oasc.SolrResourceLoader.locateSolrHome using system property solr.solr.home: .\org.apache.solr.handler.TestReplicationHandler$SolrInstance-1351349171465\master
[junit4:junit4]   2> 22 T396 oasc.SolrResourceLoader.<init> new SolrResourceLoader for deduced Solr Home: '.\org.apache.solr.handler.TestReplicationHandler$SolrInstance-1351349171465\master\'
[junit4:junit4]   2> 51 T396 oass.SolrDispatchFilter.init SolrDispatchFilter.init()
[junit4:junit4]   2> 52 T396 oasc.SolrResourceLoader.locateSolrHome JNDI not configured for solr (NoInitialContextEx)
[junit4:junit4]   2> 52 T396 oasc.SolrResourceLoader.locateSolrHome using system property solr.solr.home: .\org.apache.solr.handler.TestReplicationHandler$SolrInstance-1351349171465\master
[junit4:junit4]   2> 52 T396 oasc.CoreContainer$Initializer.initialize looking for solr.xml: C:\Users\JenkinsSlave\workspace\Lucene-Solr-trunk-Windows\solr\build\solr-core\test\J0\.\org.apache.solr.handler.TestReplicationHandler$SolrInstance-1351349171465\master\solr.xml
[junit4:junit4]   2> 52 T396 oasc.CoreContainer.<init> New CoreContainer 21939254
[junit4:junit4]   2> 54 T396 oasc.CoreContainer$Initializer.initialize no solr.xml file found - using default
[junit4:junit4]   2> 55 T396 oasc.CoreContainer.load Loading CoreContainer using Solr Home: '.\org.apache.solr.handler.TestReplicationHandler$SolrInstance-1351349171465\master\'
[junit4:junit4]   2> 55 T396 oasc.SolrResourceLoader.<init> new SolrResourceLoader for directory: '.\org.apache.solr.handler.TestReplicationHandler$SolrInstance-1351349171465\master\'
[junit4:junit4]   2> 94 T396 oasc.CoreContainer.load Registering Log Listener
[junit4:junit4]   2> 110 T396 oasc.CoreContainer.create Creating SolrCore 'collection1' using instanceDir: .\org.apache.solr.handler.TestReplicationHandler$SolrInstance-1351349171465\master\collection1
[junit4:junit4]   2> 111 T396 oasc.SolrResourceLoader.<init> new SolrResourceLoader for directory: '.\org.apache.solr.handler.TestReplicationHandler$SolrInstance-1351349171465\master\collection1\'
[junit4:junit4]   2> 143 T396 oasc.SolrConfig.<init> Using Lucene MatchVersion: LUCENE_50
[junit4:junit4]   2> 192 T396 oasc.SolrConfig.<init> Loaded SolrConfig: solrconfig.xml
[junit4:junit4]   2> 193 T396 oass.IndexSchema.readSchema Reading Solr Schema
[junit4:junit4]   2> 202 T396 oass.IndexSchema.readSchema Schema name=test
[junit4:junit4]   2> 226 T396 oass.IndexSchema.readSchema unique key field: id
[junit4:junit4]   2> 228 T396 oasc.SolrCore.<init> [collection1] Opening new SolrCore at .\org.apache.solr.handler.TestReplicationHandler$SolrInstance-1351349171465\master\collection1\, dataDir=.\org.apache.solr.handler.TestReplicationHandler$SolrInstance-1351349171465\master\collection1\data\
[junit4:junit4]   2> 228 T396 oasc.SolrCore.<init> JMX monitoring not detected for core: collection1
[junit4:junit4]   2> 228 T396 oasc.SolrCore.initDirectoryFactory org.apache.solr.core.MockDirectoryFactory
[junit4:junit4]   2> 229 T396 oasc.CachingDirectoryFactory.injectLockFactory WARNING No lockType configured for MockDirWrapper(org.apache.lucene.store.RAMDirectory@27621e lockFactory=org.apache.lucene.store.SingleInstanceLockFactory@19adc2c) assuming 'simple'
[junit4:junit4]   2> 229 T396 oasc.CachingDirectoryFactory.get return new directory for C:\Users\JenkinsSlave\workspace\Lucene-Solr-trunk-Windows\solr\build\solr-core\test\J0\.\org.apache.solr.handler.TestReplicationHandler$SolrInstance-1351349171465\master\collection1\data forceNew:false
[junit4:junit4]   2> 230 T396 oasc.CachingDirectoryFactory.close Releasing directory:C:\Users\JenkinsSlave\workspace\Lucene-Solr-trunk-Windows\solr\build\solr-core\test\J0\.\org.apache.solr.handler.TestReplicationHandler$SolrInstance-1351349171465\master\collection1\data
[junit4:junit4]   2> 230 T396 oasc.SolrCore.getNewIndexDir New index directory detected: old=null new=.\org.apache.solr.handler.TestReplicationHandler$SolrInstance-1351349171465\master\collection1\data\index/
[junit4:junit4]   2> 232 T396 oasc.SolrCore.initIndex WARNING [collection1] Solr index directory '.\org.apache.solr.handler.TestReplicationHandler$SolrInstance-1351349171465\master\collection1\data\index' doesn't exist. Creating new index...
[junit4:junit4]   2> 232 T396 oasc.CachingDirectoryFactory.get return new directory for C:\Users\JenkinsSlave\workspace\Lucene-Solr-trunk-Windows\solr\build\solr-core\test\J0\.\org.apache.solr.handler.TestReplicationHandler$SolrInstance-1351349171465\master\collection1\data\index forceNew:false
[junit4:junit4]   2> 233 T396 oasc.SolrDeletionPolicy.onCommit SolrDeletionPolicy.onCommit: commits:num=1
[junit4:junit4]   2> 		commit{dir=MockDirWrapper(org.apache.lucene.store.RAMDirectory@76784d lockFactory=org.apache.lucene.store.SingleInstanceLockFactory@e524b3),segFN=segments_1,generation=1,filenames=[segments_1]
[junit4:junit4]   2> 234 T396 oasc.SolrDeletionPolicy.updateCommits newest commit = 1[segments_1]
[junit4:junit4]   2> 234 T396 oasc.CachingDirectoryFactory.close Releasing directory:C:\Users\JenkinsSlave\workspace\Lucene-Solr-trunk-Windows\solr\build\solr-core\test\J0\.\org.apache.solr.handler.TestReplicationHandler$SolrInstance-1351349171465\master\collection1\data\index
[junit4:junit4]   2> 235 T396 oasc.RequestHandlers.initHandlersFromConfig created standard: solr.StandardRequestHandler
[junit4:junit4]   2> 236 T396 oasc.RequestHandlers.initHandlersFromConfig created /replication: solr.ReplicationHandler
[junit4:junit4]   2> 236 T396 oasc.RequestHandlers.initHandlersFromConfig created defaults: solr.StandardRequestHandler
[junit4:junit4]   2> 237 T396 oasc.RequestHandlers.initHandlersFromConfig adding lazy requestHandler: solr.StandardRequestHandler
[junit4:junit4]   2> 237 T396 oasc.RequestHandlers.initHandlersFromConfig created lazy: solr.StandardRequestHandler
[junit4:junit4]   2> 238 T396 oasc.RequestHandlers.initHandlersFromConfig created /update: solr.UpdateRequestHandler
[junit4:junit4]   2> 250 T396 oashl.XMLLoader.init xsltCacheLifetimeSeconds=60
[junit4:junit4]   2> 254 T396 oasc.CachingDirectoryFactory.close Releasing directory:C:\Users\JenkinsSlave\workspace\Lucene-Solr-trunk-Windows\solr\build\solr-core\test\J0\.\org.apache.solr.handler.TestReplicationHandler$SolrInstance-1351349171465\master\collection1\data
[junit4:junit4]   2> 255 T396 oass.SolrIndexSearcher.<init> Opening Searcher@19ad3d9 main
[junit4:junit4]   2> 255 T396 oasu.CommitTracker.<init> Hard AutoCommit: disabled
[junit4:junit4]   2> 256 T396 oasu.CommitTracker.<init> Soft AutoCommit: disabled
[junit4:junit4]   2> 256 T396 oashc.HttpShardHandlerFactory.getParameter Setting socketTimeout to: 0
[junit4:junit4]   2> 257 T396 oashc.HttpShardHandlerFactory.getParameter Setting urlScheme to: http://
[junit4:junit4]   2> 257 T396 oashc.HttpShardHandlerFactory.getParameter Setting connTimeout to: 0
[junit4:junit4]   2> 257 T396 oashc.HttpShardHandlerFactory.getParameter Setting maxConnectionsPerHost to: 20
[junit4:junit4]   2> 258 T396 oashc.HttpShardHandlerFactory.getParameter Setting corePoolSize to: 0
[junit4:junit4]   2> 258 T396 oashc.HttpShardHandlerFactory.getParameter Setting maximumPoolSize to: 2147483647
[junit4:junit4]   2> 258 T396 oashc.HttpShardHandlerFactory.getParameter Setting maxThreadIdleTime to: 5
[junit4:junit4]   2> 259 T396 oashc.HttpShardHandlerFactory.getParameter Setting sizeOfQueue to: -1
[junit4:junit4]   2> 259 T396 oashc.HttpShardHandlerFactory.getParameter Setting fairnessPolicy to: false
[junit4:junit4]   2> 259 T396 oascsi.HttpClientUtil.createClient Creating new http client, config:maxConnectionsPerHost=20&maxConnections=10000&socketTimeout=0&connTimeout=0&retry=false
[junit4:junit4]   2> 270 T396 oash.ReplicationHandler.inform Replication enabled for following config files: schema.xml,xslt/dummy.xsl
[junit4:junit4]   2> 271 T396 oash.ReplicationHandler.inform Commits will be reserved for  10000
[junit4:junit4]   2> 271 T406 oasc.SolrCore.registerSearcher [collection1] Registered new searcher Searcher@19ad3d9 main{StandardDirectoryReader(segments_1:1)}
[junit4:junit4]   2> 271 T396 oasc.CoreContainer.register registering core: collection1
[junit4:junit4]   2> 272 T396 oass.SolrDispatchFilter.init user.dir=C:\Users\JenkinsSlave\workspace\Lucene-Solr-trunk-Windows\solr\build\solr-core\test\J0
[junit4:junit4]   2> 272 T396 oass.SolrDispatchFilter.init SolrDispatchFilter.init() done
[junit4:junit4]   2> 273 T396 oascsi.HttpClientUtil.createClient Creating new http client, config:maxConnections=128&maxConnectionsPerHost=32&followRedirects=false
[junit4:junit4]   2> 291 T396 oejs.Server.doStart jetty-8.1.2.v20120308
[junit4:junit4]   2> 295 T396 oejs.AbstractConnector.doStart Started SelectChannelConnector@0.0.0.0:62541
[junit4:junit4]   2> 296 T396 oasc.SolrResourceLoader.locateSolrHome JNDI not configured for solr (NoInitialContextEx)
[junit4:junit4]   2> 297 T396 oasc.SolrResourceLoader.locateSolrHome using system property solr.solr.home: .\org.apache.solr.handler.TestReplicationHandler$SolrInstance-1351349171740\slave
[junit4:junit4]   2> 297 T396 oasc.SolrResourceLoader.<init> new SolrResourceLoader for deduced Solr Home: '.\org.apache.solr.handler.TestReplicationHandler$SolrInstance-1351349171740\slave\'
[junit4:junit4]   2> 312 T396 oass.SolrDispatchFilter.init SolrDispatchFilter.init()
[junit4:junit4]   2> 313 T396 oasc.SolrResourceLoader.locateSolrHome JNDI not configured for solr (NoInitialContextEx)
[junit4:junit4]   2> 313 T396 oasc.SolrResourceLoader.locateSolrHome using system property solr.solr.home: .\org.apache.solr.handler.TestReplicationHandler$SolrInstance-1351349171740\slave
[junit4:junit4]   2> 315 T396 oasc.CoreContainer$Initializer.initialize looking for solr.xml: C:\Users\JenkinsSlave\workspace\Lucene-Solr-trunk-Windows\solr\build\solr-core\test\J0\.\org.apache.solr.handler.TestReplicationHandler$SolrInstance-1351349171740\slave\solr.xml
[junit4:junit4]   2> 315 T396 oasc.CoreContainer.<init> New CoreContainer 12557777
[junit4:junit4]   2> 316 T396 oasc.CoreContainer$Initializer.initialize no solr.xml file found - using default
[junit4:junit4]   2> 317 T396 oasc.CoreContainer.load Loading CoreContainer using Solr Home: '.\org.apache.solr.handler.TestReplicationHandler$SolrInstance-1351349171740\slave\'
[junit4:junit4]   2> 317 T396 oasc.SolrResourceLoader.<init> new SolrResourceLoader for directory: '.\org.apache.solr.handler.TestReplicationHandler$SolrInstance-1351349171740\slave\'
[junit4:junit4]   2> 335 T396 oasc.CoreContainer.load Registering Log Listener
[junit4:junit4]   2> 359 T396 oasc.CoreContainer.create Creating SolrCore 'collection1' using instanceDir: .\org.apache.solr.handler.TestReplicationHandler$SolrInstance-1351349171740\slave\collection1
[junit4:junit4]   2> 363 T396 oasc.SolrResourceLoader.<init> new SolrResourceLoader for directory: '.\org.apache.solr.handler.TestReplicationHandler$SolrInstance-1351349171740\slave\collection1\'
[junit4:junit4]   2> 403 T396 oasc.SolrConfig.<init> Using Lucene MatchVersion: LUCENE_50
[junit4:junit4]   2> 466 T396 oasc.SolrConfig.<init> Loaded SolrConfig: solrconfig.xml
[junit4:junit4]   2> 466 T396 oass.IndexSchema.readSchema Reading Solr Schema
[junit4:junit4]   2> 470 T396 oass.IndexSchema.readSchema Schema name=test
[junit4:junit4]   2> 490 T396 oass.IndexSchema.readSchema unique key field: id
[junit4:junit4]   2> 492 T396 oasc.SolrCore.<init> [collection1] Opening new SolrCore at .\org.apache.solr.handler.TestReplicationHandler$SolrInstance-1351349171740\slave\collection1\, dataDir=.\org.apache.solr.handler.TestReplicationHandler$SolrInstance-1351349171740\slave\collection1\data\
[junit4:junit4]   2> 492 T396 oasc.SolrCore.<init> JMX monitoring not detected for core: collection1
[junit4:junit4]   2> 492 T396 oasc.SolrCore.initDirectoryFactory org.apache.solr.core.MockDirectoryFactory
[junit4:junit4]   2> 493 T396 oasc.CachingDirectoryFactory.injectLockFactory WARNING No lockType configured for MockDirWrapper(org.apache.lucene.store.RAMDirectory@672565 lockFactory=org.apache.lucene.store.SingleInstanceLockFactory@1c8176d) assuming 'simple'
[junit4:junit4]   2> 494 T396 oasc.CachingDirectoryFactory.get return new directory for C:\Users\JenkinsSlave\workspace\Lucene-Solr-trunk-Windows\solr\build\solr-core\test\J0\.\org.apache.solr.handler.TestReplicationHandler$SolrInstance-1351349171740\slave\collection1\data forceNew:false
[junit4:junit4]   2> 494 T396 oasc.CachingDirectoryFactory.close Releasing directory:C:\Users\JenkinsSlave\workspace\Lucene-Solr-trunk-Windows\solr\build\solr-core\test\J0\.\org.apache.solr.handler.TestReplicationHandler$SolrInstance-1351349171740\slave\collection1\data
[junit4:junit4]   2> 494 T396 oasc.SolrCore.getNewIndexDir New index directory detected: old=null new=.\org.apache.solr.handler.TestReplicationHandler$SolrInstance-1351349171740\slave\collection1\data\index/
[junit4:junit4]   2> 496 T396 oasc.SolrCore.initIndex WARNING [collection1] Solr index directory '.\org.apache.solr.handler.TestReplicationHandler$SolrInstance-1351349171740\slave\collection1\data\index' doesn't exist. Creating new index...
[junit4:junit4]   2> 496 T396 oasc.CachingDirectoryFactory.get return new directory for C:\Users\JenkinsSlave\workspace\Lucene-Solr-trunk-Windows\solr\build\solr-core\test\J0\.\org.apache.solr.handler.TestReplicationHandler$SolrInstance-1351349171740\slave\collection1\data\index forceNew:false
[junit4:junit4]   2> 498 T396 oasc.SolrDeletionPolicy.onCommit SolrDeletionPolicy.onCommit: commits:num=1
[junit4:junit4]   2> 		commit{dir=MockDirWrapper(org.apache.lucene.store.RAMDirectory@131f3e1 lockFactory=org.apache.lucene.store.SingleInstanceLockFactory@93330c),segFN=segments_1,generation=1,filenames=[segments_1]
[junit4:junit4]   2> 498 T396 oasc.SolrDeletionPolicy.updateCommits newest commit = 1[segments_1]
[junit4:junit4]   2> 498 T396 oasc.CachingDirectoryFactory.close Releasing directory:C:\Users\JenkinsSlave\workspace\Lucene-Solr-trunk-Windows\solr\build\solr-core\test\J0\.\org.apache.solr.handler.TestReplicationHandler$SolrInstance-1351349171740\slave\collection1\data\index
[junit4:junit4]   2> 499 T396 oasc.RequestHandlers.initHandlersFromConfig created standard: solr.StandardRequestHandler
[junit4:junit4]   2> 500 T396 oasc.RequestHandlers.initHandlersFromConfig created defaults: solr.StandardRequestHandler
[junit4:junit4]   2> 500 T396 oasc.RequestHandlers.initHandlersFromConfig adding lazy requestHandler: solr.StandardRequestHandler
[junit4:junit4]   2> 500 T396 oasc.RequestHandlers.initHandlersFromConfig created lazy: solr.StandardRequestHandler
[junit4:junit4]   2> 501 T396 oasc.RequestHandlers.initHandlersFromConfig created /update: solr.UpdateRequestHandler
[junit4:junit4]   2> 501 T396 oasc.RequestHandlers.initHandlersFromConfig created /replication: solr.ReplicationHandler
[junit4:junit4]   2> 503 T396 oashl.XMLLoader.init xsltCacheLifetimeSeconds=60
[junit4:junit4]   2> 508 T396 oasc.CachingDirectoryFactory.close Releasing directory:C:\Users\JenkinsSlave\workspace\Lucene-Solr-trunk-Windows\solr\build\solr-core\test\J0\.\org.apache.solr.handler.TestReplicationHandler$SolrInstance-1351349171740\slave\collection1\data
[junit4:junit4]   2> 508 T396 oass.SolrIndexSearcher.<init> Opening Searcher@a6bb6b main
[junit4:junit4]   2> 509 T396 oasu.CommitTracker.<init> Hard AutoCommit: disabled
[junit4:junit4]   2> 509 T396 oasu.CommitTracker.<init> Soft AutoCommit: disabled
[junit4:junit4]   2> 510 T396 oashc.HttpShardHandlerFactory.getParameter Setting socketTimeout to: 0
[junit4:junit4]   2> 510 T396 oashc.HttpShardHandlerFactory.getParameter Setting urlScheme to: http://
[junit4:junit4]   2> 510 T396 oashc.HttpShardHandlerFactory.getParameter Setting connTimeout to: 0
[junit4:junit4]   2> 511 T396 oashc.HttpShardHandlerFactory.getParameter Setting maxConnectionsPerHost to: 20
[junit4:junit4]   2> 511 T396 oashc.HttpShardHandlerFactory.getParameter Setting corePoolSize to: 0
[junit4:junit4]   2> 511 T396 oashc.HttpShardHandlerFactory.getParameter Setting maximumPoolSize to: 2147483647
[junit4:junit4]   2> 512 T396 oashc.HttpShardHandlerFactory.getParameter Setting maxThreadIdleTime to: 5
[junit4:junit4]   2> 512 T396 oashc.HttpShardHandlerFactory.getParameter Setting sizeOfQueue to: -1
[junit4:junit4]   2> 513 T396 oashc.HttpShardHandlerFactory.getParameter Setting fairnessPolicy to: false
[junit4:junit4]   2> 513 T396 oascsi.HttpClientUtil.createClient Creating new http client, config:maxConnectionsPerHost=20&maxConnections=10000&socketTimeout=0&connTimeout=0&retry=false
[junit4:junit4]   2> 519 T396 oascsi.HttpClientUtil.createClient Creating new http client, config:connTimeout=5000&socketTimeout=20000&allowCompression=false&maxConnections=10000&maxConnectionsPerHost=10000
[junit4:junit4]   2> 536 T396 oash.SnapPuller.startExecutorService Poll Scheduled at an interval of 1000ms
[junit4:junit4]   2> 537 T416 oasc.SolrCore.registerSearcher [collection1] Registered new searcher Searcher@a6bb6b main{StandardDirectoryReader(segments_1:1)}
[junit4:junit4]   2> 537 T396 oasc.CoreContainer.register registering core: collection1
[junit4:junit4]   2> 537 T396 oass.SolrDispatchFilter.init user.dir=C:\Users\JenkinsSlave\workspace\Lucene-Solr-trunk-Windows\solr\build\solr-core\test\J0
[junit4:junit4]   2> 538 T396 oass.SolrDispatchFilter.init SolrDispatchFilter.init() done
[junit4:junit4]   2> 538 T396 oascsi.HttpClientUtil.createClient Creating new http client, config:maxConnections=128&maxConnectionsPerHost=32&followRedirects=false
[junit4:junit4]   2> ASYNC  NEW_CORE C50 name=collection1 org.apache.solr.core.SolrCore@438c25
[junit4:junit4]   2> 548 T402 C50 REQ [collection1] webapp=/solr path=/replication params={command=indexversion&wt=javabin&qt=/replication&version=2} status=0 QTime=0 
[junit4:junit4]   2> 558 T396 oasc.CoreContainer.shutdown Shutting down CoreContainer instance=12557777
[junit4:junit4]   2> 559 T396 oasc.SolrCore.close [collection1]  CLOSING SolrCore org.apache.solr.core.SolrCore@694fb1
[junit4:junit4]   2> 560 T396 oasu.DirectUpdateHandler2.close closing DirectUpdateHandler2{commits=0,autocommits=0,soft autocommits=0,optimizes=0,rollbacks=0,expungeDeletes=0,docsPending=0,adds=0,deletesById=0,deletesByQuery=0,errors=0,cumulative_adds=0,cumulative_deletesById=0,cumulative_deletesByQuery=0,cumulative_errors=0}
[junit4:junit4]   2> 560 T396 oasc.SolrCore.decrefSolrCoreState Closing SolrCoreState
[junit4:junit4]   2> 560 T396 oasu.DefaultSolrCoreState.closeIndexWriter SolrCoreState ref count has reached 0 - closing IndexWriter
[junit4:junit4]   2> 560 T396 oasu.DefaultSolrCoreState.closeIndexWriter closing IndexWriter with IndexWriterCloser
[junit4:junit4]   2> 561 T396 oasc.SolrCore.closeSearcher [collection1] Closing main searcher on request.
[junit4:junit4]   2> 561 T396 oasc.CachingDirectoryFactory.close Releasing directory:C:\Users\JenkinsSlave\workspace\Lucene-Solr-trunk-Windows\solr\build\solr-core\test\J0\.\org.apache.solr.handler.TestReplicationHandler$SolrInstance-1351349171740\slave\collection1\data\index
[junit4:junit4]   2> 562 T396 oejsh.ContextHandler.doStop stopped o.e.j.s.ServletContextHandler{/solr,null}
[junit4:junit4]   2> 632 T396 oasc.CoreContainer.shutdown Shutting down CoreContainer instance=21939254
[junit4:junit4]   2> 633 T396 oasc.SolrCore.close [collection1]  CLOSING SolrCore org.apache.solr.core.SolrCore@438c25
[junit4:junit4]   2> 633 T396 oasu.DirectUpdateHandler2.close closing DirectUpdateHandler2{commits=0,autocommits=0,soft autocommits=0,optimizes=0,rollbacks=0,expungeDeletes=0,docsPending=0,adds=0,deletesById=0,deletesByQuery=0,errors=0,cumulative_adds=0,cumulative_deletesById=0,cumulative_deletesByQuery=0,cumulative_errors=0}
[junit4:junit4]   2> 635 T396 oasc.SolrCore.decrefSolrCoreState Closing SolrCoreState
[junit4:junit4]   2> 635 T396 oasu.DefaultSolrCoreState.closeIndexWriter SolrCoreState ref count has reached 0 - closing IndexWriter
[junit4:junit4]   2> 635 T396 oasu.DefaultSolrCoreState.closeIndexWriter closing IndexWriter with IndexWriterCloser
[junit4:junit4]   2> 636 T396 oasc.SolrCore.closeSearcher [collection1] Closing main searcher on request.
[junit4:junit4]   2> 636 T396 oasc.CachingDirectoryFactory.close Releasing directory:C:\Users\JenkinsSlave\workspace\Lucene-Solr-trunk-Windows\solr\build\solr-core\test\J0\.\org.apache.solr.handler.TestReplicationHandler$SolrInstance-1351349171465\master\collection1\data\index
[junit4:junit4]   2> 637 T396 oejsh.ContextHandler.doStop stopped o.e.j.s.ServletContextHandler{/solr,null}
[junit4:junit4]   2> 690 T396 oejs.Server.doStart jetty-8.1.2.v20120308
[junit4:junit4]   2> 695 T396 oejs.AbstractConnector.doStart Started SelectChannelConnector@0.0.0.0:62545
[junit4:junit4]   2> 696 T396 oasc.SolrResourceLoader.locateSolrHome JNDI not configured for solr (NoInitialContextEx)
[junit4:junit4]   2> 696 T396 oasc.SolrResourceLoader.locateSolrHome using system property solr.solr.home: .\org.apache.solr.handler.TestReplicationHandler$SolrInstance-1351349171465\master
[junit4:junit4]   2> 696 T396 oasc.SolrResourceLoader.<init> new SolrResourceLoader for deduced Solr Home: '.\org.apache.solr.handler.TestReplicationHandler$SolrInstance-1351349171465\master\'
[junit4:junit4]   2> 728 T396 oass.SolrDispatchFilter.init SolrDispatchFilter.init()
[junit4:junit4]   2> 729 T396 oasc.SolrResourceLoader.locateSolrHome JNDI not configured for solr (NoInitialContextEx)
[junit4:junit4]   2> 729 T396 oasc.SolrResourceLoader.locateSolrHome using system property solr.solr.home: .\org.apache.solr.handler.TestReplicationHandler$SolrInstance-1351349171465\master
[junit4:junit4]   2> 730 T396 oasc.CoreContainer$Initializer.initialize looking for solr.xml: C:\Users\JenkinsSlave\workspace\Lucene-Solr-trunk-Windows\solr\build\solr-core\test\J0\.\org.apache.solr.handler.TestReplicationHandler$SolrInstance-1351349171465\master\solr.xml
[junit4:junit4]   2> 730 T396 oasc.CoreContainer.<init> New CoreContainer 32941292
[junit4:junit4]   2> 731 T396 oasc.CoreContainer$Initializer.initialize no solr.xml file found - using default
[junit4:junit4]   2> 732 T396 oasc.CoreContainer.load Loading CoreContainer using Solr Home: '.\org.apache.solr.handler.TestReplicationHandler$SolrInstance-1351349171465\master\'
[junit4:junit4]   2> 732 T396 oasc.SolrResourceLoader.<init> new SolrResourceLoader for directory: '.\org.apache.solr.handler.TestReplicationHandler$SolrInstance-1351349171465\master\'
[junit4:junit4]   2> 764 T396 oasc.CoreContainer.load Registering Log Listener
[junit4:junit4]   2> 781 T396 oasc.CoreContainer.create Creating SolrCore 'collection1' using instanceDir: .\org.apache.solr.handler.TestReplicationHandler$SolrInstance-1351349171465\master\collection1
[junit4:junit4]   2> 782 T396 oasc.SolrResourceLoader.<init> new SolrResourceLoader for directory: '.\org.apache.solr.handler.TestReplicationHandler$SolrInstance-1351349171465\master\collection1\'
[junit4:junit4]   2> 814 T396 oasc.SolrConfig.<init> Using Lucene MatchVersion: LUCENE_50
[junit4:junit4]   2> 855 T396 oasc.SolrConfig.<init> Loaded SolrConfig: solrconfig.xml
[junit4:junit4]   2> 855 T396 oass.IndexSchema.readSchema Reading Solr Schema
[junit4:junit4]   2> 862 T396 oass.IndexSchema.readSchema Schema name=test
[junit4:junit4]   2> 883 T396 oass.IndexSchema.readSchema unique key field: id
[junit4:junit4]   2> 886 T396 oasc.SolrCore.<init> [collection1] Opening new SolrCore at .\org.apache.solr.handler.TestReplicationHandler$SolrInstance-1351349171465\master\collection1\, dataDir=.\org.apache.solr.handler.TestReplicationHandler$SolrInstance-1351349171465\master\collection1\data\
[junit4:junit4]   2> 886 T396 oasc.SolrCore.<init> JMX monitoring not detected for core: collection1
[junit4:junit4]   2> 887 T396 oasc.SolrCore.initDirectoryFactory org.apache.solr.core.MockDirectoryFactory
[junit4:junit4]   2> 887 T396 oasc.CachingDirectoryFactory.injectLockFactory WARNING No lockType configured for MockDirWrapper(org.apache.lucene.store.RAMDirectory@3770d2 lockFactory=org.apache.lucene.store.SingleInstanceLockFactory@1d01943) assuming 'simple'
[junit4:junit4]   2> 888 T396 oasc.CachingDirectoryFactory.get return new directory for C:\Users\JenkinsSlave\workspace\Lucene-Solr-trunk-Windows\solr\build\solr-core\test\J0\.\org.apache.solr.handler.TestReplicationHandler$SolrInstance-1351349171465\master\collection1\data forceNew:false
[junit4:junit4]   2> 888 T396 oasc.CachingDirectoryFactory.close Releasing directory:C:\Users\JenkinsSlave\workspace\Lucene-Solr-trunk-Windows\solr\build\solr-core\test\J0\.\org.apache.solr.handler.TestReplicationHandler$SolrInstance-1351349171465\master\collection1\data
[junit4:junit4]   2> 889 T396 oasc.SolrCore.getNewIndexDir New index directory detected: old=null new=.\org.apache.solr.handler.TestReplicationHandler$SolrInstance-1351349171465\master\collection1\data\index/
[junit4:junit4]   2> 891 T396 oasc.SolrCore.initIndex WARNING [collection1] Solr index directory '.\org.apache.solr.handler.TestReplicationHandler$SolrInstance-1351349171465\master\collection1\data\index' doesn't exist. Creating new index...
[junit4:junit4]   2> 891 T396 oasc.CachingDirectoryFactory.get return new directory for C:\Users\JenkinsSlave\workspace\Lucene-Solr-trunk-Windows\solr\build\solr-core\test\J0\.\org.apache.solr.handler.TestReplicationHandler$SolrInstance-1351349171465\master\collection1\data\index forceNew:false
[junit4:junit4]   2> 893 T396 oasc.SolrDeletionPolicy.onCommit SolrDeletionPolicy.onCommit: commits:num=1
[junit4:junit4]   2> 		commit{dir=MockDirWrapper(NRTCachingDirectory(org.apache.lucene.store.RAMDirectory@3d148b lockFactory=org.apache.lucene.store.SingleInstanceLockFactory@1120064; maxCacheMB=0.81640625 maxMergeSizeMB=0.1806640625)),segFN=segments_1,generation=1,filenames=[segments_1]
[junit4:junit4]   2> 893 T396 oasc.SolrDeletionPolicy.updateCommits newest commit = 1[segments_1]
[junit4:junit4]   2> 893 T396 oasc.CachingDirectoryFactory.close Releasing directory:C:\Users\JenkinsSlave\workspace\Lucene-Solr-trunk-Windows\solr\build\solr-core\test\J0\.\org.apache.solr.handler.TestReplicationHandler$SolrInstance-1351349171465\master\collection1\data\index
[junit4:junit4]   2> 894 T396 oasc.RequestHandlers.initHandlersFromConfig created standard: solr.StandardRequestHandler
[junit4:junit4]   2> 894 T396 oasc.RequestHandlers.initHandlersFromConfig created /replication: solr.ReplicationHandler
[junit4:junit4]   2> 895 T396 oasc.RequestHandlers.initHandlersFromConfig created defaults: solr.StandardRequestHandler
[junit4:junit4]   2> 895 T396 oasc.RequestHandlers.initHandlersFromConfig adding lazy requestHandler: solr.StandardRequestHandler
[junit4:junit4]   2> 895 T396 oasc.RequestHandlers.initHandlersFromConfig created lazy: solr.StandardRequestHandler
[junit4:junit4]   2> 896 T396 oasc.RequestHandlers.initHandlersFromConfig created /update: solr.UpdateRequestHandler
[junit4:junit4]   2> 903 T396 oashl.XMLLoader.init xsltCacheLifetimeSeconds=60
[junit4:junit4]   2> 907 T396 oasc.CachingDirectoryFactory.close Releasing directory:C:\Users\JenkinsSlave\workspace\Lucene-Solr-trunk-Windows\solr\build\solr-core\test\J0\.\org.apache.solr.handler.TestReplicationHandler$SolrInstance-1351349171465\master\collection1\data
[junit4:junit4]   2> 907 T396 oass.SolrIndexSearcher.<init> Opening Searcher@3c6515 main
[junit4:junit4]   2> 908 T396 oasu.CommitTracker.<init> Hard AutoCommit: disabled
[junit4:junit4]   2> 908 T396 oasu.CommitTracker.<init> Soft AutoCommit: disabled
[junit4:junit4]   2> 909 T396 oashc.HttpShardHandlerFactory.getParameter Setting socketTimeout to: 0
[junit4:junit4]   2> 909 T396 oashc.HttpShardHandlerFactory.getParameter Setting urlScheme to: http://
[junit4:junit4]   2> 909 T396 oashc.HttpShardHandlerFactory.getParameter Setting connTimeout to: 0
[junit4:junit4]   2> 910 T396 oashc.HttpShardHandlerFactory.getParameter Setting maxConnectionsPerHost to: 20
[junit4:junit4]   2> 910 T396 oashc.HttpShardHandlerFactory.getParameter Setting corePoolSize to: 0
[junit4:junit4]   2> 911 T396 oashc.HttpShardHandlerFactory.getParameter Setting maximumPoolSize to: 2147483647
[junit4:junit4]   2> 911 T396 oashc.HttpShardHandlerFactory.getParameter Setting maxThreadIdleTime to: 5
[junit4:junit4]   2> 911 T396 oashc.HttpShardHandlerFactory.getParameter Setting sizeOfQueue to: -1
[junit4:junit4]   2> 912 T396 oashc.HttpShardHandlerFactory.getParameter Setting fairnessPolicy to: false
[junit4:junit4]   2> 912 T396 oascsi.HttpClientUtil.createClient Creating new http client, config:maxConnectionsPerHost=20&maxConnections=10000&socketTimeout=0&connTimeout=0&retry=false
[junit4:junit4]   2> 920 T396 oash.ReplicationHandler.inform Replication enabled for following config files: schema.xml
[junit4:junit4]   2> 921 T396 oash.ReplicationHandler.inform Commits will be reserved for  10000
[junit4:junit4]   2> 922 T427 oasc.SolrCore.registerSearcher [collection1] Registered new searcher Searcher@3c6515 main{StandardDirectoryReader(segments_1:1)}
[junit4:junit4]   2> 922 T396 oasc.CoreContainer.register registering core: collection1
[junit4:junit4]   2> 922 T396 oass.SolrDispatchFilter.init user.dir=C:\Users\JenkinsSlave\workspace\Lucene-Solr-trunk-Windows\solr\build\solr-core\test\J0
[junit4:junit4]   2> 923 T396 oass.SolrDispatchFilter.init SolrDispatchFilter.init() done
[junit4:junit4]   2> 923 T396 oascsi.HttpClientUtil.createClient Creating new http client, config:maxConnections=128&maxConnectionsPerHost=32&followRedirects=false
[junit4:junit4]   2> ASYNC  NEW_CORE C51 name=collection1 org.apache.solr.core.SolrCore@1a28f15
[junit4:junit4]   2> 936 T422 C51 oasu.DirectUpdateHandler2.deleteAll [collection1] REMOVING ALL DOCUMENTS FROM INDEX
[junit4:junit4]   2> 937 T422 C51 oasc.CachingDirectoryFactory.close Releasing directory:C:\Users\JenkinsSlave\workspace\Lucene-Solr-trunk-Windows\solr\build\solr-core\test\J0\.\org.apache.solr.handler.TestReplicationHandler$SolrInstance-1351349171465\master\collection1\data
[junit4:junit4]   2> 938 T422 C51 oasc.SolrDeletionPolicy.onInit SolrDeletionPolicy.onInit: commits:num=1
[junit4:junit4]   2> 		commit{dir=MockDirWrapper(NRTCachingDirectory(org.apache.lucene.store.RAMDirectory@3d148b lockFactory=org.apache.lucene.store.SingleInstanceLockFactory@1120064; maxCacheMB=0.81640625 maxMergeSizeMB=0.1806640625)),segFN=segments_1,generation=1,filenames=[segments_1]
[junit4:junit4]   2> 940 T422 C51 oasc.SolrDeletionPolicy.updateCommits newest commit = 1[segments_1]
[junit4:junit4]   2> 940 T422 C51 UPDATE [collection1] webapp=/solr path=/update params={wt=javabin&version=2} {deleteByQuery=*:*} 0 4
[junit4:junit4]   2> 944 T421 C51 UPDATE [collection1] webapp=/solr path=/update params={wt=javabin&version=2} {add=[0]} 0 1
[junit4:junit4]   2> 947 T423 C51 UPDATE [collection1] webapp=/solr path=/update params={wt=javabin&version=2} {add=[1]} 0 0
[junit4:junit4]   2> 950 T424 C51 UPDATE [collection1] webapp=/solr path=/update params={wt=javabin&version=2} {add=[2]} 0 0
[junit4:junit4]   2> 953 T425 C51 UPDATE [collection1] webapp=/solr path=/update params={wt=javabin&version=2} {add=[3]} 0 0
[junit4:junit4]   2> 956 T426 C51 UPDATE [collection1] webapp=/solr path=/update params={wt=javabin&version=2} {add=[4]} 0 0
[junit4:junit4]   2> 959 T422 C51 UPDATE [collection1] webapp=/solr path=/update params={wt=javabin&version=2} {add=[5]} 0 0
[junit4:junit4]   2> 962 T421 C51 UPDATE [collection1] webapp=/solr path=/update params={wt=javabin&version=2} {add=[6]} 0 0
[junit4:junit4]   2> 965 T423 C51 UPDATE [collection1] webapp=/solr path=/update params={wt=javabin&version=2} {add=[7]} 0 0
[junit4:junit4]   2> 968 T424 C51 UPDATE [collection1] webapp=/solr path=/update params={wt=javabin&version=2} {add=[8]} 0 0
[junit4:junit4]   2> 971 T425 C51 UPDATE [collection1] webapp=/solr path=/update params={wt=javabin&version=2} {add=[9]} 0 0
[junit4:junit4]   2> 974 T426 C51 oasu.DirectUpdateHandler2.commit start commit{flags=0,_version_=0,optimize=false,openSearcher=true,waitSearcher=true,expungeDeletes=false,softCommit=false}
[junit4:junit4]   2> 977 T426 C51 oasc.SolrDeletionPolicy.onCommit SolrDeletionPolicy.onCommit: commits:num=2
[junit4:junit4]   2> 		commit{dir=MockDirWrapper(NRTCachingDirectory(org.apache.lucene.store.RAMDirectory@3d148b lockFactory=org.apache.lucene.store.SingleInstanceLockFactory@1120064; maxCacheMB=0.81640625 maxMergeSizeMB=0.1806640625)),segFN=segments_1,generation=1,filenames=[segments_1]
[junit4:junit4]   2> 		commit{dir=MockDirWrapper(NRTCachingDirectory(org.apache.lucene.store.RAMDirectory@3d148b lockFactory=org.apache.lucene.store.SingleInstanceLockFactory@1120064; maxCacheMB=0.81640625 maxMergeSizeMB=0.1806640625)),segFN=segments_2,generation=2,filenames=[_0.fnm, _0.tim, _0_nrm.cfe, segments_2, _0.fdx, _0_nrm.cfs, _0.si, _0.doc, _0.tip, _0.fdt]
[junit4:junit4]   2> 977 T426 C51 oasc.SolrDeletionPolicy.updateCommits newest commit = 2[_0.fnm, _0.tim, _0_nrm.cfe, segments_2, _0.fdx, _0_nrm.cfs, _0.si, _0.doc, _0.tip, _0.fdt]
[junit4:junit4]   2> 978 T426 C51 oasc.CachingDirectoryFactory.close Releasing directory:C:\Users\JenkinsSlave\workspace\Lucene-Solr-trunk-Windows\solr\build\solr-core\test\J0\.\org.apache.solr.handler.TestReplicationHandler$SolrInstance-1351349171465\master\collection1\data
[junit4:junit4]   2> 980 T426 C51 oass.SolrIndexSearcher.<init> Opening Searcher@192d3b1 main
[junit4:junit4]   2> 980 T426 C51 oasu.DirectUpdateHandler2.commit end_commit_flush
[junit4:junit4]   2> 981 T427 oasc.SolrCore.registerSearcher [collection1] Registered new searcher Searcher@192d3b1 main{StandardDirectoryReader(segments_2:4 _0(5.0):C10)}
[junit4:junit4]   2> 982 T427 oasc.CachingDirectoryFactory.close Releasing directory:C:\Users\JenkinsSlave\workspace\Lucene-Solr-trunk-Windows\solr\build\solr-core\test\J0\.\org.apache.solr.handler.TestReplicationHandler$SolrInstance-1351349171465\master\collection1\data\index
[junit4:junit4]   2> 982 T426 C51 UPDATE [collection1] webapp=/solr path=/update params={waitSearcher=true&wt=javabin&commit=true&softCommit=false&version=2} {commit=} 0 8
[junit4:junit4]   2> 986 T422 C51 REQ [collection1] webapp=/solr path=/select params={wt=javabin&q=*:*&version=2} hits=10 status=0 QTime=1 
[junit4:junit4]   2> 1093 T396 oejs.Server.doStart jetty-8.1.2.v20120308
[junit4:junit4]   2> 1097 T396 oejs.AbstractConnector.doStart Started SelectChannelConnector@0.0.0.0:62549
[junit4:junit4]   2> 1098 T396 oasc.SolrResourceLoader.locateSolrHome JNDI not configured for solr (NoInitialContextEx)
[junit4:junit4]   2> 1099 T396 oasc.SolrResourceLoader.locateSolrHome using system property solr.solr.home: .\org.apache.solr.handler.TestReplicationHandler$SolrInstance-1351349171740\slave
[junit4:junit4]   2> 1099 T396 oasc.SolrResourceLoader.<init> new SolrResourceLoader for deduced Solr Home: '.\org.apache.solr.handler.TestReplicationHandler$SolrInstance-1351349171740\slave\'
[junit4:junit4]   2> 1114 T396 oass.SolrDispatchFilter.init SolrDispatchFilter.init()
[junit4:junit4]   2> 1115 T396 oasc.SolrResourceLoader.locateSolrHome JNDI not configured for solr (NoInitialContextEx)
[junit4:junit4]   2> 1115 T396 oasc.SolrResourceLoader.locateSolrHome using system property solr.solr.home: .\org.apache.solr.handler.TestReplicationHandler$SolrInstance-1351349171740\slave
[junit4:junit4]   2> 1116 T396 oasc.CoreContainer$Initializer.initialize looking for solr.xml: C:\Users\JenkinsSlave\workspace\Lucene-Solr-trunk-Windows\solr\build\solr-core\test\J0\.\org.apache.solr.handler.TestReplicationHandler$SolrInstance-1351349171740\slave\solr.xml
[junit4:junit4]   2> 1116 T396 oasc.CoreContainer.<init> New CoreContainer 23094532
[junit4:junit4]   2> 1116 T396 oasc.CoreContainer$Initializer.initialize no solr.xml file found - using default
[junit4:junit4]   2> 1117 T396 oasc.CoreContainer.load Loading CoreContainer using Solr Home: '.\org.apache.solr.handler.TestReplicationHandler$SolrInstance-1351349171740\slave\'
[junit4:junit4]   2> 1117 T396 oasc.SolrResourceLoader.<init> new SolrResourceLoader for directory: '.\org.apache.solr.handler.TestReplicationHandler$SolrInstance-1351349171740\slave\'
[junit4:junit4]   2> 1136 T396 oasc.CoreContainer.load Registering Log Listener
[junit4:junit4]   2> 1157 T396 oasc.CoreContainer.create Creating SolrCore 'collection1' using instanceDir: .\org.apache.solr.handler.TestReplicationHandler$SolrInstance-1351349171740\slave\collection1
[junit4:junit4]   2> 1157 T396 oasc.SolrResourceLoader.<init> new SolrResourceLoader for directory: '.\org.apache.solr.handler.TestReplicationHandler$SolrInstance-1351349171740\slave\collection1\'
[junit4:junit4]   2> 1200 T396 oasc.SolrConfig.<init> Using Lucene MatchVersion: LUCENE_50
[junit4:junit4]   2> 1239 T396 oasc.SolrConfig.<init> Loaded SolrConfig: solrconfig.xml
[junit4:junit4]   2> 1240 T396 oass.IndexSchema.readSchema Reading Solr Schema
[junit4:junit4]   2> 1242 T396 oass.IndexSchema.readSchema Schema name=test
[junit4:junit4]   2> 1265 T396 oass.IndexSchema.readSchema unique key field: id
[junit4:junit4]   2> 1266 T396 oasc.SolrCore.<init> [collection1] Opening new SolrCore at .\org.apache.solr.handler.TestReplicationHandler$SolrInstance-1351349171740\slave\collection1\, dataDir=.\org.apache.solr.handler.TestReplicationHandler$SolrInstance-1351349171740\slave\collection1\data\
[junit4:junit4]   2> 1267 T396 oasc.SolrCore.<init> JMX monitoring not detected for core: collection1
[junit4:junit4]   2> 1267 T396 oasc.SolrCore.initDirectoryFactory org.apache.solr.core.MockDirectoryFactory
[junit4:junit4]   2> 1267 T396 oasc.CachingDirectoryFactory.injectLockFactory WARNING No lockType configured for MockDirWrapper(org.apache.lucene.store.RAMDirectory@1d5c64 lockFactory=org.apache.lucene.store.SingleInstanceLockFactory@19ce9eb) assuming 'simple'
[junit4:junit4]   2> 1268 T396 oasc.CachingDirectoryFactory.get return new directory for C:\Users\JenkinsSlave\workspace\Lucene-Solr-trunk-Windows\solr\build\solr-core\test\J0\.\org.apache.solr.handler.TestReplicationHandler$SolrInstance-1351349171740\slave\collection1\data forceNew:false
[junit4:junit4]   2> 1268 T396 oasc.CachingDirectoryFactory.close Releasing directory:C:\Users\JenkinsSlave\workspace\Lucene-Solr-trunk-Windows\solr\build\solr-core\test\J0\.\org.apache.solr.handler.TestReplicationHandler$SolrInstance-1351349171740\slave\collection1\data
[junit4:junit4]   2> 1269 T396 oasc.SolrCore.getNewIndexDir New index directory detected: old=null new=.\org.apache.solr.handler.TestReplicationHandler$SolrInstance-1351349171740\slave\collection1\data\index/
[junit4:junit4]   2> 1269 T396 oasc.SolrCore.initIndex WARNING [collection1] Solr index directory '.\org.apache.solr.handler.TestReplicationHandler$SolrInstance-1351349171740\slave\collection1\data\index' doesn't exist. Creating new index...
[junit4:junit4]   2> 1269 T396 oasc.CachingDirectoryFactory.get return new directory for C:\Users\JenkinsSlave\workspace\Lucene-Solr-trunk-Windows\solr\build\solr-core\test\J0\.\org.apache.solr.handler.TestReplicationHandler$SolrInstance-1351349171740\slave\collection1\data\index forceNew:false
[junit4:junit4]   2> 1270 T396 oasc.SolrDeletionPolicy.onCommit SolrDeletionPolicy.onCommit: commits:num=1
[junit4:junit4]   2> 		commit{dir=MockDirWrapper(org.apache.lucene.store.RAMDirectory@1b187c6 lockFactory=org.apache.lucene.store.SingleInstanceLockFactory@1928345),segFN=segments_1,generation=1,filenames=[segments_1]
[junit4:junit4]   2> 1271 T396 oasc.SolrDeletionPolicy.updateCommits newest commit = 1[segments_1]
[junit4:junit4]   2> 1271 T396 oasc.CachingDirectoryFactory.close Releasing directory:C:\Users\JenkinsSlave\workspace\Lucene-Solr-trunk-Windows\solr\build\solr-core\test\J0\.\org.apache.solr.handler.TestReplicationHandler$SolrInstance-1351349171740\slave\collection1\data\index
[junit4:junit4]   2> 1272 T396 oasc.RequestHandlers.initHandlersFromConfig created standard: solr.StandardRequestHandler
[junit4:junit4]   2> 1273 T396 oasc.RequestHandlers.initHandlersFromConfig created defaults: solr.StandardRequestHandler
[junit4:junit4]   2> 1273 T396 oasc.RequestHandlers.initHandlersFromConfig adding lazy requestHandler: solr.StandardRequestHandler
[junit4:junit4]   2> 1273 T396 oasc.RequestHandlers.initHandlersFromConfig created lazy: solr.StandardRequestHandler
[junit4:junit4]   2> 1274 T396 oasc.RequestHandlers.initHandlersFromConfig created /update: solr.UpdateRequestHandler
[junit4:junit4]   2> 1274 T396 oasc.RequestHandlers.initHandlersFromConfig created /replication: solr.ReplicationHandler
[junit4:junit4]   2> 1276 T396 oashl.XMLLoader.init xsltCacheLifetimeSeconds=60
[junit4:junit4]   2> 1279 T396 oasc.CachingDirectoryFactory.close Releasing directory:C:\Users\JenkinsSlave\workspace\Lucene-Solr-trunk-Windows\solr\build\solr-core\test\J0\.\org.apache.solr.handler.TestReplicationHandler$SolrInstance-1351349171740\slave\collection1\data
[junit4:junit4]   2> 1280 T396 oass.SolrIndexSearcher.<init> Opening Searcher@749454 main
[junit4:junit4]   2> 1280 T396 oasu.CommitTracker.<init> Hard AutoCommit: disabled
[junit4:junit4]   2> 1281 T396 oasu.CommitTracker.<init> Soft AutoCommit: disabled
[junit4:junit4]   2> 1282 T396 oashc.HttpShardHandlerFactory.getParameter Setting socketTimeout to: 0
[junit4:junit4]   2> 1282 T396 oashc.HttpShardHandlerFactory.getParameter Setting urlScheme to: http://
[junit4:junit4]   2> 1282 T396 oashc.HttpShardHandlerFactory.getParameter Setting connTimeout to: 0
[junit4:junit4]   2> 1282 T396 oashc.HttpShardHandlerFactory.getParameter Setting maxConnectionsPerHost to: 20
[junit4:junit4]   2> 1283 T396 oashc.HttpShardHandlerFactory.getParameter Setting corePoolSize to: 0
[junit4:junit4]   2> 1283 T396 oashc.HttpShardHandlerFactory.getParameter Setting maximumPoolSize to: 2147483647
[junit4:junit4]   2> 1283 T396 oashc.HttpShardHandlerFactory.getParameter Setting maxThreadIdleTime to: 5
[junit4:junit4]   2> 1284 T396 oashc.HttpShardHandlerFactory.getParameter Setting sizeOfQueue to: -1
[junit4:junit4]   2> 1284 T396 oashc.HttpShardHandlerFactory.getParameter Setting fairnessPolicy to: false
[junit4:junit4]   2> 1284 T396 oascsi.HttpClientUtil.createClient Creating new http client, config:maxConnectionsPerHost=20&maxConnections=10000&socketTimeout=0&connTimeout=0&retry=false
[junit4:junit4]   2> 1290 T396 oash.SnapPuller.startExecutorService Poll Scheduled at an interval of 1000ms
[junit4:junit4]   2> 1290 T396 oasc.CoreContainer.register registering core: collection1
[junit4:junit4]   2> 1292 T396 oass.SolrDispatchFilter.init user.dir=C:\Users\JenkinsSlave\workspace\Lucene-Solr-trunk-Windows\solr\build\solr-core\test\J0
[junit4:junit4]   2> 1292 T396 oass.SolrDispatchFilter.init SolrDispatchFilter.init() done
[junit4:junit4]   2> 1292 T396 oascsi.HttpClientUtil.createClient Creating new http client, config:maxConnections=128&maxConnectionsPerHost=32&followRedirects=false
[junit4:junit4]   2> 1299 T437 oasc.SolrCore.registerSearcher [collection1] Registered new searcher Searcher@749454 main{StandardDirectoryReader(segments_1:1)}
[junit4:junit4]   2> ASYNC  NEW_CORE C52 name=collection1 org.apache.solr.core.SolrCore@173019f
[junit4:junit4]   2> 1305 T431 C52 REQ [collection1] webapp=/solr path=/select params={wt=javabin&q=*:*&version=2} hits=0 status=0 QTime=1 
[junit4:junit4]   2> 1415 T432 C52 REQ [collection1] webapp=/solr path=/select params={wt=javabin&q=*:*&version=2} hits=0 status=0 QTime=0 
[junit4:junit4]   2> 1524 T433 C52 REQ [collection1] webapp=/solr path=/select params={wt=javabin&q=*:*&version=2} hits=0 status=0 QTime=1 
[junit4:junit4]   2> 1552 T423 C51 REQ [collection1] webapp=/solr path=/replication params={command=indexversion&wt=javabin&qt=/replication&version=2} status=0 QTime=0 
[junit4:junit4]   2> 1554 T438 oash.SnapPuller.fetchLatestIndex Master's generation: 2
[junit4:junit4]   2> 1554 T438 oash.SnapPuller.fetchLatestIndex Slave's generation: 1
[junit4:junit4]   2> 1554 T438 oash.SnapPuller.fetchLatestIndex Starting replication process
[junit4:junit4]   2> 1556 T424 C51 oasc.CachingDirectoryFactory.close Releasing directory:C:\Users\JenkinsSlave\workspace\Lucene-Solr-trunk-Windows\solr\build\solr-core\test\J0\.\org.apache.solr.handler.TestReplicationHandler$SolrInstance-1351349171465\master\collection1\data
[junit4:junit4]   2> 1556 T424 C51 oasc.CachingDirectoryFactory.close Releasing directory:C:\Users\JenkinsSlave\workspace\Lucene-Solr-trunk-Windows\solr\build\solr-core\test\J0\.\org.apache.solr.handler.TestReplicationHandler$SolrInstance-1351349171465\master\collection1\data\index
[junit4:junit4]   2> 1562 T424 C51 REQ [collection1] webapp=/solr path=/replication params={command=filelist&generation=2&wt=javabin&qt=/replication&version=2} status=0 QTime=6 
[junit4:junit4]   2> 1563 T438 oash.SnapPuller.fetchLatestIndex Number of files in latest index in master: 10
[junit4:junit4]   2> 1563 T438 oasc.CachingDirectoryFactory.injectLockFactory WARNING No lockType configured for MockDirWrapper(org.apache.lucene.store.RAMDirectory@1ff9c98 lockFactory=org.apache.lucene.store.SingleInstanceLockFactory@81f68c) assuming 'simple'
[junit4:junit4]   2> 1565 T438 oasc.CachingDirectoryFactory.get return new directory for C:\Users\JenkinsSlave\workspace\Lucene-Solr-trunk-Windows\solr\build\solr-core\test\J0\.\org.apache.solr.handler.TestReplicationHandler$SolrInstance-1351349171740\slave\collection1\data\index.20121027194613024 forceNew:false
[junit4:junit4]   2> 1565 T438 oasc.CachingDirectoryFactory.close Releasing directory:C:\Users\JenkinsSlave\workspace\Lucene-Solr-trunk-Windows\solr\build\solr-core\test\J0\.\org.apache.solr.handler.TestReplicationHandler$SolrInstance-1351349171740\slave\collection1\data
[junit4:junit4]   2> 1565 T438 oash.SnapPuller.fetchLatestIndex Starting download to MockDirWrapper(org.apache.lucene.store.RAMDirectory@1ff9c98 lockFactory=org.apache.lucene.store.SimpleFSLockFactory@4b3dbe) fullCopy=false
[junit4:junit4]   2> 1575 T425 C51 REQ [collection1] webapp=/solr path=/replication params={file=_0.fnm&command=filecontent&checksum=true&compression=true&generation=2&qt=/replication&wt=filestream} status=0 QTime=3 
[junit4:junit4]   2> 1582 T426 C51 REQ [collection1] webapp=/solr path=/replication params={file=_0_nrm.cfe&command=filecontent&checksum=true&compression=true&generation=2&qt=/replication&wt=filestream} status=0 QTime=0 
[junit4:junit4]   2> 1591 T422 C51 REQ [collection1] webapp=/solr path=/replication params={file=_0.tim&command=filecontent&checksum=true&compression=true&generation=2&qt=/replication&wt=filestream} status=0 QTime=0 
[junit4:junit4]   2> 1594 T421 C51 REQ [collection1] webapp=/solr path=/replication params={file=segments_2&command=filecontent&checksum=true&compression=true&generation=2&qt=/replication&wt=filestream} status=0 QTime=0 
[junit4:junit4]   2> 1598 T423 C51 REQ [collection1] webapp=/solr path=/replication params={file=_0.fdx&command=filecontent&checksum=true&compression=true&generation=2&qt=/replication&wt=filestream} status=0 QTime=0 
[junit4:junit4]   2> 1602 T424 C51 REQ [collection1] webapp=/solr path=/replication params={file=_0_nrm.cfs&command=filecontent&checksum=true&compression=true&generation=2&qt=/replication&wt=filestream} status=0 QTime=0 
[junit4:junit4]   2> 1605 T425 C51 REQ [collection1] webapp=/solr path=/replication params={file=_0.si&command=filecontent&checksum=true&compression=true&generation=2&qt=/replication&wt=filestream} status=0 QTime=0 
[junit4:junit4]   2> 1608 T426 C51 REQ [collection1] webapp=/solr path=/replication params={file=_0.tip&command=filecontent&checksum=true&compression=true&generation=2&qt=/replication&wt=filestream} status=0 QTime=0 
[junit4:junit4]   2> 1612 T422 C51 REQ [collection1] webapp=/solr path=/replication params={file=_0.doc&command=filecontent&checksum=true&compression=true&generation=2&qt=/replication&wt=filestream} status=0 QTime=0 
[junit4:junit4]   2> 1615 T421 C51 REQ [collection1] webapp=/solr path=/replication params={file=_0.fdt&command=filecontent&checksum=true&compression=true&generation=2&qt=/replication&wt=filestream} status=0 QTime=0 
[junit4:junit4]   2> 1616 T438 oasc.CachingDirectoryFactory.close Releasing directory:C:\Users\JenkinsSlave\workspace\Lucene-Solr-trunk-Windows\solr\build\solr-core\test\J0\.\org.apache.solr.handler.TestReplicationHandler$SolrInstance-1351349171740\slave\collection1\data\index
[junit4:junit4]   2> 1616 T438 oash.SnapPuller.fetchLatestIndex Total time taken for download : 0 secs
[junit4:junit4]   2> 1622 T438 oasu.DefaultSolrCoreState.newIndexWriter Creating new IndexWriter...
[junit4:junit4]   2> 1622 T438 oasu.DefaultSolrCoreState.newIndexWriter Waiting until IndexWriter is unused... core=collection1
[junit4:junit4]   2> 1622 T438 oasc.CachingDirectoryFactory.close Releasing directory:C:\Users\JenkinsSlave\workspace\Lucene-Solr-trunk-Windows\solr\build\solr-core\test\J0\.\org.apache.solr.handler.TestReplicationHandler$SolrInstance-1351349171740\slave\collection1\data
[junit4:junit4]   2> 1623 T438 oasc.SolrDeletionPolicy.onInit SolrDeletionPolicy.onInit: commits:num=2
[junit4:junit4]   2> 		commit{dir=MockDirWrapper(org.apache.lucene.store.RAMDirectory@1b187c6 lockFactory=org.apache.lucene.store.SingleInstanceLockFactory@1928345),segFN=segments_1,generation=1,filenames=[segments_1]
[junit4:junit4]   2> 		commit{dir=MockDirWrapper(org.apache.lucene.store.RAMDirectory@1b187c6 lockFactory=org.apache.lucene.store.SingleInstanceLockFactory@1928345),segFN=segments_2,generation=2,filenames=[_0.fnm, _0_nrm.cfe, _0.tim, segments_2, _0.fdx, _0_nrm.cfs, _0.si, _0.tip, _0.doc, _0.fdt]
[junit4:junit4]   2> 1624 T438 oasc.SolrDeletionPolicy.updateCommits newest commit = 2[_0.fnm, _0_nrm.cfe, _0.tim, segments_2, _0.fdx, _0_nrm.cfs, _0.si, _0.tip, _0.doc, _0.fdt]
[junit4:junit4]   2> 1624 T438 oasu.DefaultSolrCoreState.newIndexWriter New IndexWriter is ready to be used.
[junit4:junit4]   2> 1625 T438 oasc.CachingDirectoryFactory.close Releasing directory:C:\Users\JenkinsSlave\workspace\Lucene-Solr-trunk-Windows\solr\build\solr-core\test\J0\.\org.apache.solr.handler.TestReplicationHandler$SolrInstance-1351349171740\slave\collection1\data
[junit4:junit4]   2> 1625 T438 oass.SolrIndexSearcher.<init> Opening Searcher@752dd0 main
[junit4:junit4]   2> 1626 T437 oasc.SolrCore.registerSearcher [collection1] Registered new searcher Searcher@752dd0 main{StandardDirectoryReader(segments_2:4:nrt _0(5.0):C10)}
[junit4:junit4]   2> 1626 T437 oasc.CachingDirectoryFactory.close Releasing directory:C:\Users\JenkinsSlave\workspace\Lucene-Solr-trunk-Windows\solr\build\solr-core\test\J0\.\org.apache.solr.handler.TestReplicationHandler$SolrInstance-1351349171740\slave\collection1\data\index
[junit4:junit4]   2> 1626 T438 oasu.DirectUpdateHandler2.commit start commit{flags=0,_version_=0,optimize=false,openSearcher=false,waitSearcher=false,expungeDeletes=false,softCommit=false}
[junit4:junit4]   2> 1627 T438 oasc.CachingDirectoryFactory.close Releasing directory:C:\Users\JenkinsSlave\workspace\Lucene-Solr-trunk-Windows\solr\build\solr-core\test\J0\.\org.apache.solr.handler.TestReplicationHandler$SolrInstance-1351349171740\slave\collection1\data
[junit4:junit4]   2> 1627 T438 oasu.DirectUpdateHandler2.commit end_commit_flush
[junit4:junit4]   2> 1627 T438 oash.SnapPuller.fetchLatestIndex removing temporary index download directory files MockDirWrapper(org.apache.lucene.store.RAMDirectory@1ff9c98 lockFactory=org.apache.lucene.store.SimpleFSLockFactory@4b3dbe)
[junit4:junit4]   2> 1627 T438 oasc.CachingDirectoryFactory.close Releasing directory:C:\Users\JenkinsSlave\workspace\Lucene-Solr-trunk-Windows\solr\build\solr-core\test\J0\.\org.apache.solr.handler.TestReplicationHandler$SolrInstance-1351349171740\slave\collection1\data\index.20121027194613024
[junit4:junit4]   2> 1627 T438 oasc.CachingDirectoryFactory.close Releasing directory:C:\Users\JenkinsSlave\workspace\Lucene-Solr-trunk-Windows\solr\build\solr-core\test\J0\.\org.apache.solr.handler.TestReplicationHandler$SolrInstance-1351349171740\slave\collection1\data\index
[junit4:junit4]   2> 1632 T435 C52 REQ [collection1] webapp=/solr path=/select params={wt=javabin&q=*:*&version=2} hits=10 status=0 QTime=0 
[junit4:junit4]   2> 1740 T423 C51 REQ [collection1] webapp=/solr path=/replication params={command=indexversion&qt=/replication&wt=javabin&version=2} status=0 QTime=0 
[junit4:junit4]   2> 1743 T424 C51 REQ [collection1] webapp=/solr path=/replication params={command=commits&qt=/replication&wt=javabin&version=2} status=0 QTime=0 
[junit4:junit4]   2> 1754 T425 oasc.CoreContainer.reload Reloading SolrCore 'collection1' using instanceDir: C:\Users\JenkinsSlave\workspace\Lucene-Solr-trunk-Windows\solr\build\solr-core\test\J0\.\org.apache.solr.handler.TestReplicationHandler$SolrInstance-1351349171465\master\collection1
[junit4:junit4]   2> 1755 T425 oasc.SolrResourceLoader.<init> new SolrResourceLoader for directory: 'C:\Users\JenkinsSlave\workspace\Lucene-Solr-trunk-Windows\solr\build\solr-core\test\J0\.\org.apache.solr.handler.TestReplicationHandler$SolrInstance-1351349171465\master\collection1\'
[junit4:junit4]   2> 1789 T425 oasc.SolrConfig.<init> Using Lucene MatchVersion: LUCENE_50
[junit4:junit4]   2> 1840 T425 oasc.SolrConfig.<init> Loaded SolrConfig: solrconfig.xml
[junit4:junit4]   2> 1841 T425 oass.IndexSchema.readSchema Reading Solr Schema
[junit4:junit4]   2> 1844 T425 oass.IndexSchema.readSchema Schema name=test
[junit4:junit4]   2> 1858 T425 oass.IndexSchema.readSchema unique key field: id
[junit4:junit4]   2> 1859 T425 oasc.SolrCore.<init> [collection1] Opening new SolrCore at C:\Users\JenkinsSlave\workspace\Lucene-Solr-trunk-Windows\solr\build\solr-core\test\J0\.\org.apache.solr.handler.TestReplicationHandler$SolrInstance-1351349171465\master\collection1\, dataDir=.\org.apache.solr.handler.TestReplicationHandler$SolrInstance-1351349171465\master\collection1\data\
[junit4:junit4]   2> 1859 T425 oasc.SolrCore.<init> JMX monitoring not detected for core: collection1
[junit4:junit4]   2> 1859 T425 oasc.CachingDirectoryFactory.close Releasing directory:C:\Users\JenkinsSlave\workspace\Lucene-Solr-trunk-Windows\solr\build\solr-core\test\J0\.\org.apache.solr.handler.TestReplicationHandler$SolrInstance-1351349171465\master\collection1\data
[junit4:junit4]   2> 1859 T425 oasc.SolrCore.getNewIndexDir New index directory detected: old=null new=.\org.apache.solr.handler.TestReplicationHandler$SolrInstance-1351349171465\master\collection1\data\index/
[junit4:junit4]   2> 1860 T425 oasc.RequestHandlers.initHandlersFromConfig created standard: solr.StandardRequestHandler
[junit4:junit4]   2> 1861 T425 oasc.RequestHandlers.initHandlersFromConfig created /replication: solr.ReplicationHandler
[junit4:junit4]   2> 1861 T425 oasc.RequestHandlers.initHandlersFromConfig created defaults: solr.StandardRequestHandler
[junit4:junit4]   2> 1861 T425 oasc.RequestHandlers.initHandlersFromConfig adding lazy requestHandler: solr.StandardRequestHandler
[junit4:junit4]   2> 1861 T425 oasc.RequestHandlers.initHandlersFromConfig created lazy: solr.StandardRequestHandler
[junit4:junit4]   2> 1861 T425 oasc.RequestHandlers.initHandlersFromConfig created /update: solr.UpdateRequestHandler
[junit4:junit4]   2> 1863 T425 oashl.XMLLoader.init xsltCacheLifetimeSeconds=60
[junit4:junit4]   2> 1866 T425 oasc.CachingDirectoryFactory.close Releasing directory:C:\Users\JenkinsSlave\workspace\Lucene-Solr-trunk-Windows\solr\build\solr-core\test\J0\.\org.apache.solr.handler.TestReplicationHandler$SolrInstance-1351349171465\master\collection1\data
[junit4:junit4]   2> 1920 T425 oass.SolrIndexSearcher.<init> Opening Searcher@137cc50 main
[junit4:junit4]   2> 1921 T425 oasu.CommitTracker.<init> Hard AutoCommit: disabled
[junit4:junit4]   2> 1921 T425 oasu.CommitTracker.<init> Soft AutoCommit: disabled
[junit4:junit4]   2> 1921 T425 oash.ReplicationHandler.inform Replication enabled for following config files: schema.xml
[junit4:junit4]   2> 1921 T425 oash.ReplicationHandler.inform Commits will be reserved for  10000
[junit4:junit4]   2> 1923 T440 oasc.SolrCore.registerSearcher [collection1] Registered new searcher Searcher@137cc50 main{StandardDirectoryReader(segments_2:4:nrt _0(5.0):C10)}
[junit4:junit4]   2> 1924 T425 oasc.CoreContainer.register replacing core: collection1
[junit4:junit4]   2> 1924 T425 oasc.SolrCore.close [collection1]  CLOSING SolrCore org.apache.solr.core.SolrCore@1a28f15
[junit4:junit4]   2> 1924 T425 oasu.DirectUpdateHandler2.close closing DirectUpdateHandler2{commits=1,autocommits=0,soft autocommits=0,optimizes=0,rollbacks=0,expungeDeletes=0,docsPending=0,adds=0,deletesById=0,deletesByQuery=0,errors=0,cumulative_adds=10,cumulative_deletesById=0,cumulative_deletesByQuery=1,cumulative_errors=0}
[junit4:junit4]   2> 1925 T425 oasc.SolrCore.closeSearcher [collection1] Closing main searcher on request.
[junit4:junit4]   2> 1925 T425 oasc.CachingDirectoryFactory.close Releasing directory:C:\Users\JenkinsSlave\workspace\Lucene-Solr-trunk-Windows\solr\build\solr-core\test\J0\.\org.apache.solr.handler.TestReplicationHandler$SolrInstance-1351349171465\master\collection1\data\index
[junit4:junit4]   2> ASYNC  NEW_CORE C53 name=collection1 org.apache.solr.core.SolrCore@1224c45
[junit4:junit4]   2> 1933 T422 C53 REQ [collection1] webapp=/solr path=/replication params={command=indexversion&qt=/replication&wt=javabin&version=2} status=0 QTime=0 
[junit4:junit4]   2> 1936 T421 C53 REQ [collection1] webapp=/solr path=/replication params={command=commits&qt=/replication&wt=javabin&version=2} status=0 QTime=0 
[junit4:junit4]   2> 1940 T423 C53 UPDATE [collection1] webapp=/solr path=/update params={wt=javabin&version=2} {add=[110]} 0 1
[junit4:junit4]   2> 1944 T424 C53 UPDATE [collection1] webapp=/solr path=/update params={wt=javabin&version=2} {add=[120]} 0 1
[junit4:junit4]   2> 1946 T426 C53 oasu.DirectUpdateHandler2.commit start commit{flags=0,_version_=0,optimize=false,openSearcher=true,waitSearcher=true,expungeDeletes=false,softCommit=false}
[junit4:junit4]   2> 1948 T426 C53 oasc.SolrDeletionPolicy.onCommit SolrDeletionPolicy.onCommit: commits:num=2
[junit4:junit4]   2> 		commit{dir=MockDirWrapper(NRTCachingDirectory(org.apache.lucene.store.RAMDirectory@3d148b lockFactory=org.apache.lucene.store.SingleInstanceLockFactory@1120064; maxCacheMB=0.81640625 maxMergeSizeMB=0.1806640625)),segFN=segments_2,generation=2,filenames=[_0.fnm, _0.tim, _0_nrm.cfe, segments_2, _0.fdx, _0_nrm.cfs, _0.si, _0.doc, _0.tip, _0.fdt]
[junit4:junit4]   2> 		commit{dir=MockDirWrapper(NRTCachingDirectory(org.apache.lucene.store.RAMDirectory@3d148b lockFactory=org.apache.lucene.store.SingleInstanceLockFactory@1120064; maxCacheMB=0.81640625 maxMergeSizeMB=0.1806640625)),segFN=segments_3,generation=3,filenames=[_1.doc, _1_nrm.cfs, _0.fnm, _0_nrm.cfs, _1.fnm, _1_nrm.cfe, _1.fdx, _1.fdt, _1.si, _0_nrm.cfe, _0.tim, _0.fdx, _0.si, _1.tip, _0.tip, _0.doc, _1.tim, segments_3, _0.fdt]
[junit4:junit4]   2> 1949 T426 C53 oasc.SolrDeletionPolicy.updateCommits newest commit = 3[_1.doc, _1_nrm.cfs, _0.fnm, _0_nrm.cfs, _1.fnm, _1_nrm.cfe, _1.fdx, _1.fdt, _1.si, _0_nrm.cfe, _0.tim, _0.fdx, _0.si, _1.tip, _0.tip, _0.doc, _1.tim, segments_3, _0.fdt]
[junit4:junit4]   2> 1949 T426 C53 oasc.CachingDirectoryFactory.close Releasing directory:C:\Users\JenkinsSlave\workspace\Lucene-Solr-trunk-Windows\solr\build\solr-core\test\J0\.\org.apache.solr.handler.TestReplicationHandler$SolrInstance-1351349171465\master\collection1\data
[junit4:junit4]   2> 1950 T426 C53 oass.SolrIndexSearcher.<init> Opening Searcher@3be949 main
[junit4:junit4]   2> 1950 T426 C53 oasu.DirectUpdateHandler2.commit end_commit_flush
[junit4:junit4]   2> 1951 T440 oasc.SolrCore.registerSearcher [collection1] Registered new searcher Searcher@3be949 main{StandardDirectoryReader(segments_3:6:nrt _0(5.0):C10 _1(5.0):C2)}
[junit4:junit4]   2> 1951 T440 oasc.CachingDirectoryFactory.close Releasing directory:C:\Users\JenkinsSlave\workspace\Lucene-Solr-trunk-Windows\solr\build\solr-core\test\J0\.\org.apache.solr.handler.TestReplicationHandler$SolrInstance-1351349171465\master\collection1\data\index
[junit4:junit4]   2> 1951 T426 C53 UPDATE [collection1] webapp=/solr path=/update params={waitSearcher=true&wt=javabin&commit=true&softCommit=false&version=2} {commit=} 0 5
[junit4:junit4]   2> 1957 T425 C53 REQ [collection1] webapp=/solr path=/select params={wt=javabin&q=*:*&version=2} hits=12 status=0 QTime=1 
[junit4:junit4]   2> 2066 T431 C52 REQ [collection1] webapp=/solr path=/select params={wt=javabin&q=*:*&version=2} hits=10 status=0 QTime=0 
[junit4:junit4]   2> 2175 T432 C52 REQ [collection1] webapp=/solr path=/select params={wt=javabin&q=*:*&version=2} hits=10 status=0 QTime=0 
[junit4:junit4]   2> 2285 T434 C52 REQ [collection1] webapp=/solr path=/select params={wt=javabin&q=*:*&version=2} hits=10 status=0 QTime=0 
[junit4:junit4]   2> 2393 T433 C52 REQ [collection1] webapp=/solr path=/select params={wt=javabin&q=*:*&version=2} hits=10 status=0 QTime=0 
[junit4:junit4]   2> 2503 T435 C52 REQ [collection1] webapp=/solr path=/select params={wt=javabin&q=*:*&version=2} hits=10 status=0 QTime=1 
[junit4:junit4]   2> 2597 T421 C53 REQ [collection1] webapp=/solr path=/replication params={command=indexversion&wt=javabin&qt=/replication&version=2} status=0 QTime=0 
[junit4:junit4]   2> 2598 T438 oash.SnapPuller.fetchLatestIndex Master's generation: 3
[junit4:junit4]   2> 2598 T438 oash.SnapPuller.fetchLatestIndex Slave's generation: 2
[junit4:junit4]   2> 2599 T438 oash.SnapPuller.fetchLatestIndex Starting replication process
[junit4:junit4]   2> 2601 T423 C53 oasc.CachingDirectoryFactory.close Releasing directory:C:\Users\JenkinsSlave\workspace\Lucene-Solr-trunk-Windows\solr\build\solr-core\test\J0\.\org.apache.solr.handler.TestReplicationHandler$SolrInstance-1351349171465\master\collection1\data
[junit4:junit4]   2> 2602 T423 C53 oasc.CachingDirectoryFactory.close Releasing directory:C:\Users\JenkinsSlave\workspace\Lucene-Solr-trunk-Windows\solr\build\solr-core\test\J0\.\org.apache.solr.handler.TestReplicationHandler$SolrInstance-1351349171465\master\collection1\data\index
[junit4:junit4]   2> 2604 T423 C53 REQ [collection1] webapp=/solr path=/replication params={command=filelist&generation=3&wt=javabin&qt=/replication&version=2} status=0 QTime=3 
[junit4:junit4]   2> 2605 T438 oash.SnapPuller.fetchLatestIndex Number of files in latest index in master: 19
[junit4:junit4]   2> 2605 T438 oasc.CachingDirectoryFactory.injectLockFactory WARNING No lockType configured for MockDirWrapper(org.apache.lucene.store.RAMDirectory@1ad3a7a lockFactory=org.apache.lucene.store.SingleInstanceLockFactory@1da2dc8) assuming 'simple'
[junit4:junit4]   2> 2605 T438 oasc.CachingDirectoryFactory.get return new directory for C:\Users\JenkinsSlave\workspace\Lucene-Solr-trunk-Windows\solr\build\solr-core\test\J0\.\org.apache.solr.handler.TestReplicationHandler$SolrInstance-1351349171740\slave\collection1\data\index.20121027194614066 forceNew:false
[junit4:junit4]   2> 2606 T438 oasc.CachingDirectoryFactory.close Releasing directory:C:\Users\JenkinsSlave\workspace\Lucene-Solr-trunk-Windows\solr\build\solr-core\test\J0\.\org.apache.solr.handler.TestReplicationHandler$SolrInstance-1351349171740\slave\collection1\data
[junit4:junit4]   2> 2606 T438 oash.SnapPuller.fetchLatestIndex Starting download to MockDirWrapper(org.apache.lucene.store.RAMDirectory@1ad3a7a lockFactory=org.apache.lucene.store.SimpleFSLockFactory@f3aa85) fullCopy=false
[junit4:junit4]   2> 2608 T424 C53 REQ [collection1] webapp=/solr path=/replication params={file=_1.doc&command=filecontent&checksum=true&compression=true&generation=3&qt=/replication&wt=filestream} status=0 QTime=0 
[junit4:junit4]   2> 2611 T431 C52 REQ [collection1] webapp=/solr path=/select params={wt=javabin&q=*:*&version=2} hits=10 status=0 QTime=0 
[junit4:junit4]   2> 2613 T426 C53 REQ [collection1] webapp=/solr path=/replication params={file=_1_nrm.cfs&command=filecontent&checksum=true&compression=true&generation=3&qt=/replication&wt=filestream} status=0 QTime=0 
[junit4:junit4]   2> 2614 T438 oash.SnapPuller.downloadIndexFiles Skipping download for _0.fnm
[junit4:junit4]   2> 2614 T438 oash.SnapPuller.downloadIndexFiles Skipping download for _0_nrm.cfs
[junit4:junit4]   2> 2617 T425 C53 REQ [collection1] webapp=/solr path=/replication params={file=_1.fnm&command=filecontent&checksum=true&compression=true&generation=3&qt=/replication&wt=filestream} status=0 QTime=0 
[junit4:junit4]   2> 2620 T422 C53 REQ [collection1] webapp=/solr path=/replication params={file=_1_nrm.cfe&command=filecontent&checksum=true&compression=true&generation=3&qt=/replication&wt=filestream} status=0 QTime=0 
[junit4:junit4]   2> 2623 T421 C53 REQ [collection1] webapp=/solr path=/replication params={file=_1.fdx&command=filecontent&checksum=true&compression=true&generation=3&qt=/replication&wt=filestream} status=0 QTime=0 
[junit4:junit4]   2> 2627 T423 C53 REQ [collection1] webapp=/solr path=/replication params={file=_1.fdt&command=filecontent&checksum=true&compression=true&generation=3&qt=/replication&wt=filestream} status=0 QTime=0 
[junit4:junit4]   2> 2632 T424 C53 REQ [collection1] webapp=/solr path=/replication params={file=_1.si&command=filecontent&checksum=true&compression=true&generation=3&qt=/replication&wt=filestream} status=0 QTime=0 
[junit4:junit4]   2> 2633 T438 oash.SnapPuller.downloadIndexFiles Skipping download for _0.tim
[junit4:junit4]   2> 2633 T438 oash.SnapPuller.downloadIndexFiles Skipping download for _0_nrm.cfe
[junit4:junit4]   2> 2633 T438 oash.SnapPuller.downloadIndexFiles Skipping download for _0.fdx
[junit4:junit4]   2> 2634 T438 oash.SnapPuller.downloadIndexFiles Skipping download for _0.si
[junit4:junit4]   2> 2634 T438 oash.SnapPuller.downloadIndexFiles Skipping download for _0.doc
[junit4:junit4]   2> 2634 T438 oash.SnapPuller.downloadIndexFiles Skipping download for _0.tip
[junit4:junit4]   2> 2636 T426 C53 REQ [collection1] webapp=/solr path=/replication params={file=_1.tip&command=filecontent&checksum=true&compression=true&generation=3&qt=/replication&wt=filestream} status=0 QTime=0 
[junit4:junit4]   2> 2647 T438 oash.SnapPuller.downloadIndexFiles Skipping download for _0.fdt
[junit4:junit4]   2> 2650 T425 C53 REQ [collection1] webapp=/solr path=/replication params={file=segments_3&command=filecontent&checksum=true&compression=true&generation=3&qt=/replication&wt=filestream} status=0 QTime=0 
[junit4:junit4]   2> 2654 T422 C53 REQ [collection1] webapp=/solr path=/replication params={file=_1.tim&command=filecontent&checksum=true&compression=true&generation=3&qt=/replication&wt=filestream} status=0 QTime=0 
[junit4:junit4]   2> 2656 T438 oasc.CachingDirectoryFactory.close Releasing directory:C:\Users\JenkinsSlave\workspace\Lucene-Solr-trunk-Windows\solr\build\solr-core\test\J0\.\org.apache.solr.handler.TestReplicationHandler$SolrInstance-1351349171740\slave\collection1\data\index
[junit4:junit4]   2> 2656 T438 oash.SnapPuller.fetchLatestIndex Total time taken for download : 0 secs
[junit4:junit4]   2> 2659 T438 oasu.DefaultSolrCoreState.newIndexWriter Creating new IndexWriter...
[junit4:junit4]   2> 2660 T438 oasu.DefaultSolrCoreState.newIndexWriter Waiting until IndexWriter is unused... core=collection1
[junit4:junit4]   2> 2660 T438 oasu.DefaultSolrCoreState.newIndexWriter Closing old IndexWriter... core=collection1
[junit4:junit4]   2> 2660 T438 oasc.CachingDirectoryFactory.close Releasing directory:C:\Users\JenkinsSlave\workspace\Lucene-Solr-trunk-Windows\solr\build\solr-core\test\J0\.\org.apache.solr.handler.TestReplicationHandler$SolrInstance-1351349171740\slave\collection1\data\index
[junit4:junit4]   2> 2660 T438 oasc.CachingDirectoryFactory.close Releasing directory:C:\Users\JenkinsSlave\workspace\Lucene-Solr-trunk-Windows\solr\build\solr-core\test\J0\.\org.apache.solr.handler.TestReplicationHandler$SolrInstance-1351349171740\slave\collection1\data
[junit4:junit4]   2> 2662 T438 oasc.SolrDeletionPolicy.onInit SolrDeletionPolicy.onInit: commits:num=2
[junit4:junit4]   2> 		commit{dir=MockDirWrapper(org.apache.lucene.store.RAMDirectory@1b187c6 lockFactory=org.apache.lucene.store.SingleInstanceLockFactory@1928345),segFN=segments_2,generation=2,filenames=[_0.fnm, _0_nrm.cfe, _0.tim, segments_2, _0.fdx, _0_nrm.cfs, _0.si, _0.tip, _0.doc, _0.fdt]
[junit4:junit4]   2> 		commit{dir=MockDirWrapper(org.apache.lucene.store.RAMDirectory@1b187c6 lockFactory=org.apache.lucene.store.SingleInstanceLockFactory@1928345),segFN=segments_3,generation=3,filenames=[_1.doc, _1_nrm.cfs, _0.fnm, _0_nrm.cfs, _1.fnm, _1_nrm.cfe, _1.fdx, _1.fdt, _1.si, _0.tim, _0_nrm.cfe, _0.fdx, _0.si, _1.tip, _0.doc, _0.tip, _1.tim, segments_3, _0.fdt]
[junit4:junit4]   2> 2662 T438 oasc.SolrDeletionPolicy.updateCommits newest commit = 3[_1.doc, _1_nrm.cfs, _0.fnm, _0_nrm.cfs, _1.fnm, _1_nrm.cfe, _1.fdx, _1.fdt, _1.si, _0.tim, _0_nrm.cfe, _0.fdx, _0.si, _1.tip, _0.doc, _0.tip, _1.tim, segments_3, _0.fdt]
[junit4:junit4]   2> 2662 T438 oasu.DefaultSolrCoreState.newIndexWriter New IndexWriter is ready to be used.
[junit4:junit4]   2> 2663 T438 oasc.CachingDirectoryFactory.close Releasing directory:C:\Users\JenkinsSlave\workspace\Lucene-Solr-trunk-Windows\solr\build\solr-core\test\J0\.\org.apache.solr.handler.TestReplicationHandler$SolrInstance-1351349171740\slave\collection1\data
[junit4:junit4]   2> 2664 T438 oass.SolrIndexSearcher.<init> Opening Searcher@11f92a5 main
[junit4:junit4]   2> 2664 T437 oasc.SolrCore.registerSearcher [collection1] Registered new searcher Searcher@11f92a5 main{StandardDirectoryReader(segments_3:6:nrt _0(5.0):C10 _1(5.0):C2)}
[junit4:junit4]   2> 2664 T437 oasc.CachingDirectoryFactory.close Releasing directory:C:\Users\JenkinsSlave\workspace\Lucene-Solr-trunk-Windows\solr\build\solr-core\test\J0\.\org.apache.solr.handler.TestReplicationHandler$SolrInstance-1351349171740\slave\collection1\data\index
[junit4:junit4]   2> 2665 T438 oasu.DirectUpdateHandler2.commit start commit{flags=0,_version_=0,optimize=false,openSearcher=false,waitSearcher=false,expungeDeletes=false,softCommit=false}
[junit4:junit4]   2> 2665 T438 oasc.CachingDirectoryFactory.close Releasing directory:C:\Users\JenkinsSlave\workspace\Lucene-Solr-trunk-Windows\solr\build\solr-core\test\J0\.\org.apache.solr.handler.TestReplicationHandler$SolrInstance-1351349171740\slave\collection1\data
[junit4:junit4]   2> 2665 T438 oasu.DirectUpdateHandler2.commit end_commit_flush
[junit4:junit4]   2> 2666 T438 oash.SnapPuller.fetchLatestIndex removing temporary index download directory files MockDirWrapper(org.apache.lucene.store.RAMDirectory@1ad3a7a lockFactory=org.apache.lucene.store.SimpleFSLockFactory@f3aa85)
[junit4:junit4]   2> 2666 T438 oasc.CachingDirectoryFactory.close Releasing directory:C:\Users\JenkinsSlave\workspace\Lucene-Solr-trunk-Windows\solr\build\solr-core\test\J0\.\org.apache.solr.handler.TestReplicationHandler$SolrInstance-1351349171740\slave\collection1\data\index.20121027194614066
[junit4:junit4]   2> 2666 T438 oasc.CachingDirectoryFactory.close Releasing directory:C:\Users\JenkinsSlave\workspace\Lucene-Solr-trunk-Windows\solr\build\solr-core\test\J0\.\org.apache.solr.handler.TestReplicationHandler$SolrInstance-1351349171740\slave\collection1\data\index
[junit4:junit4]   2> 2720 T432 C52 REQ [collection1] webapp=/solr path=/select params={wt=javabin&q=*:*&version=2} hits=12 status=0 QTime=0 
[junit4:junit4]   2> 2845 T396 oasc.CoreContainer.shutdown Shutting down CoreContainer instance=32941292
[junit4:junit4]   2> 2845 T396 oasc.SolrCore.close [collection1]  CLOSING SolrCore org.apache.solr.core.SolrCore@1224c45
[junit4:junit4]   2> 2845 T396 oasu.DirectUpdateHandler2.close closing DirectUpdateHandler2{commits=1,autocommits=0,soft autocommits=0,optimizes=0,rollbacks=0,expungeDeletes=0,docsPending=0,adds=0,deletesById=0,deletesByQuery=0,errors=0,cumulative_adds=2,cumulative_deletesById=0,cumulative_deletesByQuery=0,cumulative_errors=0}
[junit4:junit4]   2> 2846 T396 oasc.SolrCore.decrefSolrCoreState Closing SolrCoreState
[junit4:junit4]   2> 2847 T396 oasu.DefaultSolrCoreState.closeIndexWriter SolrCoreState ref count has reached 0 - closing IndexWriter
[junit4:junit4]   2> 2847 T396 oasu.DefaultSolrCoreState.closeIndexWriter closing IndexWriter with IndexWriterCloser
[junit4:junit4]   2> 2849 T396 C53 oasc.CachingDirectoryFactory.close Releasing directory:C:\Users\JenkinsSlave\workspace\Lucene-Solr-trunk-Windows\solr\build\solr-core\test\J0\.\org.apache.solr.handler.TestReplicationHandler$SolrInstance-1351349171465\master\collection1\data\index
[junit4:junit4]   2> 2849 T396 oasc.SolrCore.closeSearcher [collection1] Closing main searcher on request.
[junit4:junit4]   2> 2850 T396 oasc.CachingDirectoryFactory.close Releasing directory:C:\Users\JenkinsSlave\workspace\Lucene-Solr-trunk-Windows\solr\build\solr-core\test\J0\.\org.apache.solr.handler.TestReplicationHandler$SolrInstance-1351349171465\master\collection1\data\index
[junit4:junit4]   2> 2851 T396 oejsh.ContextHandler.doStop stopped o.e.j.s.ServletContextHandler{/solr,null}
[junit4:junit4]   2> 2904 T396 oejs.Server.doStart jetty-8.1.2.v20120308
[junit4:junit4]   2> 2908 T396 oejs.AbstractConnector.doStart Started SelectChannelConnector@0.0.0.0:62554
[junit4:junit4]   2> 2910 T396 oasc.SolrResourceLoader.locateSolrHome JNDI not configured for solr (NoInitialContextEx)
[junit4:junit4]   2> 2910 T396 oasc.SolrResourceLoader.locateSolrHome using system property solr.solr.home: .\org.apache.solr.handler.TestReplicationHandler$SolrInstance-1351349171465\master
[junit4:junit4]   2> 2911 T396 oasc.SolrResourceLoader.<init> new SolrResourceLoader for deduced Solr Home: '.\org.apache.solr.handler.TestReplicationHandler$SolrInstance-1351349171465\master\'
[junit4:junit4]   2> 2928 T396 oass.SolrDispatchFilter.init SolrDispatchFilter.init()
[junit4:junit4]   2> 2928 T396 oasc.SolrResourceLoader.locateSolrHome JNDI not configured for solr (NoInitialContextEx)
[junit4:junit4]   2> 2928 T396 oasc.SolrResourceLoader.locateSolrHome using system property solr.solr.home: .\org.apache.solr.handler.TestReplicationHandler$SolrInstance-1351349171465\master
[junit4:junit4]   2> 2929 T396 oasc.CoreContainer$Initializer.initialize looking for solr.xml: C:\Users\JenkinsSlave\workspace\Lucene-Solr-trunk-Windows\solr\build\solr-core\test\J0\.\org.apache.solr.handler.TestReplicationHandler$SolrInstance-1351349171465\master\solr.xml
[junit4:junit4]   2> 2929 T396 oasc.CoreContainer.<init> New CoreContainer 31240705
[junit4:junit4]   2> 2930 T396 oasc.CoreContainer$Initializer.initialize no solr.xml file found - using default
[junit4:junit4]   2> 2930 T396 oasc.CoreContainer.load Loading CoreContainer using Solr Home: '.\org.apache.solr.handler.TestReplicationHandler$SolrInstance-1351349171465\master\'
[junit4:junit4]   2> 2930 T396 oasc.SolrResourceLoader.<init> new SolrResourceLoader for directory: '.\org.apache.solr.handler.TestReplicationHandler$SolrInstance-1351349171465\master\'
[junit4:junit4]   2> 2950 T396 oasc.CoreContainer.load Registering Log Listener
[junit4:junit4]   2> 2972 T396 oasc.CoreContainer.create Creating SolrCore 'collection1' using instanceDir: .\org.apache.solr.handler.TestReplicationHandler$SolrInstance-1351349171465\master\collection1
[junit4:junit4]   2> 2972 T396 oasc.SolrResourceLoader.<init> new SolrResourceLoader for directory: '.\org.apache.solr.handler.TestReplicationHandler$SolrInstance-1351349171465\master\collection1\'
[junit4:junit4]   2> 3014 T396 oasc.SolrConfig.<init> Using Lucene MatchVersion: LUCENE_50
[junit4:junit4]   2> 3083 T396 oasc.SolrConfig.<init> Loaded SolrConfig: solrconfig.xml
[junit4:junit4]   2> 3084 T396 oass.IndexSchema.readSchema Reading Solr Schema
[junit4:junit4]   2> 3085 T396 oass.IndexSchema.readSchema Schema name=test
[junit4:junit4]   2> 3099 T396 oass.IndexSchema.readSchema unique key field: id
[junit4:junit4]   2> 3100 T396 oasc.SolrCore.<init> [collection1] Opening new SolrCore at .\org.apache.solr.handler.TestReplicationHandler$SolrInstance-1351349171465\master\collection1\, dataDir=.\org.apache.solr.handler.TestReplicationHandler$SolrInstance-1351349171465\master\collection1\data\
[junit4:junit4]   2> 3100 T396 oasc.SolrCore.<init> JMX monitoring not detected for core: collection1
[junit4:junit4]   2> 3100 T396 oasc.SolrCore.initDirectoryFactory org.apache.solr.core.MockDirectoryFactory
[junit4:junit4]   2> 3102 T396 oasc.CachingDirectoryFactory.injectLockFactory WARNING No lockType configured for MockDirWrapper(org.apache.lucene.store.RAMDirectory@1defa7a lockFactory=org.apache.lucene.store.SingleInstanceLockFactory@e815f) assuming 'simple'
[junit4:junit4]   2> 3102 T396 oasc.CachingDirectoryFactory.get return new directory for C:\Users\JenkinsSlave\workspace\Lucene-Solr-trunk-Windows\solr\build\solr-core\test\J0\.\org.apache.solr.handler.TestReplicationHandler$SolrInstance-1351349171465\master\collection1\data forceNew:false
[junit4:junit4]   2> 3102 T396 oasc.CachingDirectoryFactory.close Releasing directory:C:\Users\JenkinsSlave\workspace\Lucene-Solr-trunk-Windows\solr\build\solr-core\test\J0\.\org.apache.solr.handler.TestReplicationHandler$SolrInstance-1351349171465\master\collection1\data
[junit4:junit4]   2> 3102 T396 oasc.SolrCore.getNewIndexDir New index directory detected: old=null new=.\org.apache.solr.handler.TestReplicationHandler$SolrInstance-1351349171465\master\collection1\data\index/
[junit4:junit4]   2> 3103 T396 oasc.SolrCore.initIndex WARNING [collection1] Solr index directory '.\org.apache.solr.handler.TestReplicationHandler$SolrInstance-1351349171465\master\collection1\data\index' doesn't exist. Creating new index...
[junit4:junit4]   2> 3104 T396 oasc.CachingDirectoryFactory.get return new directory for C:\Users\JenkinsSlave\workspace\Lucene-Solr-trunk-Windows\solr\build\solr-core\test\J0\.\org.apache.solr.handler.TestReplicationHandler$SolrInstance-1351349171465\master\collection1\data\index forceNew:false
[junit4:junit4]   2> 3105 T396 oasc.SolrDeletionPolicy.onCommit SolrDeletionPolicy.onCommit: commits:num=1
[junit4:junit4]   2> 		commit{dir=MockDirWrapper(org.apache.lucene.store.RAMDirectory@cb0514 lockFactory=org.apache.lucene.store.SingleInstanceLockFactory@c7e125),segFN=segments_1,generation=1,filenames=[segments_1]
[junit4:junit4]   2> 3105 T396 oasc.SolrDeletionPolicy.updateCommits newest commit = 1[segments_1]
[junit4:junit4]   2> 3105 T396 oasc.CachingDirectoryFactory.close Releasing directory:C:\Users\JenkinsSlave\workspace\Lucene-Solr-trunk-Windows\solr\build\solr-core\test\J0\.\org.apache.solr.handler.TestReplicationHandler$SolrInstance-1351349171465\master\collection1\data\index
[junit4:junit4]   2> 3106 T396 oasc.RequestHandlers.initHandlersFromConfig created standard: solr.StandardRequestHandler
[junit4:junit4]   2> 3106 T396 oasc.RequestHandlers.initHandlersFromConfig created /replication: solr.ReplicationHandler
[junit4:junit4]   2> 3106 T396 oasc.RequestHandlers.initHandlersFromConfig created defaults: solr.StandardRequestHandler
[junit4:junit4]   2> 3107 T396 oasc.RequestHandlers.initHandlersFromConfig adding lazy requestHandler: solr.StandardRequestHandler
[junit4:junit4]   2> 3107 T396 oasc.RequestHandlers.initHandlersFromConfig created lazy: solr.StandardRequestHandler
[junit4:junit4]   2> 3107 T396 oasc.RequestHandlers.initHandlersFromConfig created /update: solr.UpdateRequestHandler
[junit4:junit4]   2> 3109 T396 oashl.XMLLoader.init xsltCacheLifetimeSeconds=60
[junit4:junit4]   2> 3111 T396 oasc.CachingDirectoryFactory.close Releasing directory:C:\Users\JenkinsSlave\workspace\Lucene-Solr-trunk-Windows\solr\build\solr-core\test\J0\.\org.apache.solr.handler.TestReplicationHandler$SolrInstance-1351349171465\master\collection1\data
[junit4:junit4]   2> 3112 T396 oass.SolrIndexSearcher.<init> Opening Searcher@ef69f3 main
[junit4:junit4]   2> 3112 T396 oasu.CommitTracker.<init> Hard AutoCommit: disabled
[junit4:junit4]   2> 3113 T396 oasu.CommitTracker.<init> Soft AutoCommit: disabled
[junit4:junit4]   2> 3114 T396 oashc.HttpShardHandlerFactory.getParameter Setting socketTimeout to: 0
[junit4:junit4]   2> 3114 T396 oashc.HttpShardHandlerFactory.getParameter Setting urlScheme to: http://
[junit4:junit4]   2> 3115 T396 oashc.HttpShardHandlerFactory.getParameter Setting connTimeout to: 0
[junit4:junit4]   2> 3115 T396 oashc.HttpShardHandlerFactory.getParameter Setting maxConnectionsPerHost to: 20
[junit4:junit4]   2> 3116 T396 oashc.HttpShardHandlerFactory.getParameter Setting corePoolSize to: 0
[junit4:junit4]   2> 3116 T396 oashc.HttpShardHandlerFactory.getParameter Setting maximumPoolSize to: 2147483647
[junit4:junit4]   2> 3118 T396 oashc.HttpShardHandlerFactory.getParameter Setting maxThreadIdleTime to: 5
[junit4:junit4]   2> 3118 T396 oashc.HttpShardHandlerFactory.getParameter Setting sizeOfQueue to: -1
[junit4:junit4]   2> 3119 T396 oashc.HttpShardHandlerFactory.getParameter Setting fairnessPolicy to: false
[junit4:junit4]   2> 3119 T396 oascsi.HttpClientUtil.createClient Creating new http client, config:maxConnectionsPerHost=20&maxConnections=10000&socketTimeout=0&connTimeout=0&retry=false
[junit4:junit4]   2> 3125 T396 oash.ReplicationHandler.inform Replication enabled for following config files: schema.xml,xslt/dummy.xsl
[junit4:junit4]   2> 3125 T396 oash.ReplicationHandler.inform Commits will be reserved for  10000
[junit4:junit4]   2> 3126 T451 oasc.SolrCore.registerSearcher [collection1] Registered new searcher Searcher@ef69f3 main{StandardDirectoryReader(segments_1:1)}
[junit4:junit4]   2> 3126 T396 oasc.CoreContainer.register registering core: collection1
[junit4:junit4]   2> 3127 T396 oass.SolrDispatchFilter.init user.dir=C:\Users\JenkinsSlave\workspace\Lucene-Solr-trunk-Windows\solr\build\solr-core\test\J0
[junit4:junit4]   2> 3127 T396 oass.SolrDispatchFilter.init SolrDispatchFilter.init() done
[junit4:junit4]   2> 3127 T396 oascsi.HttpClientUtil.createClient Creating new http client, config:maxConnections=128&maxConnectionsPerHost=32&followRedirects=false
[junit4:junit4]   2> 3150 T396 oasc.CoreContainer.shutdown Shutting down CoreContainer instance=23094532
[junit4:junit4]   2> 3151 T396 oasc.SolrCore.close [collection1]  CLOSING SolrCore org.apache.solr.core.SolrCore@173019f
[junit4:junit4]   2> 3151 T396 oasu.DirectUpdateHandler2.close closing DirectUpdateHandler2{commits=2,autocommits=0,soft autocommits=0,optimizes=0,rollbacks=0,expungeDeletes=0,docsPending=0,adds=0,deletesById=0,deletesByQuery=0,errors=0,cumulative_adds=0,cumulative_deletesById=0,cumulative_deletesByQuery=0,cumulative_errors=0}
[junit4:junit4]   2> 3152 T396 oasc.SolrCore.decrefSolrCoreState Closing SolrCoreState
[junit4:junit4]   2> 3152 T396 oasu.DefaultSolrCoreState.closeIndexWriter SolrCoreState ref count has reached 0 - closing IndexWriter
[junit4:junit4]   2> 3153 T396 oasu.DefaultSolrCoreState.closeIndexWriter closing IndexWriter with IndexWriterCloser
[junit4:junit4]   2> 3154 T396 C52 oasc.CachingDirectoryFactory.close Releasing directory:C:\Users\JenkinsSlave\workspace\Lucene-Solr-trunk-Windows\solr\build\solr-core\test\J0\.\org.apache.solr.handler.TestReplicationHandler$SolrInstance-1351349171740\slave\collection1\data\index
[junit4:junit4]   2> 3155 T396 oasc.SolrCore.closeSearcher [collection1] Closing main searcher on request.
[junit4:junit4]   2> 3155 T396 oasc.CachingDirectoryFactory.close Releasing directory:C:\Users\JenkinsSlave\workspace\Lucene-Solr-trunk-Windows\solr\build\solr-core\test\J0\.\org.apache.solr.handler.TestReplicationHandler$SolrInstance-1351349171740\slave\collection1\data\index
[junit4:junit4]   2> 3156 T396 oejsh.ContextHandler.doStop stopped o.e.j.s.ServletContextHandler{/solr,null}
[junit4:junit4]   2> 3209 T396 oejs.Server.doStart jetty-8.1.2.v20120308
[junit4:junit4]   2> 3214 T396 oejs.AbstractConnector.doStart Started SelectChannelConnector@0.0.0.0:62557
[junit4:junit4]   2> 3214 T396 oasc.SolrResourceLoader.locateSolrHome JNDI not configured for solr (NoInitialContextEx)
[junit4:junit4]   2> 3215 T396 oasc.SolrResourceLoader.locateSolrHome using system property solr.solr.home: .\org.apache.solr.handler.TestReplicationHandler$SolrInstance-1351349171740\slave
[junit4:junit4]   2> 3215 T396 oasc.SolrResourceLoader.<init> new SolrResourceLoader for deduced Solr Home: '.\org.apache.solr.handler.TestReplicationHandler$SolrInstance-1351349171740\slave\'
[junit4:junit4]   2> 3248 T396 oass.SolrDispatchFilter.init SolrDispatchFilter.init()
[junit4:junit4]   2> 3248 T396 oasc.SolrResourceLoader.locateSolrHome JNDI not configured for solr (NoInitialContextEx)
[junit4:junit4]   2> 3249 T396 oasc.SolrResourceLoader.locateSolrHome using system property solr.solr.home: .\org.apache.solr.handler.TestReplicationHandler$SolrInstance-1351349171740\slave
[junit4:junit4]   2> 3249 T396 oasc.CoreContainer$Initializer.initialize looking for solr.xml: C:\Users\JenkinsSlave\workspace\Lucene-Solr-trunk-Windows\solr\build\solr-core\test\J0\.\org.apache.solr.handler.TestReplicationHandler$SolrInstance-1351349171740\slave\solr.xml
[junit4:junit4]   2> 3249 T396 oasc.CoreContainer.<init> New CoreContainer 15164378
[junit4:junit4]   2> 3251 T396 oasc.CoreContainer$Initializer.initialize no solr.xml file found - using default
[junit4:junit4]   2> 3251 T396 oasc.CoreContainer.load Loading CoreContainer using Solr Home: '.\org.apache.solr.handler.TestReplicationHandler$SolrInstance-1351349171740\slave\'
[junit4:junit4]   2> 3251 T396 oasc.SolrResourceLoader.<init> new SolrResourceLoader for directory: '.\org.apache.solr.handler.TestReplicationHandler$SolrInstance-1351349171740\slave\'
[junit4:junit4]   2> 3279 T396 oasc.CoreContainer.load Registering Log Listener
[junit4:junit4]   2> 3300 T396 oasc.CoreContainer.create Creating SolrCore 'collection1' using instanceDir: .\org.apache.solr.handler.TestReplicationHandler$SolrInstance-1351349171740\slave\collection1
[junit4:junit4]   2> 3300 T396 oasc.SolrResourceLoader.<init> new SolrResourceLoader for directory: '.\org.apache.solr.handler.TestReplicationHandler$SolrInstance-1351349171740\slave\collection1\'
[junit4:junit4]   2> 3347 T396 oasc.SolrConfig.<init> Using Lucene MatchVersion: LUCENE_50
[junit4:junit4]   2> 3400 T396 oasc.SolrConfig.<init> Loaded SolrConfig: solrconfig.xml
[junit4:junit4]   2> 3401 T396 oass.IndexSchema.readSchema Reading Solr Schema
[junit4:junit4]   2> 3406 T396 oass.IndexSchema.readSchema Schema name=test
[junit4:junit4]   2> 3427 T396 oass.IndexSchema.readSchema unique key field: id
[junit4:junit4]   2> 3429 T396 oasc.SolrCore.<init> [collection1] Opening new SolrCore at .\org.apache.solr.handler.TestReplicationHandler$SolrInstance-1351349171740\slave\collection1\, dataDir=.\org.apache.solr.handler.TestReplicationHandler$SolrInstance-1351349171740\slave\collection1\data\
[junit4:junit4]   2> 3429 T396 oasc.SolrCore.<init> JMX monitoring not detected for core: collection1
[junit4:junit4]   2> 3429 T396 oasc.SolrCore.initDirectoryFactory org.apache.solr.core.MockDirectoryFactory
[junit4:junit4]   2> 3430 T396 oasc.CachingDirectoryFactory.injectLockFactory WARNING No lockType configured for MockDirWrapper(org.apache.lucene.store.RAMDirectory@1192444 lockFactory=org.apache.lucene.store.SingleInstanceLockFactory@19bf627) assuming 'simple'
[junit4:junit4]   2> 3430 T396 oasc.CachingDirectoryFactory.get return new directory for C:\Users\JenkinsSlave\workspace\Lucene-Solr-trunk-Windows\solr\build\solr-core\test\J0\.\org.apache.solr.handler.TestReplicationHandler$SolrInstance-1351349171740\slave\collection1\data forceNew:false
[junit4:junit4]   2> 3431 T396 oasc.CachingDirectoryFactory.close Releasing directory:C:\Users\JenkinsSlave\workspace\Lucene-Solr-trunk-Windows\solr\build\solr-core\test\J0\.\org.apache.solr.handler.TestReplicationHandler$SolrInstance-1351349171740\slave\collection1\data
[junit4:junit4]   2> 3431 T396 oasc.SolrCore.getNewIndexDir New index directory detected: old=null new=.\org.apache.solr.handler.TestReplicationHandler$SolrInstance-1351349171740\slave\collection1\data\index/
[junit4:junit4]   2> 3433 T396 oasc.SolrCore.initIndex WARNING [collection1] Solr index directory '.\org.apache.solr.handler.TestReplicationHandler$SolrInstance-1351349171740\slave\collection1\data\index' doesn't exist. Creating new index...
[junit4:junit4]   2> 3433 T396 oasc.CachingDirectoryFactory.get return new directory for C:\Users\JenkinsSlave\workspace\Lucene-Solr-trunk-Windows\solr\build\solr-core\test\J0\.\org.apache.solr.handler.TestReplicationHandler$SolrInstance-1351349171740\slave\collection1\data\index forceNew:false
[junit4:junit4]   2> 3434 T396 oasc.SolrDeletionPolicy.onCommit SolrDeletionPolicy.onCommit: commits:num=1
[junit4:junit4]   2> 		commit{dir=MockDirWrapper(org.apache.lucene.store.RAMDirectory@a98af4 lockFactory=org.apache.lucene.store.SingleInstanceLockFactory@4cc2e1),segFN=segments_1,generation=1,filenames=[segments_1]
[junit4:junit4]   2> 3435 T396 oasc.SolrDeletionPolicy.updateCommits newest commit = 1[segments_1]
[junit4:junit4]   2> 3435 T396 oasc.CachingDirectoryFactory.close Releasing directory:C:\Users\JenkinsSlave\workspace\Lucene-Solr-trunk-Windows\solr\build\solr-core\test\J0\.\org.apache.solr.handler.TestReplicationHandler$SolrInstance-1351349171740\slave\collection1\data\index
[junit4:junit4]   2> 3436 T396 oasc.RequestHandlers.initHandlersFromConfig created standard: solr.StandardRequestHandler
[junit4:junit4]   2> 3436 T396 oasc.RequestHandlers.initHandlersFromConfig created defaults: solr.StandardRequestHandler
[junit4:junit4]   2> 3437 T396 oasc.RequestHandlers.initHandlersFromConfig adding lazy requestHandler: solr.StandardRequestHandler
[junit4:junit4]   2> 3437 T396 oasc.RequestHandlers.initHandlersFromConfig created lazy: solr.StandardRequestHandler
[junit4:junit4]   2> 3437 T396 oasc.RequestHandlers.initHandlersFromConfig created /update: solr.UpdateRequestHandler
[junit4:junit4]   2> 3438 T396 oasc.RequestHandlers.initHandlersFromConfig created /replication: solr.ReplicationHandler
[junit4:junit4]   2> 3447 T396 oashl.XMLLoader.init xsltCacheLifetimeSeconds=60
[junit4:junit4]   2> 3452 T396 oasc.CachingDirectoryFactory.close Releasing directory:C:\Users\JenkinsSlave\workspace\Lucene-Solr-trunk-Windows\solr\build\solr-core\test\J0\.\org.apache.solr.handler.TestReplicationHandler$SolrInstance-1351349171740\slave\collection1\data
[junit4:junit4]   2> 3452 T396 oass.SolrIndexSearcher.<init> Opening Searcher@36cf0e main
[junit4:junit4]   2> 3453 T396 oasu.CommitTracker.<init> Hard AutoCommit: disabled
[junit4:junit4]   2> 3453 T396 oasu.CommitTracker.<init> Soft AutoCommit: disabled
[junit4:junit4]   2> 3454 T396 oashc.HttpShardHandlerFactory.getParameter Setting socketTimeout to: 0
[junit4:junit4]   2> 3454 T396 oashc.HttpShardHandlerFactory.getParameter Setting urlScheme to: http://
[junit4:junit4]   2> 3454 T396 oashc.HttpShardHandlerFactory.getParameter Setting connTimeout to: 0
[junit4:junit4]   2> 3455 T396 oashc.HttpShardHandlerFactory.getParameter Setting maxConnectionsPerHost to: 20
[junit4:junit4]   2> 3455 T396 oashc.HttpShardHandlerFactory.getParameter Setting corePoolSize to: 0
[junit4:junit4]   2> 3456 T396 oashc.HttpShardHandlerFactory.getParameter Setting maximumPoolSize to: 2147483647
[junit4:junit4]   2> 3456 T396 oashc.HttpShardHandlerFactory.getParameter Setting maxThreadIdleTime to: 5
[junit4:junit4]   2> 3456 T396 oashc.HttpShardHandlerFactory.getParameter Setting sizeOfQueue to: -1
[junit4:junit4]   2> 3457 T396 oashc.HttpShardHandlerFactory.getParameter Setting fairnessPolicy to: false
[junit4:junit4]   2> 3457 T396 oascsi.HttpClientUtil.createClient Creating new http client, config:maxConnectionsPerHost=20&maxConnections=10000&socketTimeout=0&connTimeout=0&retry=false
[junit4:junit4]   2> 3466 T396 oash.SnapPuller.startExecutorService Poll Scheduled at an interval of 1000ms
[junit4:junit4]   2> 3467 T461 oasc.SolrCore.registerSearcher [collection1] Registered new searcher Searcher@36cf0e main{StandardDirectoryReader(segments_1:1)}
[junit4:junit4]   2> 3467 T396 oasc.CoreContainer.register registering core: collection1
[junit4:junit4]   2> 3467 T396 oass.SolrDispatchFilter.init user.dir=C:\Users\JenkinsSlave\workspace\Lucene-Solr-trunk-Windows\solr\build\solr-core\test\J0
[junit4:junit4]   2> 3468 T396 oass.SolrDispatchFilter.init SolrDispatchFilter.init() done
[junit4:junit4]   2> 3468 T396 oascsi.HttpClientUtil.createClient Creating new http client, config:maxConnections=128&maxConnectionsPerHost=32&followRedirects=false
[junit4:junit4]   2> ASYNC  NEW_CORE C54 name=collection1 org.apache.solr.core.SolrCore@1a38f6d
[junit4:junit4]   2> 3493 T446 C54 oasc.CachingDirectoryFactory.close Releasing directory:C:\Users\JenkinsSlave\workspace\Lucene-Solr-trunk-Windows\solr\build\solr-core\test\J0\.\org.apache.solr.handler.TestReplicationHandler$SolrInstance-1351349171465\master\collection1\data\index
[junit4:junit4]   2> 3493 T446 C54 REQ [collection1] webapp=/solr path=/replication params={command=details&qt=/replication&wt=javabin&version=2} status=0 QTime=1 
[junit4:junit4]   2> ASYNC  NEW_CORE C55 name=collection1 org.apache.solr.core.SolrCore@1e909
[junit4:junit4]   2> 3502 T454 C55 oasc.CachingDirectoryFactory.close Releasing directory:C:\Users\JenkinsSlave\workspace\Lucene-Solr-trunk-Windows\solr\build\solr-core\test\J0\.\org.apache.solr.handler.TestReplicationHandler$SolrInstance-1351349171740\slave\collection1\data\index
[junit4:junit4]   2> 3505 T447 C54 oasc.CachingDirectoryFactory.close Releasing directory:C:\Users\JenkinsSlave\workspace\Lucene-Solr-trunk-Windows\solr\build\solr-core\test\J0\.\org.apache.solr.handler.TestReplicationHandler$SolrInstance-1351349171465\master\collection1\data\index
[junit4:junit4]   2> 3507 T447 C54 REQ [collection1] webapp=/solr path=/replication params={command=details&slave=false&qt=/replication&wt=javabin&version=2} status=0 QTime=2 
[junit4:junit4]   2> 3509 T454 C55 REQ [collection1] webapp=/solr path=/replication params={command=details&qt=/replication&wt=javabin&version=2} status=0 QTime=7 
[junit4:junit4]   2> 3527 T396 oejs.Server.doStart jetty-8.1.2.v20120308
[junit4:junit4]   2> 3530 T396 oejs.AbstractConnector.doStart Started SelectChannelConnector@0.0.0.0:62563
[junit4:junit4]   2> 3532 T396 oasc.SolrResourceLoader.locateSolrHome JNDI not configured for solr (NoInitialContextEx)
[junit4:junit4]   2> 3532 T396 oasc.SolrResourceLoader.locateSolrHome using system property solr.solr.home: .\org.apache.solr.handler.TestReplicationHandler$SolrInstance-1351349174970\repeater
[junit4:junit4]   2> 3532 T396 oasc.SolrResourceLoader.<init> new SolrResourceLoader for deduced Solr Home: '.\org.apache.solr.handler.TestReplicationHandler$SolrInstance-1351349174970\repeater\'
[junit4:junit4]   2> 3546 T448 C54 REQ [collection1] webapp=/solr path=/replication params={command=indexversion&wt=javabin&qt=/replication&version=2} status=0 QTime=0 
[junit4:junit4]   2> 3548 T396 oass.SolrDispatchFilter.init SolrDispatchFilter.init()
[junit4:junit4]   2> 3550 T396 oasc.SolrResourceLoader.locateSolrHome JNDI not configured for solr (NoInitialContextEx)
[junit4:junit4]   2> 3550 T396 oasc.SolrResourceLoader.locateSolrHome using system property solr.solr.home: .\org.apache.solr.handler.TestReplicationHandler$SolrInstance-1351349174970\repeater
[junit4:junit4]   2> 3550 T396 oasc.CoreContainer$Initializer.initialize looking for solr.xml: C:\Users\JenkinsSlave\workspace\Lucene-Solr-trunk-Windows\solr\build\solr-core\test\J0\.\org.apache.solr.handler.TestReplicationHandler$SolrInstance-1351349174970\repeater\solr.xml
[junit4:junit4]   2> 3550 T396 oasc.CoreContainer.<init> New CoreContainer 459234
[junit4:junit4]   2> 3551 T396 oasc.CoreContainer$Initializer.initialize no solr.xml file found - using default
[junit4:junit4]   2> 3551 T396 oasc.CoreContainer.load Loading CoreContainer using Solr Home: '.\org.apache.solr.handler.TestReplicationHandler$SolrInstance-1351349174970\repeater\'
[junit4:junit4]   2> 3553 T396 oasc.SolrResourceLoader.<init> new SolrResourceLoader for directory: '.\org.apache.solr.handler.TestReplicationHandler$SolrInstance-1351349174970\repeater\'
[junit4:junit4]   2> 3571 T396 oasc.CoreContainer.load Registering Log Listener
[junit4:junit4]   2> 3591 T396 oasc.CoreContainer.create Creating SolrCore 'collection1' using instanceDir: .\org.apache.solr.handler.TestReplicationHandler$SolrInstance-1351349174970\repeater\collection1
[junit4:junit4]   2> 3594 T396 oasc.SolrResourceLoader.<init> new SolrResourceLoader for directory: '.\org.apache.solr.handler.TestReplicationHandler$SolrInstance-1351349174970\repeater\collection1\'
[junit4:junit4]   2> 3632 T396 oasc.SolrConfig.<init> Using Lucene MatchVersion: LUCENE_50
[junit4:junit4]   2> 3689 T396 oasc.SolrConfig.<init> Loaded SolrConfig: solrconfig.xml
[junit4:junit4]   2> 3690 T396 oass.IndexSchema.readSchema Reading Solr Schema
[junit4:junit4]   2> 3693 T396 oass.IndexSchema.readSchema Schema name=test
[junit4:junit4]   2> 3712 T396 oass.IndexSchema.readSchema unique key field: id
[junit4:junit4]   2> 3714 T396 oasc.SolrCore.<init> [collection1] Opening new SolrCore at .\org.apache.solr.handler.TestReplicationHandler$SolrInstance-1351349174970\repeater\collection1\, dataDir=.\org.apache.solr.handler.TestReplicationHandler$SolrInstance-1351349174970\repeater\collection1\data\
[junit4:junit4]   2> 3714 T396 oasc.SolrCore.<init> JMX monitoring not detected for core: collection1
[junit4:junit4]   2> 3714 T396 oasc.SolrCore.initDirectoryFactory org.apache.solr.core.MockDirectoryFactory
[junit4:junit4]   2> 3715 T396 oasc.CachingDirectoryFactory.injectLockFactory WARNING No lockType configured for MockDirWrapper(org.apache.lucene.store.RAMDirectory@1730081 lockFactory=org.apache.lucene.store.SingleInstanceLockFactory@1263ff4) assuming 'simple'
[junit4:junit4]   2> 3715 T396 oasc.CachingDirectoryFactory.get return new directory for C:\Users\JenkinsSlave\workspace\Lucene-Solr-trunk-Windows\solr\build\solr-core\test\J0\.\org.apache.solr.handler.TestReplicationHandler$SolrInstance-1351349174970\repeater\collection1\data forceNew:false
[junit4:junit4]   2> 3716 T396 oasc.CachingDirectoryFactory.close Releasing directory:C:\Users\JenkinsSlave\workspace\Lucene-Solr-trunk-Windows\solr\build\solr-core\test\J0\.\org.apache.solr.handler.TestReplicationHandler$SolrInstance-1351349174970\repeater\collection1\data
[junit4:junit4]   2> 3716 T396 oasc.SolrCore.getNewIndexDir New index directory detected: old=null new=.\org.apache.solr.handler.TestReplicationHandler$SolrInstance-1351349174970\repeater\collection1\data\index/
[junit4:junit4]   2> 3718 T396 oasc.SolrCore.initIndex WARNING [collection1] Solr index directory '.\org.apache.solr.handler.TestReplicationHandler$SolrInstance-1351349174970\repeater\collection1\data\index' doesn't exist. Creating new index...
[junit4:junit4]   2> 3721 T396 oasc.CachingDirectoryFactory.get return new directory for C:\Users\JenkinsSlave\workspace\Lucene-Solr-trunk-Windows\solr\build\solr-core\test\J0\.\org.apache.solr.handler.TestReplicationHandler$SolrInstance-1351349174970\repeater\collection1\data\index forceNew:false
[junit4:junit4]   2> 3724 T396 oasc.SolrDeletionPolicy.onCommit SolrDeletionPolicy.onCommit: commits:num=1
[junit4:junit4]   2> 		commit{dir=MockDirWrapper(org.apache.lucene.store.SimpleFSDirectory@C:\Users\JenkinsSlave\workspace\Lucene-Solr-trunk-Windows\solr\build\solr-core\test\J0\index4699546999tmp lockFactory=org.apache.lucene.store.SingleInstanceLockFactory@e8fa70),segFN=segments_1,generation=1,filenames=[segments_1]
[junit4:junit4]   2> 3724 T396 oasc.SolrDeletionPolicy.updateCommits newest commit = 1[segments_1]
[junit4:junit4]   2> 3725 T396 oasc.CachingDirectoryFactory.close Releasing directory:C:\Users\JenkinsSlave\workspace\Lucene-Solr-trunk-Windows\solr\build\solr-core\test\J0\.\org.apache.solr.handler.TestReplicationHandler$SolrInstance-1351349174970\repeater\collection1\data\index
[junit4:junit4]   2> 3726 T396 oasc.RequestHandlers.initHandlersFromConfig created standard: solr.StandardRequestHandler
[junit4:junit4]   2> 3726 T396 oasc.RequestHandlers.initHandlersFromConfig created defaults: solr.StandardRequestHandler
[junit4:junit4]   2> 3727 T396 oasc.RequestHandlers.initHandlersFromConfig adding lazy requestHandler: solr.StandardRequestHandler
[junit4:junit4]   2> 3727 T396 oasc.RequestHandlers.initHandlersFromConfig created lazy: solr.StandardRequestHandler
[junit4:junit4]   2> 3727 T396 oasc.RequestHandlers.initHandlersFromConfig created /update: solr.UpdateRequestHandler
[junit4:junit4]   2> 3728 T396 oasc.RequestHandlers.initHandlersFromConfig created /replication: solr.ReplicationHandler
[junit4:junit4]   2> 3740 T396 oashl.XMLLoader.init xsltCacheLifetimeSeconds=60
[junit4:junit4]   2> 3747 T396 oasc.CachingDirectoryFactory.close Releasing directory:C:\Users\JenkinsSlave\workspace\Lucene-Solr-trunk-Windows\solr\build\solr-core\test\J0\.\org.apache.solr.handler.TestReplicationHandler$SolrInstance-1351349174970\repeater\collection1\data
[junit4:junit4]   2> 3749 T396 oass.SolrIndexSearcher.<init> Opening Searcher@7b06a1 main
[junit4:junit4]   2> 3749 T396 oasu.CommitTracker.<init> Hard AutoCommit: disabled
[junit4:junit4]   2> 3750 T396 oasu.CommitTracker.<init> Soft AutoCommit: disabled
[junit4:junit4]   2> 3750 T396 oashc.HttpShardHandlerFactory.getParameter Setting socketTimeout to: 0
[junit4:junit4]   2> 3751 T396 oashc.HttpShardHandlerFactory.getParameter Setting urlScheme to: http://
[junit4:junit4]   2> 3751 T396 oashc.HttpShardHandlerFactory.getParameter Setting connTimeout to: 0
[junit4:junit4]   2> 3751 T396 oashc.HttpShardHandlerFactory.getParameter Setting maxConnectionsPerHost to: 20
[junit4:junit4]   2> 3752 T396 oashc.HttpShardHandlerFactory.getParameter Setting corePoolSize to: 0
[junit4:junit4]   2> 3752 T396 oashc.HttpShardHandlerFactory.getParameter Setting maximumPoolSize to: 2147483647
[junit4:junit4]   2> 3752 T396 oashc.HttpShardHandlerFactory.getParameter Setting maxThreadIdleTime to: 5
[junit4:junit4]   2> 3753 T396 oashc.HttpShardHandlerFactory.getParameter Setting sizeOfQueue to: -1
[junit4:junit4]   2> 3753 T396 oashc.HttpShardHandlerFactory.getParameter Setting fairnessPolicy to: false
[junit4:junit4]   2> 3754 T396 oascsi.HttpClientUtil.createClient Creating new http client, config:maxConnectionsPerHost=20&maxConnections=10000&socketTimeout=0&connTimeout=0&retry=false
[junit4:junit4]   2> 3763 T396 oash.SnapPuller.<init> WARNING 'masterUrl' must be specified without the /replication suffix
[junit4:junit4]   2> 3764 T396 oash.SnapPuller.startExecutorService Poll Scheduled at an interval of 1000ms
[junit4:junit4]   2> 3764 T396 oash.ReplicationHandler.inform Replication enabled for following config files: schema.xml
[junit4:junit4]   2> 3764 T396 oash.ReplicationHandler.inform Commits will be reserved for  10000
[junit4:junit4]   2> 3765 T472 oasc.SolrCore.registerSearcher [collection1] Registered new searcher Searcher@7b06a1 main{StandardDirectoryReader(segments_1:1)}
[junit4:junit4]   2> 3765 T396 oasc.CoreContainer.register registering core: collection1
[junit4:junit4]   2> 3765 T396 oass.SolrDispatchFilter.init user.dir=C:\Users\JenkinsSlave\workspace\Lucene-Solr-trunk-Windows\solr\build\solr-core\test\J0
[junit4:junit4]   2> 3766 T396 oass.SolrDispatchFilter.init SolrDispatchFilter.init() done
[junit4:junit4]   2> 3766 T396 oascsi.HttpClientUtil.createClient Creating new http client, config:maxConnections=128&maxConnectionsPerHost=32&followRedirects=false
[junit4:junit4]   2> ASYNC  NEW_CORE C56 name=collection1 org.apache.solr.core.SolrCore@9ae6bb
[junit4:junit4]   2> 3780 T466 C56 oasc.CachingDirectoryFactory.close Releasing directory:C:\Users\JenkinsSlave\workspace\Lucene-Solr-trunk-Windows\solr\build\solr-core\test\J0\.\org.apache.solr.handler.TestReplicationHandler$SolrInstance-1351349174970\repeater\collection1\data\index
[junit4:junit4]   2> 3786 T449 C54 oasc.CachingDirectoryFactory.close Releasing directory:C:\Users\JenkinsSlave\workspace\Lucene-Solr-trunk-Windows\solr\build\solr-core\test\J0\.\org.apache.solr.handler.TestReplicationHandler$SolrInstance-1351349171465\master\collection1\data\index
[junit4:junit4]   2> 3787 T449 C54 REQ [collection1] webapp=/solr path=/replication params={command=details&slave=false&qt=/replication&wt=javabin&version=2} status=0 QTime=1 
[junit4:junit4]   2> 3788 T466 C56 REQ [collection1] webapp=/solr path=/replication params={command=details&qt=/replication&wt=javabin&version=2} status=0 QTime=9 
[junit4:junit4]   2> 3801 T396 oasc.CoreContainer.shutdown Shutting down CoreContainer instance=459234
[junit4:junit4]   2> 3802 T396 oasc.SolrCore.close [collection1]  CLOSING SolrCore org.apache.solr.core.SolrCore@9ae6bb
[junit4:junit4]   2> 3802 T396 oasu.DirectUpdateHandler2.close closing DirectUpdateHandler2{commits=0,autocommits=0,soft autocommits=0,optimizes=0,rollbacks=0,expungeDeletes=0,docsPending=0,adds=0,deletesById=0,deletesByQuery=0,errors=0,cumulative_adds=0,cumulative_deletesById=0,cumulative_deletesByQuery=0,cumulative_errors=0}
[junit4:junit4]   2> 3802 T396 oasc.SolrCore.decrefSolrCoreState Closing SolrCoreState
[junit4:junit4]   2> 3802 T396 oasu.DefaultSolrCoreState.closeIndexWriter SolrCoreState ref count has reached 0 - closing IndexWriter
[junit4:junit4]   2> 3803 T396 oasu.DefaultSolrCoreState.closeIndexWriter closing IndexWriter with IndexWriterCloser
[junit4:junit4]   2> 3803 T396 oasc.SolrCore.closeSearcher [collection1] Closing main searcher on request.
[junit4:junit4]   2> 3803 T396 oasc.CachingDirectoryFactory.close Releasing directory:C:\Users\JenkinsSlave\workspace\Lucene-Solr-trunk-Windows\solr\build\solr-core\test\J0\.\org.apache.solr.handler.TestReplicationHandler$SolrInstance-1351349174970\repeater\collection1\data\index
[junit4:junit4]   2> 3804 T396 oejsh.ContextHandler.doStop stopped o.e.j.s.ServletContextHandler{/solr,null}
[junit4:junit4]   2> 3870 T445 C54 REQ [collection1] webapp=/solr path=/select params={wt=javabin&q=*:*&version=2} hits=0 status=0 QTime=0 
[junit4:junit4]   2> 3874 T446 C54 oasc.CachingDirectoryFactory.close Releasing directory:C:\Users\JenkinsSlave\workspace\Lucene-Solr-trunk-Windows\solr\build\solr-core\test\J0\.\org.apache.solr.handler.TestReplicationHandler$SolrInstance-1351349171465\master\collection1\data
[junit4:junit4]   2> 3876 T446 C54 oasc.SolrDeletionPolicy.onInit SolrDeletionPolicy.onInit: commits:num=1
[junit4:junit4]   2> 		commit{dir=MockDirWrapper(org.apache.lucene.store.RAMDirectory@cb0514 lockFactory=org.apache.lucene.store.SingleInstanceLockFactory@c7e125),segFN=segments_1,generation=1,filenames=[segments_1]
[junit4:junit4]   2> 3876 T446 C54 oasc.SolrDeletionPolicy.updateCommits newest commit = 1[segments_1]
[junit4:junit4]   2> 3876 T446 C54 UPDATE [collection1] webapp=/solr path=/update params={wt=javabin&version=2} {add=[0]} 0 2
[junit4:junit4]   2> 3881 T447 C54 UPDATE [collection1] webapp=/solr path=/update params={wt=javabin&version=2} {add=[1]} 0 1
[junit4:junit4]   2> 3884 T448 C54 UPDATE [collection1] webapp=/solr path=/update params={wt=javabin&version=2} {add=[2]} 0 0
[junit4:junit4]   2> 3888 T450 C54 UPDATE [collection1] webapp=/solr path=/update params={wt=javabin&version=2} {add=[3]} 0 1
[junit4:junit4]   2> 3890 T449 C54 UPDATE [collection1] webapp=/solr path=/update params={wt=javabin&version=2} {add=[4]} 0 0
[junit4:junit4]   2> 3893 T445 C54 UPDATE [collection1] webapp=/solr path=/update params={wt=javabin&version=2} {add=[5]} 0 0
[junit4:junit4]   2> 3896 T446 C54 UPDATE [collection1] webapp=/solr path=/update params={wt=javabin&version=2} {add=[6]} 0 0
[junit4:junit4]   2> 3899 T447 C54 UPDATE [collection1] webapp=/solr path=/update params={wt=javabin&version=2} {add=[7]} 0 0
[junit4:junit4]   2> 3902 T448 C54 UPDATE [collection1] webapp=/solr path=/update params={wt=javabin&version=2} {add=[8]} 0 0
[junit4:junit4]   2> 3905 T450 C54 UPDATE [collection1] webapp=/solr path=/update params={wt=javabin&version=2} {add=[9]} 0 0
[junit4:junit4]   2> 3908 T449 C54 UPDATE [collection1] webapp=/solr path=/update params={wt=javabin&version=2} {add=[10]} 0 0
[junit4:junit4]   2> 3912 T445 C54 UPDATE [collection1] webapp=/solr path=/update params={wt=javabin&version=2} {add=[11]} 0 1
[junit4:junit4]   2> 3914 T446 C54 UPDATE [collection1] webapp=/solr path=/update params={wt=javabin&version=2} {add=[12]} 0 0
[junit4:junit4]   2> 3918 T447 C54 UPDATE [collection1] webapp=/solr path=/update params={wt=javabin&version=2} {add=[13]} 0 1
[junit4:junit4]   2> 3921 T448 C54 UPDATE [collection1] webapp=/solr path=/update params={wt=javabin&version=2} {add=[14]} 0 0
[junit4:junit4]   2> 3926 T450 C54 UPDATE [collection1] webapp=/solr path=/update params={wt=javabin&version=2} {add=[15]} 0 2
[junit4:junit4]   2> 3929 T449 C54 UPDATE [collection1] webapp=/solr path=/update params={wt=javabin&version=2} {add=[16]} 0 1
[junit4:junit4]   2> 3931 T445 C54 UPDATE [collection1] webapp=/solr path=/update params={wt=javabin&version=2} {add=[17]} 0 0
[junit4:junit4]   2> 3934 T446 C54 UPDATE [collection1] webapp=/solr path=/update params={wt=javabin&version=2} {add=[18]} 0 0
[junit4:junit4]   2> 3937 T447 C54 UPDATE [collection1] webapp=/solr path=/update params={wt=javabin&version=2} {add=[19]} 0 0
[junit4:junit4]   2> 3940 T448 C54 UPDATE [collection1] webapp=/solr path=/update params={wt=javabin&version=2} {add=[20]} 0 0
[junit4:junit4]   2> 3943 T450 C54 UPDATE [collection1] webapp=/solr path=/update params={wt=javabin&version=2} {add=[21]} 0 0
[junit4:junit4]   2> 3947 T449 C54 UPDATE [collection1] webapp=/solr path=/update params={wt=javabin&version=2} {add=[22]} 0 1
[junit4:junit4]   2> 3951 T445 C54 UPDATE [collection1] webapp=/solr path=/update params={wt=javabin&version=2} {add=[23]} 0 1
[junit4:junit4]   2> 3955 T446 C54 UPDATE [collection1] webapp=/solr path=/update params={wt=javabin&version=2} {add=[24]} 0 1
[junit4:junit4]   2> 3957 T447 C54 UPDATE [collection1] webapp=/solr path=/update params={wt=javabin&version=2} {add=[25]} 0 0
[junit4:junit4]   2> 3960 T448 C54 UPDATE [collection1] webapp=/solr path=/update params={wt=javabin&version=2} {add=[26]} 0 0
[junit4:junit4]   2> 3963 T450 C54 UPDATE [collection1] webapp=/solr path=/update params={wt=javabin&version=2} {add=[27]} 0 0
[junit4:junit4]   2> 3966 T449 C54 UPDATE [collection1] webapp=/solr path=/update params={wt=javabin&version=2} {add=[28]} 0 0
[junit4:junit4]   2> 3969 T445 C54 UPDATE [collection1] webapp=/solr path=/update params={wt=javabin&version=2} {add=[29]} 0 0
[junit4:junit4]   2> 3973 T446 C54 UPDATE [collection1] webapp=/solr path=/update params={wt=javabin&version=2} {add=[30]} 0 0
[junit4:junit4]   2> 3976 T447 C54 UPDATE [collection1] webapp=/solr path=/update params={wt=javabin&version=2} {add=[31]} 0 0
[junit4:junit4]   2> 3979 T448 C54 UPDATE [collection1] webapp=/solr path=/update params={wt=javabin&version=2} {add=[32]} 0 0
[junit4:junit4]   2> 3982 T450 C54 UPDATE [collection1] webapp=/solr path=/update params={wt=javabin&version=2} {add=[33]} 0 0
[junit4:junit4]   2> 3985 T449 C54 UPDATE [collection1] webapp=/solr path=/update params={wt=javabin&version=2} {add=[34]} 0 0
[junit4:junit4]   2> 3988 T445 C54 UPDATE [collection1] webapp=/solr path=/update params={wt=javabin&version=2} {add=[35]} 0 0
[junit4:junit4]   2> 3991 T446 C54 UPDATE [collection1] webapp=/solr path=/update params={wt=javabin&version=2} {add=[36]} 0 0
[junit4:junit4]   2> 3994 T447 C54 UPDATE [collection1] webapp=/solr path=/update params={wt=javabin&version=2} {add=[37]} 0 0
[junit4:junit4]   2> 3997 T448 C54 UPDATE [collection1] webapp=/solr path=/update params={wt=javabin&version=2} {add=[38]} 0 0
[junit4:junit4]   2> 4000 T450 C54 UPDATE [collection1] webapp=/solr path=/update params={wt=javabin&version=2} {add=[39]} 0 0
[junit4:junit4]   2> 4003 T449 C54 UPDATE [collection1] webapp=/solr path=/update params={wt=javabin&version=2} {add=[40]} 0 0
[junit4:junit4]   2> 4006 T445 C54 UPDATE [collection1] webapp=/solr path=/update params={wt=javabin&version=2} {add=[41]} 0 0
[junit4:junit4]   2> 4009 T446 C54 UPDATE [collection1] webapp=/solr path=/update params={wt=javabin&version=2} {add=[42]} 0 0
[junit4:junit4]   2> 4012 T447 C54 UPDATE [collection1] webapp=/solr path=/update params={wt=javabin&version=2} {add=[43]} 0 0
[junit4:junit4]   2> 4016 T448 C54 UPDATE [collection1] webapp=/solr path=/update params={wt=javabin&version=2} {add=[44]} 0 0
[junit4:junit4]   2> 4019 T450 C54 UPDATE [collection1] webapp=/solr path=/update params={wt=javabin&version=2} {add=[45]} 0 0
[junit4:junit4]   2> 4023 T449 C54 UPDATE [collection1] webapp=/solr path=/update params={wt=javabin&version=2} {add=[46]} 0 0
[junit4:junit4]   2> 4026 T445 C54 UPDATE [collection1] webapp=/solr path=/update params={wt=javabin&version=2} {add=[47]} 0 0
[junit4:junit4]   2> 4029 T446 C54 UPDATE [collection1] webapp=/solr path=/update params={wt=javabin&version=2} {add=[48]} 0 0
[junit4:junit4]   2> 4032 T447 C54 UPDATE [collection1] webapp=/solr path=/update params={wt=javabin&version=2} {add=[49]} 0 0
[junit4:junit4]   2> 4035 T448 C54 UPDATE [collection1] webapp=/solr path=/update params={wt=javabin&version=2} {add=[50]} 0 0
[junit4:junit4]   2> 4038 T450 C54 UPDATE [collection1] webapp=/solr path=/update params={wt=javabin&version=2} {add=[51]} 0 0
[junit4:junit4]   2> 4041 T449 C54 UPDATE [collection1] webapp=/solr path=/update params={wt=javabin&version=2} {add=[52]} 0 0
[junit4:junit4]   2> 4044 T445 C54 UPDATE [collection1] webapp=/solr path=/update params={wt=javabin&version=2} {add=[53]} 0 0
[junit4:junit4]   2> 4047 T446 C54 UPDATE [collection1] webapp=/solr path=/update params={wt=javabin&version=2} {add=[54]} 0 0
[junit4:junit4]   2> 4050 T447 C54 UPDATE [collection1] webapp=/solr path=/update params={wt=javabin&version=2} {add=[55]} 0 0
[junit4:junit4]   2> 4053 T448 C54 UPDATE [collection1] webapp=/solr path=/update params={wt=javabin&version=2} {add=[56]} 0 0
[junit4:junit4]   2> 4056 T450 C54 UPDATE [collection1] webapp=/solr path=/update params={wt=javabin&version=2} {add=[57]} 0 0
[junit4:junit4]   2> 4059 T449 C54 UPDATE [collection1] webapp=/solr path=/update params={wt=javabin&version=2} {add=[58]} 0 0
[junit4:junit4]   2> 4062 T445 C54 UPDATE [collection1] webapp=/solr path=/update params={wt=javabin&version=2} {add=[59]} 0 0
[junit4:junit4]   2> 4065 T446 C54 UPDATE [collection1] webapp=/solr path=/update params={wt=javabin&version=2} {add=[60]} 0 0
[junit4:junit4]   2> 4070 T447 C54 UPDATE [collection1] webapp=/solr path=/update params={wt=javabin&version=2} {add=[61]} 0 0
[junit4:junit4]   2> 4073 T448 C54 UPDATE [collection1] webapp=/solr path=/update params={wt=javabin&version=2} {add=[62]} 0 0
[junit4:junit4]   2> 4076 T450 C54 UPDATE [collection1] webapp=/solr path=/update params={wt=javabin&version=2} {add=[63]} 0 0
[junit4:junit4]   2> 4079 T449 C54 UPDATE [collection1] webapp=/solr path=/update params={wt=javabin&version=2} {add=[64]} 0 0
[junit4:junit4]   2> 4083 T445 C54 UPDATE [collection1] webapp=/solr path=/update params={wt=javabin&version=2} {add=[65]} 0 0
[junit4:junit4]   2> 4087 T446 C54 UPDATE [collection1] webapp=/solr path=/update params={wt=javabin&version=2} {add=[66]} 0 1
[junit4:junit4]   2> 4089 T447 C54 UPDATE [collection1] webapp=/solr path=/update params={wt=javabin&version=2} {add=[67]} 0 0
[junit4:junit4]   2> 4092 T448 C54 UPDATE [collection1] webapp=/solr path=/update params={wt=javabin&version=2} {add=[68]} 0 0
[junit4:junit4]   2> 4095 T450 C54 UPDATE [collection1] webapp=/solr path=/update params={wt=javabin&version=2} {add=[69]} 0 0
[junit4:junit4]   2> 4098 T449 C54 UPDATE [collection1] webapp=/solr path=/update params={wt=javabin&version=2} {add=[70]} 0 0
[junit4:junit4]   2> 4101 T445 C54 UPDATE [collection1] webapp=/solr path=/update params={wt=javabin&version=2} {add=[71]} 0 0
[junit4:junit4]   2> 4104 T446 C54 UPDATE [collection1] webapp=/solr path=/update params={wt=javabin&version=2} {add=[72]} 0 0
[junit4:junit4]   2> 4108 T447 C54 UPDATE [collection1] webapp=/solr path=/update params={wt=javabin&version=2} {add=[73]} 0 0
[junit4:junit4]   2> 4110 T448 C54 UPDATE [collection1] webapp=/solr path=/update params={wt=javabin&version=2} {add=[74]} 0 0
[junit4:junit4]   2> 4113 T450 C54 UPDATE [collection1] webapp=/solr path=/update params={wt=javabin&version=2} {add=[75]} 0 0
[junit4:junit4]   2> 4117 T449 C54 UPDATE [collection1] webapp=/solr path=/update params={wt=javabin&version=2} {add=[76]} 0 0
[junit4:junit4]   2> 4121 T445 C54 UPDATE [collection1] webapp=/solr path=/update params={wt=javabin&version=2} {add=[77]} 0 0
[junit4:junit4]   2> 4125 T446 C54 UPDATE [collection1] webapp=/solr path=/update params={wt=javabin&version=2} {add=[78]} 0 0
[junit4:junit4]   2> 4128 T447 C54 UPDATE [collection1] webapp=/solr path=/update params={wt=javabin&version=2} {add=[79]} 0 0
[junit4:junit4]   2> 4132 T448 C54 UPDATE [collection1] webapp=/solr path=/update params={wt=javabin&version=2} {add=[80]} 0 0
[junit4:junit4]   2> 4136 T450 C54 UPDATE [collection1] webapp=/solr path=/update params={wt=javabin&version=2} {add=[81]} 0 0
[junit4:junit4]   2> 4139 T449 C54 UPDATE [collection1] webapp=/solr path=/update params={wt=javabin&version=2} {add=[82]} 0 0
[junit4:junit4]   2> 4142 T445 C54 UPDATE [collection1] webapp=/solr path=/update params={wt=javabin&version=2} {add=[83]} 0 0
[junit4:junit4]   2> 4145 T446 C54 UPDATE [collection1] webapp=/solr path=/update params={wt=javabin&version=2} {add=[84]} 0 0
[junit4:junit4]   2> 4148 T447 C54 UPDATE [collection1] webapp=/solr path=/update params={wt=javabin&version=2} {add=[85]} 0 0
[junit4:junit4]   2> 4151 T448 C54 UPDATE [collection1] webapp=/solr path=/update params={wt=javabin&version=2} {add=[86]} 0 0
[junit4:junit4]   2> 4154 T450 C54 UPDATE [collection1] webapp=/solr path=/update params={wt=javabin&version=2} {add=[87]} 0 0
[junit4:junit4]   2> 4157 T449 C54 UPDATE [collection1] webapp=/solr path=/update params={wt=javabin&version=2} {add=[88]} 0 0
[junit4:junit4]   2> 4160 T445 C54 UPDATE [collection1] webapp=/solr path=/update params={wt=javabin&version=2} {add=[89]} 0 0
[junit4:junit4]   2> 4164 T446 C54 UPDATE [collection1] webapp=/solr path=/update params={wt=javabin&version=2} {add=[90]} 0 0
[junit4:junit4]   2> 4168 T447 C54 UPDATE [collection1] webapp=/solr path=/update params={wt=javabin&version=2} {add=[91]} 0 0
[junit4:junit4]   2> 4171 T448 C54 UPDATE [collection1] webapp=/solr path=/update params={wt=javabin&version=2} {add=[92]} 0 0
[junit4:junit4]   2> 4174 T450 C54 UPDATE [collection1] webapp=/solr path=/update params={wt=javabin&version=2} {add=[93]} 0 0
[junit4:junit4]   2> 4177 T449 C54 UPDATE [collection1] webapp=/solr path=/update params={wt=javabin&version=2} {add=[94]} 0 0
[junit4:junit4]   2> 4180 T445 C54 UPDATE [collection1] webapp=/solr path=/update params={wt=javabin&version=2} {add=[95]} 0 0
[junit4:junit4]   2> 4183 T446 C54 UPDATE [collection1] webapp=/solr path=/update params={wt=javabin&version=2} {add=[96]} 0 0
[junit4:junit4]   2> 4186 T447 C54 UPDATE [collection1] webapp=/solr path=/update params={wt=javabin&version=2} {add=[97]} 0 0
[junit4:junit4]   2> 4189 T450 C54 UPDATE [collection1] webapp=/solr path=/update params={wt=javabin&version=2} {add=[98]} 0 0
[junit4:junit4]   2> 4192 T449 C54 UPDATE [collection1] webapp=/solr path=/update params={wt=javabin&version=2} {add=[99]} 0 0
[junit4:junit4]   2> 4195 T445 C54 UPDATE [collection1] webapp=/solr path=/update params={wt=javabin&version=2} {add=[100]} 0 0
[junit4:junit4]   2> 4198 T446 C54 UPDATE [collection1] webapp=/solr path=/update params={wt=javabin&version=2} {add=[101]} 0 0
[junit4:junit4]   2> 4201 T447 C54 UPDATE [collection1] webapp=/solr path=/update params={wt=javabin&version=2} {add=[102]} 0 0
[junit4:junit4]   2> 4203 T448 C54 UPDATE [collection1] webapp=/solr path=/update params={wt=javabin&version=2} {add=[103]} 0 0
[junit4:junit4]   2> 4206 T450 C54 UPDATE [collection1] webapp=/solr path=/update params={wt=javabin&version=2} {add=[104]} 0 0
[junit4:junit4]   2> 4209 T449 C54 UPDATE [collection1] webapp=/solr path=/update params={wt=javabin&version=2} {add=[105]} 0 0
[junit4:junit4]   2> 4214 T445 C54 UPDATE [collection1] webapp=/solr path=/update params={wt=javabin&version=2} {add=[106]} 0 0
[junit4:junit4]   2> 4217 T446 C54 UPDATE [collection1] webapp=/solr path=/update params={wt=javabin&version=2} {add=[107]} 0 0
[junit4:junit4]   2> 4220 T447 C54 UPDATE [collection1] webapp=/solr path=/update params={wt=javabin&version=2} {add=[108]} 0 0
[junit4:junit4]   2> 4223 T448 C54 UPDATE [collection1] webapp=/solr path=/update params={wt=javabin&version=2} {add=[109]} 0 0
[junit4:junit4]   2> 4226 T450 C54 UPDATE [collection1] webapp=/solr path=/update params={wt=javabin&version=2} {add=[110]} 0 0
[junit4:junit4]   2> 4229 T449 C54 UPDATE [collection1] webapp=/solr path=/update params={wt=javabin&version=2} {add=[111]} 0 0
[junit4:junit4]   2> 4232 T445 C54 UPDATE [collection1] webapp=/solr path=/update params={wt=javabin&version=2} {add=[112]} 0 0
[junit4:junit4]   2> 4235 T446 C54 UPDATE [collection1] webapp=/solr path=/update params={wt=javabin&version=2} {add=[113]} 0 0
[junit4:junit4]   2> 4238 T447 C54 UPDATE [collection1] webapp=/solr path=/update params={wt=javabin&version=2} {add=[114]} 0 0
[junit4:junit4]   2> 4241 T448 C54 UPDATE [collection1] webapp=/solr path=/update params={wt=javabin&version=2} {add=[115]} 0 0
[junit4:junit4]   2> 4244 T450 C54 UPDATE [collection1] webapp=/solr path=/update params={wt=javabin&version=2} {add=[116]} 0 0
[junit4:junit4]   2> 4247 T449 C54 UPDATE [collection1] webapp=/solr path=/update params={wt=javabin&version=2} {add=[117]} 0 0
[junit4:junit4]   2> 4250 T445 C54 UPDATE [collection1] webapp=/solr path=/update params={wt=javabin&version=2} {add=[118]} 0 0
[junit4:junit4]   2> 4253 T446 C54 UPDATE [collection1] webapp=/solr path=/update params={wt=javabin&version=2} {add=[119]} 0 0
[junit4:junit4]   2> 4256 T447 C54 UPDATE [collection1] webapp=/solr path=/update params={wt=javabin&version=2} {add=[120]} 0 0
[junit4:junit4]   2> 4261 T448 C54 UPDATE [collection1] webapp=/solr path=/update params={wt=javabin&version=2} {add=[121]} 0 0
[junit4:junit4]   2> 4263 T450 C54 UPDATE [collection1] webapp=/solr path=/update params={wt=javabin&version=2} {add=[122]} 0 0
[junit4:junit4]   2> 4266 T449 C54 UPDATE [collection1] webapp=/solr path=/update params={wt=javabin&version=2} {add=[123]} 0 0
[junit4:junit4]   2> 4269 T445 C54 UPDATE [collection1] webapp=/solr path=/update params={wt=javabin&version=2} {add=[124]} 0 0
[junit4:junit4]   2> 4272 T446 C54 UPDATE [collection1] webapp=/solr path=/update params={wt=javabin&version=2} {add=[125]} 0 0
[junit4:junit4]   2> 4275 T447 C54 UPDATE [collection1] webapp=/solr path=/update params={wt=javabin&version=2} {add=[126]} 0 0
[junit4:junit4]   2> 4278 T448 C54 UPDATE [collection1] webapp=/solr path=/update params={wt=javabin&version=2} {add=[127]} 0 0
[junit4:junit4]   2> 4281 T450 C54 UPDATE [collection1] webapp=/solr path=/update params={wt=javabin&version=2} {add=[128]} 0 0
[junit4:junit4]   2> 4284 T449 C54 UPDATE [collection1] webapp=/solr path=/update params={wt=javabin&version=2} {add=[129]} 0 0
[junit4:junit4]   2> 4287 T445 C54 UPDATE [collection1] webapp=/solr path=/update params={wt=javabin&version=2} {add=[130]} 0 0
[junit4:junit4]   2> 4290 T446 C54 UPDATE [collection1] webapp=/solr path=/update params={wt=javabin&version=2} {add=[131]} 0 0
[junit4:junit4]   2> 4293 T447 C54 UPDATE [collection1] webapp=/solr path=/update params={wt=javabin&version=2} {add=[132]} 0 0
[junit4:junit4]   2> 4296 T448 C54 UPDATE [collection1] webapp=/solr path=/update params={wt=javabin&version=2} {add=[133]} 0 0
[junit4:junit4]   2> 4299 T450 C54 UPDATE [collection1] webapp=/solr path=/update params={wt=javabin&version=2} {add=[134]} 0 0
[junit4:junit4]   2> 4302 T449 C54 UPDATE [collection1] webapp=/solr path=/update params={wt=javabin&version=2} {add=[135]} 0 0
[junit4:junit4]   2> 4306 T445 C54 UPDATE [collection1] webapp=/solr path=/update params={wt=javabin&version=2} {add=[136]} 0 0
[junit4:junit4]   2> 4309 T446 C54 UPDATE [collection1] webapp=/solr path=/update params={wt=javabin&version=2} {add=[137]} 0 0
[junit4:junit4]   2> 4312 T447 C54 UPDATE [collection1] webapp=/solr path=/update params={wt=javabin&version=2} {add=[138]} 0 0
[junit4:junit4]   2> 4315 T448 C54 UPDATE [collection1] webapp=/solr path=/update params={wt=javabin&version=2} {add=[139]} 0 0
[junit4:junit4]   2> 4318 T450 C54 UPDATE [collection1] webapp=/solr path=/update params={wt=javabin&version=2} {add=[140]} 0 0
[junit4:junit4]   2> 4321 T449 C54 UPDATE [collection1] webapp=/solr path=/update params={wt=javabin&version=2} {add=[141]} 0 0
[junit4:junit4]   2> 4324 T445 C54 UPDATE [collection1] webapp=/solr path=/update params={wt=javabin&version=2} {add=[142]} 0 0
[junit4:junit4]   2> 4327 T446 C54 UPDATE [collection1] webapp=/solr path=/update params={wt=javabin&version=2} {add=[143]} 0 0
[junit4:junit4]   2> 4330 T447 C54 UPDATE [collection1] webapp=/solr path=/update params={wt=javabin&version=2} {add=[144]} 0 0
[junit4:junit4]   2> 4333 T448 C54 UPDATE [collection1] webapp=/solr path=/update params={wt=javabin&version=2} {add=[145]} 0 0
[junit4:junit4]   2> 4336 T450 C54 UPDATE [collection1] webapp=/solr path=/update params={wt=javabin&version=2} {add=[146]} 0 0
[junit4:junit4]   2> 4339 T449 C54 UPDATE [collection1] webapp=/solr path=/update params={wt=javabin&version=2} {add=[147]} 0 0
[junit4:junit4]   2> 4342 T445 C54 UPDATE [collection1] webapp=/solr path=/update params={wt=javabin&version=2} {add=[148]} 0 0
[junit4:junit4]   2> 4345 T446 C54 UPDATE [collection1] webapp=/solr path=/update params={wt=javabin&version=2} {add=[149]} 0 0
[junit4:junit4]   2> 4348 T447 C54 UPDATE [collection1] webapp=/solr path=/update params={wt=javabin&version=2} {add=[150]} 0 0
[junit4:junit4]   2> 4351 T448 C54 UPDATE [collection1] webapp=/solr path=/update params={wt=javabin&version=2} {add=[151]} 0 0
[junit4:junit4]   2> 4356 T450 C54 UPDATE [collection1] webapp=/solr path=/update params={wt=javabin&version=2} {add=[152]} 0 1
[junit4:junit4]   2> 4358 T449 C54 UPDATE [collection1] webapp=/solr path=/update params={wt=javabin&version=2} {add=[153]} 0 0
[junit4:junit4]   2> 4361 T445 C54 UPDATE [collection1] webapp=/solr path=/update params={wt=javabin&version=2} {add=[154]} 0 0
[junit4:junit4]   2> 4364 T446 C54 UPDATE [collection1] webapp=/solr path=/update params={wt=javabin&version=2} {add=[155]} 0 0
[junit4:junit4]   2> 4367 T447 C54 UPDATE [collection1] webapp=/solr path=/update params={wt=javabin&version=2} {add=[156]} 0 0
[junit4:junit4]   2> 4371 T448 C54 UPDATE [collection1] webapp=/solr path=/update params={wt=javabin&version=2} {add=[157]} 0 0
[junit4:junit4]   2> 4374 T450 C54 UPDATE [collection1] webapp=/solr path=/update params={wt=javabin&version=2} {add=[158]} 0 0
[junit4:junit4]   2> 4377 T449 C54 UPDATE [collection1] webapp=/solr path=/update params={wt=javabin&version=2} {add=[159]} 0 0
[junit4:junit4]   2> 4380 T445 C54 UPDATE [collection1] webapp=/solr path=/update params={wt=javabin&version=2} {add=[160]} 0 0
[junit4:junit4]   2> 4383 T446 C54 UPDATE [collection1] webapp=/solr path=/update params={wt=javabin&version=2} {add=[161]} 0 0
[junit4:junit4]   2> 4386 T447 C54 UPDATE [collection1] webapp=/solr path=/update params={wt=javabin&version=2} {add=[162]} 0 0
[junit4:junit4]   2> 4389 T448 C54 UPDATE [collection1] webapp=/solr path=/update params={wt=javabin&version=2} {add=[163]} 0 0
[junit4:junit4]   2> 4392 T450 C54 UPDATE [collection1] webapp=/solr path=/update params={wt=javabin&version=2} {add=[164]} 0 0
[junit4:junit4]   2> 4395 T449 C54 UPDATE [collection1] webapp=/solr path=/update params={wt=javabin&version=2} {add=[165]} 0 0
[junit4:junit4]   2> 4398 T445 C54 UPDATE [collection1] webapp=/solr path=/update params={wt=javabin&version=2} {add=[166]} 0 0
[junit4:junit4]   2> 4403 T446 C54 UPDATE [collection1] webapp=/solr path=/update params={wt=javabin&version=2} {add=[167]} 0 0
[junit4:junit4]   2> 4405 T447 C54 UPDATE [collection1] webapp=/solr path=/update params={wt=javabin&version=2} {add=[168]} 0 0
[junit4:junit4]   2> 4408 T448 C54 UPDATE [collection1] webapp=/solr path=/update params={wt=javabin&version=2} {add=[169]} 0 0
[junit4:junit4]   2> 4411 T450 C54 UPDATE [collection1] webapp=/solr path=/update params={wt=javabin&version=2} {add=[170]} 0 0
[junit4:junit4]   2> 4414 T449 C54 UPDATE [collection1] webapp=/solr path=/update params={wt=javabin&version=2} {add=[171]} 0 0
[junit4:junit4]   2> 4417 T445 C54 UPDATE [collection1] webapp=/solr path=/update params={wt=javabin&version=2} {add=[172]} 0 0
[junit4:junit4]   2> 4420 T446 C54 UPDATE [collection1] webapp=/solr path=/update params={wt=javabin&version=2} {add=[173]} 0 0
[junit4:junit4]   2> 4423 T447 C54 UPDATE [collection1] webapp=/solr path=/update params={wt=javabin&version=2} {add=[174]} 0 0
[junit4:junit4]   2> 4426 T448 C54 UPDATE [collection1] webapp=/solr path=/update params={wt=javabin&version=2} {add=[175]} 0 0
[junit4:junit4]   2> 4429 T450 C54 UPDATE [collection1] webapp=/solr path=/update params={wt=javabin&version=2} {add=[176]} 0 0
[junit4:junit4]   2> 4433 T449 C54 UPDATE [collection1] webapp=/solr path=/update params={wt=javabin&version=2} {add=[177]} 0 0
[junit4:junit4]   2> 4435 T445 C54 UPDATE [collection1] webapp=/solr path=/update params={wt=javabin&version=2} {add=[178]} 0 0
[junit4:junit4]   2> 4438 T446 C54 UPDATE [collection1] webapp=/solr path=/update params={wt=javabin&version=2} {add=[179]} 0 0
[junit4:junit4]   2> 4441 T447 C54 UPDATE [collection1] webapp=/solr path=/update params={wt=javabin&version=2} {add=[180]} 0 0
[junit4:junit4]   2> 4444 T448 C54 UPDATE [collection1] webapp=/solr path=/update params={wt=javabin&version=2} {add=[181]} 0 0
[junit4:junit4]   2> 4448 T450 C54 UPDATE [collection1] webapp=/solr path=/update params={wt=javabin&version=2} {add=[182]} 0 0
[junit4:junit4]   2> 4451 T449 C54 UPDATE [collection1] webapp=/solr path=/update params={wt=javabin&version=2} {add=[183]} 0 0
[junit4:junit4]   2> 4454 T445 C54 UPDATE [collection1] webapp=/solr path=/update params={wt=javabin&version=2} {add=[184]} 0 0
[junit4:junit4]   2> 4457 T446 C54 UPDATE [collection1] webapp=/solr path=/update params={wt=javabin&version=2} {add=[185]} 0 0
[junit4:junit4]   2> 4460 T447 C54 UPDATE [collection1] webapp=/solr path=/update params={wt=javabin&version=2} {add=[186]} 0 0
[junit4:junit4]   2> 4463 T448 C54 UPDATE [collection1] webapp=/solr path=/update params={wt=javabin&version=2} {add=[187]} 0 0
[junit4:junit4]   2> 4466 T450 C54 UPDATE [collection1] webapp=/solr path=/update params={wt=javabin&version=2} {add=[188]} 0 0
[junit4:junit4]   2> 4469 T449 C54 UPDATE [collection1] webapp=/solr path=/update params={wt=javabin&version=2} {add=[189]} 0 0
[junit4:junit4]   2> 4472 T445 C54 UPDATE [collection1] webapp=/solr path=/update params={wt=javabin&version=2} {add=[190]} 0 0
[junit4:junit4]   2> 4475 T446 C54 UPDATE [collection1] webapp=/solr path=/update params={wt=javabin&version=2} {add=[191]} 0 0
[junit4:junit4]   2> 4478 T447 C54 UPDATE [collection1] webapp=/solr path=/update params={wt=javabin&version=2} {add=[192]} 0 0
[junit4:junit4]   2> 4481 T448 C54 UPDATE [collection1] webapp=/solr path=/update params={wt=javabin&version=2} {add=[193]} 0 0
[junit4:junit4]   2> 4485 T450 C54 UPDATE [collection1] webapp=/solr path=/update params={wt=javabin&version=2} {add=[194]} 0 1
[junit4:junit4]   2> 4487 T449 C54 UPDATE [collection1] webapp=/solr path=/update params={wt=javabin&version=2} {add=[195]} 0 0
[junit4:junit4]   2> 4492 T445 C54 UPDATE [collection1] webapp=/solr path=/update params={wt=javabin&version=2} {add=[196]} 0 0
[junit4:junit4]   2> 4494 T446 C54 UPDATE [collection1] webapp=/solr path=/update params={wt=javabin&version=2} {add=[197]} 0 0
[junit4:junit4]   2> 4497 T447 C54 UPDATE [collection1] webapp=/solr path=/update params={wt=javabin&version=2} {add=[198]} 0 0
[junit4:junit4]   2> 4500 T448 C54 UPDATE [collection1] webapp=/solr path=/update params={wt=javabin&version=2} {add=[199]} 0 0
[junit4:junit4]   2> 4503 T450 C54 UPDATE [collection1] webapp=/solr path=/update params={wt=javabin&version=2} {add=[200]} 0 0
[junit4:junit4]   2> 4505 T449 C54 UPDATE [collection1] webapp=/solr path=/update params={wt=javabin&version=2} {add=[201]} 0 0
[junit4:junit4]   2> 4508 T445 C54 UPDATE [collection1] webapp=/solr path=/update params={wt=javabin&version=2} {add=[202]} 0 0
[junit4:junit4]   2> 4511 T446 C54 UPDATE [collection1] webapp=/solr path=/update params={wt=javabin&version=2} {add=[203]} 0 0
[junit4:junit4]   2> 4514 T447 C54 UPDATE [collection1] webapp=/solr path=/update params={wt=javabin&version=2} {add=[204]} 0 0
[junit4:junit4]   2> 4517 T448 C54 UPDATE [collection1] webapp=/solr path=/update params={wt=javabin&version=2} {add=[205]} 0 0
[junit4:junit4]   2> 4520 T450 C54 UPDATE [collection1] webapp=/solr path=/update params={wt=javabin&version=2} {add=[206]} 0 0
[junit4:junit4]   2> 4524 T449 C54 UPDATE [collection1] webapp=/solr path=/update params={wt=javabin&version=2} {add=[207]} 0 1
[junit4:junit4]   2> 4527 T445 C54 UPDATE [collection1] webapp=/solr path=/update params={wt=javabin&version=2} {add=[208]} 0 0
[junit4:junit4]   2> 4530 T446 C54 UPDATE [collection1] webapp=/solr path=/update params={wt=javabin&version=2} {add=[209]} 0 0
[junit4:junit4]   2> 4533 T447 C54 UPDATE [collection1] webapp=/solr path=/update params={wt=javabin&version=2} {add=[210]} 0 0
[junit4:junit4]   2> 4536 T448 C54 UPDATE [collection1] webapp=/solr path=/update params={wt=javabin&version=2} {add=[211]} 0 0
[junit4:junit4]   2> 4539 T450 C54 UPDATE [collection1] webapp=/solr path=/update params={wt=javabin&version=2} {add=[212]} 0 0
[junit4:junit4]   2> 4543 T449 C54 UPDATE [collection1] webapp=/solr path=/update params={wt=javabin&version=2} {add=[213]} 0 0
[junit4:junit4]   2> 4546 T445 C54 UPDATE [collection1] webapp=/solr path=/update params={wt=javabin&version=2} {add=[214]} 0 0
[junit4:junit4]   2> 4549 T446 C54 UPDATE [collection1] webapp=/solr path=/update params={wt=javabin&version=2} {add=[215]} 0 0
[junit4:junit4]   2> 4552 T447 C54 UPDATE [collection1] webapp=/solr path=/update params={wt=javabin&version=2} {add=[216]} 0 0
[junit4:junit4]   2> 4555 T448 C54 UPDATE [collection1] webapp=/solr path=/update params={wt=javabin&version=2} {add=[217]} 0 0
[junit4:junit4]   2> 4558 T450 C54 UPDATE [collection1] webapp=/solr path=/update params={wt=javabin&version=2} {add=[218]} 0 0
[junit4:junit4]   2> 4561 T449 C54 UPDATE [collection1] webapp=/solr path=/update params={wt=javabin&version=2} {add=[219]} 0 0
[junit4:junit4]   2> 4564 T445 C54 UPDATE [collection1] webapp=/solr path=/update params={wt=javabin&version=2} {add=[220]} 0 0
[junit4:junit4]   2> 4567 T446 C54 UPDATE [collection1] webapp=/solr path=/update params={wt=javabin&version=2} {add=[221]} 0 0
[junit4:junit4]   2> 4570 T447 C54 UPDATE [collection1] webapp=/solr path=/update params={wt=javabin&version=2} {add=[222]} 0 0
[junit4:junit4]   2> 4574 T448 C54 UPDATE [collection1] webapp=/solr path=/update params={wt=javabin&version=2} {add=[223]} 0 1
[junit4:junit4]   2> 4576 T450 C54 UPDATE [collection1] webapp=/solr path=/update params={wt=javabin&version=2} {add=[224]} 0 0
[junit4:junit4]   2> 4579 T449 C54 UPDATE [collection1] webapp=/solr path=/update params={wt=javabin&version=2} {add=[225]} 0 0
[junit4:junit4]   2> 4582 T445 C54 UPDATE [collection1] webapp=/solr path=/update params={wt=javabin&version=2} {add=[226]} 0 0
[junit4:junit4]   2> 4585 T446 C54 UPDATE [collection1] webapp=/solr path=/update params={wt=javabin&version=2} {add=[227]} 0 0
[junit4:junit4]   2> 4588 T447 C54 REQ [collection1] webapp=/solr path=/replication params={command=indexversion&wt=javabin&qt=/replication&version=2} status=0 QTime=0 
[junit4:junit4]   2> 4588 T448 C54 UPDATE [collection1] webapp=/solr path=/update params={wt=javabin&version=2} {add=[228]} 0 0
[junit4:junit4]   2> 4592 T449 C54 UPDATE [collection1] webapp=/solr path=/update params={wt=javabin&version=2} {add=[229]} 0 0
[junit4:junit4]   2> 4596 T445 C54 UPDATE [collection1] webapp=/solr path=/update params={wt=javabin&version=2} {add=[230]} 0 0
[junit4:junit4]   2> 4599 T446 C54 UPDATE [collection1] webapp=/solr path=/update params={wt=javabin&version=2} {add=[231]} 0 0
[junit4:junit4]   2> 4602 T447 C54 UPDATE [collection1] webapp=/solr path=/update params={wt=javabin&version=2} {add=[232]} 0 0
[junit4:junit4]   2> 4605 T450 C54 UPDATE [collection1] webapp=/solr path=/update params={wt=javabin&version=2} {add=[233]} 0 0
[junit4:junit4]   2> 4608 T448 C54 UPDATE [collection1] webapp=/solr path=/update params={wt=javabin&version=2} {add=[234]} 0 0
[junit4:junit4]   2> 4611 T449 C54 UPDATE [collection1] webapp=/solr path=/update params={wt=javabin&version=2} {add=[235]} 0 0
[junit4:junit4]   2> 4614 T445 C54 UPDATE [collection1] webapp=/solr path=/update params={wt=javabin&version=2} {add=[236]} 0 0
[junit4:junit4]   2> 4617 T446 C54 UPDATE [collection1] webapp=/solr path=/update params={wt=javabin&version=2} {add=[237]} 0 0
[junit4:junit4]   2> 4621 T447 C54 UPDATE [collection1] webapp=/solr path=/update params={wt=javabin&version=2} {add=[238]} 0 1
[junit4:junit4]   2> 4624 T450 C54 UPDATE [collection1] webapp=/solr path=/update params={wt=javabin&version=2} {add=[239]} 0 0
[junit4:junit4]   2> 4626 T448 C54 UPDATE [collection1] webapp=/solr path=/update params={wt=javabin&version=2} {add=[240]} 0 0
[junit4:junit4]   2> 4629 T449 C54 UPDATE [collection1] webapp=/solr path=/update params={wt=javabin&version=2} {add=[241]} 0 0
[junit4:junit4]   2> 4632 T445 C54 UPDATE [collection1] webapp=/solr path=/update params={wt=javabin&version=2} {add=[242]} 0 0
[junit4:junit4]   2> 4635 T446 C54 UPDATE [collection1] webapp=/solr path=/update params={wt=javabin&version=2} {add=[243]} 0 0
[junit4:junit4]   2> 4639 T447 C54 UPDATE [collection1] webapp=/solr path=/update params={wt=javabin&version=2} {add=[244]} 0 0
[junit4:junit4]   2> 4642 T450 C54 UPDATE [collection1] webapp=/solr path=/update params={wt=javabin&version=2} {add=[245]} 0 0
[junit4:junit4]   2> 4645 T448 C54 UPDATE [collection1] webapp=/solr path=/update params={wt=javabin&version=2} {add=[246]} 0 0
[junit4:junit4]   2> 4648 T449 C54 UPDATE [collection1] webapp=/solr path=/update params={wt=javabin&version=2} {add=[247]} 0 0
[junit4:junit4]   2> 4651 T445 C54 UPDATE [collection1] webapp=/solr path=/update params={wt=javabin&version=2} {add=[248]} 0 0
[junit4:junit4]   2> 4654 T446 C54 UPDATE [collection1] webapp=/solr path=/update params={wt=javabin&version=2} {add=[249]} 0 0
[junit4:junit4]   2> 4657 T447 C54 UPDATE [collection1] webapp=/solr path=/update params={wt=javabin&version=2} {add=[250]} 0 0
[junit4:junit4]   2> 4660 T450 C54 UPDATE [collection1] webapp=/solr path=/update params={wt=javabin&version=2} {add=[251]} 0 0
[junit4:junit4]   2> 4663 T448 C54 UPDATE [collection1] webapp=/solr path=/update params={wt=javabin&version=2} {add=[252]} 0 0
[junit4:junit4]   2> 4666 T449 C54 UPDATE [collection1] webapp=/solr path=/update params={wt=javabin&version=2} {add=[253]} 0 0
[junit4:junit4]   2> 4669 T445 C54 UPDATE [collection1] webapp=/solr path=/update params={wt=javabin&version=2} {add=[254]} 0 0
[junit4:junit4]   2> 4672 T446 C54 UPDATE [collection1] webapp=/solr path=/update params={wt=javabin&version=2} {add=[255]} 0 0
[junit4:junit4]   2> 4675 T447 C54 UPDATE [collection1] webapp=/solr path=/update params={wt=javabin&version=2} {add=[256]} 0 0
[junit4:junit4]   2> 4678 T450 C54 UPDATE [collection1] webapp=/solr path=/update params={wt=javabin&version=2} {add=[257]} 0 0
[junit4:junit4]   2> 4681 T448 C54 UPDATE [collection1] webapp=/solr path=/update params={wt=javabin&version=2} {add=[258]} 0 0
[junit4:junit4]   2> 4684 T449 C54 UPDATE [collection1] webapp=/solr path=/update params={wt=javabin&version=2} {add=[259]} 0 0
[junit4:junit4]   2> 4688 T445 C54 UPDATE [collection1] webapp=/solr path=/update params={wt=javabin&version=2} {add=[260]} 0 0
[junit4:junit4]   2> 4691 T446 C54 UPDATE [collection1] webapp=/solr path=/update params={wt=javabin&version=2} {add=[261]} 0 0
[junit4:junit4]   2> 4694 T447 C54 UPDATE [collection1] webapp=/solr path=/update params={wt=javabin&version=2} {add=[262]} 0 0
[junit4:junit4]   2> 4697 T450 C54 UPDATE [collection1] webapp=/solr path=/update params={wt=javabin&version=2} {add=[263]} 0 0
[junit4:junit4]   2> 4700 T448 C54 UPDATE [collection1] webapp=/solr path=/update params={wt=javabin&version=2} {add=[264]} 0 0
[junit4:junit4]   2> 4703 T449 C54 UPDATE [collection1] webapp=/solr path=/update params={wt=javabin&version=2} {add=[265]} 0 0
[junit4:junit4]   2> 4706 T445 C54 UPDATE [collection1] webapp=/solr path=/update params={wt=javabin&version=2} {add=[266]} 0 0
[junit4:junit4]   2> 4709 T446 C54 UPDATE [collection1] webapp=/solr path=/update params={wt=javabin&version=2} {add=[267]} 0 0
[junit4:junit4]   2> 4712 T447 C54 UPDATE [collection1] webapp=/solr path=/update params={wt=javabin&version=2} {add=[268]} 0 0
[junit4:junit4]   2> 4715 T450 C54 UPDATE [collection1] webapp=/solr path=/update params={wt=javabin&version=2} {add=[269]} 0 0
[junit4:junit4]   2> 4718 T448 C54 UPDATE [collection1] webapp=/solr path=/update params={wt=javabin&version=2} {add=[270]} 0 0
[junit4:junit4]   2> 4721 T449 C54 UPDATE [collection1] webapp=/solr path=/update params={wt=javabin&version=2} {add=[271]} 0 0
[junit4:junit4]   2> 4724 T445 C54 UPDATE [collection1] webapp=/solr path=/update params={wt=javabin&version=2} {add=[272]} 0 0
[junit4:junit4]   2> 4727 T446 C54 UPDATE [collection1] webapp=/solr path=/update params={wt=javabin&version=2} {add=[273]} 0 0
[junit4:junit4]   2> 4730 T447 C54 UPDATE [collection1] webapp=/solr path=/update params={wt=javabin&version=2} {add=[274]} 0 0
[junit4:junit4]   2> 4734 T450 C54 UPDATE [collection1] webapp=/solr path=/update params={wt=javabin&version=2} {add=[275]} 0 0
[junit4:junit4]   2> 4737 T448 C54 UPDATE [collection1] webapp=/solr path=/update params={wt=javabin&version=2} {add=[276]} 0 0
[junit4:junit4]   2> 4740 T449 C54 UPDATE [collection1] webapp=/solr path=/update params={wt=javabin&version=2} {add=[277]} 0 0
[junit4:junit4]   2> 4743 T445 C54 UPDATE [collection1] webapp=/solr path=/update params={wt=javabin&version=2} {add=[278]} 0 0
[junit4:junit4]   2> 4746 T446 C54 UPDATE [collection1] webapp=/solr path=/update params={wt=javabin&version=2} {add=[279]} 0 0
[junit4:junit4]   2> 4749 T447 C54 UPDATE [collection1] webapp=/solr path=/update params={wt=javabin&version=2} {add=[280]} 0 0
[junit4:junit4]   2> 4752 T450 C54 UPDATE [collection1] webapp=/solr path=/update params={wt=javabin&version=2} {add=[281]} 0 0
[junit4:junit4]   2> 4755 T448 C54 UPDATE [collection1] webapp=/solr path=/update params={wt=javabin&version=2} {add=[282]} 0 0
[junit4:junit4]   2> 4758 T449 C54 UPDATE [collection1] webapp=/solr path=/update params={wt=javabin&version=2} {add=[283]} 0 0
[junit4:junit4]   2> 4761 T445 C54 UPDATE [collection1] webapp=/solr path=/update params={wt=javabin&version=2} {add=[284]} 0 0
[junit4:junit4]   2> 4764 T446 C54 UPDATE [collection1] webapp=/solr path=/update params={wt=javabin&version=2} {add=[285]} 0 0
[junit4:junit4]   2> 4767 T447 C54 UPDATE [collection1] webapp=/solr path=/update params={wt=javabin&version=2} {add=[286]} 0 0
[junit4:junit4]   2> 4770 T450 C54 UPDATE [collection1] webapp=/solr path=/update params={wt=javabin&version=2} {add=[287]} 0 0
[junit4:junit4]   2> 4773 T448 C54 UPDATE [collection1] webapp=/solr path=/update params={wt=javabin&version=2} {add=[288]} 0 0
[junit4:junit4]   2> 4776 T449 C54 UPDATE [collection1] webapp=/solr path=/update params={wt=javabin&version=2} {add=[289]} 0 0
[junit4:junit4]   2> 4779 T445 C54 UPDATE [collection1] webapp=/solr path=/update params={wt=javabin&version=2} {add=[290]} 0 0
[junit4:junit4]   2> 4783 T446 C54 UPDATE [collection1] webapp=/solr path=/update params={wt=javabin&version=2} {add=[291]} 0 0
[junit4:junit4]   2> 4786 T447 C54 UPDATE [collection1] webapp=/solr path=/update params={wt=javabin&version=2} {add=[292]} 0 0
[junit4:junit4]   2> 4789 T450 C54 UPDATE [collection1] webapp=/solr path=/update params={wt=javabin&version=2} {add=[293]} 0 0
[junit4:junit4]   2> 4792 T448 C54 UPDATE [collection1] webapp=/solr path=/update params={wt=javabin&version=2} {add=[294]} 0 0
[junit4:junit4]   2> 4796 T449 C54 UPDATE [collection1] webapp=/solr path=/update params={wt=javabin&version=2} {add=[295]} 0 0
[junit4:junit4]   2> 4799 T445 C54 UPDATE [collection1] webapp=/solr path=/update params={wt=javabin&version=2} {add=[296]} 0 0
[junit4:junit4]   2> 4802 T446 C54 UPDATE [collection1] webapp=/solr path=/update params={wt=javabin&version=2} {add=[297]} 0 0
[junit4:junit4]   2> 4806 T447 C54 UPDATE [collection1] webapp=/solr path=/update params={wt=javabin&version=2} {add=[298]} 0 1
[junit4:junit4]   2> 4809 T450 C54 UPDATE [collection1] webapp=/solr path=/update params={wt=javabin&version=2} {add=[299]} 0 1
[junit4:junit4]   2> 4811 T448 C54 UPDATE [collection1] webapp=/solr path=/update params={wt=javabin&version=2} {add=[300]} 0 0
[junit4:junit4]   2> 4814 T449 C54 UPDATE [collection1] webapp=/solr path=/update params={wt=javabin&version=2} {add=[301]} 0 0
[junit4:junit4]   2> 4817 T445 C54 UPDATE [collection1] webapp=/solr path=/update params={wt=javabin&version=2} {add=[302]} 0 0
[junit4:junit4]   2> 4820 T446 C54 UPDATE [collection1] webapp=/solr path=/update params={wt=javabin&version=2} {add=[303]} 0 0
[junit4:junit4]   2> 4823 T447 C54 UPDATE [collection1] webapp=/solr path=/update params={wt=javabin&version=2} {add=[304]} 0 0
[junit4:junit4]   2> 4826 T450 C54 UPDATE [collection1] webapp=/solr path=/update params={wt=javabin&version=2} {add=[305]} 0 0
[junit4:junit4]   2> 4830 T448 C54 UPDATE [collection1] webapp=/solr path=/update params={wt=javabin&version=2} {add=[306]} 0 0
[junit4:junit4]   2> 4839 T449 C54 UPDATE [collection1] webapp=/solr path=/update params={wt=javabin&version=2} {add=[307]} 0 0
[junit4:junit4]   2> 4842 T445 C54 UPDATE [collection1] webapp=/solr path=/update params={wt=javabin&version=2} {add=[308]} 0 0
[junit4:junit4]   2> 4845 T446 C54 UPDATE [collection1] webapp=/solr path=/update params={wt=javabin&version=2} {add=[309]} 0 0
[junit4:junit4]   2> 4848 T447 C54 UPDATE [collection1] webapp=/solr path=/update params={wt=javabin&version=2} {add=[310]} 0 0
[junit4:junit4]   2> 4851 T450 C54 UPDATE [collection1] webapp=/solr path=/update params={wt=javabin&version=2} {add=[311]} 0 0
[junit4:junit4]   2> 4854 T448 C54 UPDATE [collection1] webapp=/solr path=/update params={wt=javabin&version=2} {add=[312]} 0 0
[junit4:junit4]   2> 4857 T449 C54 UPDATE [collection1] webapp=/solr path=/update params={wt=javabin&version=2} {add=[313]} 0 0
[junit4:junit4]   2> 4860 T445 C54 UPDATE [collection1] webapp=/solr path=/update params={wt=javabin&version=2} {add=[314]} 0 0
[junit4:junit4]   2> 4863 T446 C54 UPDATE [collection1] webapp=/solr path=/update params={wt=javabin&version=2} {add=[315]} 0 0
[junit4:junit4]   2> 4866 T447 C54 UPDATE [collection1] webapp=/solr path=/update params={wt=javabin&version=2} {add=[316]} 0 0
[junit4:junit4]   2> 4869 T450 C54 UPDATE [collection1] webapp=/solr path=/update params={wt=javabin&version=2} {add=[317]} 0 0
[junit4:junit4]   2> 4873 T448 C54 UPDATE [collection1] webapp=/solr path=/update params={wt=javabin&version=2} {add=[318]} 0 0
[junit4:junit4]   2> 4877 T449 C54 UPDATE [collection1] webapp=/solr path=/update params={wt=javabin&version=2} {add=[319]} 0 0
[junit4:junit4]   2> 4880 T445 C54 UPDATE [collection1] webapp=/solr path=/update params={wt=javabin&version=2} {add=[320]} 0 0
[junit4:junit4]   2> 4883 T446 C54 UPDATE [collection1] webapp=/solr path=/update params={wt=javabin&version=2} {add=[321]} 0 0
[junit4:junit4]   2> 4886 T447 C54 UPDATE [collection1] webapp=/solr path=/update params={wt=javabin&version=2} {add=[322]} 0 0
[junit4:junit4]   2> 4889 T450 C54 UPDATE [collection1] webapp=/solr path=/update params={wt=javabin&version=2} {add=[323]} 0 0
[junit4:junit4]   2> 4893 T448 C54 UPDATE [collection1] webapp=/solr path=/update params={wt=javabin&version=2} {add=[324]} 0 0
[junit4:junit4]   2> 4895 T449 C54 UPDATE [collection1] webapp=/solr path=/update params={wt=javabin&version=2} {add=[325]} 0 0
[junit4:junit4]   2> 4898 T445 C54 UPDATE [collection1] webapp=/solr path=/update params={wt=javabin&version=2} {add=[326]} 0 0
[junit4:junit4]   2> 4901 T446 C54 UPDATE [collection1] webapp=/solr path=/update params={wt=javabin&version=2} {add=[327]} 0 0
[junit4:junit4]   2> 4904 T447 C54 UPDATE [collection1] webapp=/solr path=/update params={wt=javabin&version=2} {add=[328]} 0 0
[junit4:junit4]   2> 4907 T450 C54 UPDATE [collection1] webapp=/solr path=/update params={wt=javabin&version=2} {add=[329]} 0 0
[junit4:junit4]   2> 4910 T448 C54 UPDATE [collection1] webapp=/solr path=/update params={wt=javabin&version=2} {add=[330]} 0 0
[junit4:junit4]   2> 4913 T449 C54 UPDATE [collection1] webapp=/solr path=/update params={wt=javabin&version=2} {add=[331]} 0 0
[junit4:junit4]   2> 4916 T445 C54 UPDATE [collection1] webapp=/solr path=/update params={wt=javabin&version=2} {add=[332]} 0 0
[junit4:junit4]   2> 4919 T446 C54 UPDATE [collection1] webapp=/solr path=/update params={wt=javabin&version=2} {add=[333]} 0 0
[junit4:junit4]   2> 4923 T447 C54 UPDATE [collection1] webapp=/solr path=/update params={wt=javabin&version=2} {add=[334]} 0 0
[junit4:junit4]   2> 4926 T450 C54 UPDATE [collection1] webapp=/solr path=/update params={wt=javabin&version=2} {add=[335]} 0 0
[junit4:junit4]   2> 4929 T448 C54 UPDATE [collection1] webapp=/solr path=/update params={wt=javabin&version=2} {add=[336]} 0 0
[junit4:junit4]   2> 4932 T449 C54 UPDATE [collection1] webapp=/solr path=/update params={wt=javabin&version=2} {add=[337]} 0 0
[junit4:junit4]   2> 4935 T445 C54 UPDATE [collection1] webapp=/solr path=/update params={wt=javabin&version=2} {add=[338]} 0 0
[junit4:junit4]   2> 4938 T446 C54 UPDATE [collection1] webapp=/solr path=/update params={wt=javabin&version=2} {add=[339]} 0 0
[junit4:junit4]   2> 4941 T447 C54 UPDATE [collection1] webapp=/solr path=/update params={wt=javabin&version=2} {add=[340]} 0 0
[junit4:junit4]   2> 4944 T450 C54 UPDATE [collection1] webapp=/solr path=/update params={wt=javabin&version=2} {add=[341]} 0 0
[junit4:junit4]   2> 4947 T448 C54 UPDATE [collection1] webapp=/solr path=/update params={wt=javabin&version=2} {add=[342]} 0 0
[junit4:junit4]   2> 4951 T449 C54 UPDATE [collection1] webapp=/solr path=/update params={wt=javabin&version=2} {add=[343]} 0 0
[junit4:junit4]   2> 4953 T445 C54 UPDATE [collection1] webapp=/solr path=/update params={wt=javabin&version=2} {add=[344]} 0 0
[junit4:junit4]   2> 4956 T446 C54 UPDATE [collection1] webapp=/solr path=/update params={wt=javabin&version=2} {add=[345]} 0 0
[junit4:junit4]   2> 4959 T447 C54 UPDATE [collection1] webapp=/solr path=/update params={wt=javabin&version=2} {add=[346]} 0 0
[junit4:junit4]   2> 4962 T450 C54 UPDATE [collection1] webapp=/solr path=/update params={wt=javabin&version=2} {add=[347]} 0 0
[junit4:junit4]   2> 4965 T448 C54 UPDATE [collection1] webapp=/solr path=/update params={wt=javabin&version=2} {add=[348]} 0 0
[junit4:junit4]   2> 4968 T449 C54 UPDATE [collection1] webapp=/solr path=/update params={wt=javabin&version=2} {add=[349]} 0 0
[junit4:junit4]   2> 4972 T445 C54 UPDATE [collection1] webapp=/solr path=/update params={wt=javabin&version=2} {add=[350]} 0 0
[junit4:junit4]   2> 4975 T446 C54 UPDATE [collection1] webapp=/solr path=/update params={wt=javabin&version=2} {add=[351]} 0 0
[junit4:junit4]   2> 4978 T447 C54 UPDATE [collection1] webapp=/solr path=/update params={wt=javabin&version=2} {add=[352]} 0 0
[junit4:junit4]   2> 4981 T450 C54 UPDATE [collection1] webapp=/solr path=/update params={wt=javabin&version=2} {add=[353]} 0 0
[junit4:junit4]   2> 4984 T448 C54 UPDATE [collection1] webapp=/solr path=/update params={wt=javabin&version=2} {add=[354]} 0 0
[junit4:junit4]   2> 4987 T449 C54 UPDATE [collection1] webapp=/solr path=/update params={wt=javabin&version=2} {add=[355]} 0 0
[junit4:junit4]   2> 4990 T445 C54 UPDATE [collection1] webapp=/solr path=/update params={wt=javabin&version=2} {add=[356]} 0 0
[junit4:junit4]   2> 4994 T447 C54 UPDATE [collection1] webapp=/solr path=/update params={wt=javabin&version=2} {add=[357]} 0 1
[junit4:junit4]   2> 4996 T450 C54 UPDATE [collection1] webapp=/solr path=/update params={wt=javabin&version=2} {add=[358]} 0 0
[junit4:junit4]   2> 4999 T448 C54 UPDATE [collection1] webapp=/solr path=/update params={wt=javabin&version=2} {add=[359]} 0 0
[junit4:junit4]   2> 5003 T449 C54 UPDATE [collection1] webapp=/solr path=/update params={wt=javabin&version=2} {add=[360]} 0 0
[junit4:junit4]   2> 5006 T446 C54 UPDATE [collection1] webapp=/solr path=/update params={wt=javabin&version=2} {add=[361]} 0 0
[junit4:junit4]   2> 5009 T445 C54 UPDATE [collection1] webapp=/solr path=/update params={wt=javabin&version=2} {add=[362]} 0 0
[junit4:junit4]   2> 5012 T447 C54 UPDATE [collection1] webapp=/solr path=/update params={wt=javabin&version=2} {add=[363]} 0 0
[junit4:junit4]   2> 5015 T450 C54 UPDATE [collection1] webapp=/solr path=/update params={wt=javabin&version=2} {add=[364]} 0 0
[junit4:junit4]   2> 5020 T448 C54 UPDATE [collection1] webapp=/solr path=/update params={wt=javabin&version=2} {add=[365]} 0 1
[junit4:junit4]   2> 5022 T449 C54 UPDATE [collection1] webapp=/solr path=/update params={wt=javabin&version=2} {add=[366]} 0 0
[junit4:junit4]   2> 5026 T446 C54 UPDATE [collection1] webapp=/solr path=/update params={wt=javabin&version=2} {add=[367]} 0 1
[junit4:junit4]   2> 5030 T445 C54 UPDATE [collection1] webapp=/solr path=/update params={wt=javabin&version=2} {add=[368]} 0 1
[junit4:junit4]   2> 5034 T447 C54 UPDATE [collection1] webapp=/solr path=/update params={wt=javabin&version=2} {add=[369]} 0 1
[junit4:junit4]   2> 5037 T450 C54 UPDATE [collection1] webapp=/solr path=/update params={wt=javabin&version=2} {add=[370]} 0 1
[junit4:junit4]   2> 5040 T448 C54 UPDATE [collection1] webapp=/solr path=/update params={wt=javabin&version=2} {add=[371]} 0 1
[junit4:junit4]   2> 5044 T449 C54 UPDATE [collection1] webapp=/solr path=/update params={wt=javabin&version=2} {add=[372]} 0 1
[junit4:junit4]   2> 5048 T446 C54 UPDATE [collection1] webapp=/solr path=/update params={wt=javabin&version=2} {add=[373]} 0 0
[junit4:junit4]   2> 5051 T445 C54 UPDATE [collection1] webapp=/solr path=/update params={wt=javabin&version=2} {add=[374]} 0 0
[junit4:junit4]   2> 5054 T447 C54 UPDATE [collection1] webapp=/solr path=/update params={wt=javabin&version=2} {add=[375]} 0 0
[junit4:junit4]   2> 5057 T450 C54 UPDATE [collection1] webapp=/solr path=/update params={wt=javabin&version=2} {add=[376]} 0 0
[junit4:junit4]   2> 5060 T448 C54 UPDATE [collection1] webapp=/solr path=/update params={wt=javabin&version=2} {add=[377]} 0 0
[junit4:junit4]   2> 5063 T449 C54 UPDATE [collection1] webapp=/solr path=/update params={wt=javabin&version=2} {add=[378]} 0 0
[junit4:junit4]   2> 5068 T446 C54 UPDATE [collection1] webapp=/solr path=/update params={wt=javabin&version=2} {add=[379]} 0 0
[junit4:junit4]   2> 5072 T445 C54 UPDATE [collection1] webapp=/solr path=/update params={wt=javabin&version=2} {add=[380]} 0 0
[junit4:junit4]   2> 5076 T447 C54 UPDATE [collection1] webapp=/solr path=/update params={wt=javabin&version=2} {add=[381]} 0 0
[junit4:junit4]   2> 5078 T450 C54 UPDATE [collection1] webapp=/solr path=/update params={wt=javabin&version=2} {add=[382]} 0 0
[junit4:junit4]   2> 5082 T448 C54 UPDATE [collection1] webapp=/solr path=/update params={wt=javabin&version=2} {add=[383]} 0 0
[junit4:junit4]   2> 5087 T449 C54 UPDATE [collection1] webapp=/solr path=/update params={wt=javabin&version=2} {add=[384]} 0 1
[junit4:junit4]   2> 5091 T446 C54 UPDATE [collection1] webapp=/solr path=/update params={wt=javabin&version=2} {add=[385]} 0 1
[junit4:junit4]   2> 5096 T445 C54 UPDATE [collection1] webapp=/solr path=/update params={wt=javabin&version=2} {add=[386]} 0 1
[junit4:junit4]   2> 5099 T447 C54 UPDATE [collection1] webapp=/solr path=/update params={wt=javabin&version=2} {add=[387]} 0 0
[junit4:junit4]   2> 5102 T450 C54 UPDATE [collection1] webapp=/solr path=/update params={wt=javabin&version=2} {add=[388]} 0 0
[junit4:junit4]   2> 5106 T448 C54 UPDATE [collection1] webapp=/solr path=/update params={wt=javabin&version=2} {add=[389]} 0 0
[junit4:junit4]   2> 5109 T449 C54 UPDATE [collection1] webapp=/solr path=/update params={wt=javabin&version=2} {add=[390]} 0 0
[junit4:junit4]   2> 5113 T446 C54 UPDATE [collection1] webapp=/solr path=/update params={wt=javabin&version=2} {add=[391]} 0 0
[junit4:junit4]   2> 5117 T445 C54 UPDATE [collection1] webapp=/solr path=/update params={wt=javabin&version=2} {add=[392]} 0 1
[junit4:junit4]   2> 5120 T447 C54 UPDATE [collection1] webapp=/solr path=/update params={wt=javabin&version=2} {add=[393]} 0 0
[junit4:junit4]   2> 5123 T450 C54 UPDATE [collection1] webapp=/solr path=/update params={wt=javabin&version=2} {add=[394]} 0 0
[junit4:junit4]   2> 5126 T448 C54 UPDATE [collection1] webapp=/solr path=/update params={wt=javabin&version=2} {add=[395]} 0 0
[junit4:junit4]   2> 5129 T449 C54 UPDATE [collection1] webapp=/solr path=/update params={wt=javabin&version=2} {add=[396]} 0 0
[junit4:junit4]   2> 5133 T446 C54 UPDATE [collection1] webapp=/solr path=/update params={wt=javabin&version=2} {add=[397]} 0 0
[junit4:junit4]   2> 5136 T445 C54 UPDATE [collection1] webapp=/solr path=/update params={wt=javabin&version=2} {add=[398]} 0 0
[junit4:junit4]   2> 5139 T447 C54 UPDATE [collection1] webapp=/solr path=/update params={wt=javabin&version=2} {add=[399]} 0 0
[junit4:junit4]   2> 5142 T450 C54 UPDATE [collection1] webapp=/solr path=/update params={wt=javabin&version=2} {add=[400]} 0 0
[junit4:junit4]   2> 5145 T448 C54 UPDATE [collection1] webapp=/solr path=/update params={wt=javabin&version=2} {add=[401]} 0 0
[junit4:junit4]   2> 5148 T449 C54 UPDATE [collection1] webapp=/solr path=/update params={wt=javabin&version=2} {add=[402]} 0 0
[junit4:junit4]   2> 5151 T446 C54 UPDATE [collection1] webapp=/solr path=/update params={wt=javabin&version=2} {add=[403]} 0 0
[junit4:junit4]   2> 5154 T445 C54 UPDATE [collection1] webapp=/solr path=/update params={wt=javabin&version=2} {add=[404]} 0 0
[junit4:junit4]   2> 5157 T447 C54 UPDATE [collection1] webapp=/solr path=/update params={wt=javabin&version=2} {add=[405]} 0 0
[junit4:junit4]   2> 5162 T450 C54 UPDATE [collection1] webapp=/solr path=/update params={wt=javabin&version=2} {add=[406]} 0 0
[junit4:junit4]   2> 5166 T448 C54 UPDATE [collection1] webapp=/solr path=/update params={wt=javabin&version=2} {add=[407]} 0 0
[junit4:junit4]   2> 5169 T449 C54 UPDATE [collection1] webapp=/solr path=/update params={wt=javabin&version=2} {add=[408]} 0 0
[junit4:junit4]   2> 5172 T446 C54 UPDATE [collection1] webapp=/solr path=/update params={wt=javabin&version=2} {add=[409]} 0 0
[junit4:junit4]   2> 5175 T445 C54 UPDATE [collection1] webapp=/solr path=/update params={wt=javabin&version=2} {add=[410]} 0 0
[junit4:junit4]   2> 5179 T447 C54 UPDATE [collection1] webapp=/solr path=/update params={wt=javabin&version=2} {add=[411]} 0 0
[junit4:junit4]   2> 5182 T450 C54 UPDATE [collection1] webapp=/solr path=/update params={wt=javabin&version=2} {add=[412]} 0 0
[junit4:junit4]   2> 5185 T448 C54 UPDATE [collection1] webapp=/solr path=/update params={wt=javabin&version=2} {add=[413]} 0 0
[junit4:junit4]   2> 5188 T449 C54 UPDATE [collection1] webapp=/solr path=/update params={wt=javabin&version=2} {add=[414]} 0 0
[junit4:junit4]   2> 5191 T446 C54 UPDATE [collection1] webapp=/solr path=/update params={wt=javabin&version=2} {add=[415]} 0 0
[junit4:junit4]   2> 5194 T445 C54 UPDATE [collection1] webapp=/solr path=/update params={wt=javabin&version=2} {add=[416]} 0 0
[junit4:junit4]   2> 5197 T447 C54 UPDATE [collection1] webapp=/solr path=/update params={wt=javabin&version=2} {add=[417]} 0 0
[junit4:junit4]   2> 5200 T450 C54 UPDATE [collection1] webapp=/solr path=/update params={wt=javabin&version=2} {add=[418]} 0 0
[junit4:junit4]   2> 5203 T448 C54 UPDATE [collection1] webapp=/solr path=/update params={wt=javabin&version=2} {add=[419]} 0 0
[junit4:junit4]   2> 5206 T449 C54 UPDATE [collection1] webapp=/solr path=/update params={wt=javabin&version=2} {add=[420]} 0 0
[junit4:junit4]   2> 5210 T446 C54 UPDATE [collection1] webapp=/solr path=/update params={wt=javabin&version=2} {add=[421]} 0 0
[junit4:junit4]   2> 5213 T445 C54 UPDATE [collection1] webapp=/solr path=/update params={wt=javabin&version=2} {add=[422]} 0 0
[junit4:junit4]   2> 5217 T447 C54 UPDATE [collection1] webapp=/solr path=/update params={wt=javabin&version=2} {add=[423]} 0 0
[junit4:junit4]   2> 5220 T450 C54 UPDATE [collection1] webapp=/solr path=/update params={wt=javabin&version=2} {add=[424]} 0 0
[junit4:junit4]   2> 5223 T448 C54 UPDATE [collection1] webapp=/solr path=/update params={wt=javabin&version=2} {add=[425]} 0 0
[junit4:junit4]   2> 5226 T449 C54 UPDATE [collection1] webapp=/solr path=/update params={wt=javabin&version=2} {add=[426]} 0 0
[junit4:junit4]   2> 5229 T446 C54 UPDATE [collection1] webapp=/solr path=/update params={wt=javabin&version=2} {add=[427]} 0 0
[junit4:junit4]   2> 5232 T445 C54 UPDATE [collection1] webapp=/solr path=/update params={wt=javabin&version=2} {add=[428]} 0 0
[junit4:junit4]   2> 5235 T447 C54 UPDATE [collection1] webapp=/solr path=/update params={wt=javabin&version=2} {add=[429]} 0 0
[junit4:junit4]   2> 5239 T450 C54 UPDATE [collection1] webapp=/solr path=/update params={wt=javabin&version=2} {add=[430]} 0 1
[junit4:junit4]   2> 5241 T448 C54 UPDATE [collection1] webapp=/solr path=/update params={wt=javabin&version=2} {add=[431]} 0 0
[junit4:junit4]   2> 5244 T449 C54 UPDATE [collection1] webapp=/solr path=/update params={wt=javabin&version=2} {add=[432]} 0 0
[junit4:junit4]   2> 5247 T446 C54 UPDATE [collection1] webapp=/solr path=/update params={wt=javabin&version=2} {add=[433]} 0 0
[junit4:junit4]   2> 5250 T445 C54 UPDATE [collection1] webapp=/solr path=/update params={wt=javabin&version=2} {add=[434]} 0 0
[junit4:junit4]   2> 5253 T447 C54 UPDATE [collection1] webapp=/solr path=/update params={wt=javabin&version=2} {add=[435]} 0 0
[junit4:junit4]   2> 5257 T450 C54 UPDATE [collection1] webapp=/solr path=/update params={wt=javabin&version=2} {add=[436]} 0 0
[junit4:junit4]   2> 5260 T448 C54 UPDATE [collection1] webapp=/solr path=/update params={wt=javabin&version=2} {add=[437]} 0 0
[junit4:junit4]   2> 5263 T449 C54 UPDATE [collection1] webapp=/solr path=/update params={wt=javabin&version=2} {add=[438]} 0 0
[junit4:junit4]   2> 5267 T446 C54 UPDATE [collection1] webapp=/solr path=/update params={wt=javabin&version=2} {add=[439]} 0 0
[junit4:junit4]   2> 5270 T445 C54 UPDATE [collection1] webapp=/solr path=/update params={wt=javabin&version=2} {add=[440]} 0 0
[junit4:junit4]   2> 5273 T447 C54 UPDATE [collection1] webapp=/solr path=/update params={wt=javabin&version=2} {add=[441]} 0 0
[junit4:junit4]   2> 5276 T450 C54 UPDATE [collection1] webapp=/solr path=/update params={wt=javabin&version=2} {add=[442]} 0 0
[junit4:junit4]   2> 5279 T448 C54 UPDATE [collection1] webapp=/solr path=/update params={wt=javabin&version=2} {add=[443]} 0 0
[junit4:junit4]   2> 5282 T449 C54 UPDATE [collection1] webapp=/solr path=/update params={wt=javabin&version=2} {add=[444]} 0 0
[junit4:junit4]   2> 5285 T446 C54 UPDATE [collection1] webapp=/solr path=/update params={wt=javabin&version=2} {add=[445]} 0 0
[junit4:junit4]   2> 5288 T445 C54 UPDATE [collection1] webapp=/solr path=/update params={wt=javabin&version=2} {add=[446]} 0 0
[junit4:junit4]   2> 5291 T447 C54 UPDATE [collection1] webapp=/solr path=/update params={wt=javabin&version=2} {add=[447]} 0 0
[junit4:junit4]   2> 5294 T450 C54 UPDATE [collection1] webapp=/solr path=/update params={wt=javabin&version=2} {add=[448]} 0 0
[junit4:junit4]   2> 5297 T448 C54 UPDATE [collection1] webapp=/solr path=/update params={wt=javabin&version=2} {add=[449]} 0 0
[junit4:junit4]   2> 5300 T449 C54 UPDATE [collection1] webapp=/solr path=/update params={wt=javabin&version=2} {add=[450]} 0 0
[junit4:junit4]   2> 5305 T446 C54 UPDATE [collection1] webapp=/solr path=/update params={wt=javabin&version=2} {add=[451]} 0 0
[junit4:junit4]   2> 5308 T445 C54 UPDATE [collection1] webapp=/solr path=/update params={wt=javabin&version=2} {add=[452]} 0 0
[junit4:junit4]   2> 5311 T447 C54 UPDATE [collection1] webapp=/solr path=/update params={wt=javabin&version=2} {add=[453]} 0 0
[junit4:junit4]   2> 5314 T450 C54 UPDATE [collection1] webapp=/solr path=/update params={wt=javabin&version=2} {add=[454]} 0 0
[junit4:junit4]   2> 5317 T448 C54 UPDATE [collection1] webapp=/solr path=/update params={wt=javabin&version=2} {add=[455]} 0 0
[junit4:junit4]   2> 5320 T449 C54 UPDATE [collection1] webapp=/solr path=/update params={wt=javabin&version=2} {add=[456]} 0 0
[junit4:junit4]   2> 5323 T446 C54 UPDATE [collection1] webapp=/solr path=/update params={wt=javabin&version=2} {add=[457]} 0 0
[junit4:junit4]   2> 5326 T445 C54 UPDATE [collection1] webapp=/solr path=/update params={wt=javabin&version=2} {add=[458]} 0 0
[junit4:junit4]   2> 5329 T447 C54 UPDATE [collection1] webapp=/solr path=/update params={wt=javabin&version=2} {add=[459]} 0 0
[junit4:junit4]   2> 5332 T450 C54 UPDATE [collection1] webapp=/solr path=/update params={wt=javabin&version=2} {add=[460]} 0 0
[junit4:junit4]   2> 5335 T448 C54 UPDATE [collection1] webapp=/solr path=/update params={wt=javabin&version=2} {add=[461]} 0 0
[junit4:junit4]   2> 5339 T449 C54 UPDATE [collection1] webapp=/solr path=/update params={wt=javabin&version=2} {add=[462]} 0 0
[junit4:junit4]   2> 5341 T446 C54 UPDATE [collection1] webapp=/solr path=/update params={wt=javabin&version=2} {add=[463]} 0 0
[junit4:junit4]   2> 5344 T445 C54 UPDATE [collection1] webapp=/solr path=/update params={wt=javabin&version=2} {add=[464]} 0 0
[junit4:junit4]   2> 5347 T447 C54 UPDATE [collection1] webapp=/solr path=/update params={wt=javabin&version=2} {add=[465]} 0 0
[junit4:junit4]   2> 5351 T450 C54 UPDATE [collection1] webapp=/solr path=/update params={wt=javabin&version=2} {add=[466]} 0 0
[j

[...truncated too long message...]

seerTest, DOMUtilTest, TestIndexingPerformance, TestDefaultSimilarityFactory, RAMDirectoryFactoryTest, DateFieldTest, ResourceLoaderTest, TestFiltering, TestLMDirichletSimilarityFactory, DebugComponentTest, SpatialFilterTest, StatsComponentTest, IndexReaderFactoryTest, NumericFieldsTest, TestBinaryField, BadIndexSchemaTest, IndexBasedSpellCheckerTest, TimeZoneUtilsTest, RequiredFieldsTest, SpellCheckComponentTest, TestJmxIntegration, OpenExchangeRatesOrgProviderTest, TestAnalyzedSuggestions, BasicZkTest, TestRealTimeGet, TestDocSet, UUIDFieldTest, XmlUpdateRequestHandlerTest, SolrRequestParserTest, TestSuggestSpellingConverter, CacheHeaderTest, DirectUpdateHandlerOptimizeTest, TestPluginEnable, ResponseLogComponentTest, SolrCoreCheckLockOnStartupTest, JsonLoaderTest, TestCodecSupport, TestCollationField, UpdateParamsTest, CoreContainerCoreInitFailuresTest, FieldAnalysisRequestHandlerTest, URLClassifyProcessorTest, TestSolrDeletionPolicy1, TestRTGBase, PrimitiveFieldTypeTest, TestIndexSearcher, BasicDistributedZkTest, RecoveryZkTest, FullSolrCloudDistribCmdsTest, LeaderElectionIntegrationTest, LeaderElectionTest, DistributedSpellCheckComponentTest, TestDistributedGrouping, TestRandomFaceting, SpellCheckCollatorTest, TestExtendedDismaxParser, SoftAutoCommitTest, AutoCommitTest, ZkSolrClientTest, TestFaceting, WordBreakSolrSpellCheckerTest, DistributedTermsComponentTest, TestRecovery, TestJoin, TestRangeQuery, DirectUpdateHandlerTest, LukeRequestHandlerTest, TestSort, TestGroupingSearch, DirectSolrSpellCheckerTest, FileBasedSpellCheckerTest, PeerSyncTest, QueryElevationComponentTest, TestBinaryResponseWriter, SampleTest, HighlighterTest, CoreAdminHandlerTest, TestFunctionQuery, TestRemoteStreaming, PolyFieldTest, MoreLikeThisHandlerTest, DocumentBuilderTest, MBeansHandlerTest, DistributedQueryElevationComponentTest, DisMaxRequestHandlerTest, IndexSchemaTest, BinaryUpdateRequestHandlerTest, DistanceFunctionTest, SolrInfoMBeanTest, XsltUpdateRequestHandlerTest, MinimalSchemaTest, StandardRequestHandlerTest, TestQueryTypes, TestPHPSerializedResponseWriter, TestSurroundQueryParser, IndexSchemaRuntimeFieldTest, SolrPluginUtilsTest, TestValueSourceCache, ReturnFieldsTest, RequestHandlersTest, SearchHandlerTest, SuggesterFSTTest, SuggesterTSTTest, SolrCmdDistributorTest, CSVRequestHandlerTest, TestSearchPerf, TestFoldingMultitermQuery, TestLuceneMatchVersion, TestPropInject, TestWriterPerf, NoCacheHeaderTest, AlternateDirectoryTest, FieldMutatingUpdateProcessorTest, TestUpdate, HighlighterConfigTest, TestSolrDeletionPolicy2, TestPropInjectDefaults, TestXIncludeConfig, TestLFUCache, SolrIndexConfigTest, TestNumberUtils, MultiTermTest, TestSolrCoreProperties, TestJmxMonitoredMap, TestConfig, SpellPossibilityIteratorTest, TestPhraseSuggestions, LegacyHTMLStripCharFilterTest, FileUtilsTest, TestSolrXMLSerializer, TestBadConfig, TestLRUCache, SystemInfoHandlerTest, TestUtils, PreAnalyzedFieldTest, ZkNodePropsTest, CircularListTest, AnalysisAfterCoreReloadTest, TestDocumentBuilder, PathHierarchyTokenizerFactoryTest, BasicDistributedZk2Test, ClusterStateTest, ClusterStateUpdateTest, SyncSliceTest]
[junit4:junit4]   2> NOTE: reproduce with: ant test  -Dtestcase=SyncSliceTest -Dtests.seed=C420575F98B7BAD8 -Dtests.slow=true -Dtests.locale=en_SG -Dtests.timezone=Indian/Christmas -Dtests.file.encoding=ISO-8859-1
[junit4:junit4] ERROR   0.00s | SyncSliceTest (suite) <<<
[junit4:junit4]    > Throwable #1: java.lang.AssertionError: ERROR: SolrIndexSearcher opens=8 closes=7
[junit4:junit4]    > 	at __randomizedtesting.SeedInfo.seed([C420575F98B7BAD8]:0)
[junit4:junit4]    > 	at org.junit.Assert.fail(Assert.java:93)
[junit4:junit4]    > 	at org.apache.solr.SolrTestCaseJ4.endTrackingSearchers(SolrTestCaseJ4.java:243)
[junit4:junit4]    > 	at org.apache.solr.SolrTestCaseJ4.afterClass(SolrTestCaseJ4.java:97)
[junit4:junit4]    > 	at sun.reflect.GeneratedMethodAccessor17.invoke(Unknown Source)
[junit4:junit4]    > 	at sun.reflect.DelegatingMethodAccessorImpl.invoke(DelegatingMethodAccessorImpl.java:43)
[junit4:junit4]    > 	at java.lang.reflect.Method.invoke(Method.java:601)
[junit4:junit4]    > 	at com.carrotsearch.randomizedtesting.RandomizedRunner.invoke(RandomizedRunner.java:1559)
[junit4:junit4]    > 	at com.carrotsearch.randomizedtesting.RandomizedRunner.access$600(RandomizedRunner.java:79)
[junit4:junit4]    > 	at com.carrotsearch.randomizedtesting.RandomizedRunner$5.evaluate(RandomizedRunner.java:700)
[junit4:junit4]    > 	at com.carrotsearch.randomizedtesting.rules.StatementAdapter.evaluate(StatementAdapter.java:36)
[junit4:junit4]    > 	at com.carrotsearch.randomizedtesting.rules.SystemPropertiesRestoreRule$1.evaluate(SystemPropertiesRestoreRule.java:53)
[junit4:junit4]    > 	at org.apache.lucene.util.AbstractBeforeAfterRule$1.evaluate(AbstractBeforeAfterRule.java:45)
[junit4:junit4]    > 	at org.apache.lucene.util.TestRuleStoreClassName$1.evaluate(TestRuleStoreClassName.java:42)
[junit4:junit4]    > 	at com.carrotsearch.randomizedtesting.rules.SystemPropertiesInvariantRule$1.evaluate(SystemPropertiesInvariantRule.java:55)
[junit4:junit4]    > 	at com.carrotsearch.randomizedtesting.rules.NoShadowingOrOverridesOnMethodsRule$1.evaluate(NoShadowingOrOverridesOnMethodsRule.java:39)
[junit4:junit4]    > 	at com.carrotsearch.randomizedtesting.rules.NoShadowingOrOverridesOnMethodsRule$1.evaluate(NoShadowingOrOverridesOnMethodsRule.java:39)
[junit4:junit4]    > 	at com.carrotsearch.randomizedtesting.rules.StatementAdapter.evaluate(StatementAdapter.java:36)
[junit4:junit4]    > 	at org.apache.lucene.util.TestRuleAssertionsRequired$1.evaluate(TestRuleAssertionsRequired.java:43)
[junit4:junit4]    > 	at org.apache.lucene.util.TestRuleMarkFailure$1.evaluate(TestRuleMarkFailure.java:48)
[junit4:junit4]    > 	at org.apache.lucene.util.TestRuleIgnoreAfterMaxFailures$1.evaluate(TestRuleIgnoreAfterMaxFailures.java:70)
[junit4:junit4]    > 	at org.apache.lucene.util.TestRuleIgnoreTestSuites$1.evaluate(TestRuleIgnoreTestSuites.java:55)
[junit4:junit4]    > 	at com.carrotsearch.randomizedtesting.rules.StatementAdapter.evaluate(StatementAdapter.java:36)
[junit4:junit4]    > 	at com.carrotsearch.randomizedtesting.ThreadLeakControl$StatementRunner.run(ThreadLeakControl.java:358)
[junit4:junit4]    > 	at java.lang.Thread.run(Thread.java:722)
[junit4:junit4]    > Throwable #2: com.carrotsearch.randomizedtesting.ThreadLeakError: 1 thread leaked from SUITE scope at org.apache.solr.cloud.SyncSliceTest: 
[junit4:junit4]    >    1) Thread[id=3474, name=searcherExecutor-2239-thread-1, state=WAITING, group=TGRP-SyncSliceTest]
[junit4:junit4]    >         at sun.misc.Unsafe.park(Native Method)
[junit4:junit4]    >         at java.util.concurrent.locks.LockSupport.park(LockSupport.java:186)
[junit4:junit4]    >         at java.util.concurrent.locks.AbstractQueuedSynchronizer$ConditionObject.await(AbstractQueuedSynchronizer.java:2043)
[junit4:junit4]    >         at java.util.concurrent.LinkedBlockingQueue.take(LinkedBlockingQueue.java:442)
[junit4:junit4]    >         at java.util.concurrent.ThreadPoolExecutor.getTask(ThreadPoolExecutor.java:1043)
[junit4:junit4]    >         at java.util.concurrent.ThreadPoolExecutor.runWorker(ThreadPoolExecutor.java:1103)
[junit4:junit4]    >         at java.util.concurrent.ThreadPoolExecutor$Worker.run(ThreadPoolExecutor.java:603)
[junit4:junit4]    >         at java.lang.Thread.run(Thread.java:722)
[junit4:junit4]    > 	at __randomizedtesting.SeedInfo.seed([C420575F98B7BAD8]:0)
[junit4:junit4]    > Throwable #3: com.carrotsearch.randomizedtesting.ThreadLeakError: There are still zombie threads that couldn't be terminated:
[junit4:junit4]    >    1) Thread[id=3474, name=searcherExecutor-2239-thread-1, state=WAITING, group=TGRP-SyncSliceTest]
[junit4:junit4]    >         at sun.misc.Unsafe.park(Native Method)
[junit4:junit4]    >         at java.util.concurrent.locks.LockSupport.park(LockSupport.java:186)
[junit4:junit4]    >         at java.util.concurrent.locks.AbstractQueuedSynchronizer$ConditionObject.await(AbstractQueuedSynchronizer.java:2043)
[junit4:junit4]    >         at java.util.concurrent.LinkedBlockingQueue.take(LinkedBlockingQueue.java:442)
[junit4:junit4]    >         at java.util.concurrent.ThreadPoolExecutor.getTask(ThreadPoolExecutor.java:1043)
[junit4:junit4]    >         at java.util.concurrent.ThreadPoolExecutor.runWorker(ThreadPoolExecutor.java:1103)
[junit4:junit4]    >         at java.util.concurrent.ThreadPoolExecutor$Worker.run(ThreadPoolExecutor.java:603)
[junit4:junit4]    >         at java.lang.Thread.run(Thread.java:722)
[junit4:junit4]    > 	at __randomizedtesting.SeedInfo.seed([C420575F98B7BAD8]:0)
[junit4:junit4] Completed in 238.39s, 1 test, 2 failures, 2 errors <<< FAILURES!

[...truncated 53 lines...]
BUILD FAILED
C:\Users\JenkinsSlave\workspace\Lucene-Solr-trunk-Windows\build.xml:335: The following error occurred while executing this line:
C:\Users\JenkinsSlave\workspace\Lucene-Solr-trunk-Windows\build.xml:39: The following error occurred while executing this line:
C:\Users\JenkinsSlave\workspace\Lucene-Solr-trunk-Windows\solr\build.xml:178: The following error occurred while executing this line:
C:\Users\JenkinsSlave\workspace\Lucene-Solr-trunk-Windows\lucene\module-build.xml:61: The following error occurred while executing this line:
C:\Users\JenkinsSlave\workspace\Lucene-Solr-trunk-Windows\lucene\common-build.xml:1159: The following error occurred while executing this line:
C:\Users\JenkinsSlave\workspace\Lucene-Solr-trunk-Windows\lucene\common-build.xml:827: There were test failures: 232 suites, 961 tests, 5 suite-level errors, 1 failure, 47 ignored (5 assumptions)

Total time: 41 minutes 2 seconds
Build step 'Invoke Ant' marked build as failure
Archiving artifacts
Recording test results
Description set: Java: 32bit/jdk1.7.0_07 -server -XX:+UseConcMarkSweepGC
Email was triggered for: Failure
Sending email for trigger: Failure



Mime
View raw message