lucene-dev mailing list archives

Site index · List index
Message view « Date » · « Thread »
Top « Date » · « Thread »
From Charlie Cron <hudsonsevilt...@gmail.com>
Subject Build failed in Jenkins: fast-io-beasting #6255
Date Mon, 29 Oct 2012 17:30:35 GMT
See <http://sierranevada.servebeer.com/job/fast-io-beasting/6255/>

------------------------------------------
[...truncated 14007 lines...]
[junit4:junit4]   2> 255325 T88 oaz.ClientCnxn$SendThread.startConnect Opening socket connection
to server localhost.localdomain/127.0.0.1:37444
[junit4:junit4]   2> 255325 T88 oaz.ClientCnxn$SendThread.run WARNING Session 0x13aad8f0a0e0006
for server null, unexpected error, closing socket connection and attempting reconnect java.net.ConnectException:
Connection refused
[junit4:junit4]   2> 	at sun.nio.ch.SocketChannelImpl.checkConnect(Native Method)
[junit4:junit4]   2> 	at sun.nio.ch.SocketChannelImpl.finishConnect(SocketChannelImpl.java:567)
[junit4:junit4]   2> 	at org.apache.zookeeper.ClientCnxn$SendThread.run(ClientCnxn.java:1143)
[junit4:junit4]   2> 
[junit4:junit4]   2> 255833 T74 oaz.ClientCnxn$SendThread.startConnect Opening socket connection
to server localhost.localdomain/127.0.0.1:37444
[junit4:junit4]   2> 255834 T74 oaz.ClientCnxn$SendThread.run WARNING Session 0x13aad8f0a0e0005
for server null, unexpected error, closing socket connection and attempting reconnect java.net.ConnectException:
Connection refused
[junit4:junit4]   2> 	at sun.nio.ch.SocketChannelImpl.checkConnect(Native Method)
[junit4:junit4]   2> 	at sun.nio.ch.SocketChannelImpl.finishConnect(SocketChannelImpl.java:567)
[junit4:junit4]   2> 	at org.apache.zookeeper.ClientCnxn$SendThread.run(ClientCnxn.java:1143)
[junit4:junit4]   2> 
[junit4:junit4]   2> 255834 T50 oaz.ClientCnxn$SendThread.startConnect Opening socket connection
to server localhost.localdomain/127.0.0.1:37444
[junit4:junit4]   2> 255850 T62 oaz.ClientCnxn$SendThread.startConnect Opening socket connection
to server localhost.localdomain/127.0.0.1:37444
[junit4:junit4]   2> 255851 T62 oaz.ClientCnxn$SendThread.run WARNING Session 0x13aad8f0a0e0004
for server null, unexpected error, closing socket connection and attempting reconnect java.net.ConnectException:
Connection refused
[junit4:junit4]   2> 	at sun.nio.ch.SocketChannelImpl.checkConnect(Native Method)
[junit4:junit4]   2> 	at sun.nio.ch.SocketChannelImpl.finishConnect(SocketChannelImpl.java:567)
[junit4:junit4]   2> 	at org.apache.zookeeper.ClientCnxn$SendThread.run(ClientCnxn.java:1143)
[junit4:junit4]   2> 
[junit4:junit4]   2> 255935 T51 oaz.ClientCnxn$EventThread.run EventThread shut down
[junit4:junit4]   2> 255935 T16 oaz.ZooKeeper.close Session: 0x13aad8f0a0e0003 closed
[junit4:junit4]   2> 255958 T16 oejsh.ContextHandler.doStop stopped o.e.j.s.ServletContextHandler{/solr,null}
[junit4:junit4]   2> 256010 T16 oasc.ChaosMonkey.monkeyLog monkey: stop shard! 47940
[junit4:junit4]   2> 256011 T16 oasc.CoreContainer.shutdown Shutting down CoreContainer
instance=1890657725
[junit4:junit4]   2> 256011 T16 oasc.SolrCore.close [collection1]  CLOSING SolrCore org.apache.solr.core.SolrCore@3191394e
[junit4:junit4]   2> 256015 T16 oasu.DirectUpdateHandler2.close closing DirectUpdateHandler2{commits=1,autocommits=0,soft
autocommits=0,optimizes=0,rollbacks=0,expungeDeletes=0,docsPending=0,adds=0,deletesById=0,deletesByQuery=0,errors=0,cumulative_adds=0,cumulative_deletesById=0,cumulative_deletesByQuery=0,cumulative_errors=0}
[junit4:junit4]   2> 256016 T16 oasc.SolrCore.decrefSolrCoreState Closing SolrCoreState
[junit4:junit4]   2> 256017 T16 oasu.DefaultSolrCoreState.closeIndexWriter SolrCoreState
ref count has reached 0 - closing IndexWriter
[junit4:junit4]   2> 256017 T16 oasu.DefaultSolrCoreState.closeIndexWriter closing IndexWriter
with IndexWriterCloser
[junit4:junit4]   2> 256019 T16 oasc.SolrCore.closeSearcher [collection1] Closing main
searcher on request.
[junit4:junit4]   2> 256960 T88 oaz.ClientCnxn$SendThread.startConnect Opening socket connection
to server localhost.localdomain/127.0.0.1:37444
[junit4:junit4]   2> 256961 T88 oaz.ClientCnxn$SendThread.run WARNING Session 0x13aad8f0a0e0006
for server null, unexpected error, closing socket connection and attempting reconnect java.net.ConnectException:
Connection refused
[junit4:junit4]   2> 	at sun.nio.ch.SocketChannelImpl.checkConnect(Native Method)
[junit4:junit4]   2> 	at sun.nio.ch.SocketChannelImpl.finishConnect(SocketChannelImpl.java:567)
[junit4:junit4]   2> 	at org.apache.zookeeper.ClientCnxn$SendThread.run(ClientCnxn.java:1143)
[junit4:junit4]   2> 
[junit4:junit4]   2> 256975 T62 oaz.ClientCnxn$SendThread.startConnect Opening socket connection
to server localhost.localdomain/127.0.0.1:37444
[junit4:junit4]   2> 257076 T63 oaz.ClientCnxn$EventThread.run EventThread shut down
[junit4:junit4]   2> 257076 T16 oaz.ZooKeeper.close Session: 0x13aad8f0a0e0004 closed
[junit4:junit4]   2> 257098 T16 oejsh.ContextHandler.doStop stopped o.e.j.s.ServletContextHandler{/solr,null}
[junit4:junit4]   2> 257150 T16 oasc.ChaosMonkey.monkeyLog monkey: stop shard! 59666
[junit4:junit4]   2> 257151 T16 oasc.CoreContainer.shutdown Shutting down CoreContainer
instance=1061818337
[junit4:junit4]   2> 257151 T16 oasc.SolrCore.close [collection1]  CLOSING SolrCore org.apache.solr.core.SolrCore@1a659078
[junit4:junit4]   2> 257156 T16 oasu.DirectUpdateHandler2.close closing DirectUpdateHandler2{commits=2,autocommits=0,soft
autocommits=0,optimizes=0,rollbacks=0,expungeDeletes=0,docsPending=0,adds=0,deletesById=0,deletesByQuery=0,errors=0,cumulative_adds=1,cumulative_deletesById=0,cumulative_deletesByQuery=0,cumulative_errors=0}
[junit4:junit4]   2> 257157 T16 oasc.SolrCore.decrefSolrCoreState Closing SolrCoreState
[junit4:junit4]   2> 257157 T16 oasu.DefaultSolrCoreState.closeIndexWriter SolrCoreState
ref count has reached 0 - closing IndexWriter
[junit4:junit4]   2> 257157 T16 oasu.DefaultSolrCoreState.closeIndexWriter closing IndexWriter
with IndexWriterCloser
[junit4:junit4]   2> 257159 T16 oasc.SolrCore.closeSearcher [collection1] Closing main
searcher on request.
[junit4:junit4]   2> 257847 T74 oaz.ClientCnxn$SendThread.startConnect Opening socket connection
to server localhost.localdomain/127.0.0.1:37444
[junit4:junit4]   2> 257948 T75 oaz.ClientCnxn$EventThread.run EventThread shut down
[junit4:junit4]   2> 257948 T16 oaz.ZooKeeper.close Session: 0x13aad8f0a0e0005 closed
[junit4:junit4]   2> 257970 T16 oejsh.ContextHandler.doStop stopped o.e.j.s.ServletContextHandler{/solr,null}
[junit4:junit4]   2> 258021 T16 oasc.ChaosMonkey.monkeyLog monkey: stop shard! 36156
[junit4:junit4]   2> 258022 T16 oasc.CoreContainer.shutdown Shutting down CoreContainer
instance=1424875934
[junit4:junit4]   2> 258124 T88 oaz.ClientCnxn$SendThread.startConnect Opening socket connection
to server localhost.localdomain/127.0.0.1:37444
[junit4:junit4]   2> 258224 T89 oaz.ClientCnxn$EventThread.run EventThread shut down
[junit4:junit4]   2> 258224 T16 oaz.ZooKeeper.close Session: 0x13aad8f0a0e0006 closed
[junit4:junit4]   2> 258247 T16 oejsh.ContextHandler.doStop stopped o.e.j.s.ServletContextHandler{/solr,null}
[junit4:junit4]   2> 258318 T16 oas.SolrTestCaseJ4.tearDown ###Ending testDistribSearch
[junit4:junit4]   1>     /solr/collections/control_collection/shards (0)
[junit4:junit4]   1>     /solr/collections/control_collection/leader_elect (1)
[junit4:junit4]   1>      /solr/collections/control_collection/leader_elect/control_shard
(1)
[junit4:junit4]   1>       /solr/collections/control_collection/leader_elect/control_shard/election
(1)
[junit4:junit4]   1>        /solr/collections/control_collection/leader_elect/control_shard/election/88573972547764226-127.0.0.1:46308_solr_collection1-n_0000000000
(0)
[junit4:junit4]   1>     /solr/collections/control_collection/leaders (1)
[junit4:junit4]   1>      /solr/collections/control_collection/leaders/control_shard (0)
[junit4:junit4]   1>      DATA:
[junit4:junit4]   1>          {
[junit4:junit4]   1>            "core":"collection1",
[junit4:junit4]   1>            "node_name":"127.0.0.1:46308_solr",
[junit4:junit4]   1>            "base_url":"http://127.0.0.1:46308/solr"}
[junit4:junit4]   1>   /solr/clusterstate.json (0)
[junit4:junit4]   1>   DATA:
[junit4:junit4]   1>       {
[junit4:junit4]   1>         "collection1":{
[junit4:junit4]   1>           "shard1":{
[junit4:junit4]   1>             "range":"80000000-ffffffff",
[junit4:junit4]   1>             "replicas":{
[junit4:junit4]   1>               "127.0.0.1:43374_solr_collection1":{
[junit4:junit4]   1>                 "shard":"shard1",
[junit4:junit4]   1>                 "roles":null,
[junit4:junit4]   1>                 "state":"active",
[junit4:junit4]   1>                 "core":"collection1",
[junit4:junit4]   1>                 "collection":"collection1",
[junit4:junit4]   1>                 "node_name":"127.0.0.1:43374_solr",
[junit4:junit4]   1>                 "base_url":"http://127.0.0.1:43374/solr",
[junit4:junit4]   1>                 "leader":"true"},
[junit4:junit4]   1>               "127.0.0.1:59666_solr_collection1":{
[junit4:junit4]   1>                 "shard":"shard1",
[junit4:junit4]   1>                 "roles":null,
[junit4:junit4]   1>                 "state":"active",
[junit4:junit4]   1>                 "core":"collection1",
[junit4:junit4]   1>                 "collection":"collection1",
[junit4:junit4]   1>                 "node_name":"127.0.0.1:59666_solr",
[junit4:junit4]   1>                 "base_url":"http://127.0.0.1:59666/solr"}}},
[junit4:junit4]   1>           "shard2":{
[junit4:junit4]   1>             "range":"0-7fffffff",
[junit4:junit4]   1>             "replicas":{
[junit4:junit4]   1>               "127.0.0.1:47940_solr_collection1":{
[junit4:junit4]   1>                 "shard":"shard2",
[junit4:junit4]   1>                 "roles":null,
[junit4:junit4]   1>                 "state":"active",
[junit4:junit4]   1>                 "core":"collection1",
[junit4:junit4]   1>                 "collection":"collection1",
[junit4:junit4]   1>                 "node_name":"127.0.0.1:47940_solr",
[junit4:junit4]   1>                 "base_url":"http://127.0.0.1:47940/solr",
[junit4:junit4]   1>                 "leader":"true"},
[junit4:junit4]   1>               "127.0.0.1:36156_solr_collection1":{
[junit4:junit4]   1>                 "shard":null,
[junit4:junit4]   1>                 "roles":null,
[junit4:junit4]   1>                 "state":"down",
[junit4:junit4]   1>                 "core":"collection1",
[junit4:junit4]   1>                 "collection":"collection1",
[junit4:junit4]   1>                 "node_name":"127.0.0.1:36156_solr",
[junit4:junit4]   1>                 "base_url":"http://127.0.0.1:36156/solr"}}}},
[junit4:junit4]   1>         "control_collection":{"control_shard":{"replicas":{"127.0.0.1:46308_solr_collection1":{
[junit4:junit4]   1>                 "shard":"control_shard",
[junit4:junit4]   1>                 "roles":null,
[junit4:junit4]   1>                 "state":"active",
[junit4:junit4]   1>                 "core":"collection1",
[junit4:junit4]   1>                 "collection":"control_collection",
[junit4:junit4]   1>                 "node_name":"127.0.0.1:46308_solr",
[junit4:junit4]   1>                 "base_url":"http://127.0.0.1:46308/solr",
[junit4:junit4]   1>                 "leader":"true"}}}}}
[junit4:junit4]   1>  /zookeeper (1)
[junit4:junit4]   1>  DATA:
[junit4:junit4]   1>      
[junit4:junit4]   1> 
[junit4:junit4]   2> NOTE: reproduce with: ant test  -Dtestcase=BasicDistributedZk2Test
-Dtests.method=testDistribSearch -Dtests.seed=85E797298F7E2CA5 -Dtests.slow=true -Dtests.locale=es_MX
-Dtests.timezone=PNT -Dtests.file.encoding=UTF-8
[junit4:junit4] FAILURE  258s J2 | BasicDistributedZk2Test.testDistribSearch <<<
[junit4:junit4]    > Throwable #1: java.lang.AssertionError: There are still nodes recoverying
- waited for 180 seconds
[junit4:junit4]    > 	at __randomizedtesting.SeedInfo.seed([85E797298F7E2CA5:4011931F8214C99]:0)
[junit4:junit4]    > 	at org.junit.Assert.fail(Assert.java:93)
[junit4:junit4]    > 	at org.apache.solr.cloud.AbstractDistribZkTestBase.waitForRecoveriesToFinish(AbstractDistribZkTestBase.java:165)
[junit4:junit4]    > 	at org.apache.solr.cloud.AbstractDistribZkTestBase.waitForRecoveriesToFinish(AbstractDistribZkTestBase.java:115)
[junit4:junit4]    > 	at org.apache.solr.cloud.AbstractDistribZkTestBase.waitForRecoveriesToFinish(AbstractDistribZkTestBase.java:110)
[junit4:junit4]    > 	at org.apache.solr.cloud.AbstractFullDistribZkTestBase.waitForRecoveriesToFinish(AbstractFullDistribZkTestBase.java:553)
[junit4:junit4]    > 	at org.apache.solr.cloud.BasicDistributedZk2Test.doTest(BasicDistributedZk2Test.java:65)
[junit4:junit4]    > 	at org.apache.solr.BaseDistributedSearchTestCase.testDistribSearch(BaseDistributedSearchTestCase.java:695)
[junit4:junit4]    > 	at sun.reflect.NativeMethodAccessorImpl.invoke0(Native Method)
[junit4:junit4]    > 	at sun.reflect.NativeMethodAccessorImpl.invoke(NativeMethodAccessorImpl.java:39)
[junit4:junit4]    > 	at sun.reflect.DelegatingMethodAccessorImpl.invoke(DelegatingMethodAccessorImpl.java:25)
[junit4:junit4]    > 	at java.lang.reflect.Method.invoke(Method.java:597)
[junit4:junit4]    > 	at com.carrotsearch.randomizedtesting.RandomizedRunner.invoke(RandomizedRunner.java:1559)
[junit4:junit4]    > 	at com.carrotsearch.randomizedtesting.RandomizedRunner.access$600(RandomizedRunner.java:79)
[junit4:junit4]    > 	at com.carrotsearch.randomizedtesting.RandomizedRunner$6.evaluate(RandomizedRunner.java:737)
[junit4:junit4]    > 	at com.carrotsearch.randomizedtesting.RandomizedRunner$7.evaluate(RandomizedRunner.java:773)
[junit4:junit4]    > 	at com.carrotsearch.randomizedtesting.RandomizedRunner$8.evaluate(RandomizedRunner.java:787)
[junit4:junit4]    > 	at com.carrotsearch.randomizedtesting.rules.SystemPropertiesRestoreRule$1.evaluate(SystemPropertiesRestoreRule.java:53)
[junit4:junit4]    > 	at org.apache.lucene.util.TestRuleSetupTeardownChained$1.evaluate(TestRuleSetupTeardownChained.java:50)
[junit4:junit4]    > 	at org.apache.lucene.util.TestRuleFieldCacheSanity$1.evaluate(TestRuleFieldCacheSanity.java:51)
[junit4:junit4]    > 	at org.apache.lucene.util.AbstractBeforeAfterRule$1.evaluate(AbstractBeforeAfterRule.java:45)
[junit4:junit4]    > 	at com.carrotsearch.randomizedtesting.rules.SystemPropertiesInvariantRule$1.evaluate(SystemPropertiesInvariantRule.java:55)
[junit4:junit4]    > 	at org.apache.lucene.util.TestRuleThreadAndTestName$1.evaluate(TestRuleThreadAndTestName.java:48)
[junit4:junit4]    > 	at org.apache.lucene.util.TestRuleIgnoreAfterMaxFailures$1.evaluate(TestRuleIgnoreAfterMaxFailures.java:70)
[junit4:junit4]    > 	at org.apache.lucene.util.TestRuleMarkFailure$1.evaluate(TestRuleMarkFailure.java:48)
[junit4:junit4]    > 	at com.carrotsearch.randomizedtesting.rules.StatementAdapter.evaluate(StatementAdapter.java:36)
[junit4:junit4]    > 	at com.carrotsearch.randomizedtesting.ThreadLeakControl$StatementRunner.run(ThreadLeakControl.java:358)
[junit4:junit4]    > 	at com.carrotsearch.randomizedtesting.ThreadLeakControl.forkTimeoutingTask(ThreadLeakControl.java:782)
[junit4:junit4]    > 	at com.carrotsearch.randomizedtesting.ThreadLeakControl$3.evaluate(ThreadLeakControl.java:442)
[junit4:junit4]    > 	at com.carrotsearch.randomizedtesting.RandomizedRunner.runSingleTest(RandomizedRunner.java:746)
[junit4:junit4]    > 	at com.carrotsearch.randomizedtesting.RandomizedRunner$3.evaluate(RandomizedRunner.java:648)
[junit4:junit4]    > 	at com.carrotsearch.randomizedtesting.RandomizedRunner$4.evaluate(RandomizedRunner.java:682)
[junit4:junit4]    > 	at com.carrotsearch.randomizedtesting.RandomizedRunner$5.evaluate(RandomizedRunner.java:693)
[junit4:junit4]    > 	at com.carrotsearch.randomizedtesting.rules.StatementAdapter.evaluate(StatementAdapter.java:36)
[junit4:junit4]    > 	at com.carrotsearch.randomizedtesting.rules.SystemPropertiesRestoreRule$1.evaluate(SystemPropertiesRestoreRule.java:53)
[junit4:junit4]    > 	at org.apache.lucene.util.AbstractBeforeAfterRule$1.evaluate(AbstractBeforeAfterRule.java:45)
[junit4:junit4]    > 	at org.apache.lucene.util.TestRuleStoreClassName$1.evaluate(TestRuleStoreClassName.java:42)
[junit4:junit4]    > 	at com.carrotsearch.randomizedtesting.rules.SystemPropertiesInvariantRule$1.evaluate(SystemPropertiesInvariantRule.java:55)
[junit4:junit4]    > 	at com.carrotsearch.randomizedtesting.rules.NoShadowingOrOverridesOnMethodsRule$1.evaluate(NoShadowingOrOverridesOnMethodsRule.java:39)
[junit4:junit4]    > 	at com.carrotsearch.randomizedtesting.rules.NoShadowingOrOverridesOnMethodsRule$1.evaluate(NoShadowingOrOverridesOnMethodsRule.java:39)
[junit4:junit4]    > 	at com.carrotsearch.randomizedtesting.rules.StatementAdapter.evaluate(StatementAdapter.java:36)
[junit4:junit4]    > 	at org.apache.lucene.util.TestRuleAssertionsRequired$1.evaluate(TestRuleAssertionsRequired.java:43)
[junit4:junit4]    > 	at org.apache.lucene.util.TestRuleMarkFailure$1.evaluate(TestRuleMarkFailure.java:48)
[junit4:junit4]    > 	at org.apache.lucene.util.TestRuleIgnoreAfterMaxFailures$1.evaluate(TestRuleIgnoreAfterMaxFailures.java:70)
[junit4:junit4]    > 	at org.apache.lucene.util.TestRuleIgnoreTestSuites$1.evaluate(TestRuleIgnoreTestSuites.java:55)
[junit4:junit4]    > 	at com.carrotsearch.randomizedtesting.rules.StatementAdapter.evaluate(StatementAdapter.java:36)
[junit4:junit4]    > 	at com.carrotsearch.randomizedtesting.ThreadLeakControl$StatementRunner.run(ThreadLeakControl.java:358)
[junit4:junit4]    > 	at java.lang.Thread.run(Thread.java:662)
[junit4:junit4]   2> 258341 T16 oas.SolrTestCaseJ4.deleteCore ###deleteCore
[junit4:junit4]   2> NOTE: test params are: codec=Lucene41: {n_f1=PostingsFormat(name=SimpleText),
foo_b=MockFixedIntBlock(blockSize=48), foo_d=Pulsing41(freqCutoff=10 minBlockSize=42 maxBlockSize=101),
foo_f=MockFixedIntBlock(blockSize=48), n_tl1=PostingsFormat(name=SimpleText), n_d1=PostingsFormat(name=MockRandom),
rnd_b=Pulsing41(freqCutoff=10 minBlockSize=42 maxBlockSize=101), intDefault=PostingsFormat(name=MockRandom),
n_td1=PostingsFormat(name=SimpleText), id=Pulsing41(freqCutoff=10 minBlockSize=42 maxBlockSize=101),
timestamp=PostingsFormat(name=MockRandom), range_facet_sl=MockFixedIntBlock(blockSize=48),
range_facet_si=PostingsFormat(name=SimpleText), multiDefault=PostingsFormat(name=SimpleText),
n_tf1=PostingsFormat(name=MockRandom), n_dt1=PostingsFormat(name=SimpleText), n_ti1=Pulsing41(freqCutoff=10
minBlockSize=42 maxBlockSize=101), range_facet_l=PostingsFormat(name=MockRandom), text=MockFixedIntBlock(blockSize=48),
_version_=PostingsFormat(name=MockRandom), a_t=PostingsFormat(name=MockRandom), n_tdt1=PostingsFormat(name=MockRandom),
other_tl1=PostingsFormat(name=MockRandom), n_l1=PostingsFormat(name=MockRandom), a_si=PostingsFormat(name=SimpleText)},
sim=RandomSimilarityProvider(queryNorm=false,coord=no): {}, locale=es_MX, timezone=PNT
[junit4:junit4]   2> NOTE: Linux 3.2.0-24-generic amd64/Sun Microsystems Inc. 1.6.0_27
(64-bit)/cpus=8,threads=1,free=167135744,total=318570496
[junit4:junit4]   2> NOTE: All tests run in this JVM: [TestSolrIndexConfig, TestQueryUtils,
BasicDistributedZk2Test]
[junit4:junit4] Completed on J2 in 258.44s, 1 test, 1 failure <<< FAILURES!
[junit4:junit4] 
[junit4:junit4] Suite: org.apache.solr.handler.component.DistributedTermsComponentTest
[junit4:junit4] Completed on J2 in 4.96s, 1 test
[junit4:junit4] 
[junit4:junit4] Suite: org.apache.solr.util.SolrPluginUtilsTest
[junit4:junit4] Completed on J2 in 0.46s, 7 tests
[junit4:junit4] 
[junit4:junit4] Suite: org.apache.solr.handler.MoreLikeThisHandlerTest
[junit4:junit4] Completed on J2 in 0.45s, 1 test
[junit4:junit4] 
[junit4:junit4] Suite: org.apache.solr.cloud.ChaosMonkeyNothingIsSafeTest
[junit4:junit4] Completed on J2 in 0.00s, 0 tests
[junit4:junit4] 
[junit4:junit4] Suite: org.apache.solr.core.SolrCoreCheckLockOnStartupTest
[junit4:junit4] Completed on J2 in 0.63s, 2 tests
[junit4:junit4] 
[junit4:junit4] Suite: org.apache.solr.update.TestUpdate
[junit4:junit4] Completed on J2 in 0.58s, 1 test
[junit4:junit4] 
[junit4:junit4] Suite: org.apache.solr.schema.DateFieldTest
[junit4:junit4] Completed on J2 in 0.04s, 8 tests, 1 skipped
[junit4:junit4] 
[junit4:junit4] Suite: org.apache.solr.search.TestFoldingMultitermQuery
[junit4:junit4] Completed on J2 in 0.70s, 18 tests
[junit4:junit4] 
[junit4:junit4] Suite: org.apache.solr.spelling.suggest.TestPhraseSuggestions
[junit4:junit4] Completed on J2 in 0.13s, 1 test
[junit4:junit4] 
[junit4:junit4] Suite: org.apache.solr.TestTrie
[junit4:junit4] Completed on J2 in 0.89s, 8 tests
[junit4:junit4] 
[junit4:junit4] Suite: org.apache.solr.search.TestSort
[junit4:junit4] Completed on J2 in 2.32s, 2 tests
[junit4:junit4] 
[junit4:junit4] Suite: org.apache.solr.update.processor.SignatureUpdateProcessorFactoryTest
[junit4:junit4] Completed on J2 in 1.21s, 6 tests
[junit4:junit4] 
[junit4:junit4] Suite: org.apache.solr.spelling.suggest.SuggesterFSTTest
[junit4:junit4] Completed on J2 in 0.70s, 4 tests
[junit4:junit4] 
[junit4:junit4] 
[junit4:junit4] Tests with failures:
[junit4:junit4]   - org.apache.solr.cloud.BasicDistributedZk2Test.testDistribSearch
[junit4:junit4] 
[junit4:junit4] 
[junit4:junit4] JVM J0:     0.90 ..   167.91 =   167.01s
[junit4:junit4] JVM J1:     0.88 ..   150.94 =   150.06s
[junit4:junit4] JVM J2:     0.88 ..   281.93 =   281.06s
[junit4:junit4] JVM J3:     0.89 ..   124.01 =   123.12s
[junit4:junit4] JVM J4:     0.87 ..   127.66 =   126.79s
[junit4:junit4] JVM J5:     1.13 ..   127.42 =   126.29s
[junit4:junit4] JVM J6:     0.87 ..   124.04 =   123.16s
[junit4:junit4] JVM J7:     1.13 ..   126.09 =   124.96s
[junit4:junit4] Execution time total: 4 minutes 41 seconds
[junit4:junit4] Tests summary: 233 suites, 965 tests, 1 failure, 8 ignored (3 assumptions)

BUILD FAILED
<http://sierranevada.servebeer.com/job/fast-io-beasting/ws/build.xml>:39: The following
error occurred while executing this line:
<http://sierranevada.servebeer.com/job/fast-io-beasting/ws/solr/build.xml>:178: The
following error occurred while executing this line:
<http://sierranevada.servebeer.com/job/fast-io-beasting/ws/lucene/module-build.xml>:61:
The following error occurred while executing this line:
<http://sierranevada.servebeer.com/job/fast-io-beasting/ws/lucene/common-build.xml>:1159:
The following error occurred while executing this line:
<http://sierranevada.servebeer.com/job/fast-io-beasting/ws/lucene/common-build.xml>:827:
There were test failures: 233 suites, 965 tests, 1 failure, 8 ignored (3 assumptions)

Total time: 9 minutes 49 seconds
Build step 'Invoke Ant' marked build as failure

---------------------------------------------------------------------
To unsubscribe, e-mail: dev-unsubscribe@lucene.apache.org
For additional commands, e-mail: dev-help@lucene.apache.org


Mime
View raw message