lucene-dev mailing list archives

Site index · List index
Message view « Date » · « Thread »
Top « Date » · « Thread »
From Policeman Jenkins Server <jenk...@sd-datasolutions.de>
Subject [JENKINS] Lucene-Solr-trunk-Windows (64bit/jdk1.6.0_35) - Build # 1321 - Still Failing!
Date Sat, 27 Oct 2012 03:40:59 GMT
Build: http://jenkins.sd-datasolutions.de/job/Lucene-Solr-trunk-Windows/1321/
Java: 64bit/jdk1.6.0_35 -XX:+UseSerialGC

4 tests failed.
FAILED:  junit.framework.TestSuite.org.apache.solr.handler.TestReplicationHandler

Error Message:
Resource in scope SUITE failed to close. Resource was registered from thread Thread[id=1467, name=TEST-TestReplicationHandler.test-seed#[B788DA7241566456], state=RUNNABLE, group=TGRP-TestReplicationHandler], registration stack trace below.

Stack Trace:
com.carrotsearch.randomizedtesting.ResourceDisposalError: Resource in scope SUITE failed to close. Resource was registered from thread Thread[id=1467, name=TEST-TestReplicationHandler.test-seed#[B788DA7241566456], state=RUNNABLE, group=TGRP-TestReplicationHandler], registration stack trace below.
	at java.lang.Thread.getStackTrace(Thread.java:1479)
	at com.carrotsearch.randomizedtesting.RandomizedContext.closeAtEnd(RandomizedContext.java:150)
	at org.apache.lucene.util.LuceneTestCase.closeAfterSuite(LuceneTestCase.java:514)
	at org.apache.lucene.util.LuceneTestCase.wrapDirectory(LuceneTestCase.java:958)
	at org.apache.lucene.util.LuceneTestCase.newDirectory(LuceneTestCase.java:872)
	at org.apache.lucene.util.LuceneTestCase.newDirectory(LuceneTestCase.java:864)
	at org.apache.solr.core.MockDirectoryFactory.create(MockDirectoryFactory.java:33)
	at org.apache.solr.core.CachingDirectoryFactory.get(CachingDirectoryFactory.java:221)
	at org.apache.solr.update.SolrIndexWriter.create(SolrIndexWriter.java:60)
	at org.apache.solr.core.SolrCore.initIndex(SolrCore.java:502)
	at org.apache.solr.core.SolrCore.<init>(SolrCore.java:705)
	at org.apache.solr.core.SolrCore.<init>(SolrCore.java:618)
	at org.apache.solr.core.CoreContainer.create(CoreContainer.java:842)
	at org.apache.solr.core.CoreContainer.load(CoreContainer.java:529)
	at org.apache.solr.core.CoreContainer$Initializer.initialize(CoreContainer.java:306)
	at org.apache.solr.servlet.SolrDispatchFilter.init(SolrDispatchFilter.java:107)
	at org.eclipse.jetty.servlet.FilterHolder.doStart(FilterHolder.java:114)
	at org.eclipse.jetty.util.component.AbstractLifeCycle.start(AbstractLifeCycle.java:59)
	at org.eclipse.jetty.servlet.ServletHandler.initialize(ServletHandler.java:754)
	at org.eclipse.jetty.servlet.ServletHandler.updateMappings(ServletHandler.java:1227)
	at org.eclipse.jetty.servlet.ServletHandler.setFilterMappings(ServletHandler.java:1263)
	at org.eclipse.jetty.servlet.ServletHandler.addFilterWithMapping(ServletHandler.java:965)
	at org.eclipse.jetty.servlet.ServletHandler.addFilterWithMapping(ServletHandler.java:923)
	at org.eclipse.jetty.servlet.ServletContextHandler.addFilter(ServletContextHandler.java:333)
	at org.apache.solr.client.solrj.embedded.JettySolrRunner$1.lifeCycleStarted(JettySolrRunner.java:173)
	at org.eclipse.jetty.util.component.AbstractLifeCycle.setStarted(AbstractLifeCycle.java:169)
	at org.eclipse.jetty.util.component.AbstractLifeCycle.start(AbstractLifeCycle.java:60)
	at org.apache.solr.client.solrj.embedded.JettySolrRunner.start(JettySolrRunner.java:225)
	at org.apache.solr.client.solrj.embedded.JettySolrRunner.start(JettySolrRunner.java:205)
	at org.apache.solr.handler.TestReplicationHandler.createJetty(TestReplicationHandler.java:131)
	at org.apache.solr.handler.TestReplicationHandler.doTestIndexAndConfigReplication(TestReplicationHandler.java:410)
	at org.apache.solr.handler.TestReplicationHandler.test(TestReplicationHandler.java:254)
	at sun.reflect.NativeMethodAccessorImpl.invoke0(Native Method)
	at sun.reflect.NativeMethodAccessorImpl.invoke(NativeMethodAccessorImpl.java:39)
	at sun.reflect.DelegatingMethodAccessorImpl.invoke(DelegatingMethodAccessorImpl.java:25)
	at java.lang.reflect.Method.invoke(Method.java:597)
	at com.carrotsearch.randomizedtesting.RandomizedRunner.invoke(RandomizedRunner.java:1559)
	at com.carrotsearch.randomizedtesting.RandomizedRunner.access$600(RandomizedRunner.java:79)
	at com.carrotsearch.randomizedtesting.RandomizedRunner$6.evaluate(RandomizedRunner.java:737)
	at com.carrotsearch.randomizedtesting.RandomizedRunner$7.evaluate(RandomizedRunner.java:773)
	at com.carrotsearch.randomizedtesting.RandomizedRunner$8.evaluate(RandomizedRunner.java:787)
	at com.carrotsearch.randomizedtesting.rules.SystemPropertiesRestoreRule$1.evaluate(SystemPropertiesRestoreRule.java:53)
	at org.apache.lucene.util.TestRuleSetupTeardownChained$1.evaluate(TestRuleSetupTeardownChained.java:50)
	at org.apache.lucene.util.TestRuleFieldCacheSanity$1.evaluate(TestRuleFieldCacheSanity.java:51)
	at org.apache.lucene.util.AbstractBeforeAfterRule$1.evaluate(AbstractBeforeAfterRule.java:45)
	at com.carrotsearch.randomizedtesting.rules.SystemPropertiesInvariantRule$1.evaluate(SystemPropertiesInvariantRule.java:55)
	at org.apache.lucene.util.TestRuleThreadAndTestName$1.evaluate(TestRuleThreadAndTestName.java:48)
	at org.apache.lucene.util.TestRuleIgnoreAfterMaxFailures$1.evaluate(TestRuleIgnoreAfterMaxFailures.java:70)
	at org.apache.lucene.util.TestRuleMarkFailure$1.evaluate(TestRuleMarkFailure.java:48)
	at com.carrotsearch.randomizedtesting.rules.StatementAdapter.evaluate(StatementAdapter.java:36)
	at com.carrotsearch.randomizedtesting.ThreadLeakControl$StatementRunner.run(ThreadLeakControl.java:358)
	at com.carrotsearch.randomizedtesting.ThreadLeakControl.forkTimeoutingTask(ThreadLeakControl.java:782)
	at com.carrotsearch.randomizedtesting.ThreadLeakControl$3.evaluate(ThreadLeakControl.java:442)
	at com.carrotsearch.randomizedtesting.RandomizedRunner.runSingleTest(RandomizedRunner.java:746)
	at com.carrotsearch.randomizedtesting.RandomizedRunner$3.evaluate(RandomizedRunner.java:648)
	at com.carrotsearch.randomizedtesting.RandomizedRunner$4.evaluate(RandomizedRunner.java:682)
	at com.carrotsearch.randomizedtesting.RandomizedRunner$5.evaluate(RandomizedRunner.java:693)
	at com.carrotsearch.randomizedtesting.rules.StatementAdapter.evaluate(StatementAdapter.java:36)
	at com.carrotsearch.randomizedtesting.rules.SystemPropertiesRestoreRule$1.evaluate(SystemPropertiesRestoreRule.java:53)
	at org.apache.lucene.util.AbstractBeforeAfterRule$1.evaluate(AbstractBeforeAfterRule.java:45)
	at org.apache.lucene.util.TestRuleStoreClassName$1.evaluate(TestRuleStoreClassName.java:42)
	at com.carrotsearch.randomizedtesting.rules.SystemPropertiesInvariantRule$1.evaluate(SystemPropertiesInvariantRule.java:55)
	at com.carrotsearch.randomizedtesting.rules.NoShadowingOrOverridesOnMethodsRule$1.evaluate(NoShadowingOrOverridesOnMethodsRule.java:39)
	at com.carrotsearch.randomizedtesting.rules.NoShadowingOrOverridesOnMethodsRule$1.evaluate(NoShadowingOrOverridesOnMethodsRule.java:39)
	at com.carrotsearch.randomizedtesting.rules.StatementAdapter.evaluate(StatementAdapter.java:36)
	at org.apache.lucene.util.TestRuleAssertionsRequired$1.evaluate(TestRuleAssertionsRequired.java:43)
	at org.apache.lucene.util.TestRuleMarkFailure$1.evaluate(TestRuleMarkFailure.java:48)
	at org.apache.lucene.util.TestRuleIgnoreAfterMaxFailures$1.evaluate(TestRuleIgnoreAfterMaxFailures.java:70)
	at org.apache.lucene.util.TestRuleIgnoreTestSuites$1.evaluate(TestRuleIgnoreTestSuites.java:55)
	at com.carrotsearch.randomizedtesting.rules.StatementAdapter.evaluate(StatementAdapter.java:36)
	at com.carrotsearch.randomizedtesting.ThreadLeakControl$StatementRunner.run(ThreadLeakControl.java:358)
	at java.lang.Thread.run(Thread.java:662)
Caused by: java.lang.AssertionError: Directory not closed: MockDirWrapper(org.apache.lucene.store.RAMDirectory@7155eed0 lockFactory=org.apache.lucene.store.SingleInstanceLockFactory@5ac95f85)
	at org.junit.Assert.fail(Assert.java:93)
	at org.apache.lucene.util.CloseableDirectory.close(CloseableDirectory.java:47)
	at com.carrotsearch.randomizedtesting.RandomizedRunner$2$1.apply(RandomizedRunner.java:602)
	at com.carrotsearch.randomizedtesting.RandomizedRunner$2$1.apply(RandomizedRunner.java:599)
	at com.carrotsearch.randomizedtesting.RandomizedContext.closeResources(RandomizedContext.java:167)
	at com.carrotsearch.randomizedtesting.RandomizedRunner$2.afterAlways(RandomizedRunner.java:615)
	at com.carrotsearch.randomizedtesting.rules.StatementAdapter.evaluate(StatementAdapter.java:43)
	... 2 more


FAILED:  junit.framework.TestSuite.org.apache.solr.handler.TestReplicationHandler

Error Message:
Resource in scope SUITE failed to close. Resource was registered from thread Thread[id=1590, name=Thread-804, state=RUNNABLE, group=TGRP-TestReplicationHandler], registration stack trace below.

Stack Trace:
com.carrotsearch.randomizedtesting.ResourceDisposalError: Resource in scope SUITE failed to close. Resource was registered from thread Thread[id=1590, name=Thread-804, state=RUNNABLE, group=TGRP-TestReplicationHandler], registration stack trace below.
	at java.lang.Thread.getStackTrace(Thread.java:1479)
	at com.carrotsearch.randomizedtesting.RandomizedContext.closeAtEnd(RandomizedContext.java:150)
	at org.apache.lucene.util.LuceneTestCase.closeAfterSuite(LuceneTestCase.java:514)
	at org.apache.lucene.util.LuceneTestCase.wrapDirectory(LuceneTestCase.java:958)
	at org.apache.lucene.util.LuceneTestCase.newDirectory(LuceneTestCase.java:872)
	at org.apache.lucene.util.LuceneTestCase.newDirectory(LuceneTestCase.java:864)
	at org.apache.solr.core.MockDirectoryFactory.create(MockDirectoryFactory.java:33)
	at org.apache.solr.core.CachingDirectoryFactory.get(CachingDirectoryFactory.java:221)
	at org.apache.solr.core.CachingDirectoryFactory.get(CachingDirectoryFactory.java:181)
	at org.apache.solr.handler.SnapPuller.fetchLatestIndex(SnapPuller.java:373)
	at org.apache.solr.handler.ReplicationHandler.doFetch(ReplicationHandler.java:273)
	at org.apache.solr.handler.ReplicationHandler$1.run(ReplicationHandler.java:181)
Caused by: java.lang.AssertionError: Directory not closed: MockDirWrapper(org.apache.lucene.store.RAMDirectory@4f18b4a4 lockFactory=org.apache.lucene.store.SimpleFSLockFactory@24f56a1)
	at org.junit.Assert.fail(Assert.java:93)
	at org.apache.lucene.util.CloseableDirectory.close(CloseableDirectory.java:47)
	at com.carrotsearch.randomizedtesting.RandomizedRunner$2$1.apply(RandomizedRunner.java:602)
	at com.carrotsearch.randomizedtesting.RandomizedRunner$2$1.apply(RandomizedRunner.java:599)
	at com.carrotsearch.randomizedtesting.RandomizedContext.closeResources(RandomizedContext.java:167)
	at com.carrotsearch.randomizedtesting.RandomizedRunner$2.afterAlways(RandomizedRunner.java:615)
	at com.carrotsearch.randomizedtesting.rules.StatementAdapter.evaluate(StatementAdapter.java:43)
	at com.carrotsearch.randomizedtesting.ThreadLeakControl$StatementRunner.run(ThreadLeakControl.java:358)
	at java.lang.Thread.run(Thread.java:662)


FAILED:  org.apache.solr.cloud.BasicDistributedZk2Test.testDistribSearch

Error Message:
Shard still reported as live in zk - 0 jetty

Stack Trace:
java.lang.AssertionError: Shard still reported as live in zk - 0 jetty
	at __randomizedtesting.SeedInfo.seed([B788DA7241566456:366E546A3609046A]:0)
	at org.junit.Assert.fail(Assert.java:93)
	at org.apache.solr.cloud.AbstractFullDistribZkTestBase.waitToSeeNotLive(AbstractFullDistribZkTestBase.java:1231)
	at org.apache.solr.cloud.BasicDistributedZk2Test.brindDownShardIndexSomeDocsAndRecover(BasicDistributedZk2Test.java:217)
	at org.apache.solr.cloud.BasicDistributedZk2Test.doTest(BasicDistributedZk2Test.java:92)
	at org.apache.solr.BaseDistributedSearchTestCase.testDistribSearch(BaseDistributedSearchTestCase.java:695)
	at sun.reflect.NativeMethodAccessorImpl.invoke0(Native Method)
	at sun.reflect.NativeMethodAccessorImpl.invoke(NativeMethodAccessorImpl.java:39)
	at sun.reflect.DelegatingMethodAccessorImpl.invoke(DelegatingMethodAccessorImpl.java:25)
	at java.lang.reflect.Method.invoke(Method.java:597)
	at com.carrotsearch.randomizedtesting.RandomizedRunner.invoke(RandomizedRunner.java:1559)
	at com.carrotsearch.randomizedtesting.RandomizedRunner.access$600(RandomizedRunner.java:79)
	at com.carrotsearch.randomizedtesting.RandomizedRunner$6.evaluate(RandomizedRunner.java:737)
	at com.carrotsearch.randomizedtesting.RandomizedRunner$7.evaluate(RandomizedRunner.java:773)
	at com.carrotsearch.randomizedtesting.RandomizedRunner$8.evaluate(RandomizedRunner.java:787)
	at com.carrotsearch.randomizedtesting.rules.SystemPropertiesRestoreRule$1.evaluate(SystemPropertiesRestoreRule.java:53)
	at org.apache.lucene.util.TestRuleSetupTeardownChained$1.evaluate(TestRuleSetupTeardownChained.java:50)
	at org.apache.lucene.util.TestRuleFieldCacheSanity$1.evaluate(TestRuleFieldCacheSanity.java:51)
	at org.apache.lucene.util.AbstractBeforeAfterRule$1.evaluate(AbstractBeforeAfterRule.java:45)
	at com.carrotsearch.randomizedtesting.rules.SystemPropertiesInvariantRule$1.evaluate(SystemPropertiesInvariantRule.java:55)
	at org.apache.lucene.util.TestRuleThreadAndTestName$1.evaluate(TestRuleThreadAndTestName.java:48)
	at org.apache.lucene.util.TestRuleIgnoreAfterMaxFailures$1.evaluate(TestRuleIgnoreAfterMaxFailures.java:70)
	at org.apache.lucene.util.TestRuleMarkFailure$1.evaluate(TestRuleMarkFailure.java:48)
	at com.carrotsearch.randomizedtesting.rules.StatementAdapter.evaluate(StatementAdapter.java:36)
	at com.carrotsearch.randomizedtesting.ThreadLeakControl$StatementRunner.run(ThreadLeakControl.java:358)
	at com.carrotsearch.randomizedtesting.ThreadLeakControl.forkTimeoutingTask(ThreadLeakControl.java:782)
	at com.carrotsearch.randomizedtesting.ThreadLeakControl$3.evaluate(ThreadLeakControl.java:442)
	at com.carrotsearch.randomizedtesting.RandomizedRunner.runSingleTest(RandomizedRunner.java:746)
	at com.carrotsearch.randomizedtesting.RandomizedRunner$3.evaluate(RandomizedRunner.java:648)
	at com.carrotsearch.randomizedtesting.RandomizedRunner$4.evaluate(RandomizedRunner.java:682)
	at com.carrotsearch.randomizedtesting.RandomizedRunner$5.evaluate(RandomizedRunner.java:693)
	at com.carrotsearch.randomizedtesting.rules.StatementAdapter.evaluate(StatementAdapter.java:36)
	at com.carrotsearch.randomizedtesting.rules.SystemPropertiesRestoreRule$1.evaluate(SystemPropertiesRestoreRule.java:53)
	at org.apache.lucene.util.AbstractBeforeAfterRule$1.evaluate(AbstractBeforeAfterRule.java:45)
	at org.apache.lucene.util.TestRuleStoreClassName$1.evaluate(TestRuleStoreClassName.java:42)
	at com.carrotsearch.randomizedtesting.rules.SystemPropertiesInvariantRule$1.evaluate(SystemPropertiesInvariantRule.java:55)
	at com.carrotsearch.randomizedtesting.rules.NoShadowingOrOverridesOnMethodsRule$1.evaluate(NoShadowingOrOverridesOnMethodsRule.java:39)
	at com.carrotsearch.randomizedtesting.rules.NoShadowingOrOverridesOnMethodsRule$1.evaluate(NoShadowingOrOverridesOnMethodsRule.java:39)
	at com.carrotsearch.randomizedtesting.rules.StatementAdapter.evaluate(StatementAdapter.java:36)
	at org.apache.lucene.util.TestRuleAssertionsRequired$1.evaluate(TestRuleAssertionsRequired.java:43)
	at org.apache.lucene.util.TestRuleMarkFailure$1.evaluate(TestRuleMarkFailure.java:48)
	at org.apache.lucene.util.TestRuleIgnoreAfterMaxFailures$1.evaluate(TestRuleIgnoreAfterMaxFailures.java:70)
	at org.apache.lucene.util.TestRuleIgnoreTestSuites$1.evaluate(TestRuleIgnoreTestSuites.java:55)
	at com.carrotsearch.randomizedtesting.rules.StatementAdapter.evaluate(StatementAdapter.java:36)
	at com.carrotsearch.randomizedtesting.ThreadLeakControl$StatementRunner.run(ThreadLeakControl.java:358)
	at java.lang.Thread.run(Thread.java:662)


FAILED:  org.apache.solr.cloud.SyncSliceTest.testDistribSearch

Error Message:
Shard still reported as live in zk - 0 jetty

Stack Trace:
java.lang.AssertionError: Shard still reported as live in zk - 0 jetty
	at __randomizedtesting.SeedInfo.seed([B788DA7241566456:366E546A3609046A]:0)
	at org.junit.Assert.fail(Assert.java:93)
	at org.apache.solr.cloud.AbstractFullDistribZkTestBase.waitToSeeNotLive(AbstractFullDistribZkTestBase.java:1231)
	at org.apache.solr.cloud.AbstractFullDistribZkTestBase.waitToSeeNotLive(AbstractFullDistribZkTestBase.java:1216)
	at org.apache.solr.cloud.SyncSliceTest.waitToSeeDownInClusterState(SyncSliceTest.java:259)
	at org.apache.solr.cloud.SyncSliceTest.doTest(SyncSliceTest.java:163)
	at org.apache.solr.BaseDistributedSearchTestCase.testDistribSearch(BaseDistributedSearchTestCase.java:695)
	at sun.reflect.NativeMethodAccessorImpl.invoke0(Native Method)
	at sun.reflect.NativeMethodAccessorImpl.invoke(NativeMethodAccessorImpl.java:39)
	at sun.reflect.DelegatingMethodAccessorImpl.invoke(DelegatingMethodAccessorImpl.java:25)
	at java.lang.reflect.Method.invoke(Method.java:597)
	at com.carrotsearch.randomizedtesting.RandomizedRunner.invoke(RandomizedRunner.java:1559)
	at com.carrotsearch.randomizedtesting.RandomizedRunner.access$600(RandomizedRunner.java:79)
	at com.carrotsearch.randomizedtesting.RandomizedRunner$6.evaluate(RandomizedRunner.java:737)
	at com.carrotsearch.randomizedtesting.RandomizedRunner$7.evaluate(RandomizedRunner.java:773)
	at com.carrotsearch.randomizedtesting.RandomizedRunner$8.evaluate(RandomizedRunner.java:787)
	at com.carrotsearch.randomizedtesting.rules.SystemPropertiesRestoreRule$1.evaluate(SystemPropertiesRestoreRule.java:53)
	at org.apache.lucene.util.TestRuleSetupTeardownChained$1.evaluate(TestRuleSetupTeardownChained.java:50)
	at org.apache.lucene.util.TestRuleFieldCacheSanity$1.evaluate(TestRuleFieldCacheSanity.java:51)
	at org.apache.lucene.util.AbstractBeforeAfterRule$1.evaluate(AbstractBeforeAfterRule.java:45)
	at com.carrotsearch.randomizedtesting.rules.SystemPropertiesInvariantRule$1.evaluate(SystemPropertiesInvariantRule.java:55)
	at org.apache.lucene.util.TestRuleThreadAndTestName$1.evaluate(TestRuleThreadAndTestName.java:48)
	at org.apache.lucene.util.TestRuleIgnoreAfterMaxFailures$1.evaluate(TestRuleIgnoreAfterMaxFailures.java:70)
	at org.apache.lucene.util.TestRuleMarkFailure$1.evaluate(TestRuleMarkFailure.java:48)
	at com.carrotsearch.randomizedtesting.rules.StatementAdapter.evaluate(StatementAdapter.java:36)
	at com.carrotsearch.randomizedtesting.ThreadLeakControl$StatementRunner.run(ThreadLeakControl.java:358)
	at com.carrotsearch.randomizedtesting.ThreadLeakControl.forkTimeoutingTask(ThreadLeakControl.java:782)
	at com.carrotsearch.randomizedtesting.ThreadLeakControl$3.evaluate(ThreadLeakControl.java:442)
	at com.carrotsearch.randomizedtesting.RandomizedRunner.runSingleTest(RandomizedRunner.java:746)
	at com.carrotsearch.randomizedtesting.RandomizedRunner$3.evaluate(RandomizedRunner.java:648)
	at com.carrotsearch.randomizedtesting.RandomizedRunner$4.evaluate(RandomizedRunner.java:682)
	at com.carrotsearch.randomizedtesting.RandomizedRunner$5.evaluate(RandomizedRunner.java:693)
	at com.carrotsearch.randomizedtesting.rules.StatementAdapter.evaluate(StatementAdapter.java:36)
	at com.carrotsearch.randomizedtesting.rules.SystemPropertiesRestoreRule$1.evaluate(SystemPropertiesRestoreRule.java:53)
	at org.apache.lucene.util.AbstractBeforeAfterRule$1.evaluate(AbstractBeforeAfterRule.java:45)
	at org.apache.lucene.util.TestRuleStoreClassName$1.evaluate(TestRuleStoreClassName.java:42)
	at com.carrotsearch.randomizedtesting.rules.SystemPropertiesInvariantRule$1.evaluate(SystemPropertiesInvariantRule.java:55)
	at com.carrotsearch.randomizedtesting.rules.NoShadowingOrOverridesOnMethodsRule$1.evaluate(NoShadowingOrOverridesOnMethodsRule.java:39)
	at com.carrotsearch.randomizedtesting.rules.NoShadowingOrOverridesOnMethodsRule$1.evaluate(NoShadowingOrOverridesOnMethodsRule.java:39)
	at com.carrotsearch.randomizedtesting.rules.StatementAdapter.evaluate(StatementAdapter.java:36)
	at org.apache.lucene.util.TestRuleAssertionsRequired$1.evaluate(TestRuleAssertionsRequired.java:43)
	at org.apache.lucene.util.TestRuleMarkFailure$1.evaluate(TestRuleMarkFailure.java:48)
	at org.apache.lucene.util.TestRuleIgnoreAfterMaxFailures$1.evaluate(TestRuleIgnoreAfterMaxFailures.java:70)
	at org.apache.lucene.util.TestRuleIgnoreTestSuites$1.evaluate(TestRuleIgnoreTestSuites.java:55)
	at com.carrotsearch.randomizedtesting.rules.StatementAdapter.evaluate(StatementAdapter.java:36)
	at com.carrotsearch.randomizedtesting.ThreadLeakControl$StatementRunner.run(ThreadLeakControl.java:358)
	at java.lang.Thread.run(Thread.java:662)




Build Log:
[...truncated 8014 lines...]
[junit4:junit4] Suite: org.apache.solr.handler.TestReplicationHandler
[junit4:junit4]   2> 4 T1467 oas.SolrTestCaseJ4.setUp ###Starting test
[junit4:junit4]   2> 4 T1467 oas.SolrTestCaseJ4.setUp ###Starting test
[junit4:junit4]   2> 16 T1467 oejs.Server.doStart jetty-8.1.2.v20120308
[junit4:junit4]   2> 24 T1467 oejs.AbstractConnector.doStart Started SelectChannelConnector@0.0.0.0:64524
[junit4:junit4]   2> 25 T1467 oasc.SolrResourceLoader.locateSolrHome JNDI not configured for solr (NoInitialContextEx)
[junit4:junit4]   2> 25 T1467 oasc.SolrResourceLoader.locateSolrHome using system property solr.solr.home: .\org.apache.solr.handler.TestReplicationHandler$SolrInstance-1351308457351\master
[junit4:junit4]   2> 25 T1467 oasc.SolrResourceLoader.<init> new SolrResourceLoader for deduced Solr Home: '.\org.apache.solr.handler.TestReplicationHandler$SolrInstance-1351308457351\master\'
[junit4:junit4]   2> 54 T1467 oass.SolrDispatchFilter.init SolrDispatchFilter.init()
[junit4:junit4]   2> 55 T1467 oasc.SolrResourceLoader.locateSolrHome JNDI not configured for solr (NoInitialContextEx)
[junit4:junit4]   2> 55 T1467 oasc.SolrResourceLoader.locateSolrHome using system property solr.solr.home: .\org.apache.solr.handler.TestReplicationHandler$SolrInstance-1351308457351\master
[junit4:junit4]   2> 55 T1467 oasc.CoreContainer$Initializer.initialize looking for solr.xml: C:\Users\JenkinsSlave\workspace\Lucene-Solr-trunk-Windows\solr\build\solr-core\test\J0\.\org.apache.solr.handler.TestReplicationHandler$SolrInstance-1351308457351\master\solr.xml
[junit4:junit4]   2> 55 T1467 oasc.CoreContainer.<init> New CoreContainer 894890497
[junit4:junit4]   2> 56 T1467 oasc.CoreContainer$Initializer.initialize no solr.xml file found - using default
[junit4:junit4]   2> 57 T1467 oasc.CoreContainer.load Loading CoreContainer using Solr Home: '.\org.apache.solr.handler.TestReplicationHandler$SolrInstance-1351308457351\master\'
[junit4:junit4]   2> 57 T1467 oasc.SolrResourceLoader.<init> new SolrResourceLoader for directory: '.\org.apache.solr.handler.TestReplicationHandler$SolrInstance-1351308457351\master\'
[junit4:junit4]   2> 79 T1467 oasc.CoreContainer.load Registering Log Listener
[junit4:junit4]   2> 114 T1467 oasc.CoreContainer.create Creating SolrCore 'collection1' using instanceDir: .\org.apache.solr.handler.TestReplicationHandler$SolrInstance-1351308457351\master\collection1
[junit4:junit4]   2> 115 T1467 oasc.SolrResourceLoader.<init> new SolrResourceLoader for directory: '.\org.apache.solr.handler.TestReplicationHandler$SolrInstance-1351308457351\master\collection1\'
[junit4:junit4]   2> 148 T1467 oasc.SolrConfig.<init> Using Lucene MatchVersion: LUCENE_50
[junit4:junit4]   2> 198 T1467 oasc.SolrConfig.<init> Loaded SolrConfig: solrconfig.xml
[junit4:junit4]   2> 198 T1467 oass.IndexSchema.readSchema Reading Solr Schema
[junit4:junit4]   2> 201 T1467 oass.IndexSchema.readSchema Schema name=test
[junit4:junit4]   2> 220 T1467 oass.IndexSchema.readSchema unique key field: id
[junit4:junit4]   2> 221 T1467 oasc.SolrCore.<init> [collection1] Opening new SolrCore at .\org.apache.solr.handler.TestReplicationHandler$SolrInstance-1351308457351\master\collection1\, dataDir=.\org.apache.solr.handler.TestReplicationHandler$SolrInstance-1351308457351\master\collection1\data\
[junit4:junit4]   2> 221 T1467 oasc.SolrCore.<init> JMX monitoring not detected for core: collection1
[junit4:junit4]   2> 222 T1467 oasc.SolrCore.initDirectoryFactory org.apache.solr.core.MockDirectoryFactory
[junit4:junit4]   2> 222 T1467 oasc.CachingDirectoryFactory.injectLockFactory WARNING No lockType configured for MockDirWrapper(org.apache.lucene.store.RAMDirectory@6fc183d3 lockFactory=org.apache.lucene.store.SingleInstanceLockFactory@9b5caf7) assuming 'simple'
[junit4:junit4]   2> 223 T1467 oasc.CachingDirectoryFactory.get return new directory for C:\Users\JenkinsSlave\workspace\Lucene-Solr-trunk-Windows\solr\build\solr-core\test\J0\.\org.apache.solr.handler.TestReplicationHandler$SolrInstance-1351308457351\master\collection1\data forceNew:false
[junit4:junit4]   2> 223 T1467 oasc.CachingDirectoryFactory.close Releasing directory:C:\Users\JenkinsSlave\workspace\Lucene-Solr-trunk-Windows\solr\build\solr-core\test\J0\.\org.apache.solr.handler.TestReplicationHandler$SolrInstance-1351308457351\master\collection1\data
[junit4:junit4]   2> 223 T1467 oasc.SolrCore.getNewIndexDir New index directory detected: old=null new=.\org.apache.solr.handler.TestReplicationHandler$SolrInstance-1351308457351\master\collection1\data\index/
[junit4:junit4]   2> 224 T1467 oasc.SolrCore.initIndex WARNING [collection1] Solr index directory '.\org.apache.solr.handler.TestReplicationHandler$SolrInstance-1351308457351\master\collection1\data\index' doesn't exist. Creating new index...
[junit4:junit4]   2> 225 T1467 oasc.CachingDirectoryFactory.get return new directory for C:\Users\JenkinsSlave\workspace\Lucene-Solr-trunk-Windows\solr\build\solr-core\test\J0\.\org.apache.solr.handler.TestReplicationHandler$SolrInstance-1351308457351\master\collection1\data\index forceNew:false
[junit4:junit4]   2> 225 T1467 oasc.SolrDeletionPolicy.onCommit SolrDeletionPolicy.onCommit: commits:num=1
[junit4:junit4]   2> 		commit{dir=MockDirWrapper(org.apache.lucene.store.RAMDirectory@1d5e469d lockFactory=org.apache.lucene.store.SingleInstanceLockFactory@5cdafbc4),segFN=segments_1,generation=1,filenames=[segments_1]
[junit4:junit4]   2> 226 T1467 oasc.SolrDeletionPolicy.updateCommits newest commit = 1[segments_1]
[junit4:junit4]   2> 226 T1467 oasc.CachingDirectoryFactory.close Releasing directory:C:\Users\JenkinsSlave\workspace\Lucene-Solr-trunk-Windows\solr\build\solr-core\test\J0\.\org.apache.solr.handler.TestReplicationHandler$SolrInstance-1351308457351\master\collection1\data\index
[junit4:junit4]   2> 227 T1467 oasc.RequestHandlers.initHandlersFromConfig created standard: solr.StandardRequestHandler
[junit4:junit4]   2> 227 T1467 oasc.RequestHandlers.initHandlersFromConfig created /replication: solr.ReplicationHandler
[junit4:junit4]   2> 227 T1467 oasc.RequestHandlers.initHandlersFromConfig created defaults: solr.StandardRequestHandler
[junit4:junit4]   2> 227 T1467 oasc.RequestHandlers.initHandlersFromConfig adding lazy requestHandler: solr.StandardRequestHandler
[junit4:junit4]   2> 228 T1467 oasc.RequestHandlers.initHandlersFromConfig created lazy: solr.StandardRequestHandler
[junit4:junit4]   2> 228 T1467 oasc.RequestHandlers.initHandlersFromConfig created /update: solr.UpdateRequestHandler
[junit4:junit4]   2> 232 T1467 oashl.XMLLoader.init xsltCacheLifetimeSeconds=60
[junit4:junit4]   2> 235 T1467 oasc.CachingDirectoryFactory.close Releasing directory:C:\Users\JenkinsSlave\workspace\Lucene-Solr-trunk-Windows\solr\build\solr-core\test\J0\.\org.apache.solr.handler.TestReplicationHandler$SolrInstance-1351308457351\master\collection1\data
[junit4:junit4]   2> 235 T1467 oass.SolrIndexSearcher.<init> Opening Searcher@542f2ff8 main
[junit4:junit4]   2> 235 T1467 oasu.CommitTracker.<init> Hard AutoCommit: disabled
[junit4:junit4]   2> 236 T1467 oasu.CommitTracker.<init> Soft AutoCommit: disabled
[junit4:junit4]   2> 236 T1467 oashc.HttpShardHandlerFactory.getParameter Setting socketTimeout to: 0
[junit4:junit4]   2> 236 T1467 oashc.HttpShardHandlerFactory.getParameter Setting urlScheme to: http://
[junit4:junit4]   2> 236 T1467 oashc.HttpShardHandlerFactory.getParameter Setting connTimeout to: 0
[junit4:junit4]   2> 236 T1467 oashc.HttpShardHandlerFactory.getParameter Setting maxConnectionsPerHost to: 20
[junit4:junit4]   2> 237 T1467 oashc.HttpShardHandlerFactory.getParameter Setting corePoolSize to: 0
[junit4:junit4]   2> 237 T1467 oashc.HttpShardHandlerFactory.getParameter Setting maximumPoolSize to: 2147483647
[junit4:junit4]   2> 237 T1467 oashc.HttpShardHandlerFactory.getParameter Setting maxThreadIdleTime to: 5
[junit4:junit4]   2> 238 T1467 oashc.HttpShardHandlerFactory.getParameter Setting sizeOfQueue to: -1
[junit4:junit4]   2> 239 T1467 oashc.HttpShardHandlerFactory.getParameter Setting fairnessPolicy to: false
[junit4:junit4]   2> 239 T1467 oascsi.HttpClientUtil.createClient Creating new http client, config:maxConnectionsPerHost=20&maxConnections=10000&socketTimeout=0&connTimeout=0&retry=false
[junit4:junit4]   2> 246 T1467 oash.ReplicationHandler.inform Replication enabled for following config files: schema.xml,xslt/dummy.xsl
[junit4:junit4]   2> 246 T1467 oash.ReplicationHandler.inform Commits will be reserved for  10000
[junit4:junit4]   2> 247 T1467 oasc.CoreContainer.register registering core: collection1
[junit4:junit4]   2> 247 T1477 oasc.SolrCore.registerSearcher [collection1] Registered new searcher Searcher@542f2ff8 main{StandardDirectoryReader(segments_1:1)}
[junit4:junit4]   2> 247 T1467 oass.SolrDispatchFilter.init user.dir=C:\Users\JenkinsSlave\workspace\Lucene-Solr-trunk-Windows\solr\build\solr-core\test\J0
[junit4:junit4]   2> 248 T1467 oass.SolrDispatchFilter.init SolrDispatchFilter.init() done
[junit4:junit4]   2> 248 T1467 oascsi.HttpClientUtil.createClient Creating new http client, config:maxConnections=128&maxConnectionsPerHost=32&followRedirects=false
[junit4:junit4]   2> 263 T1467 oejs.Server.doStart jetty-8.1.2.v20120308
[junit4:junit4]   2> 265 T1467 oejs.AbstractConnector.doStart Started SelectChannelConnector@0.0.0.0:64527
[junit4:junit4]   2> 268 T1467 oasc.SolrResourceLoader.locateSolrHome JNDI not configured for solr (NoInitialContextEx)
[junit4:junit4]   2> 268 T1467 oasc.SolrResourceLoader.locateSolrHome using system property solr.solr.home: .\org.apache.solr.handler.TestReplicationHandler$SolrInstance-1351308457596\slave
[junit4:junit4]   2> 269 T1467 oasc.SolrResourceLoader.<init> new SolrResourceLoader for deduced Solr Home: '.\org.apache.solr.handler.TestReplicationHandler$SolrInstance-1351308457596\slave\'
[junit4:junit4]   2> 305 T1467 oass.SolrDispatchFilter.init SolrDispatchFilter.init()
[junit4:junit4]   2> 306 T1467 oasc.SolrResourceLoader.locateSolrHome JNDI not configured for solr (NoInitialContextEx)
[junit4:junit4]   2> 306 T1467 oasc.SolrResourceLoader.locateSolrHome using system property solr.solr.home: .\org.apache.solr.handler.TestReplicationHandler$SolrInstance-1351308457596\slave
[junit4:junit4]   2> 307 T1467 oasc.CoreContainer$Initializer.initialize looking for solr.xml: C:\Users\JenkinsSlave\workspace\Lucene-Solr-trunk-Windows\solr\build\solr-core\test\J0\.\org.apache.solr.handler.TestReplicationHandler$SolrInstance-1351308457596\slave\solr.xml
[junit4:junit4]   2> 307 T1467 oasc.CoreContainer.<init> New CoreContainer 1491330039
[junit4:junit4]   2> 308 T1467 oasc.CoreContainer$Initializer.initialize no solr.xml file found - using default
[junit4:junit4]   2> 308 T1467 oasc.CoreContainer.load Loading CoreContainer using Solr Home: '.\org.apache.solr.handler.TestReplicationHandler$SolrInstance-1351308457596\slave\'
[junit4:junit4]   2> 308 T1467 oasc.SolrResourceLoader.<init> new SolrResourceLoader for directory: '.\org.apache.solr.handler.TestReplicationHandler$SolrInstance-1351308457596\slave\'
[junit4:junit4]   2> 351 T1467 oasc.CoreContainer.load Registering Log Listener
[junit4:junit4]   2> 382 T1467 oasc.CoreContainer.create Creating SolrCore 'collection1' using instanceDir: .\org.apache.solr.handler.TestReplicationHandler$SolrInstance-1351308457596\slave\collection1
[junit4:junit4]   2> 385 T1467 oasc.SolrResourceLoader.<init> new SolrResourceLoader for directory: '.\org.apache.solr.handler.TestReplicationHandler$SolrInstance-1351308457596\slave\collection1\'
[junit4:junit4]   2> 421 T1467 oasc.SolrConfig.<init> Using Lucene MatchVersion: LUCENE_50
[junit4:junit4]   2> 486 T1467 oasc.SolrConfig.<init> Loaded SolrConfig: solrconfig.xml
[junit4:junit4]   2> 487 T1467 oass.IndexSchema.readSchema Reading Solr Schema
[junit4:junit4]   2> 490 T1467 oass.IndexSchema.readSchema Schema name=test
[junit4:junit4]   2> 512 T1467 oass.IndexSchema.readSchema unique key field: id
[junit4:junit4]   2> 514 T1467 oasc.SolrCore.<init> [collection1] Opening new SolrCore at .\org.apache.solr.handler.TestReplicationHandler$SolrInstance-1351308457596\slave\collection1\, dataDir=.\org.apache.solr.handler.TestReplicationHandler$SolrInstance-1351308457596\slave\collection1\data\
[junit4:junit4]   2> 514 T1467 oasc.SolrCore.<init> JMX monitoring not detected for core: collection1
[junit4:junit4]   2> 515 T1467 oasc.SolrCore.initDirectoryFactory org.apache.solr.core.MockDirectoryFactory
[junit4:junit4]   2> 518 T1467 oasc.CachingDirectoryFactory.injectLockFactory WARNING No lockType configured for MockDirWrapper(org.apache.lucene.store.NIOFSDirectory@C:\Users\JenkinsSlave\workspace\Lucene-Solr-trunk-Windows\solr\build\solr-core\test\J0\index2513625144tmp lockFactory=org.apache.lucene.store.NativeFSLockFactory@7951ec36) assuming 'simple'
[junit4:junit4]   2> 519 T1467 oasc.CachingDirectoryFactory.get return new directory for C:\Users\JenkinsSlave\workspace\Lucene-Solr-trunk-Windows\solr\build\solr-core\test\J0\.\org.apache.solr.handler.TestReplicationHandler$SolrInstance-1351308457596\slave\collection1\data forceNew:false
[junit4:junit4]   2> 520 T1467 oasc.CachingDirectoryFactory.close Releasing directory:C:\Users\JenkinsSlave\workspace\Lucene-Solr-trunk-Windows\solr\build\solr-core\test\J0\.\org.apache.solr.handler.TestReplicationHandler$SolrInstance-1351308457596\slave\collection1\data
[junit4:junit4]   2> 520 T1467 oasc.SolrCore.getNewIndexDir New index directory detected: old=null new=.\org.apache.solr.handler.TestReplicationHandler$SolrInstance-1351308457596\slave\collection1\data\index/
[junit4:junit4]   2> 522 T1467 oasc.SolrCore.initIndex WARNING [collection1] Solr index directory '.\org.apache.solr.handler.TestReplicationHandler$SolrInstance-1351308457596\slave\collection1\data\index' doesn't exist. Creating new index...
[junit4:junit4]   2> 522 T1467 oasc.CachingDirectoryFactory.get return new directory for C:\Users\JenkinsSlave\workspace\Lucene-Solr-trunk-Windows\solr\build\solr-core\test\J0\.\org.apache.solr.handler.TestReplicationHandler$SolrInstance-1351308457596\slave\collection1\data\index forceNew:false
[junit4:junit4]   2> 523 T1467 oasc.SolrDeletionPolicy.onCommit SolrDeletionPolicy.onCommit: commits:num=1
[junit4:junit4]   2> 		commit{dir=MockDirWrapper(org.apache.lucene.store.RAMDirectory@2abce531 lockFactory=org.apache.lucene.store.SingleInstanceLockFactory@34560144),segFN=segments_1,generation=1,filenames=[segments_1]
[junit4:junit4]   2> 524 T1467 oasc.SolrDeletionPolicy.updateCommits newest commit = 1[segments_1]
[junit4:junit4]   2> 524 T1467 oasc.CachingDirectoryFactory.close Releasing directory:C:\Users\JenkinsSlave\workspace\Lucene-Solr-trunk-Windows\solr\build\solr-core\test\J0\.\org.apache.solr.handler.TestReplicationHandler$SolrInstance-1351308457596\slave\collection1\data\index
[junit4:junit4]   2> 526 T1467 oasc.RequestHandlers.initHandlersFromConfig created standard: solr.StandardRequestHandler
[junit4:junit4]   2> 526 T1467 oasc.RequestHandlers.initHandlersFromConfig created defaults: solr.StandardRequestHandler
[junit4:junit4]   2> 526 T1467 oasc.RequestHandlers.initHandlersFromConfig adding lazy requestHandler: solr.StandardRequestHandler
[junit4:junit4]   2> 527 T1467 oasc.RequestHandlers.initHandlersFromConfig created lazy: solr.StandardRequestHandler
[junit4:junit4]   2> 527 T1467 oasc.RequestHandlers.initHandlersFromConfig created /update: solr.UpdateRequestHandler
[junit4:junit4]   2> 528 T1467 oasc.RequestHandlers.initHandlersFromConfig created /replication: solr.ReplicationHandler
[junit4:junit4]   2> 535 T1467 oashl.XMLLoader.init xsltCacheLifetimeSeconds=60
[junit4:junit4]   2> 542 T1467 oasc.CachingDirectoryFactory.close Releasing directory:C:\Users\JenkinsSlave\workspace\Lucene-Solr-trunk-Windows\solr\build\solr-core\test\J0\.\org.apache.solr.handler.TestReplicationHandler$SolrInstance-1351308457596\slave\collection1\data
[junit4:junit4]   2> 543 T1467 oass.SolrIndexSearcher.<init> Opening Searcher@7c177a08 main
[junit4:junit4]   2> 543 T1467 oasu.CommitTracker.<init> Hard AutoCommit: disabled
[junit4:junit4]   2> 543 T1467 oasu.CommitTracker.<init> Soft AutoCommit: disabled
[junit4:junit4]   2> 544 T1467 oashc.HttpShardHandlerFactory.getParameter Setting socketTimeout to: 0
[junit4:junit4]   2> 544 T1467 oashc.HttpShardHandlerFactory.getParameter Setting urlScheme to: http://
[junit4:junit4]   2> 545 T1467 oashc.HttpShardHandlerFactory.getParameter Setting connTimeout to: 0
[junit4:junit4]   2> 545 T1467 oashc.HttpShardHandlerFactory.getParameter Setting maxConnectionsPerHost to: 20
[junit4:junit4]   2> 545 T1467 oashc.HttpShardHandlerFactory.getParameter Setting corePoolSize to: 0
[junit4:junit4]   2> 545 T1467 oashc.HttpShardHandlerFactory.getParameter Setting maximumPoolSize to: 2147483647
[junit4:junit4]   2> 546 T1467 oashc.HttpShardHandlerFactory.getParameter Setting maxThreadIdleTime to: 5
[junit4:junit4]   2> 546 T1467 oashc.HttpShardHandlerFactory.getParameter Setting sizeOfQueue to: -1
[junit4:junit4]   2> 546 T1467 oashc.HttpShardHandlerFactory.getParameter Setting fairnessPolicy to: false
[junit4:junit4]   2> 547 T1467 oascsi.HttpClientUtil.createClient Creating new http client, config:maxConnectionsPerHost=20&maxConnections=10000&socketTimeout=0&connTimeout=0&retry=false
[junit4:junit4]   2> 555 T1467 oascsi.HttpClientUtil.createClient Creating new http client, config:connTimeout=5000&socketTimeout=20000&allowCompression=false&maxConnections=10000&maxConnectionsPerHost=10000
[junit4:junit4]   2> 566 T1467 oash.SnapPuller.startExecutorService Poll Scheduled at an interval of 1000ms
[junit4:junit4]   2> 567 T1487 oasc.SolrCore.registerSearcher [collection1] Registered new searcher Searcher@7c177a08 main{StandardDirectoryReader(segments_1:1)}
[junit4:junit4]   2> 567 T1467 oasc.CoreContainer.register registering core: collection1
[junit4:junit4]   2> 567 T1467 oass.SolrDispatchFilter.init user.dir=C:\Users\JenkinsSlave\workspace\Lucene-Solr-trunk-Windows\solr\build\solr-core\test\J0
[junit4:junit4]   2> 567 T1467 oass.SolrDispatchFilter.init SolrDispatchFilter.init() done
[junit4:junit4]   2> 568 T1467 oascsi.HttpClientUtil.createClient Creating new http client, config:maxConnections=128&maxConnectionsPerHost=32&followRedirects=false
[junit4:junit4]   2> 586 T1467 oasc.CoreContainer.shutdown Shutting down CoreContainer instance=1491330039
[junit4:junit4]   2> 587 T1467 oasc.SolrCore.close [collection1]  CLOSING SolrCore org.apache.solr.core.SolrCore@20b9f0d0
[junit4:junit4]   2> 587 T1467 oasu.DirectUpdateHandler2.close closing DirectUpdateHandler2{commits=0,autocommits=0,soft autocommits=0,optimizes=0,rollbacks=0,expungeDeletes=0,docsPending=0,adds=0,deletesById=0,deletesByQuery=0,errors=0,cumulative_adds=0,cumulative_deletesById=0,cumulative_deletesByQuery=0,cumulative_errors=0}
[junit4:junit4]   2> 588 T1467 oasc.SolrCore.decrefSolrCoreState Closing SolrCoreState
[junit4:junit4]   2> 588 T1467 oasu.DefaultSolrCoreState.closeIndexWriter SolrCoreState ref count has reached 0 - closing IndexWriter
[junit4:junit4]   2> 588 T1467 oasu.DefaultSolrCoreState.closeIndexWriter closing IndexWriter with IndexWriterCloser
[junit4:junit4]   2> 589 T1467 oasc.SolrCore.closeSearcher [collection1] Closing main searcher on request.
[junit4:junit4]   2> 589 T1467 oasc.CachingDirectoryFactory.close Releasing directory:C:\Users\JenkinsSlave\workspace\Lucene-Solr-trunk-Windows\solr\build\solr-core\test\J0\.\org.apache.solr.handler.TestReplicationHandler$SolrInstance-1351308457596\slave\collection1\data\index
[junit4:junit4]   2> 589 T1467 oejsh.ContextHandler.doStop stopped o.e.j.s.ServletContextHandler{/solr,null}
[junit4:junit4]   2> 659 T1467 oasc.CoreContainer.shutdown Shutting down CoreContainer instance=894890497
[junit4:junit4]   2> 659 T1467 oasc.SolrCore.close [collection1]  CLOSING SolrCore org.apache.solr.core.SolrCore@7839e749
[junit4:junit4]   2> 660 T1467 oasu.DirectUpdateHandler2.close closing DirectUpdateHandler2{commits=0,autocommits=0,soft autocommits=0,optimizes=0,rollbacks=0,expungeDeletes=0,docsPending=0,adds=0,deletesById=0,deletesByQuery=0,errors=0,cumulative_adds=0,cumulative_deletesById=0,cumulative_deletesByQuery=0,cumulative_errors=0}
[junit4:junit4]   2> 660 T1467 oasc.SolrCore.decrefSolrCoreState Closing SolrCoreState
[junit4:junit4]   2> 660 T1467 oasu.DefaultSolrCoreState.closeIndexWriter SolrCoreState ref count has reached 0 - closing IndexWriter
[junit4:junit4]   2> 660 T1467 oasu.DefaultSolrCoreState.closeIndexWriter closing IndexWriter with IndexWriterCloser
[junit4:junit4]   2> 662 T1467 oasc.SolrCore.closeSearcher [collection1] Closing main searcher on request.
[junit4:junit4]   2> 662 T1467 oasc.CachingDirectoryFactory.close Releasing directory:C:\Users\JenkinsSlave\workspace\Lucene-Solr-trunk-Windows\solr\build\solr-core\test\J0\.\org.apache.solr.handler.TestReplicationHandler$SolrInstance-1351308457351\master\collection1\data\index
[junit4:junit4]   2> 663 T1467 oejsh.ContextHandler.doStop stopped o.e.j.s.ServletContextHandler{/solr,null}
[junit4:junit4]   2> 715 T1467 oejs.Server.doStart jetty-8.1.2.v20120308
[junit4:junit4]   2> 718 T1467 oejs.AbstractConnector.doStart Started SelectChannelConnector@0.0.0.0:64530
[junit4:junit4]   2> 719 T1467 oasc.SolrResourceLoader.locateSolrHome JNDI not configured for solr (NoInitialContextEx)
[junit4:junit4]   2> 719 T1467 oasc.SolrResourceLoader.locateSolrHome using system property solr.solr.home: .\org.apache.solr.handler.TestReplicationHandler$SolrInstance-1351308457351\master
[junit4:junit4]   2> 719 T1467 oasc.SolrResourceLoader.<init> new SolrResourceLoader for deduced Solr Home: '.\org.apache.solr.handler.TestReplicationHandler$SolrInstance-1351308457351\master\'
[junit4:junit4]   2> 751 T1467 oass.SolrDispatchFilter.init SolrDispatchFilter.init()
[junit4:junit4]   2> 751 T1467 oasc.SolrResourceLoader.locateSolrHome JNDI not configured for solr (NoInitialContextEx)
[junit4:junit4]   2> 752 T1467 oasc.SolrResourceLoader.locateSolrHome using system property solr.solr.home: .\org.apache.solr.handler.TestReplicationHandler$SolrInstance-1351308457351\master
[junit4:junit4]   2> 752 T1467 oasc.CoreContainer$Initializer.initialize looking for solr.xml: C:\Users\JenkinsSlave\workspace\Lucene-Solr-trunk-Windows\solr\build\solr-core\test\J0\.\org.apache.solr.handler.TestReplicationHandler$SolrInstance-1351308457351\master\solr.xml
[junit4:junit4]   2> 753 T1467 oasc.CoreContainer.<init> New CoreContainer 1020562001
[junit4:junit4]   2> 754 T1467 oasc.CoreContainer$Initializer.initialize no solr.xml file found - using default
[junit4:junit4]   2> 754 T1467 oasc.CoreContainer.load Loading CoreContainer using Solr Home: '.\org.apache.solr.handler.TestReplicationHandler$SolrInstance-1351308457351\master\'
[junit4:junit4]   2> 755 T1467 oasc.SolrResourceLoader.<init> new SolrResourceLoader for directory: '.\org.apache.solr.handler.TestReplicationHandler$SolrInstance-1351308457351\master\'
[junit4:junit4]   2> 777 T1467 oasc.CoreContainer.load Registering Log Listener
[junit4:junit4]   2> 807 T1467 oasc.CoreContainer.create Creating SolrCore 'collection1' using instanceDir: .\org.apache.solr.handler.TestReplicationHandler$SolrInstance-1351308457351\master\collection1
[junit4:junit4]   2> 807 T1467 oasc.SolrResourceLoader.<init> new SolrResourceLoader for directory: '.\org.apache.solr.handler.TestReplicationHandler$SolrInstance-1351308457351\master\collection1\'
[junit4:junit4]   2> 840 T1467 oasc.SolrConfig.<init> Using Lucene MatchVersion: LUCENE_50
[junit4:junit4]   2> 892 T1467 oasc.SolrConfig.<init> Loaded SolrConfig: solrconfig.xml
[junit4:junit4]   2> 893 T1467 oass.IndexSchema.readSchema Reading Solr Schema
[junit4:junit4]   2> 896 T1467 oass.IndexSchema.readSchema Schema name=test
[junit4:junit4]   2> 916 T1467 oass.IndexSchema.readSchema unique key field: id
[junit4:junit4]   2> 917 T1467 oasc.SolrCore.<init> [collection1] Opening new SolrCore at .\org.apache.solr.handler.TestReplicationHandler$SolrInstance-1351308457351\master\collection1\, dataDir=.\org.apache.solr.handler.TestReplicationHandler$SolrInstance-1351308457351\master\collection1\data\
[junit4:junit4]   2> 917 T1467 oasc.SolrCore.<init> JMX monitoring not detected for core: collection1
[junit4:junit4]   2> 919 T1467 oasc.SolrCore.initDirectoryFactory org.apache.solr.core.MockDirectoryFactory
[junit4:junit4]   2> 919 T1467 oasc.CachingDirectoryFactory.injectLockFactory WARNING No lockType configured for MockDirWrapper(org.apache.lucene.store.RAMDirectory@70b7ae2f lockFactory=org.apache.lucene.store.SingleInstanceLockFactory@2b0cc979) assuming 'simple'
[junit4:junit4]   2> 919 T1467 oasc.CachingDirectoryFactory.get return new directory for C:\Users\JenkinsSlave\workspace\Lucene-Solr-trunk-Windows\solr\build\solr-core\test\J0\.\org.apache.solr.handler.TestReplicationHandler$SolrInstance-1351308457351\master\collection1\data forceNew:false
[junit4:junit4]   2> 920 T1467 oasc.CachingDirectoryFactory.close Releasing directory:C:\Users\JenkinsSlave\workspace\Lucene-Solr-trunk-Windows\solr\build\solr-core\test\J0\.\org.apache.solr.handler.TestReplicationHandler$SolrInstance-1351308457351\master\collection1\data
[junit4:junit4]   2> 920 T1467 oasc.SolrCore.getNewIndexDir New index directory detected: old=null new=.\org.apache.solr.handler.TestReplicationHandler$SolrInstance-1351308457351\master\collection1\data\index/
[junit4:junit4]   2> 921 T1467 oasc.SolrCore.initIndex WARNING [collection1] Solr index directory '.\org.apache.solr.handler.TestReplicationHandler$SolrInstance-1351308457351\master\collection1\data\index' doesn't exist. Creating new index...
[junit4:junit4]   2> 921 T1467 oasc.CachingDirectoryFactory.get return new directory for C:\Users\JenkinsSlave\workspace\Lucene-Solr-trunk-Windows\solr\build\solr-core\test\J0\.\org.apache.solr.handler.TestReplicationHandler$SolrInstance-1351308457351\master\collection1\data\index forceNew:false
[junit4:junit4]   2> 922 T1467 oasc.SolrDeletionPolicy.onCommit SolrDeletionPolicy.onCommit: commits:num=1
[junit4:junit4]   2> 		commit{dir=MockDirWrapper(org.apache.lucene.store.RAMDirectory@1b3a7116 lockFactory=org.apache.lucene.store.SingleInstanceLockFactory@4b9c5217),segFN=segments_1,generation=1,filenames=[segments_1]
[junit4:junit4]   2> 922 T1467 oasc.SolrDeletionPolicy.updateCommits newest commit = 1[segments_1]
[junit4:junit4]   2> 923 T1467 oasc.CachingDirectoryFactory.close Releasing directory:C:\Users\JenkinsSlave\workspace\Lucene-Solr-trunk-Windows\solr\build\solr-core\test\J0\.\org.apache.solr.handler.TestReplicationHandler$SolrInstance-1351308457351\master\collection1\data\index
[junit4:junit4]   2> 923 T1467 oasc.RequestHandlers.initHandlersFromConfig created standard: solr.StandardRequestHandler
[junit4:junit4]   2> 924 T1467 oasc.RequestHandlers.initHandlersFromConfig created /replication: solr.ReplicationHandler
[junit4:junit4]   2> 924 T1467 oasc.RequestHandlers.initHandlersFromConfig created defaults: solr.StandardRequestHandler
[junit4:junit4]   2> 924 T1467 oasc.RequestHandlers.initHandlersFromConfig adding lazy requestHandler: solr.StandardRequestHandler
[junit4:junit4]   2> 924 T1467 oasc.RequestHandlers.initHandlersFromConfig created lazy: solr.StandardRequestHandler
[junit4:junit4]   2> 925 T1467 oasc.RequestHandlers.initHandlersFromConfig created /update: solr.UpdateRequestHandler
[junit4:junit4]   2> 926 T1467 oashl.XMLLoader.init xsltCacheLifetimeSeconds=60
[junit4:junit4]   2> 929 T1467 oasc.CachingDirectoryFactory.close Releasing directory:C:\Users\JenkinsSlave\workspace\Lucene-Solr-trunk-Windows\solr\build\solr-core\test\J0\.\org.apache.solr.handler.TestReplicationHandler$SolrInstance-1351308457351\master\collection1\data
[junit4:junit4]   2> 929 T1467 oass.SolrIndexSearcher.<init> Opening Searcher@51a44424 main
[junit4:junit4]   2> 930 T1467 oasu.CommitTracker.<init> Hard AutoCommit: disabled
[junit4:junit4]   2> 930 T1467 oasu.CommitTracker.<init> Soft AutoCommit: disabled
[junit4:junit4]   2> 930 T1467 oashc.HttpShardHandlerFactory.getParameter Setting socketTimeout to: 0
[junit4:junit4]   2> 930 T1467 oashc.HttpShardHandlerFactory.getParameter Setting urlScheme to: http://
[junit4:junit4]   2> 932 T1467 oashc.HttpShardHandlerFactory.getParameter Setting connTimeout to: 0
[junit4:junit4]   2> 932 T1467 oashc.HttpShardHandlerFactory.getParameter Setting maxConnectionsPerHost to: 20
[junit4:junit4]   2> 932 T1467 oashc.HttpShardHandlerFactory.getParameter Setting corePoolSize to: 0
[junit4:junit4]   2> 932 T1467 oashc.HttpShardHandlerFactory.getParameter Setting maximumPoolSize to: 2147483647
[junit4:junit4]   2> 932 T1467 oashc.HttpShardHandlerFactory.getParameter Setting maxThreadIdleTime to: 5
[junit4:junit4]   2> 933 T1467 oashc.HttpShardHandlerFactory.getParameter Setting sizeOfQueue to: -1
[junit4:junit4]   2> 933 T1467 oashc.HttpShardHandlerFactory.getParameter Setting fairnessPolicy to: false
[junit4:junit4]   2> 933 T1467 oascsi.HttpClientUtil.createClient Creating new http client, config:maxConnectionsPerHost=20&maxConnections=10000&socketTimeout=0&connTimeout=0&retry=false
[junit4:junit4]   2> 936 T1467 oash.ReplicationHandler.inform Replication enabled for following config files: schema.xml
[junit4:junit4]   2> 937 T1467 oash.ReplicationHandler.inform Commits will be reserved for  10000
[junit4:junit4]   2> 937 T1498 oasc.SolrCore.registerSearcher [collection1] Registered new searcher Searcher@51a44424 main{StandardDirectoryReader(segments_1:1)}
[junit4:junit4]   2> 937 T1467 oasc.CoreContainer.register registering core: collection1
[junit4:junit4]   2> 938 T1467 oass.SolrDispatchFilter.init user.dir=C:\Users\JenkinsSlave\workspace\Lucene-Solr-trunk-Windows\solr\build\solr-core\test\J0
[junit4:junit4]   2> 938 T1467 oass.SolrDispatchFilter.init SolrDispatchFilter.init() done
[junit4:junit4]   2> 938 T1467 oascsi.HttpClientUtil.createClient Creating new http client, config:maxConnections=128&maxConnectionsPerHost=32&followRedirects=false
[junit4:junit4]   2> ASYNC  NEW_CORE C108 name=collection1 org.apache.solr.core.SolrCore@b0153c2
[junit4:junit4]   2> 948 T1492 C108 oasu.DirectUpdateHandler2.deleteAll [collection1] REMOVING ALL DOCUMENTS FROM INDEX
[junit4:junit4]   2> 949 T1492 C108 oasc.CachingDirectoryFactory.close Releasing directory:C:\Users\JenkinsSlave\workspace\Lucene-Solr-trunk-Windows\solr\build\solr-core\test\J0\.\org.apache.solr.handler.TestReplicationHandler$SolrInstance-1351308457351\master\collection1\data
[junit4:junit4]   2> 950 T1492 C108 oasc.SolrDeletionPolicy.onInit SolrDeletionPolicy.onInit: commits:num=1
[junit4:junit4]   2> 		commit{dir=MockDirWrapper(org.apache.lucene.store.RAMDirectory@1b3a7116 lockFactory=org.apache.lucene.store.SingleInstanceLockFactory@4b9c5217),segFN=segments_1,generation=1,filenames=[segments_1]
[junit4:junit4]   2> 950 T1492 C108 oasc.SolrDeletionPolicy.updateCommits newest commit = 1[segments_1]
[junit4:junit4]   2> 950 T1492 C108 UPDATE [collection1] webapp=/solr path=/update params={wt=javabin&version=2} {deleteByQuery=*:*} 0 2
[junit4:junit4]   2> 954 T1493 C108 UPDATE [collection1] webapp=/solr path=/update params={wt=javabin&version=2} {add=[0]} 0 1
[junit4:junit4]   2> 957 T1494 C108 UPDATE [collection1] webapp=/solr path=/update params={wt=javabin&version=2} {add=[1]} 0 0
[junit4:junit4]   2> 960 T1495 C108 UPDATE [collection1] webapp=/solr path=/update params={wt=javabin&version=2} {add=[2]} 0 0
[junit4:junit4]   2> 963 T1496 C108 UPDATE [collection1] webapp=/solr path=/update params={wt=javabin&version=2} {add=[3]} 0 0
[junit4:junit4]   2> 966 T1497 C108 UPDATE [collection1] webapp=/solr path=/update params={wt=javabin&version=2} {add=[4]} 0 0
[junit4:junit4]   2> 969 T1492 C108 UPDATE [collection1] webapp=/solr path=/update params={wt=javabin&version=2} {add=[5]} 0 0
[junit4:junit4]   2> 972 T1493 C108 UPDATE [collection1] webapp=/solr path=/update params={wt=javabin&version=2} {add=[6]} 0 0
[junit4:junit4]   2> 976 T1494 C108 UPDATE [collection1] webapp=/solr path=/update params={wt=javabin&version=2} {add=[7]} 0 0
[junit4:junit4]   2> 980 T1495 C108 UPDATE [collection1] webapp=/solr path=/update params={wt=javabin&version=2} {add=[8]} 0 0
[junit4:junit4]   2> 983 T1496 C108 UPDATE [collection1] webapp=/solr path=/update params={wt=javabin&version=2} {add=[9]} 0 0
[junit4:junit4]   2> 986 T1497 C108 oasu.DirectUpdateHandler2.commit start commit{flags=0,_version_=0,optimize=false,openSearcher=true,waitSearcher=true,expungeDeletes=false,softCommit=false}
[junit4:junit4]   2> 988 T1497 C108 oasc.SolrDeletionPolicy.onCommit SolrDeletionPolicy.onCommit: commits:num=2
[junit4:junit4]   2> 		commit{dir=MockDirWrapper(org.apache.lucene.store.RAMDirectory@1b3a7116 lockFactory=org.apache.lucene.store.SingleInstanceLockFactory@4b9c5217),segFN=segments_1,generation=1,filenames=[segments_1]
[junit4:junit4]   2> 		commit{dir=MockDirWrapper(org.apache.lucene.store.RAMDirectory@1b3a7116 lockFactory=org.apache.lucene.store.SingleInstanceLockFactory@4b9c5217),segFN=segments_2,generation=2,filenames=[_0_Pulsing41_0.doc, _0.fnm, _0_Pulsing41_0.tim, _0_Pulsing41_0.tip, _0_nrm.cfe, segments_2, _0.fdx, _0_nrm.cfs, _0.si, _0.fdt]
[junit4:junit4]   2> 988 T1497 C108 oasc.SolrDeletionPolicy.updateCommits newest commit = 2[_0_Pulsing41_0.doc, _0.fnm, _0_Pulsing41_0.tim, _0_Pulsing41_0.tip, _0_nrm.cfe, segments_2, _0.fdx, _0_nrm.cfs, _0.si, _0.fdt]
[junit4:junit4]   2> 988 T1497 C108 oasc.CachingDirectoryFactory.close Releasing directory:C:\Users\JenkinsSlave\workspace\Lucene-Solr-trunk-Windows\solr\build\solr-core\test\J0\.\org.apache.solr.handler.TestReplicationHandler$SolrInstance-1351308457351\master\collection1\data
[junit4:junit4]   2> 989 T1497 C108 oass.SolrIndexSearcher.<init> Opening Searcher@75175798 main
[junit4:junit4]   2> 989 T1497 C108 oasu.DirectUpdateHandler2.commit end_commit_flush
[junit4:junit4]   2> 989 T1498 oasc.SolrCore.registerSearcher [collection1] Registered new searcher Searcher@75175798 main{StandardDirectoryReader(segments_2:4 _0(5.0):C10)}
[junit4:junit4]   2> 990 T1498 oasc.CachingDirectoryFactory.close Releasing directory:C:\Users\JenkinsSlave\workspace\Lucene-Solr-trunk-Windows\solr\build\solr-core\test\J0\.\org.apache.solr.handler.TestReplicationHandler$SolrInstance-1351308457351\master\collection1\data\index
[junit4:junit4]   2> 990 T1497 C108 UPDATE [collection1] webapp=/solr path=/update params={waitSearcher=true&wt=javabin&commit=true&softCommit=false&version=2} {commit=} 0 4
[junit4:junit4]   2> 994 T1492 C108 REQ [collection1] webapp=/solr path=/select params={wt=javabin&q=*:*&version=2} hits=10 status=0 QTime=1 
[junit4:junit4]   2> 1105 T1467 oejs.Server.doStart jetty-8.1.2.v20120308
[junit4:junit4]   2> 1109 T1467 oejs.AbstractConnector.doStart Started SelectChannelConnector@0.0.0.0:64534
[junit4:junit4]   2> 1109 T1467 oasc.SolrResourceLoader.locateSolrHome JNDI not configured for solr (NoInitialContextEx)
[junit4:junit4]   2> 1110 T1467 oasc.SolrResourceLoader.locateSolrHome using system property solr.solr.home: .\org.apache.solr.handler.TestReplicationHandler$SolrInstance-1351308457596\slave
[junit4:junit4]   2> 1110 T1467 oasc.SolrResourceLoader.<init> new SolrResourceLoader for deduced Solr Home: '.\org.apache.solr.handler.TestReplicationHandler$SolrInstance-1351308457596\slave\'
[junit4:junit4]   2> 1127 T1467 oass.SolrDispatchFilter.init SolrDispatchFilter.init()
[junit4:junit4]   2> 1127 T1467 oasc.SolrResourceLoader.locateSolrHome JNDI not configured for solr (NoInitialContextEx)
[junit4:junit4]   2> 1127 T1467 oasc.SolrResourceLoader.locateSolrHome using system property solr.solr.home: .\org.apache.solr.handler.TestReplicationHandler$SolrInstance-1351308457596\slave
[junit4:junit4]   2> 1128 T1467 oasc.CoreContainer$Initializer.initialize looking for solr.xml: C:\Users\JenkinsSlave\workspace\Lucene-Solr-trunk-Windows\solr\build\solr-core\test\J0\.\org.apache.solr.handler.TestReplicationHandler$SolrInstance-1351308457596\slave\solr.xml
[junit4:junit4]   2> 1128 T1467 oasc.CoreContainer.<init> New CoreContainer 1609540955
[junit4:junit4]   2> 1129 T1467 oasc.CoreContainer$Initializer.initialize no solr.xml file found - using default
[junit4:junit4]   2> 1129 T1467 oasc.CoreContainer.load Loading CoreContainer using Solr Home: '.\org.apache.solr.handler.TestReplicationHandler$SolrInstance-1351308457596\slave\'
[junit4:junit4]   2> 1130 T1467 oasc.SolrResourceLoader.<init> new SolrResourceLoader for directory: '.\org.apache.solr.handler.TestReplicationHandler$SolrInstance-1351308457596\slave\'
[junit4:junit4]   2> 1151 T1467 oasc.CoreContainer.load Registering Log Listener
[junit4:junit4]   2> 1178 T1467 oasc.CoreContainer.create Creating SolrCore 'collection1' using instanceDir: .\org.apache.solr.handler.TestReplicationHandler$SolrInstance-1351308457596\slave\collection1
[junit4:junit4]   2> 1178 T1467 oasc.SolrResourceLoader.<init> new SolrResourceLoader for directory: '.\org.apache.solr.handler.TestReplicationHandler$SolrInstance-1351308457596\slave\collection1\'
[junit4:junit4]   2> 1220 T1467 oasc.SolrConfig.<init> Using Lucene MatchVersion: LUCENE_50
[junit4:junit4]   2> 1283 T1467 oasc.SolrConfig.<init> Loaded SolrConfig: solrconfig.xml
[junit4:junit4]   2> 1285 T1467 oass.IndexSchema.readSchema Reading Solr Schema
[junit4:junit4]   2> 1288 T1467 oass.IndexSchema.readSchema Schema name=test
[junit4:junit4]   2> 1309 T1467 oass.IndexSchema.readSchema unique key field: id
[junit4:junit4]   2> 1311 T1467 oasc.SolrCore.<init> [collection1] Opening new SolrCore at .\org.apache.solr.handler.TestReplicationHandler$SolrInstance-1351308457596\slave\collection1\, dataDir=.\org.apache.solr.handler.TestReplicationHandler$SolrInstance-1351308457596\slave\collection1\data\
[junit4:junit4]   2> 1313 T1467 oasc.SolrCore.<init> JMX monitoring not detected for core: collection1
[junit4:junit4]   2> 1313 T1467 oasc.SolrCore.initDirectoryFactory org.apache.solr.core.MockDirectoryFactory
[junit4:junit4]   2> 1314 T1467 oasc.CachingDirectoryFactory.injectLockFactory WARNING No lockType configured for MockDirWrapper(org.apache.lucene.store.RAMDirectory@c6d9856 lockFactory=org.apache.lucene.store.SingleInstanceLockFactory@6f2c3c79) assuming 'simple'
[junit4:junit4]   2> 1314 T1467 oasc.CachingDirectoryFactory.get return new directory for C:\Users\JenkinsSlave\workspace\Lucene-Solr-trunk-Windows\solr\build\solr-core\test\J0\.\org.apache.solr.handler.TestReplicationHandler$SolrInstance-1351308457596\slave\collection1\data forceNew:false
[junit4:junit4]   2> 1314 T1467 oasc.CachingDirectoryFactory.close Releasing directory:C:\Users\JenkinsSlave\workspace\Lucene-Solr-trunk-Windows\solr\build\solr-core\test\J0\.\org.apache.solr.handler.TestReplicationHandler$SolrInstance-1351308457596\slave\collection1\data
[junit4:junit4]   2> 1315 T1467 oasc.SolrCore.getNewIndexDir New index directory detected: old=null new=.\org.apache.solr.handler.TestReplicationHandler$SolrInstance-1351308457596\slave\collection1\data\index/
[junit4:junit4]   2> 1315 T1467 oasc.SolrCore.initIndex WARNING [collection1] Solr index directory '.\org.apache.solr.handler.TestReplicationHandler$SolrInstance-1351308457596\slave\collection1\data\index' doesn't exist. Creating new index...
[junit4:junit4]   2> 1316 T1467 oasc.CachingDirectoryFactory.get return new directory for C:\Users\JenkinsSlave\workspace\Lucene-Solr-trunk-Windows\solr\build\solr-core\test\J0\.\org.apache.solr.handler.TestReplicationHandler$SolrInstance-1351308457596\slave\collection1\data\index forceNew:false
[junit4:junit4]   2> 1317 T1467 oasc.SolrDeletionPolicy.onCommit SolrDeletionPolicy.onCommit: commits:num=1
[junit4:junit4]   2> 		commit{dir=MockDirWrapper(org.apache.lucene.store.RAMDirectory@63a0434a lockFactory=org.apache.lucene.store.SingleInstanceLockFactory@614e2e4),segFN=segments_1,generation=1,filenames=[segments_1]
[junit4:junit4]   2> 1317 T1467 oasc.SolrDeletionPolicy.updateCommits newest commit = 1[segments_1]
[junit4:junit4]   2> 1318 T1467 oasc.CachingDirectoryFactory.close Releasing directory:C:\Users\JenkinsSlave\workspace\Lucene-Solr-trunk-Windows\solr\build\solr-core\test\J0\.\org.apache.solr.handler.TestReplicationHandler$SolrInstance-1351308457596\slave\collection1\data\index
[junit4:junit4]   2> 1318 T1467 oasc.RequestHandlers.initHandlersFromConfig created standard: solr.StandardRequestHandler
[junit4:junit4]   2> 1319 T1467 oasc.RequestHandlers.initHandlersFromConfig created defaults: solr.StandardRequestHandler
[junit4:junit4]   2> 1319 T1467 oasc.RequestHandlers.initHandlersFromConfig adding lazy requestHandler: solr.StandardRequestHandler
[junit4:junit4]   2> 1319 T1467 oasc.RequestHandlers.initHandlersFromConfig created lazy: solr.StandardRequestHandler
[junit4:junit4]   2> 1320 T1467 oasc.RequestHandlers.initHandlersFromConfig created /update: solr.UpdateRequestHandler
[junit4:junit4]   2> 1320 T1467 oasc.RequestHandlers.initHandlersFromConfig created /replication: solr.ReplicationHandler
[junit4:junit4]   2> 1322 T1467 oashl.XMLLoader.init xsltCacheLifetimeSeconds=60
[junit4:junit4]   2> 1325 T1467 oasc.CachingDirectoryFactory.close Releasing directory:C:\Users\JenkinsSlave\workspace\Lucene-Solr-trunk-Windows\solr\build\solr-core\test\J0\.\org.apache.solr.handler.TestReplicationHandler$SolrInstance-1351308457596\slave\collection1\data
[junit4:junit4]   2> 1327 T1467 oass.SolrIndexSearcher.<init> Opening Searcher@724eb13e main
[junit4:junit4]   2> 1327 T1467 oasu.CommitTracker.<init> Hard AutoCommit: disabled
[junit4:junit4]   2> 1327 T1467 oasu.CommitTracker.<init> Soft AutoCommit: disabled
[junit4:junit4]   2> 1328 T1467 oashc.HttpShardHandlerFactory.getParameter Setting socketTimeout to: 0
[junit4:junit4]   2> 1328 T1467 oashc.HttpShardHandlerFactory.getParameter Setting urlScheme to: http://
[junit4:junit4]   2> 1329 T1467 oashc.HttpShardHandlerFactory.getParameter Setting connTimeout to: 0
[junit4:junit4]   2> 1329 T1467 oashc.HttpShardHandlerFactory.getParameter Setting maxConnectionsPerHost to: 20
[junit4:junit4]   2> 1329 T1467 oashc.HttpShardHandlerFactory.getParameter Setting corePoolSize to: 0
[junit4:junit4]   2> 1330 T1467 oashc.HttpShardHandlerFactory.getParameter Setting maximumPoolSize to: 2147483647
[junit4:junit4]   2> 1330 T1467 oashc.HttpShardHandlerFactory.getParameter Setting maxThreadIdleTime to: 5
[junit4:junit4]   2> 1330 T1467 oashc.HttpShardHandlerFactory.getParameter Setting sizeOfQueue to: -1
[junit4:junit4]   2> 1330 T1467 oashc.HttpShardHandlerFactory.getParameter Setting fairnessPolicy to: false
[junit4:junit4]   2> 1331 T1467 oascsi.HttpClientUtil.createClient Creating new http client, config:maxConnectionsPerHost=20&maxConnections=10000&socketTimeout=0&connTimeout=0&retry=false
[junit4:junit4]   2> 1336 T1467 oash.SnapPuller.startExecutorService Poll Scheduled at an interval of 1000ms
[junit4:junit4]   2> 1336 T1508 oasc.SolrCore.registerSearcher [collection1] Registered new searcher Searcher@724eb13e main{StandardDirectoryReader(segments_1:1)}
[junit4:junit4]   2> 1336 T1467 oasc.CoreContainer.register registering core: collection1
[junit4:junit4]   2> 1337 T1467 oass.SolrDispatchFilter.init user.dir=C:\Users\JenkinsSlave\workspace\Lucene-Solr-trunk-Windows\solr\build\solr-core\test\J0
[junit4:junit4]   2> 1339 T1467 oass.SolrDispatchFilter.init SolrDispatchFilter.init() done
[junit4:junit4]   2> 1339 T1467 oascsi.HttpClientUtil.createClient Creating new http client, config:maxConnections=128&maxConnectionsPerHost=32&followRedirects=false
[junit4:junit4]   2> ASYNC  NEW_CORE C109 name=collection1 org.apache.solr.core.SolrCore@64ffe918
[junit4:junit4]   2> 1351 T1502 C109 REQ [collection1] webapp=/solr path=/select params={wt=javabin&q=*:*&version=2} hits=0 status=0 QTime=1 
[junit4:junit4]   2> 1462 T1503 C109 REQ [collection1] webapp=/solr path=/select params={wt=javabin&q=*:*&version=2} hits=0 status=0 QTime=0 
[junit4:junit4]   2> 1576 T1504 C109 REQ [collection1] webapp=/solr path=/select params={wt=javabin&q=*:*&version=2} hits=0 status=0 QTime=0 
[junit4:junit4]   2> 1678 T1494 C108 REQ [collection1] webapp=/solr path=/replication params={command=indexversion&wt=javabin&qt=/replication&version=2} status=0 QTime=0 
[junit4:junit4]   2> 1678 T1509 oash.SnapPuller.fetchLatestIndex Master's generation: 2
[junit4:junit4]   2> 1679 T1509 oash.SnapPuller.fetchLatestIndex Slave's generation: 1
[junit4:junit4]   2> 1679 T1509 oash.SnapPuller.fetchLatestIndex Starting replication process
[junit4:junit4]   2> 1681 T1495 C108 oasc.CachingDirectoryFactory.close Releasing directory:C:\Users\JenkinsSlave\workspace\Lucene-Solr-trunk-Windows\solr\build\solr-core\test\J0\.\org.apache.solr.handler.TestReplicationHandler$SolrInstance-1351308457351\master\collection1\data
[junit4:junit4]   2> 1681 T1495 C108 oasc.CachingDirectoryFactory.close Releasing directory:C:\Users\JenkinsSlave\workspace\Lucene-Solr-trunk-Windows\solr\build\solr-core\test\J0\.\org.apache.solr.handler.TestReplicationHandler$SolrInstance-1351308457351\master\collection1\data\index
[junit4:junit4]   2> 1683 T1495 C108 REQ [collection1] webapp=/solr path=/replication params={command=filelist&generation=2&wt=javabin&qt=/replication&version=2} status=0 QTime=2 
[junit4:junit4]   2> 1684 T1509 oash.SnapPuller.fetchLatestIndex Number of files in latest index in master: 10
[junit4:junit4]   2> 1685 T1509 oasc.CachingDirectoryFactory.injectLockFactory WARNING No lockType configured for MockDirWrapper(org.apache.lucene.store.RAMDirectory@72013dcd lockFactory=org.apache.lucene.store.SingleInstanceLockFactory@2f809834) assuming 'simple'
[junit4:junit4]   2> 1685 T1509 oasc.CachingDirectoryFactory.get return new directory for C:\Users\JenkinsSlave\workspace\Lucene-Solr-trunk-Windows\solr\build\solr-core\test\J0\.\org.apache.solr.handler.TestReplicationHandler$SolrInstance-1351308457596\slave\collection1\data\index.20121026212739030 forceNew:false
[junit4:junit4]   2> 1685 T1509 oasc.CachingDirectoryFactory.close Releasing directory:C:\Users\JenkinsSlave\workspace\Lucene-Solr-trunk-Windows\solr\build\solr-core\test\J0\.\org.apache.solr.handler.TestReplicationHandler$SolrInstance-1351308457596\slave\collection1\data
[junit4:junit4]   2> 1685 T1509 oash.SnapPuller.fetchLatestIndex Starting download to MockDirWrapper(org.apache.lucene.store.RAMDirectory@72013dcd lockFactory=org.apache.lucene.store.SimpleFSLockFactory@23889649) fullCopy=false
[junit4:junit4]   2> 1687 T1506 C109 REQ [collection1] webapp=/solr path=/select params={wt=javabin&q=*:*&version=2} hits=0 status=0 QTime=0 
[junit4:junit4]   2> 1689 T1496 C108 REQ [collection1] webapp=/solr path=/replication params={file=_0_Pulsing41_0.doc&command=filecontent&checksum=true&compression=true&generation=2&qt=/replication&wt=filestream} status=0 QTime=0 
[junit4:junit4]   2> 1693 T1497 C108 REQ [collection1] webapp=/solr path=/replication params={file=_0.fnm&command=filecontent&checksum=true&compression=true&generation=2&qt=/replication&wt=filestream} status=0 QTime=0 
[junit4:junit4]   2> 1696 T1492 C108 REQ [collection1] webapp=/solr path=/replication params={file=_0_Pulsing41_0.tim&command=filecontent&checksum=true&compression=true&generation=2&qt=/replication&wt=filestream} status=0 QTime=0 
[junit4:junit4]   2> 1707 T1493 C108 REQ [collection1] webapp=/solr path=/replication params={file=_0_Pulsing41_0.tip&command=filecontent&checksum=true&compression=true&generation=2&qt=/replication&wt=filestream} status=0 QTime=0 
[junit4:junit4]   2> 1712 T1494 C108 REQ [collection1] webapp=/solr path=/replication params={file=_0_nrm.cfe&command=filecontent&checksum=true&compression=true&generation=2&qt=/replication&wt=filestream} status=0 QTime=0 
[junit4:junit4]   2> 1715 T1495 C108 REQ [collection1] webapp=/solr path=/replication params={file=segments_2&command=filecontent&checksum=true&compression=true&generation=2&qt=/replication&wt=filestream} status=0 QTime=0 
[junit4:junit4]   2> 1718 T1496 C108 REQ [collection1] webapp=/solr path=/replication params={file=_0.fdx&command=filecontent&checksum=true&compression=true&generation=2&qt=/replication&wt=filestream} status=0 QTime=0 
[junit4:junit4]   2> 1722 T1497 C108 REQ [collection1] webapp=/solr path=/replication params={file=_0_nrm.cfs&command=filecontent&checksum=true&compression=true&generation=2&qt=/replication&wt=filestream} status=0 QTime=0 
[junit4:junit4]   2> 1726 T1492 C108 REQ [collection1] webapp=/solr path=/replication params={file=_0.si&command=filecontent&checksum=true&compression=true&generation=2&qt=/replication&wt=filestream} status=0 QTime=0 
[junit4:junit4]   2> 1729 T1493 C108 REQ [collection1] webapp=/solr path=/replication params={file=_0.fdt&command=filecontent&checksum=true&compression=true&generation=2&qt=/replication&wt=filestream} status=0 QTime=0 
[junit4:junit4]   2> 1729 T1509 oasc.CachingDirectoryFactory.close Releasing directory:C:\Users\JenkinsSlave\workspace\Lucene-Solr-trunk-Windows\solr\build\solr-core\test\J0\.\org.apache.solr.handler.TestReplicationHandler$SolrInstance-1351308457596\slave\collection1\data\index
[junit4:junit4]   2> 1730 T1509 oash.SnapPuller.fetchLatestIndex Total time taken for download : 0 secs
[junit4:junit4]   2> 1736 T1509 oasu.DefaultSolrCoreState.newIndexWriter Creating new IndexWriter...
[junit4:junit4]   2> 1736 T1509 oasu.DefaultSolrCoreState.newIndexWriter Waiting until IndexWriter is unused... core=collection1
[junit4:junit4]   2> 1738 T1509 oasc.CachingDirectoryFactory.close Releasing directory:C:\Users\JenkinsSlave\workspace\Lucene-Solr-trunk-Windows\solr\build\solr-core\test\J0\.\org.apache.solr.handler.TestReplicationHandler$SolrInstance-1351308457596\slave\collection1\data
[junit4:junit4]   2> 1738 T1509 oasc.SolrDeletionPolicy.onInit SolrDeletionPolicy.onInit: commits:num=2
[junit4:junit4]   2> 		commit{dir=MockDirWrapper(org.apache.lucene.store.RAMDirectory@63a0434a lockFactory=org.apache.lucene.store.SingleInstanceLockFactory@614e2e4),segFN=segments_1,generation=1,filenames=[segments_1]
[junit4:junit4]   2> 		commit{dir=MockDirWrapper(org.apache.lucene.store.RAMDirectory@63a0434a lockFactory=org.apache.lucene.store.SingleInstanceLockFactory@614e2e4),segFN=segments_2,generation=2,filenames=[_0_Pulsing41_0.doc, _0.fnm, _0_Pulsing41_0.tim, _0_Pulsing41_0.tip, _0_nrm.cfe, segments_2, _0.fdx, _0_nrm.cfs, _0.si, _0.fdt]
[junit4:junit4]   2> 1739 T1509 oasc.SolrDeletionPolicy.updateCommits newest commit = 2[_0_Pulsing41_0.doc, _0.fnm, _0_Pulsing41_0.tim, _0_Pulsing41_0.tip, _0_nrm.cfe, segments_2, _0.fdx, _0_nrm.cfs, _0.si, _0.fdt]
[junit4:junit4]   2> 1739 T1509 oasu.DefaultSolrCoreState.newIndexWriter New IndexWriter is ready to be used.
[junit4:junit4]   2> 1739 T1509 oasc.CachingDirectoryFactory.close Releasing directory:C:\Users\JenkinsSlave\workspace\Lucene-Solr-trunk-Windows\solr\build\solr-core\test\J0\.\org.apache.solr.handler.TestReplicationHandler$SolrInstance-1351308457596\slave\collection1\data
[junit4:junit4]   2> 1740 T1509 oass.SolrIndexSearcher.<init> Opening Searcher@4c54acdc main
[junit4:junit4]   2> 1740 T1508 oasc.SolrCore.registerSearcher [collection1] Registered new searcher Searcher@4c54acdc main{StandardDirectoryReader(segments_2:4:nrt _0(5.0):C10)}
[junit4:junit4]   2> 1741 T1508 oasc.CachingDirectoryFactory.close Releasing directory:C:\Users\JenkinsSlave\workspace\Lucene-Solr-trunk-Windows\solr\build\solr-core\test\J0\.\org.apache.solr.handler.TestReplicationHandler$SolrInstance-1351308457596\slave\collection1\data\index
[junit4:junit4]   2> 1741 T1509 oasu.DirectUpdateHandler2.commit start commit{flags=0,_version_=0,optimize=false,openSearcher=false,waitSearcher=false,expungeDeletes=false,softCommit=false}
[junit4:junit4]   2> 1741 T1509 oasc.CachingDirectoryFactory.close Releasing directory:C:\Users\JenkinsSlave\workspace\Lucene-Solr-trunk-Windows\solr\build\solr-core\test\J0\.\org.apache.solr.handler.TestReplicationHandler$SolrInstance-1351308457596\slave\collection1\data
[junit4:junit4]   2> 1741 T1509 oasu.DirectUpdateHandler2.commit end_commit_flush
[junit4:junit4]   2> 1741 T1509 oash.SnapPuller.fetchLatestIndex removing temporary index download directory files MockDirWrapper(org.apache.lucene.store.RAMDirectory@72013dcd lockFactory=org.apache.lucene.store.SimpleFSLockFactory@23889649)
[junit4:junit4]   2> 1742 T1509 oasc.CachingDirectoryFactory.close Releasing directory:C:\Users\JenkinsSlave\workspace\Lucene-Solr-trunk-Windows\solr\build\solr-core\test\J0\.\org.apache.solr.handler.TestReplicationHandler$SolrInstance-1351308457596\slave\collection1\data\index.20121026212739030
[junit4:junit4]   2> 1742 T1509 oasc.CachingDirectoryFactory.close Releasing directory:C:\Users\JenkinsSlave\workspace\Lucene-Solr-trunk-Windows\solr\build\solr-core\test\J0\.\org.apache.solr.handler.TestReplicationHandler$SolrInstance-1351308457596\slave\collection1\data\index
[junit4:junit4]   2> 1796 T1507 C109 REQ [collection1] webapp=/solr path=/select params={wt=javabin&q=*:*&version=2} hits=10 status=0 QTime=0 
[junit4:junit4]   2> 1906 T1494 C108 REQ [collection1] webapp=/solr path=/replication params={command=indexversion&qt=/replication&wt=javabin&version=2} status=0 QTime=0 
[junit4:junit4]   2> 1911 T1496 C108 REQ [collection1] webapp=/solr path=/replication params={command=commits&qt=/replication&wt=javabin&version=2} status=0 QTime=0 
[junit4:junit4]   2> 1915 T1497 oasc.CoreContainer.reload Reloading SolrCore 'collection1' using instanceDir: C:\Users\JenkinsSlave\workspace\Lucene-Solr-trunk-Windows\solr\build\solr-core\test\J0\.\org.apache.solr.handler.TestReplicationHandler$SolrInstance-1351308457351\master\collection1
[junit4:junit4]   2> 1915 T1497 oasc.SolrResourceLoader.<init> new SolrResourceLoader for directory: 'C:\Users\JenkinsSlave\workspace\Lucene-Solr-trunk-Windows\solr\build\solr-core\test\J0\.\org.apache.solr.handler.TestReplicationHandler$SolrInstance-1351308457351\master\collection1\'
[junit4:junit4]   2> 1954 T1497 oasc.SolrConfig.<init> Using Lucene MatchVersion: LUCENE_50
[junit4:junit4]   2> 2015 T1497 oasc.SolrConfig.<init> Loaded SolrConfig: solrconfig.xml
[junit4:junit4]   2> 2015 T1497 oass.IndexSchema.readSchema Reading Solr Schema
[junit4:junit4]   2> 2019 T1497 oass.IndexSchema.readSchema Schema name=test
[junit4:junit4]   2> 2037 T1497 oass.IndexSchema.readSchema unique key field: id
[junit4:junit4]   2> 2039 T1497 oasc.SolrCore.<init> [collection1] Opening new SolrCore at C:\Users\JenkinsSlave\workspace\Lucene-Solr-trunk-Windows\solr\build\solr-core\test\J0\.\org.apache.solr.handler.TestReplicationHandler$SolrInstance-1351308457351\master\collection1\, dataDir=.\org.apache.solr.handler.TestReplicationHandler$SolrInstance-1351308457351\master\collection1\data\
[junit4:junit4]   2> 2039 T1497 oasc.SolrCore.<init> JMX monitoring not detected for core: collection1
[junit4:junit4]   2> 2039 T1497 oasc.CachingDirectoryFactory.close Releasing directory:C:\Users\JenkinsSlave\workspace\Lucene-Solr-trunk-Windows\solr\build\solr-core\test\J0\.\org.apache.solr.handler.TestReplicationHandler$SolrInstance-1351308457351\master\collection1\data
[junit4:junit4]   2> 2039 T1497 oasc.SolrCore.getNewIndexDir New index directory detected: old=null new=.\org.apache.solr.handler.TestReplicationHandler$SolrInstance-1351308457351\master\collection1\data\index/
[junit4:junit4]   2> 2041 T1497 oasc.RequestHandlers.initHandlersFromConfig created standard: solr.StandardRequestHandler
[junit4:junit4]   2> 2041 T1497 oasc.RequestHandlers.initHandlersFromConfig created /replication: solr.ReplicationHandler
[junit4:junit4]   2> 2041 T1497 oasc.RequestHandlers.initHandlersFromConfig created defaults: solr.StandardRequestHandler
[junit4:junit4]   2> 2041 T1497 oasc.RequestHandlers.initHandlersFromConfig adding lazy requestHandler: solr.StandardRequestHandler
[junit4:junit4]   2> 2041 T1497 oasc.RequestHandlers.initHandlersFromConfig created lazy: solr.StandardRequestHandler
[junit4:junit4]   2> 2043 T1497 oasc.RequestHandlers.initHandlersFromConfig created /update: solr.UpdateRequestHandler
[junit4:junit4]   2> 2045 T1497 oashl.XMLLoader.init xsltCacheLifetimeSeconds=60
[junit4:junit4]   2> 2050 T1497 oasc.CachingDirectoryFactory.close Releasing directory:C:\Users\JenkinsSlave\workspace\Lucene-Solr-trunk-Windows\solr\build\solr-core\test\J0\.\org.apache.solr.handler.TestReplicationHandler$SolrInstance-1351308457351\master\collection1\data
[junit4:junit4]   2> 2050 T1497 oass.SolrIndexSearcher.<init> Opening Searcher@5ad962dc main
[junit4:junit4]   2> 2051 T1497 oasu.CommitTracker.<init> Hard AutoCommit: disabled
[junit4:junit4]   2> 2051 T1497 oasu.CommitTracker.<init> Soft AutoCommit: disabled
[junit4:junit4]   2> 2051 T1497 oash.ReplicationHandler.inform Replication enabled for following config files: schema.xml
[junit4:junit4]   2> 2055 T1497 oash.ReplicationHandler.inform Commits will be reserved for  10000
[junit4:junit4]   2> 2055 T1511 oasc.SolrCore.registerSearcher [collection1] Registered new searcher Searcher@5ad962dc main{StandardDirectoryReader(segments_2:4:nrt _0(5.0):C10)}
[junit4:junit4]   2> 2056 T1497 oasc.CoreContainer.register replacing core: collection1
[junit4:junit4]   2> 2056 T1497 oasc.SolrCore.close [collection1]  CLOSING SolrCore org.apache.solr.core.SolrCore@b0153c2
[junit4:junit4]   2> 2056 T1497 oasu.DirectUpdateHandler2.close closing DirectUpdateHandler2{commits=1,autocommits=0,soft autocommits=0,optimizes=0,rollbacks=0,expungeDeletes=0,docsPending=0,adds=0,deletesById=0,deletesByQuery=0,errors=0,cumulative_adds=10,cumulative_deletesById=0,cumulative_deletesByQuery=1,cumulative_errors=0}
[junit4:junit4]   2> 2058 T1497 oasc.SolrCore.closeSearcher [collection1] Closing main searcher on request.
[junit4:junit4]   2> 2058 T1497 oasc.CachingDirectoryFactory.close Releasing directory:C:\Users\JenkinsSlave\workspace\Lucene-Solr-trunk-Windows\solr\build\solr-core\test\J0\.\org.apache.solr.handler.TestReplicationHandler$SolrInstance-1351308457351\master\collection1\data\index
[junit4:junit4]   2> ASYNC  NEW_CORE C110 name=collection1 org.apache.solr.core.SolrCore@5ca270b6
[junit4:junit4]   2> 2069 T1492 C110 REQ [collection1] webapp=/solr path=/replication params={command=indexversion&qt=/replication&wt=javabin&version=2} status=0 QTime=1 
[junit4:junit4]   2> 2072 T1493 C110 REQ [collection1] webapp=/solr path=/replication params={command=commits&qt=/replication&wt=javabin&version=2} status=0 QTime=0 
[junit4:junit4]   2> 2076 T1495 C110 UPDATE [collection1] webapp=/solr path=/update params={wt=javabin&version=2} {add=[110]} 0 1
[junit4:junit4]   2> 2079 T1494 C110 UPDATE [collection1] webapp=/solr path=/update params={wt=javabin&version=2} {add=[120]} 0 0
[junit4:junit4]   2> 2082 T1496 C110 oasu.DirectUpdateHandler2.commit start commit{flags=0,_version_=0,optimize=false,openSearcher=true,waitSearcher=true,expungeDeletes=false,softCommit=false}
[junit4:junit4]   2> 2085 T1496 C110 oasc.SolrDeletionPolicy.onCommit SolrDeletionPolicy.onCommit: commits:num=2
[junit4:junit4]   2> 		commit{dir=MockDirWrapper(org.apache.lucene.store.RAMDirectory@1b3a7116 lockFactory=org.apache.lucene.store.SingleInstanceLockFactory@4b9c5217),segFN=segments_2,generation=2,filenames=[_0_Pulsing41_0.doc, _0.fnm, _0_Pulsing41_0.tim, _0_Pulsing41_0.tip, _0_nrm.cfe, segments_2, _0.fdx, _0_nrm.cfs, _0.si, _0.fdt]
[junit4:junit4]   2> 		commit{dir=MockDirWrapper(org.apache.lucene.store.RAMDirectory@1b3a7116 lockFactory=org.apache.lucene.store.SingleInstanceLockFactory@4b9c5217),segFN=segments_3,generation=3,filenames=[_1_nrm.cfs, _0.fnm, _1_Pulsing41_0.doc, _0_nrm.cfs, _1.fnm, _1_nrm.cfe, _1.fdx, _0_Pulsing41_0.doc, _1_Pulsing41_0.tip, _1.fdt, _0_Pulsing41_0.tim, _1_Pulsing41_0.tim, _0_Pulsing41_0.tip, _1.si, _0_nrm.cfe, _0.fdx, _0.si, segments_3, _0.fdt]
[junit4:junit4]   2> 2085 T1496 C110 oasc.SolrDeletionPolicy.updateCommits newest commit = 3[_1_nrm.cfs, _0.fnm, _1_Pulsing41_0.doc, _0_nrm.cfs, _1.fnm, _1_nrm.cfe, _1.fdx, _0_Pulsing41_0.doc, _1_Pulsing41_0.tip, _1.fdt, _0_Pulsing41_0.tim, _1_Pulsing41_0.tim, _0_Pulsing41_0.tip, _1.si, _0_nrm.cfe, _0.fdx, _0.si, segments_3, _0.fdt]
[junit4:junit4]   2> 2085 T1496 C110 oasc.CachingDirectoryFactory.close Releasing directory:C:\Users\JenkinsSlave\workspace\Lucene-Solr-trunk-Windows\solr\build\solr-core\test\J0\.\org.apache.solr.handler.TestReplicationHandler$SolrInstance-1351308457351\master\collection1\data
[junit4:junit4]   2> 2086 T1496 C110 oass.SolrIndexSearcher.<init> Opening Searcher@7a7e5ba5 main
[junit4:junit4]   2> 2086 T1496 C110 oasu.DirectUpdateHandler2.commit end_commit_flush
[junit4:junit4]   2> 2087 T1511 oasc.SolrCore.registerSearcher [collection1] Registered new searcher Searcher@7a7e5ba5 main{StandardDirectoryReader(segments_3:6:nrt _0(5.0):C10 _1(5.0):C2)}
[junit4:junit4]   2> 2087 T1511 oasc.CachingDirectoryFactory.close Releasing directory:C:\Users\JenkinsSlave\workspace\Lucene-Solr-trunk-Windows\solr\build\solr-core\test\J0\.\org.apache.solr.handler.TestReplicationHandler$SolrInstance-1351308457351\master\collection1\data\index
[junit4:junit4]   2> 2087 T1496 C110 UPDATE [collection1] webapp=/solr path=/update params={waitSearcher=true&wt=javabin&commit=true&softCommit=false&version=2} {commit=} 0 5
[junit4:junit4]   2> 2089 T1497 C110 REQ [collection1] webapp=/solr path=/select params={wt=javabin&q=*:*&version=2} hits=12 status=0 QTime=0 
[junit4:junit4]   2> 2199 T1502 C109 REQ [collection1] webapp=/solr path=/select params={wt=javabin&q=*:*&version=2} hits=10 status=0 QTime=0 
[junit4:junit4]   2> 2309 T1504 C109 REQ [collection1] webapp=/solr path=/select params={wt=javabin&q=*:*&version=2} hits=10 status=0 QTime=0 
[junit4:junit4]   2> 2421 T1505 C109 REQ [collection1] webapp=/solr path=/select params={wt=javabin&q=*:*&version=2} hits=10 status=0 QTime=0 
[junit4:junit4]   2> 2536 T1506 C109 REQ [collection1] webapp=/solr path=/select params={wt=javabin&q=*:*&version=2} hits=10 status=0 QTime=0 
[junit4:junit4]   2> 2647 T1507 C109 REQ [collection1] webapp=/solr path=/select params={wt=javabin&q=*:*&version=2} hits=10 status=0 QTime=1 
[junit4:junit4]   2> 2732 T1493 C110 REQ [collection1] webapp=/solr path=/replication params={command=indexversion&wt=javabin&qt=/replication&version=2} status=0 QTime=0 
[junit4:junit4]   2> 2733 T1509 oash.SnapPuller.fetchLatestIndex Master's generation: 3
[junit4:junit4]   2> 2733 T1509 oash.SnapPuller.fetchLatestIndex Slave's generation: 2
[junit4:junit4]   2> 2733 T1509 oash.SnapPuller.fetchLatestIndex Starting replication process
[junit4:junit4]   2> 2735 T1495 C110 oasc.CachingDirectoryFactory.close Releasing directory:C:\Users\JenkinsSlave\workspace\Lucene-Solr-trunk-Windows\solr\build\solr-core\test\J0\.\org.apache.solr.handler.TestReplicationHandler$SolrInstance-1351308457351\master\collection1\data
[junit4:junit4]   2> 2735 T1495 C110 oasc.CachingDirectoryFactory.close Releasing directory:C:\Users\JenkinsSlave\workspace\Lucene-Solr-trunk-Windows\solr\build\solr-core\test\J0\.\org.apache.solr.handler.TestReplicationHandler$SolrInstance-1351308457351\master\collection1\data\index
[junit4:junit4]   2> 2738 T1495 C110 REQ [collection1] webapp=/solr path=/replication params={command=filelist&generation=3&wt=javabin&qt=/replication&version=2} status=0 QTime=3 
[junit4:junit4]   2> 2739 T1509 oash.SnapPuller.fetchLatestIndex Number of files in latest index in master: 19
[junit4:junit4]   2> 2739 T1509 oasc.CachingDirectoryFactory.injectLockFactory WARNING No lockType configured for MockDirWrapper(org.apache.lucene.store.RAMDirectory@27853176 lockFactory=org.apache.lucene.store.SingleInstanceLockFactory@19724e3f) assuming 'simple'
[junit4:junit4]   2> 2740 T1509 oasc.CachingDirectoryFactory.get return new directory for C:\Users\JenkinsSlave\workspace\Lucene-Solr-trunk-Windows\solr\build\solr-core\test\J0\.\org.apache.solr.handler.TestReplicationHandler$SolrInstance-1351308457596\slave\collection1\data\index.20121026212740085 forceNew:false
[junit4:junit4]   2> 2740 T1509 oasc.CachingDirectoryFactory.close Releasing directory:C:\Users\JenkinsSlave\workspace\Lucene-Solr-trunk-Windows\solr\build\solr-core\test\J0\.\org.apache.solr.handler.TestReplicationHandler$SolrInstance-1351308457596\slave\collection1\data
[junit4:junit4]   2> 2740 T1509 oash.SnapPuller.fetchLatestIndex Starting download to MockDirWrapper(org.apache.lucene.store.RAMDirectory@27853176 lockFactory=org.apache.lucene.store.SimpleFSLockFactory@1f6f1726) fullCopy=false
[junit4:junit4]   2> 2743 T1494 C110 REQ [collection1] webapp=/solr path=/replication params={file=_1_nrm.cfs&command=filecontent&checksum=true&compression=true&generation=3&qt=/replication&wt=filestream} status=0 QTime=0 
[junit4:junit4]   2> 2744 T1509 oash.SnapPuller.downloadIndexFiles Skipping download for _0.fnm
[junit4:junit4]   2> 2748 T1496 C110 REQ [collection1] webapp=/solr path=/replication params={file=_1_Pulsing41_0.doc&command=filecontent&checksum=true&compression=true&generation=3&qt=/replication&wt=filestream} status=0 QTime=0 
[junit4:junit4]   2> 2749 T1509 oash.SnapPuller.downloadIndexFiles Skipping download for _0_nrm.cfs
[junit4:junit4]   2> 2752 T1497 C110 REQ [collection1] webapp=/solr path=/replication params={file=_1.fnm&command=filecontent&checksum=true&compression=true&generation=3&qt=/replication&wt=filestream} status=0 QTime=0 
[junit4:junit4]   2> 2755 T1492 C110 REQ [collection1] webapp=/solr path=/replication params={file=_1_nrm.cfe&command=filecontent&checksum=true&compression=true&generation=3&qt=/replication&wt=filestream} status=0 QTime=0 
[junit4:junit4]   2> 2758 T1503 C109 REQ [collection1] webapp=/solr path=/select params={wt=javabin&q=*:*&version=2} hits=10 status=0 QTime=0 
[junit4:junit4]   2> 2758 T1493 C110 REQ [collection1] webapp=/solr path=/replication params={file=_1.fdx&command=filecontent&checksum=true&compression=true&generation=3&qt=/replication&wt=filestream} status=0 QTime=0 
[junit4:junit4]   2> 2759 T1509 oash.SnapPuller.downloadIndexFiles Skipping download for _0_Pulsing41_0.doc
[junit4:junit4]   2> 2761 T1495 C110 REQ [collection1] webapp=/solr path=/replication params={file=_1_Pulsing41_0.tip&command=filecontent&checksum=true&compression=true&generation=3&qt=/replication&wt=filestream} status=0 QTime=0 
[junit4:junit4]   2> 2762 T1509 oash.SnapPuller.downloadIndexFiles Skipping download for _0_Pulsing41_0.tim
[junit4:junit4]   2> 2765 T1494 C110 REQ [collection1] webapp=/solr path=/replication params={file=_1.fdt&command=filecontent&checksum=true&compression=true&generation=3&qt=/replication&wt=filestream} status=0 QTime=0 
[junit4:junit4]   2> 2767 T1509 oash.SnapPuller.downloadIndexFiles Skipping download for _0_Pulsing41_0.tip
[junit4:junit4]   2> 2769 T1496 C110 REQ [collection1] webapp=/solr path=/replication params={file=_1_Pulsing41_0.tim&command=filecontent&checksum=true&compression=true&generation=3&qt=/replication&wt=filestream} status=0 QTime=0 
[junit4:junit4]   2> 2774 T1497 C110 REQ [collection1] webapp=/solr path=/replication params={file=_1.si&command=filecontent&checksum=true&compression=true&generation=3&qt=/replication&wt=filestream} status=0 QTime=0 
[junit4:junit4]   2> 2775 T1509 oash.SnapPuller.downloadIndexFiles Skipping download for _0_nrm.cfe
[junit4:junit4]   2> 2775 T1509 oash.SnapPuller.downloadIndexFiles Skipping download for _0.fdx
[junit4:junit4]   2> 2775 T1509 oash.SnapPuller.downloadIndexFiles Skipping download for _0.si
[junit4:junit4]   2> 2775 T1509 oash.SnapPuller.downloadIndexFiles Skipping download for _0.fdt
[junit4:junit4]   2> 2778 T1492 C110 REQ [collection1] webapp=/solr path=/replication params={file=segments_3&command=filecontent&checksum=true&compression=true&generation=3&qt=/replication&wt=filestream} status=0 QTime=0 
[junit4:junit4]   2> 2778 T1509 oasc.CachingDirectoryFactory.close Releasing directory:C:\Users\JenkinsSlave\workspace\Lucene-Solr-trunk-Windows\solr\build\solr-core\test\J0\.\org.apache.solr.handler.TestReplicationHandler$SolrInstance-1351308457596\slave\collection1\data\index
[junit4:junit4]   2> 2779 T1509 oash.SnapPuller.fetchLatestIndex Total time taken for download : 0 secs
[junit4:junit4]   2> 2780 T1509 oasu.DefaultSolrCoreState.newIndexWriter Creating new IndexWriter...
[junit4:junit4]   2> 2780 T1509 oasu.DefaultSolrCoreState.newIndexWriter Waiting until IndexWriter is unused... core=collection1
[junit4:junit4]   2> 2780 T1509 oasu.DefaultSolrCoreState.newIndexWriter Closing old IndexWriter... core=collection1
[junit4:junit4]   2> 2780 T1509 oasc.CachingDirectoryFactory.close Releasing directory:C:\Users\JenkinsSlave\workspace\Lucene-Solr-trunk-Windows\solr\build\solr-core\test\J0\.\org.apache.solr.handler.TestReplicationHandler$SolrInstance-1351308457596\slave\collection1\data\index
[junit4:junit4]   2> 2780 T1509 oasc.CachingDirectoryFactory.close Releasing directory:C:\Users\JenkinsSlave\workspace\Lucene-Solr-trunk-Windows\solr\build\solr-core\test\J0\.\org.apache.solr.handler.TestReplicationHandler$SolrInstance-1351308457596\slave\collection1\data
[junit4:junit4]   2> 2781 T1509 oasc.SolrDeletionPolicy.onInit SolrDeletionPolicy.onInit: commits:num=2
[junit4:junit4]   2> 		commit{dir=MockDirWrapper(org.apache.lucene.store.RAMDirectory@63a0434a lockFactory=org.apache.lucene.store.SingleInstanceLockFactory@614e2e4),segFN=segments_2,generation=2,filenames=[_0_Pulsing41_0.doc, _0.fnm, _0_Pulsing41_0.tim, _0_Pulsing41_0.tip, _0_nrm.cfe, segments_2, _0.fdx, _0_nrm.cfs, _0.si, _0.fdt]
[junit4:junit4]   2> 		commit{dir=MockDirWrapper(org.apache.lucene.store.RAMDirectory@63a0434a lockFactory=org.apache.lucene.store.SingleInstanceLockFactory@614e2e4),segFN=segments_3,generation=3,filenames=[_1_nrm.cfs, _0.fnm, _1_Pulsing41_0.doc, _0_nrm.cfs, _1.fnm, _1_nrm.cfe, _1.fdx, _0_Pulsing41_0.doc, _1_Pulsing41_0.tip, _1.fdt, _0_Pulsing41_0.tim, _1_Pulsing41_0.tim, _0_Pulsing41_0.tip, _1.si, _0_nrm.cfe, _0.fdx, _0.si, segments_3, _0.fdt]
[junit4:junit4]   2> 2781 T1509 oasc.SolrDeletionPolicy.updateCommits newest commit = 3[_1_nrm.cfs, _0.fnm, _1_Pulsing41_0.doc, _0_nrm.cfs, _1.fnm, _1_nrm.cfe, _1.fdx, _0_Pulsing41_0.doc, _1_Pulsing41_0.tip, _1.fdt, _0_Pulsing41_0.tim, _1_Pulsing41_0.tim, _0_Pulsing41_0.tip, _1.si, _0_nrm.cfe, _0.fdx, _0.si, segments_3, _0.fdt]
[junit4:junit4]   2> 2781 T1509 oasu.DefaultSolrCoreState.newIndexWriter New IndexWriter is ready to be used.
[junit4:junit4]   2> 2782 T1509 oasc.CachingDirectoryFactory.close Releasing directory:C:\Users\JenkinsSlave\workspace\Lucene-Solr-trunk-Windows\solr\build\solr-core\test\J0\.\org.apache.solr.handler.TestReplicationHandler$SolrInstance-1351308457596\slave\collection1\data
[junit4:junit4]   2> 2782 T1509 oass.SolrIndexSearcher.<init> Opening Searcher@327f3bb7 main
[junit4:junit4]   2> 2784 T1508 oasc.SolrCore.registerSearcher [collection1] Registered new searcher Searcher@327f3bb7 main{StandardDirectoryReader(segments_3:6:nrt _0(5.0):C10 _1(5.0):C2)}
[junit4:junit4]   2> 2784 T1508 oasc.CachingDirectoryFactory.close Releasing directory:C:\Users\JenkinsSlave\workspace\Lucene-Solr-trunk-Windows\solr\build\solr-core\test\J0\.\org.apache.solr.handler.TestReplicationHandler$SolrInstance-1351308457596\slave\collection1\data\index
[junit4:junit4]   2> 2784 T1509 oasu.DirectUpdateHandler2.commit start commit{flags=0,_version_=0,optimize=false,openSearcher=false,waitSearcher=false,expungeDeletes=false,softCommit=false}
[junit4:junit4]   2> 2784 T1509 oasc.CachingDirectoryFactory.close Releasing directory:C:\Users\JenkinsSlave\workspace\Lucene-Solr-trunk-Windows\solr\build\solr-core\test\J0\.\org.apache.solr.handler.TestReplicationHandler$SolrInstance-1351308457596\slave\collection1\data
[junit4:junit4]   2> 2785 T1509 oasu.DirectUpdateHandler2.commit end_commit_flush
[junit4:junit4]   2> 2785 T1509 oash.SnapPuller.fetchLatestIndex removing temporary index download directory files MockDirWrapper(org.apache.lucene.store.RAMDirectory@27853176 lockFactory=org.apache.lucene.store.SimpleFSLockFactory@1f6f1726)
[junit4:junit4]   2> 2785 T1509 oasc.CachingDirectoryFactory.close Releasing directory:C:\Users\JenkinsSlave\workspace\Lucene-Solr-trunk-Windows\solr\build\solr-core\test\J0\.\org.apache.solr.handler.TestReplicationHandler$SolrInstance-1351308457596\slave\collection1\data\index.20121026212740085
[junit4:junit4]   2> 2785 T1509 oasc.CachingDirectoryFactory.close Releasing directory:C:\Users\JenkinsSlave\workspace\Lucene-Solr-trunk-Windows\solr\build\solr-core\test\J0\.\org.apache.solr.handler.TestReplicationHandler$SolrInstance-1351308457596\slave\collection1\data\index
[junit4:junit4]   2> 2869 T1504 C109 REQ [collection1] webapp=/solr path=/select params={wt=javabin&q=*:*&version=2} hits=12 status=0 QTime=0 
[junit4:junit4]   2> 2992 T1467 oasc.CoreContainer.shutdown Shutting down CoreContainer instance=1020562001
[junit4:junit4]   2> 2993 T1467 oasc.SolrCore.close [collection1]  CLOSING SolrCore org.apache.solr.core.SolrCore@5ca270b6
[junit4:junit4]   2> 2993 T1467 oasu.DirectUpdateHandler2.close closing DirectUpdateHandler2{commits=1,autocommits=0,soft autocommits=0,optimizes=0,rollbacks=0,expungeDeletes=0,docsPending=0,adds=0,deletesById=0,deletesByQuery=0,errors=0,cumulative_adds=2,cumulative_deletesById=0,cumulative_deletesByQuery=0,cumulative_errors=0}
[junit4:junit4]   2> 2994 T1467 oasc.SolrCore.decrefSolrCoreState Closing SolrCoreState
[junit4:junit4]   2> 2995 T1467 oasu.DefaultSolrCoreState.closeIndexWriter SolrCoreState ref count has reached 0 - closing IndexWriter
[junit4:junit4]   2> 2995 T1467 oasu.DefaultSolrCoreState.closeIndexWriter closing IndexWriter with IndexWriterCloser
[junit4:junit4]   2> 2995 T1467 C110 oasc.CachingDirectoryFactory.close Releasing directory:C:\Users\JenkinsSlave\workspace\Lucene-Solr-trunk-Windows\solr\build\solr-core\test\J0\.\org.apache.solr.handler.TestReplicationHandler$SolrInstance-1351308457351\master\collection1\data\index
[junit4:junit4]   2> 2996 T1467 oasc.SolrCore.closeSearcher [collection1] Closing main searcher on request.
[junit4:junit4]   2> 2996 T1467 oasc.CachingDirectoryFactory.close Releasing directory:C:\Users\JenkinsSlave\workspace\Lucene-Solr-trunk-Windows\solr\build\solr-core\test\J0\.\org.apache.solr.handler.TestReplicationHandler$SolrInstance-1351308457351\master\collection1\data\index
[junit4:junit4]   2> 2997 T1467 oejsh.ContextHandler.doStop stopped o.e.j.s.ServletContextHandler{/solr,null}
[junit4:junit4]   2> 3049 T1467 oejs.Server.doStart jetty-8.1.2.v20120308
[junit4:junit4]   2> 3051 T1467 oejs.AbstractConnector.doStart Started SelectChannelConnector@0.0.0.0:64539
[junit4:junit4]   2> 3052 T1467 oasc.SolrResourceLoader.locateSolrHome JNDI not configured for solr (NoInitialContextEx)
[junit4:junit4]   2> 3053 T1467 oasc.SolrResourceLoader.locateSolrHome using system property solr.solr.home: .\org.apache.solr.handler.TestReplicationHandler$SolrInstance-1351308457351\master
[junit4:junit4]   2> 3053 T1467 oasc.SolrResourceLoader.<init> new SolrResourceLoader for deduced Solr Home: '.\org.apache.solr.handler.TestReplicationHandler$SolrInstance-1351308457351\master\'
[junit4:junit4]   2> 3079 T1467 oass.SolrDispatchFilter.init SolrDispatchFilter.init()
[junit4:junit4]   2> 3080 T1467 oasc.SolrResourceLoader.locateSolrHome JNDI not configured for solr (NoInitialContextEx)
[junit4:junit4]   2> 3080 T1467 oasc.SolrResourceLoader.locateSolrHome using system property solr.solr.home: .\org.apache.solr.handler.TestReplicationHandler$SolrInstance-1351308457351\master
[junit4:junit4]   2> 3080 T1467 oasc.CoreContainer$Initializer.initialize looking for solr.xml: C:\Users\JenkinsSlave\workspace\Lucene-Solr-trunk-Windows\solr\build\solr-core\test\J0\.\org.apache.solr.handler.TestReplicationHandler$SolrInstance-1351308457351\master\solr.xml
[junit4:junit4]   2> 3081 T1467 oasc.CoreContainer.<init> New CoreContainer 1297268879
[junit4:junit4]   2> 3081 T1467 oasc.CoreContainer$Initializer.initialize no solr.xml file found - using default
[junit4:junit4]   2> 3081 T1467 oasc.CoreContainer.load Loading CoreContainer using Solr Home: '.\org.apache.solr.handler.TestReplicationHandler$SolrInstance-1351308457351\master\'
[junit4:junit4]   2> 3083 T1467 oasc.SolrResourceLoader.<init> new SolrResourceLoader for directory: '.\org.apache.solr.handler.TestReplicationHandler$SolrInstance-1351308457351\master\'
[junit4:junit4]   2> 3102 T1467 oasc.CoreContainer.load Registering Log Listener
[junit4:junit4]   2> 3125 T1467 oasc.CoreContainer.create Creating SolrCore 'collection1' using instanceDir: .\org.apache.solr.handler.TestReplicationHandler$SolrInstance-1351308457351\master\collection1
[junit4:junit4]   2> 3126 T1467 oasc.SolrResourceLoader.<init> new SolrResourceLoader for directory: '.\org.apache.solr.handler.TestReplicationHandler$SolrInstance-1351308457351\master\collection1\'
[junit4:junit4]   2> 3168 T1467 oasc.SolrConfig.<init> Using Lucene MatchVersion: LUCENE_50
[junit4:junit4]   2> 3238 T1467 oasc.SolrConfig.<init> Loaded SolrConfig: solrconfig.xml
[junit4:junit4]   2> 3239 T1467 oass.IndexSchema.readSchema Reading Solr Schema
[junit4:junit4]   2> 3243 T1467 oass.IndexSchema.readSchema Schema name=test
[junit4:junit4]   2> 3265 T1467 oass.IndexSchema.readSchema unique key field: id
[junit4:junit4]   2> 3267 T1467 oasc.SolrCore.<init> [collection1] Opening new SolrCore at .\org.apache.solr.handler.TestReplicationHandler$SolrInstance-1351308457351\master\collection1\, dataDir=.\org.apache.solr.handler.TestReplicationHandler$SolrInstance-1351308457351\master\collection1\data\
[junit4:junit4]   2> 3267 T1467 oasc.SolrCore.<init> JMX monitoring not detected for core: collection1
[junit4:junit4]   2> 3268 T1467 oasc.SolrCore.initDirectoryFactory org.apache.solr.core.MockDirectoryFactory
[junit4:junit4]   2> 3269 T1467 oasc.CachingDirectoryFactory.injectLockFactory WARNING No lockType configured for MockDirWrapper(org.apache.lucene.store.RAMDirectory@3f2c2914 lockFactory=org.apache.lucene.store.SingleInstanceLockFactory@6c3d0072) assuming 'simple'
[junit4:junit4]   2> 3269 T1467 oasc.CachingDirectoryFactory.get return new directory for C:\Users\JenkinsSlave\workspace\Lucene-Solr-trunk-Windows\solr\build\solr-core\test\J0\.\org.apache.solr.handler.TestReplicationHandler$SolrInstance-1351308457351\master\collection1\data forceNew:false
[junit4:junit4]   2> 3269 T1467 oasc.CachingDirectoryFactory.close Releasing directory:C:\Users\JenkinsSlave\workspace\Lucene-Solr-trunk-Windows\solr\build\solr-core\test\J0\.\org.apache.solr.handler.TestReplicationHandler$SolrInstance-1351308457351\master\collection1\data
[junit4:junit4]   2> 3270 T1467 oasc.SolrCore.getNewIndexDir New index directory detected: old=null new=.\org.apache.solr.handler.TestReplicationHandler$SolrInstance-1351308457351\master\collection1\data\index/
[junit4:junit4]   2> 3270 T1467 oasc.SolrCore.initIndex WARNING [collection1] Solr index directory '.\org.apache.solr.handler.TestReplicationHandler$SolrInstance-1351308457351\master\collection1\data\index' doesn't exist. Creating new index...
[junit4:junit4]   2> 3271 T1467 oasc.CachingDirectoryFactory.get return new directory for C:\Users\JenkinsSlave\workspace\Lucene-Solr-trunk-Windows\solr\build\solr-core\test\J0\.\org.apache.solr.handler.TestReplicationHandler$SolrInstance-1351308457351\master\collection1\data\index forceNew:false
[junit4:junit4]   2> 3272 T1467 oasc.SolrDeletionPolicy.onCommit SolrDeletionPolicy.onCommit: commits:num=1
[junit4:junit4]   2> 		commit{dir=MockDirWrapper(org.apache.lucene.store.RAMDirectory@1f490a58 lockFactory=org.apache.lucene.store.SingleInstanceLockFactory@29c82aa8),segFN=segments_1,generation=1,filenames=[segments_1]
[junit4:junit4]   2> 3272 T1467 oasc.SolrDeletionPolicy.updateCommits newest commit = 1[segments_1]
[junit4:junit4]   2> 3272 T1467 oasc.CachingDirectoryFactory.close Releasing directory:C:\Users\JenkinsSlave\workspace\Lucene-Solr-trunk-Windows\solr\build\solr-core\test\J0\.\org.apache.solr.handler.TestReplicationHandler$SolrInstance-1351308457351\master\collection1\data\index
[junit4:junit4]   2> 3273 T1467 oasc.RequestHandlers.initHandlersFromConfig created standard: solr.StandardRequestHandler
[junit4:junit4]   2> 3274 T1467 oasc.RequestHandlers.initHandlersFromConfig created /replication: solr.ReplicationHandler
[junit4:junit4]   2> 3274 T1467 oasc.RequestHandlers.initHandlersFromConfig created defaults: solr.StandardRequestHandler
[junit4:junit4]   2> 3274 T1467 oasc.RequestHandlers.initHandlersFromConfig adding lazy requestHandler: solr.StandardRequestHandler
[junit4:junit4]   2> 3275 T1467 oasc.RequestHandlers.initHandlersFromConfig created lazy: solr.StandardRequestHandler
[junit4:junit4]   2> 3275 T1467 oasc.RequestHandlers.initHandlersFromConfig created /update: solr.UpdateRequestHandler
[junit4:junit4]   2> 3277 T1467 oashl.XMLLoader.init xsltCacheLifetimeSeconds=60
[junit4:junit4]   2> 3281 T1467 oasc.CachingDirectoryFactory.close Releasing directory:C:\Users\JenkinsSlave\workspace\Lucene-Solr-trunk-Windows\solr\build\solr-core\test\J0\.\org.apache.solr.handler.TestReplicationHandler$SolrInstance-1351308457351\master\collection1\data
[junit4:junit4]   2> 3337 T1467 oass.SolrIndexSearcher.<init> Opening Searcher@3f9cc91d main
[junit4:junit4]   2> 3337 T1467 oasu.CommitTracker.<init> Hard AutoCommit: disabled
[junit4:junit4]   2> 3337 T1467 oasu.CommitTracker.<init> Soft AutoCommit: disabled
[junit4:junit4]   2> 3338 T1467 oashc.HttpShardHandlerFactory.getParameter Setting socketTimeout to: 0
[junit4:junit4]   2> 3338 T1467 oashc.HttpShardHandlerFactory.getParameter Setting urlScheme to: http://
[junit4:junit4]   2> 3338 T1467 oashc.HttpShardHandlerFactory.getParameter Setting connTimeout to: 0
[junit4:junit4]   2> 3338 T1467 oashc.HttpShardHandlerFactory.getParameter Setting maxConnectionsPerHost to: 20
[junit4:junit4]   2> 3338 T1467 oashc.HttpShardHandlerFactory.getParameter Setting corePoolSize to: 0
[junit4:junit4]   2> 3339 T1467 oashc.HttpShardHandlerFactory.getParameter Setting maximumPoolSize to: 2147483647
[junit4:junit4]   2> 3339 T1467 oashc.HttpShardHandlerFactory.getParameter Setting maxThreadIdleTime to: 5
[junit4:junit4]   2> 3339 T1467 oashc.HttpShardHandlerFactory.getParameter Setting sizeOfQueue to: -1
[junit4:junit4]   2> 3340 T1467 oashc.HttpShardHandlerFactory.getParameter Setting fairnessPolicy to: false
[junit4:junit4]   2> 3340 T1467 oascsi.HttpClientUtil.createClient Creating new http client, config:maxConnectionsPerHost=20&maxConnections=10000&socketTimeout=0&connTimeout=0&retry=false
[junit4:junit4]   2> 3343 T1467 oash.ReplicationHandler.inform Replication enabled for following config files: schema.xml,xslt/dummy.xsl
[junit4:junit4]   2> 3344 T1467 oash.ReplicationHandler.inform Commits will be reserved for  10000
[junit4:junit4]   2> 3344 T1467 oasc.CoreContainer.register registering core: collection1
[junit4:junit4]   2> 3345 T1467 oass.SolrDispatchFilter.init user.dir=C:\Users\JenkinsSlave\workspace\Lucene-Solr-trunk-Windows\solr\build\solr-core\test\J0
[junit4:junit4]   2> 3345 T1467 oass.SolrDispatchFilter.init SolrDispatchFilter.init() done
[junit4:junit4]   2> 3346 T1467 oascsi.HttpClientUtil.createClient Creating new http client, config:maxConnections=128&maxConnectionsPerHost=32&followRedirects=false
[junit4:junit4]   2> 3355 T1522 oasc.SolrCore.registerSearcher [collection1] Registered new searcher Searcher@3f9cc91d main{StandardDirectoryReader(segments_1:1)}
[junit4:junit4]   2> 3368 T1467 oasc.CoreContainer.shutdown Shutting down CoreContainer instance=1609540955
[junit4:junit4]   2> 3369 T1467 oasc.SolrCore.close [collection1]  CLOSING SolrCore org.apache.solr.core.SolrCore@64ffe918
[junit4:junit4]   2> 3369 T1467 oasu.DirectUpdateHandler2.close closing DirectUpdateHandler2{commits=2,autocommits=0,soft autocommits=0,optimizes=0,rollbacks=0,expungeDeletes=0,docsPending=0,adds=0,deletesById=0,deletesByQuery=0,errors=0,cumulative_adds=0,cumulative_deletesById=0,cumulative_deletesByQuery=0,cumulative_errors=0}
[junit4:junit4]   2> 3370 T1467 oasc.SolrCore.decrefSolrCoreState Closing SolrCoreState
[junit4:junit4]   2> 3370 T1467 oasu.DefaultSolrCoreState.closeIndexWriter SolrCoreState ref count has reached 0 - closing IndexWriter
[junit4:junit4]   2> 3371 T1467 oasu.DefaultSolrCoreState.closeIndexWriter closing IndexWriter with IndexWriterCloser
[junit4:junit4]   2> 3372 T1467 C109 oasc.CachingDirectoryFactory.close Releasing directory:C:\Users\JenkinsSlave\workspace\Lucene-Solr-trunk-Windows\solr\build\solr-core\test\J0\.\org.apache.solr.handler.TestReplicationHandler$SolrInstance-1351308457596\slave\collection1\data\index
[junit4:junit4]   2> 3372 T1467 oasc.SolrCore.closeSearcher [collection1] Closing main searcher on request.
[junit4:junit4]   2> 3372 T1467 oasc.CachingDirectoryFactory.close Releasing directory:C:\Users\JenkinsSlave\workspace\Lucene-Solr-trunk-Windows\solr\build\solr-core\test\J0\.\org.apache.solr.handler.TestReplicationHandler$SolrInstance-1351308457596\slave\collection1\data\index
[junit4:junit4]   2> 3373 T1467 oejsh.ContextHandler.doStop stopped o.e.j.s.ServletContextHandler{/solr,null}
[junit4:junit4]   2> 3426 T1467 oejs.Server.doStart jetty-8.1.2.v20120308
[junit4:junit4]   2> 3430 T1467 oejs.AbstractConnector.doStart Started SelectChannelConnector@0.0.0.0:64542
[junit4:junit4]   2> 3431 T1467 oasc.SolrResourceLoader.locateSolrHome JNDI not configured for solr (NoInitialContextEx)
[junit4:junit4]   2> 3432 T1467 oasc.SolrResourceLoader.locateSolrHome using system property solr.solr.home: .\org.apache.solr.handler.TestReplicationHandler$SolrInstance-1351308457596\slave
[junit4:junit4]   2> 3432 T1467 oasc.SolrResourceLoader.<init> new SolrResourceLoader for deduced Solr Home: '.\org.apache.solr.handler.TestReplicationHandler$SolrInstance-1351308457596\slave\'
[junit4:junit4]   2> 3448 T1467 oass.SolrDispatchFilter.init SolrDispatchFilter.init()
[junit4:junit4]   2> 3449 T1467 oasc.SolrResourceLoader.locateSolrHome JNDI not configured for solr (NoInitialContextEx)
[junit4:junit4]   2> 3449 T1467 oasc.SolrResourceLoader.locateSolrHome using system property solr.solr.home: .\org.apache.solr.handler.TestReplicationHandler$SolrInstance-1351308457596\slave
[junit4:junit4]   2> 3450 T1467 oasc.CoreContainer$Initializer.initialize looking for solr.xml: C:\Users\JenkinsSlave\workspace\Lucene-Solr-trunk-Windows\solr\build\solr-core\test\J0\.\org.apache.solr.handler.TestReplicationHandler$SolrInstance-1351308457596\slave\solr.xml
[junit4:junit4]   2> 3450 T1467 oasc.CoreContainer.<init> New CoreContainer 1254834376
[junit4:junit4]   2> 3451 T1467 oasc.CoreContainer$Initializer.initialize no solr.xml file found - using default
[junit4:junit4]   2> 3452 T1467 oasc.CoreContainer.load Loading CoreContainer using Solr Home: '.\org.apache.solr.handler.TestReplicationHandler$SolrInstance-1351308457596\slave\'
[junit4:junit4]   2> 3452 T1467 oasc.SolrResourceLoader.<init> new SolrResourceLoader for directory: '.\org.apache.solr.handler.TestReplicationHandler$SolrInstance-1351308457596\slave\'
[junit4:junit4]   2> 3471 T1467 oasc.CoreContainer.load Registering Log Listener
[junit4:junit4]   2> 3491 T1467 oasc.CoreContainer.create Creating SolrCore 'collection1' using instanceDir: .\org.apache.solr.handler.TestReplicationHandler$SolrInstance-1351308457596\slave\collection1
[junit4:junit4]   2> 3492 T1467 oasc.SolrResourceLoader.<init> new SolrResourceLoader for directory: '.\org.apache.solr.handler.TestReplicationHandler$SolrInstance-1351308457596\slave\collection1\'
[junit4:junit4]   2> 3527 T1467 oasc.SolrConfig.<init> Using Lucene MatchVersion: LUCENE_50
[junit4:junit4]   2> 3587 T1467 oasc.SolrConfig.<init> Loaded SolrConfig: solrconfig.xml
[junit4:junit4]   2> 3589 T1467 oass.IndexSchema.readSchema Reading Solr Schema
[junit4:junit4]   2> 3592 T1467 oass.IndexSchema.readSchema Schema name=test
[junit4:junit4]   2> 3611 T1467 oass.IndexSchema.readSchema unique key field: id
[junit4:junit4]   2> 3612 T1467 oasc.SolrCore.<init> [collection1] Opening new SolrCore at .\org.apache.solr.handler.TestReplicationHandler$SolrInstance-1351308457596\slave\collection1\, dataDir=.\org.apache.solr.handler.TestReplicationHandler$SolrInstance-1351308457596\slave\collection1\data\
[junit4:junit4]   2> 3613 T1467 oasc.SolrCore.<init> JMX monitoring not detected for core: collection1
[junit4:junit4]   2> 3613 T1467 oasc.SolrCore.initDirectoryFactory org.apache.solr.core.MockDirectoryFactory
[junit4:junit4]   2> 3613 T1467 oasc.CachingDirectoryFactory.injectLockFactory WARNING No lockType configured for MockDirWrapper(org.apache.lucene.store.RAMDirectory@790563c9 lockFactory=org.apache.lucene.store.SingleInstanceLockFactory@50da5f31) assuming 'simple'
[junit4:junit4]   2> 3614 T1467 oasc.CachingDirectoryFactory.get return new directory for C:\Users\JenkinsSlave\workspace\Lucene-Solr-trunk-Windows\solr\build\solr-core\test\J0\.\org.apache.solr.handler.TestReplicationHandler$SolrInstance-1351308457596\slave\collection1\data forceNew:false
[junit4:junit4]   2> 3614 T1467 oasc.CachingDirectoryFactory.close Releasing directory:C:\Users\JenkinsSlave\workspace\Lucene-Solr-trunk-Windows\solr\build\solr-core\test\J0\.\org.apache.solr.handler.TestReplicationHandler$SolrInstance-1351308457596\slave\collection1\data
[junit4:junit4]   2> 3615 T1467 oasc.SolrCore.getNewIndexDir New index directory detected: old=null new=.\org.apache.solr.handler.TestReplicationHandler$SolrInstance-1351308457596\slave\collection1\data\index/
[junit4:junit4]   2> 3615 T1467 oasc.SolrCore.initIndex WARNING [collection1] Solr index directory '.\org.apache.solr.handler.TestReplicationHandler$SolrInstance-1351308457596\slave\collection1\data\index' doesn't exist. Creating new index...
[junit4:junit4]   2> 3615 T1467 oasc.CachingDirectoryFactory.get return new directory for C:\Users\JenkinsSlave\workspace\Lucene-Solr-trunk-Windows\solr\build\solr-core\test\J0\.\org.apache.solr.handler.TestReplicationHandler$SolrInstance-1351308457596\slave\collection1\data\index forceNew:false
[junit4:junit4]   2> 3617 T1467 oasc.SolrDeletionPolicy.onCommit SolrDeletionPolicy.onCommit: commits:num=1
[junit4:junit4]   2> 		commit{dir=MockDirWrapper(org.apache.lucene.store.RAMDirectory@6a2e6950 lockFactory=org.apache.lucene.store.SingleInstanceLockFactory@1064c7f7),segFN=segments_1,generation=1,filenames=[segments_1]
[junit4:junit4]   2> 3617 T1467 oasc.SolrDeletionPolicy.updateCommits newest commit = 1[segments_1]
[junit4:junit4]   2> 3617 T1467 oasc.CachingDirectoryFactory.close Releasing directory:C:\Users\JenkinsSlave\workspace\Lucene-Solr-trunk-Windows\solr\build\solr-core\test\J0\.\org.apache.solr.handler.TestReplicationHandler$SolrInstance-1351308457596\slave\collection1\data\index
[junit4:junit4]   2> 3618 T1467 oasc.RequestHandlers.initHandlersFromConfig created standard: solr.StandardRequestHandler
[junit4:junit4]   2> 3618 T1467 oasc.RequestHandlers.initHandlersFromConfig created defaults: solr.StandardRequestHandler
[junit4:junit4]   2> 3618 T1467 oasc.RequestHandlers.initHandlersFromConfig adding lazy requestHandler: solr.StandardRequestHandler
[junit4:junit4]   2> 3620 T1467 oasc.RequestHandlers.initHandlersFromConfig created lazy: solr.StandardRequestHandler
[junit4:junit4]   2> 3620 T1467 oasc.RequestHandlers.initHandlersFromConfig created /update: solr.UpdateRequestHandler
[junit4:junit4]   2> 3621 T1467 oasc.RequestHandlers.initHandlersFromConfig created /replication: solr.ReplicationHandler
[junit4:junit4]   2> 3622 T1467 oashl.XMLLoader.init xsltCacheLifetimeSeconds=60
[junit4:junit4]   2> 3625 T1467 oasc.CachingDirectoryFactory.close Releasing directory:C:\Users\JenkinsSlave\workspace\Lucene-Solr-trunk-Windows\solr\build\solr-core\test\J0\.\org.apache.solr.handler.TestReplicationHandler$SolrInstance-1351308457596\slave\collection1\data
[junit4:junit4]   2> 3625 T1467 oass.SolrIndexSearcher.<init> Opening Searcher@2761bb9a main
[junit4:junit4]   2> 3625 T1467 oasu.CommitTracker.<init> Hard AutoCommit: disabled
[junit4:junit4]   2> 3626 T1467 oasu.CommitTracker.<init> Soft AutoCommit: disabled
[junit4:junit4]   2> 3626 T1467 oashc.HttpShardHandlerFactory.getParameter Setting socketTimeout to: 0
[junit4:junit4]   2> 3626 T1467 oashc.HttpShardHandlerFactory.getParameter Setting urlScheme to: http://
[junit4:junit4]   2> 3626 T1467 oashc.HttpShardHandlerFactory.getParameter Setting connTimeout to: 0
[junit4:junit4]   2> 3627 T1467 oashc.HttpShardHandlerFactory.getParameter Setting maxConnectionsPerHost to: 20
[junit4:junit4]   2> 3627 T1467 oashc.HttpShardHandlerFactory.getParameter Setting corePoolSize to: 0
[junit4:junit4]   2> 3627 T1467 oashc.HttpShardHandlerFactory.getParameter Setting maximumPoolSize to: 2147483647
[junit4:junit4]   2> 3627 T1467 oashc.HttpShardHandlerFactory.getParameter Setting maxThreadIdleTime to: 5
[junit4:junit4]   2> 3627 T1467 oashc.HttpShardHandlerFactory.getParameter Setting sizeOfQueue to: -1
[junit4:junit4]   2> 3628 T1467 oashc.HttpShardHandlerFactory.getParameter Setting fairnessPolicy to: false
[junit4:junit4]   2> 3628 T1467 oascsi.HttpClientUtil.createClient Creating new http client, config:maxConnectionsPerHost=20&maxConnections=10000&socketTimeout=0&connTimeout=0&retry=false
[junit4:junit4]   2> 3634 T1467 oash.SnapPuller.startExecutorService Poll Scheduled at an interval of 1000ms
[junit4:junit4]   2> 3635 T1467 oasc.CoreContainer.register registering core: collection1
[junit4:junit4]   2> 3635 T1467 oass.SolrDispatchFilter.init user.dir=C:\Users\JenkinsSlave\workspace\Lucene-Solr-trunk-Windows\solr\build\solr-core\test\J0
[junit4:junit4]   2> 3635 T1467 oass.SolrDispatchFilter.init SolrDispatchFilter.init() done
[junit4:junit4]   2> 3636 T1467 oascsi.HttpClientUtil.createClient Creating new http client, config:maxConnections=128&maxConnectionsPerHost=32&followRedirects=false
[junit4:junit4]   2> 3645 T1532 oasc.SolrCore.registerSearcher [collection1] Registered new searcher Searcher@2761bb9a main{StandardDirectoryReader(segments_1:1)}
[junit4:junit4]   2> ASYNC  NEW_CORE C111 name=collection1 org.apache.solr.core.SolrCore@4266e302
[junit4:junit4]   2> 3659 T1517 C111 oasc.CachingDirectoryFactory.close Releasing directory:C:\Users\JenkinsSlave\workspace\Lucene-Solr-trunk-Windows\solr\build\solr-core\test\J0\.\org.apache.solr.handler.TestReplicationHandler$SolrInstance-1351308457351\master\collection1\data\index
[junit4:junit4]   2> 3659 T1517 C111 REQ [collection1] webapp=/solr path=/replication params={command=details&qt=/replication&wt=javabin&version=2} status=0 QTime=2 
[junit4:junit4]   2> 3662 T1518 C111 REQ [collection1] webapp=/solr path=/replication params={command=indexversion&wt=javabin&qt=/replication&version=2} status=0 QTime=0 
[junit4:junit4]   2> ASYNC  NEW_CORE C112 name=collection1 org.apache.solr.core.SolrCore@29f3db6e
[junit4:junit4]   2> 3667 T1526 C112 oasc.CachingDirectoryFactory.close Releasing directory:C:\Users\JenkinsSlave\workspace\Lucene-Solr-trunk-Windows\solr\build\solr-core\test\J0\.\org.apache.solr.handler.TestReplicationHandler$SolrInstance-1351308457596\slave\collection1\data\index
[junit4:junit4]   2> 3671 T1520 C111 oasc.CachingDirectoryFactory.close Releasing directory:C:\Users\JenkinsSlave\workspace\Lucene-Solr-trunk-Windows\solr\build\solr-core\test\J0\.\org.apache.solr.handler.TestReplicationHandler$SolrInstance-1351308457351\master\collection1\data\index
[junit4:junit4]   2> 3671 T1520 C111 REQ [collection1] webapp=/solr path=/replication params={command=details&slave=false&qt=/replication&wt=javabin&version=2} status=0 QTime=0 
[junit4:junit4]   2> 3673 T1526 C112 REQ [collection1] webapp=/solr path=/replication params={command=details&qt=/replication&wt=javabin&version=2} status=0 QTime=7 
[junit4:junit4]   2> 3690 T1467 oejs.Server.doStart jetty-8.1.2.v20120308
[junit4:junit4]   2> 3693 T1467 oejs.AbstractConnector.doStart Started SelectChannelConnector@0.0.0.0:64548
[junit4:junit4]   2> 3694 T1467 oasc.SolrResourceLoader.locateSolrHome JNDI not configured for solr (NoInitialContextEx)
[junit4:junit4]   2> 3694 T1467 oasc.SolrResourceLoader.locateSolrHome using system property solr.solr.home: .\org.apache.solr.handler.TestReplicationHandler$SolrInstance-1351308461020\repeater
[junit4:junit4]   2> 3695 T1467 oasc.SolrResourceLoader.<init> new SolrResourceLoader for deduced Solr Home: '.\org.apache.solr.handler.TestReplicationHandler$SolrInstance-1351308461020\repeater\'
[junit4:junit4]   2> 3717 T1467 oass.SolrDispatchFilter.init SolrDispatchFilter.init()
[junit4:junit4]   2> 3718 T1467 oasc.SolrResourceLoader.locateSolrHome JNDI not configured for solr (NoInitialContextEx)
[junit4:junit4]   2> 3718 T1467 oasc.SolrResourceLoader.locateSolrHome using system property solr.solr.home: .\org.apache.solr.handler.TestReplicationHandler$SolrInstance-1351308461020\repeater
[junit4:junit4]   2> 3718 T1467 oasc.CoreContainer$Initializer.initialize looking for solr.xml: C:\Users\JenkinsSlave\workspace\Lucene-Solr-trunk-Windows\solr\build\solr-core\test\J0\.\org.apache.solr.handler.TestReplicationHandler$SolrInstance-1351308461020\repeater\solr.xml
[junit4:junit4]   2> 3720 T1467 oasc.CoreContainer.<init> New CoreContainer 2015134922
[junit4:junit4]   2> 3720 T1467 oasc.CoreContainer$Initializer.initialize no solr.xml file found - using default
[junit4:junit4]   2> 3721 T1467 oasc.CoreContainer.load Loading CoreContainer using Solr Home: '.\org.apache.solr.handler.TestReplicationHandler$SolrInstance-1351308461020\repeater\'
[junit4:junit4]   2> 3721 T1467 oasc.SolrResourceLoader.<init> new SolrResourceLoader for directory: '.\org.apache.solr.handler.TestReplicationHandler$SolrInstance-1351308461020\repeater\'
[junit4:junit4]   2> 3740 T1467 oasc.CoreContainer.load Registering Log Listener
[junit4:junit4]   2> 3754 T1467 oasc.CoreContainer.create Creating SolrCore 'collection1' using instanceDir: .\org.apache.solr.handler.TestReplicationHandler$SolrInstance-1351308461020\repeater\collection1
[junit4:junit4]   2> 3755 T1467 oasc.SolrResourceLoader.<init> new SolrResourceLoader for directory: '.\org.apache.solr.handler.TestReplicationHandler$SolrInstance-1351308461020\repeater\collection1\'
[junit4:junit4]   2> 3784 T1467 oasc.SolrConfig.<init> Using Lucene MatchVersion: LUCENE_50
[junit4:junit4]   2> 3857 T1467 oasc.SolrConfig.<init> Loaded SolrConfig: solrconfig.xml
[junit4:junit4]   2> 3858 T1467 oass.IndexSchema.readSchema Reading Solr Schema
[junit4:junit4]   2> 3862 T1467 oass.IndexSchema.readSchema Schema name=test
[junit4:junit4]   2> 3885 T1467 oass.IndexSchema.readSchema unique key field: id
[junit4:junit4]   2> 3887 T1467 oasc.SolrCore.<init> [collection1] Opening new SolrCore at .\org.apache.solr.handler.TestReplicationHandler$SolrInstance-1351308461020\repeater\collection1\, dataDir=.\org.apache.solr.handler.TestReplicationHandler$SolrInstance-1351308461020\repeater\collection1\data\
[junit4:junit4]   2> 3887 T1467 oasc.SolrCore.<init> JMX monitoring not detected for core: collection1
[junit4:junit4]   2> 3887 T1467 oasc.SolrCore.initDirectoryFactory org.apache.solr.core.MockDirectoryFactory
[junit4:junit4]   2> 3888 T1467 oasc.CachingDirectoryFactory.injectLockFactory WARNING No lockType configured for MockDirWrapper(org.apache.lucene.store.RAMDirectory@68d0110d lockFactory=org.apache.lucene.store.SingleInstanceLockFactory@340fa23d) assuming 'simple'
[junit4:junit4]   2> 3888 T1467 oasc.CachingDirectoryFactory.get return new directory for C:\Users\JenkinsSlave\workspace\Lucene-Solr-trunk-Windows\solr\build\solr-core\test\J0\.\org.apache.solr.handler.TestReplicationHandler$SolrInstance-1351308461020\repeater\collection1\data forceNew:false
[junit4:junit4]   2> 3889 T1467 oasc.CachingDirectoryFactory.close Releasing directory:C:\Users\JenkinsSlave\workspace\Lucene-Solr-trunk-Windows\solr\build\solr-core\test\J0\.\org.apache.solr.handler.TestReplicationHandler$SolrInstance-1351308461020\repeater\collection1\data
[junit4:junit4]   2> 3889 T1467 oasc.SolrCore.getNewIndexDir New index directory detected: old=null new=.\org.apache.solr.handler.TestReplicationHandler$SolrInstance-1351308461020\repeater\collection1\data\index/
[junit4:junit4]   2> 3890 T1467 oasc.SolrCore.initIndex WARNING [collection1] Solr index directory '.\org.apache.solr.handler.TestReplicationHandler$SolrInstance-1351308461020\repeater\collection1\data\index' doesn't exist. Creating new index...
[junit4:junit4]   2> 3891 T1467 oasc.CachingDirectoryFactory.get return new directory for C:\Users\JenkinsSlave\workspace\Lucene-Solr-trunk-Windows\solr\build\solr-core\test\J0\.\org.apache.solr.handler.TestReplicationHandler$SolrInstance-1351308461020\repeater\collection1\data\index forceNew:false
[junit4:junit4]   2> 3892 T1467 oasc.SolrDeletionPolicy.onCommit SolrDeletionPolicy.onCommit: commits:num=1
[junit4:junit4]   2> 		commit{dir=MockDirWrapper(org.apache.lucene.store.RAMDirectory@2332f00a lockFactory=org.apache.lucene.store.SingleInstanceLockFactory@7a5384c9),segFN=segments_1,generation=1,filenames=[segments_1]
[junit4:junit4]   2> 3892 T1467 oasc.SolrDeletionPolicy.updateCommits newest commit = 1[segments_1]
[junit4:junit4]   2> 3893 T1467 oasc.CachingDirectoryFactory.close Releasing directory:C:\Users\JenkinsSlave\workspace\Lucene-Solr-trunk-Windows\solr\build\solr-core\test\J0\.\org.apache.solr.handler.TestReplicationHandler$SolrInstance-1351308461020\repeater\collection1\data\index
[junit4:junit4]   2> 3893 T1467 oasc.RequestHandlers.initHandlersFromConfig created standard: solr.StandardRequestHandler
[junit4:junit4]   2> 3894 T1467 oasc.RequestHandlers.initHandlersFromConfig created defaults: solr.StandardRequestHandler
[junit4:junit4]   2> 3894 T1467 oasc.RequestHandlers.initHandlersFromConfig adding lazy requestHandler: solr.StandardRequestHandler
[junit4:junit4]   2> 3894 T1467 oasc.RequestHandlers.initHandlersFromConfig created lazy: solr.StandardRequestHandler
[junit4:junit4]   2> 3895 T1467 oasc.RequestHandlers.initHandlersFromConfig created /update: solr.UpdateRequestHandler
[junit4:junit4]   2> 3895 T1467 oasc.RequestHandlers.initHandlersFromConfig created /replication: solr.ReplicationHandler
[junit4:junit4]   2> 3902 T1467 oashl.XMLLoader.init xsltCacheLifetimeSeconds=60
[junit4:junit4]   2> 3907 T1467 oasc.CachingDirectoryFactory.close Releasing directory:C:\Users\JenkinsSlave\workspace\Lucene-Solr-trunk-Windows\solr\build\solr-core\test\J0\.\org.apache.solr.handler.TestReplicationHandler$SolrInstance-1351308461020\repeater\collection1\data
[junit4:junit4]   2> 3908 T1467 oass.SolrIndexSearcher.<init> Opening Searcher@73b57a52 main
[junit4:junit4]   2> 3908 T1467 oasu.CommitTracker.<init> Hard AutoCommit: disabled
[junit4:junit4]   2> 3908 T1467 oasu.CommitTracker.<init> Soft AutoCommit: disabled
[junit4:junit4]   2> 3909 T1467 oashc.HttpShardHandlerFactory.getParameter Setting socketTimeout to: 0
[junit4:junit4]   2> 3909 T1467 oashc.HttpShardHandlerFactory.getParameter Setting urlScheme to: http://
[junit4:junit4]   2> 3910 T1467 oashc.HttpShardHandlerFactory.getParameter Setting connTimeout to: 0
[junit4:junit4]   2> 3910 T1467 oashc.HttpShardHandlerFactory.getParameter Setting maxConnectionsPerHost to: 20
[junit4:junit4]   2> 3910 T1467 oashc.HttpShardHandlerFactory.getParameter Setting corePoolSize to: 0
[junit4:junit4]   2> 3910 T1467 oashc.HttpShardHandlerFactory.getParameter Setting maximumPoolSize to: 2147483647
[junit4:junit4]   2> 3911 T1467 oashc.HttpShardHandlerFactory.getParameter Setting maxThreadIdleTime to: 5
[junit4:junit4]   2> 3911 T1467 oashc.HttpShardHandlerFactory.getParameter Setting sizeOfQueue to: -1
[junit4:junit4]   2> 3911 T1467 oashc.HttpShardHandlerFactory.getParameter Setting fairnessPolicy to: false
[junit4:junit4]   2> 3912 T1467 oascsi.HttpClientUtil.createClient Creating new http client, config:maxConnectionsPerHost=20&maxConnections=10000&socketTimeout=0&connTimeout=0&retry=false
[junit4:junit4]   2> 3919 T1467 oash.SnapPuller.<init> WARNING 'masterUrl' must be specified without the /replication suffix
[junit4:junit4]   2> 3919 T1467 oash.SnapPuller.startExecutorService Poll Scheduled at an interval of 1000ms
[junit4:junit4]   2> 3920 T1467 oash.ReplicationHandler.inform Replication enabled for following config files: schema.xml
[junit4:junit4]   2> 3920 T1467 oash.ReplicationHandler.inform Commits will be reserved for  10000
[junit4:junit4]   2> 3922 T1543 oasc.SolrCore.registerSearcher [collection1] Registered new searcher Searcher@73b57a52 main{StandardDirectoryReader(segments_1:1)}
[junit4:junit4]   2> 3922 T1467 oasc.CoreContainer.register registering core: collection1
[junit4:junit4]   2> 3923 T1467 oass.SolrDispatchFilter.init user.dir=C:\Users\JenkinsSlave\workspace\Lucene-Solr-trunk-Windows\solr\build\solr-core\test\J0
[junit4:junit4]   2> 3923 T1467 oass.SolrDispatchFilter.init SolrDispatchFilter.init() done
[junit4:junit4]   2> 3923 T1467 oascsi.HttpClientUtil.createClient Creating new http client, config:maxConnections=128&maxConnectionsPerHost=32&followRedirects=false
[junit4:junit4]   2> ASYNC  NEW_CORE C113 name=collection1 org.apache.solr.core.SolrCore@a2e0ecb
[junit4:junit4]   2> 3935 T1537 C113 oasc.CachingDirectoryFactory.close Releasing directory:C:\Users\JenkinsSlave\workspace\Lucene-Solr-trunk-Windows\solr\build\solr-core\test\J0\.\org.apache.solr.handler.TestReplicationHandler$SolrInstance-1351308461020\repeater\collection1\data\index
[junit4:junit4]   2> 3939 T1519 C111 oasc.CachingDirectoryFactory.close Releasing directory:C:\Users\JenkinsSlave\workspace\Lucene-Solr-trunk-Windows\solr\build\solr-core\test\J0\.\org.apache.solr.handler.TestReplicationHandler$SolrInstance-1351308457351\master\collection1\data\index
[junit4:junit4]   2> 3939 T1519 C111 REQ [collection1] webapp=/solr path=/replication params={command=details&slave=false&qt=/replication&wt=javabin&version=2} status=0 QTime=0 
[junit4:junit4]   2> 3940 T1537 C113 REQ [collection1] webapp=/solr path=/replication params={command=details&qt=/replication&wt=javabin&version=2} status=0 QTime=6 
[junit4:junit4]   2> 3954 T1467 oasc.CoreContainer.shutdown Shutting down CoreContainer instance=2015134922
[junit4:junit4]   2> 3957 T1467 oasc.SolrCore.close [collection1]  CLOSING SolrCore org.apache.solr.core.SolrCore@a2e0ecb
[junit4:junit4]   2> 3957 T1467 oasu.DirectUpdateHandler2.close closing DirectUpdateHandler2{commits=0,autocommits=0,soft autocommits=0,optimizes=0,rollbacks=0,expungeDeletes=0,docsPending=0,adds=0,deletesById=0,deletesByQuery=0,errors=0,cumulative_adds=0,cumulative_deletesById=0,cumulative_deletesByQuery=0,cumulative_errors=0}
[junit4:junit4]   2> 3958 T1467 oasc.SolrCore.decrefSolrCoreState Closing SolrCoreState
[junit4:junit4]   2> 3958 T1467 oasu.DefaultSolrCoreState.closeIndexWriter SolrCoreState ref count has reached 0 - closing IndexWriter
[junit4:junit4]   2> 3959 T1467 oasu.DefaultSolrCoreState.closeIndexWriter closing IndexWriter with IndexWriterCloser
[junit4:junit4]   2> 3960 T1467 oasc.SolrCore.closeSearcher [collection1] Closing main searcher on request.
[junit4:junit4]   2> 3961 T1467 oasc.CachingDirectoryFactory.close Releasing directory:C:\Users\JenkinsSlave\workspace\Lucene-Solr-trunk-Windows\solr\build\solr-core\test\J0\.\org.apache.solr.handler.TestReplicationHandler$SolrInstance-1351308461020\repeater\collection1\data\index
[junit4:junit4]   2> 3962 T1467 oejsh.ContextHandler.doStop stopped o.e.j.s.ServletContextHandler{/solr,null}
[junit4:junit4]   2> 4032 T1516 C111 REQ [collection1] webapp=/solr path=/select params={wt=javabin&q=*:*&version=2} hits=0 status=0 QTime=0 
[junit4:junit4]   2> 4036 T1517 C111 oasc.CachingDirectoryFactory.close Releasing directory:C:\Users\JenkinsSlave\workspace\Lucene-Solr-trunk-Windows\solr\build\solr-core\test\J0\.\org.apache.solr.handler.TestReplicationHandler$SolrInstance-1351308457351\master\collection1\data
[junit4:junit4]   2> 4041 T1517 C111 oasc.SolrDeletionPolicy.onInit SolrDeletionPolicy.onInit: commits:num=1
[junit4:junit4]   2> 		commit{dir=MockDirWrapper(org.apache.lucene.store.RAMDirectory@1f490a58 lockFactory=org.apache.lucene.store.SingleInstanceLockFactory@29c82aa8),segFN=segments_1,generation=1,filenames=[segments_1]
[junit4:junit4]   2> 4042 T1517 C111 oasc.SolrDeletionPolicy.updateCommits newest commit = 1[segments_1]
[junit4:junit4]   2> 4043 T1517 C111 UPDATE [collection1] webapp=/solr path=/update params={wt=javabin&version=2} {add=[0]} 0 7
[junit4:junit4]   2> 4047 T1518 C111 UPDATE [collection1] webapp=/solr path=/update params={wt=javabin&version=2} {add=[1]} 0 0
[junit4:junit4]   2> 4051 T1520 C111 UPDATE [collection1] webapp=/solr path=/update params={wt=javabin&version=2} {add=[2]} 0 1
[junit4:junit4]   2> 4055 T1521 C111 UPDATE [collection1] webapp=/solr path=/update params={wt=javabin&version=2} {add=[3]} 0 1
[junit4:junit4]   2> 4059 T1519 C111 UPDATE [collection1] webapp=/solr path=/update params={wt=javabin&version=2} {add=[4]} 0 1
[junit4:junit4]   2> 4065 T1516 C111 UPDATE [collection1] webapp=/solr path=/update params={wt=javabin&version=2} {add=[5]} 0 1
[junit4:junit4]   2> 4072 T1517 C111 UPDATE [collection1] webapp=/solr path=/update params={wt=javabin&version=2} {add=[6]} 0 1
[junit4:junit4]   2> 4098 T1518 C111 UPDATE [collection1] webapp=/solr path=/update params={wt=javabin&version=2} {add=[7]} 0 3
[junit4:junit4]   2> 4112 T1520 C111 UPDATE [collection1] webapp=/solr path=/update params={wt=javabin&version=2} {add=[8]} 0 1
[junit4:junit4]   2> 4115 T1521 C111 UPDATE [collection1] webapp=/solr path=/update params={wt=javabin&version=2} {add=[9]} 0 0
[junit4:junit4]   2> 4118 T1519 C111 UPDATE [collection1] webapp=/solr path=/update params={wt=javabin&version=2} {add=[10]} 0 0
[junit4:junit4]   2> 4121 T1516 C111 UPDATE [collection1] webapp=/solr path=/update params={wt=javabin&version=2} {add=[11]} 0 0
[junit4:junit4]   2> 4126 T1517 C111 UPDATE [collection1] webapp=/solr path=/update params={wt=javabin&version=2} {add=[12]} 0 0
[junit4:junit4]   2> 4129 T1518 C111 UPDATE [collection1] webapp=/solr path=/update params={wt=javabin&version=2} {add=[13]} 0 0
[junit4:junit4]   2> 4132 T1520 C111 UPDATE [collection1] webapp=/solr path=/update params={wt=javabin&version=2} {add=[14]} 0 0
[junit4:junit4]   2> 4135 T1521 C111 UPDATE [collection1] webapp=/solr path=/update params={wt=javabin&version=2} {add=[15]} 0 0
[junit4:junit4]   2> 4139 T1519 C111 UPDATE [collection1] webapp=/solr path=/update params={wt=javabin&version=2} {add=[16]} 0 1
[junit4:junit4]   2> 4143 T1516 C111 UPDATE [collection1] webapp=/solr path=/update params={wt=javabin&version=2} {add=[17]} 0 1
[junit4:junit4]   2> 4147 T1517 C111 UPDATE [collection1] webapp=/solr path=/update params={wt=javabin&version=2} {add=[18]} 0 1
[junit4:junit4]   2> 4152 T1518 C111 UPDATE [collection1] webapp=/solr path=/update params={wt=javabin&version=2} {add=[19]} 0 1
[junit4:junit4]   2> 4155 T1520 C111 UPDATE [collection1] webapp=/solr path=/update params={wt=javabin&version=2} {add=[20]} 0 0
[junit4:junit4]   2> 4159 T1521 C111 UPDATE [collection1] webapp=/solr path=/update params={wt=javabin&version=2} {add=[21]} 0 1
[junit4:junit4]   2> 4163 T1519 C111 UPDATE [collection1] webapp=/solr path=/update params={wt=javabin&version=2} {add=[22]} 0 1
[junit4:junit4]   2> 4166 T1516 C111 UPDATE [collection1] webapp=/solr path=/update params={wt=javabin&version=2} {add=[23]} 0 0
[junit4:junit4]   2> 4170 T1517 C111 UPDATE [collection1] webapp=/solr path=/update params={wt=javabin&version=2} {add=[24]} 0 0
[junit4:junit4]   2> 4173 T1518 C111 UPDATE [collection1] webapp=/solr path=/update params={wt=javabin&version=2} {add=[25]} 0 0
[junit4:junit4]   2> 4186 T1520 C111 UPDATE [collection1] webapp=/solr path=/update params={wt=javabin&version=2} {add=[26]} 0 9
[junit4:junit4]   2> 4190 T1521 C111 UPDATE [collection1] webapp=/solr path=/update params={wt=javabin&version=2} {add=[27]} 0 0
[junit4:junit4]   2> 4194 T1519 C111 UPDATE [collection1] webapp=/solr path=/update params={wt=javabin&version=2} {add=[28]} 0 1
[junit4:junit4]   2> 4198 T1516 C111 UPDATE [collection1] webapp=/solr path=/update params={wt=javabin&version=2} {add=[29]} 0 0
[junit4:junit4]   2> 4202 T1517 C111 UPDATE [collection1] webapp=/solr path=/update params={wt=javabin&version=2} {add=[30]} 0 0
[junit4:junit4]   2> 4208 T1518 C111 UPDATE [collection1] webapp=/solr path=/update params={wt=javabin&version=2} {add=[31]} 0 1
[junit4:junit4]   2> 4212 T1520 C111 UPDATE [collection1] webapp=/solr path=/update params={wt=javabin&version=2} {add=[32]} 0 0
[junit4:junit4]   2> 4218 T1521 C111 UPDATE [collection1] webapp=/solr path=/update params={wt=javabin&version=2} {add=[33]} 0 1
[junit4:junit4]   2> 4222 T1519 C111 UPDATE [collection1] webapp=/solr path=/update params={wt=javabin&version=2} {add=[34]} 0 0
[junit4:junit4]   2> 4226 T1516 C111 UPDATE [collection1] webapp=/solr path=/update params={wt=javabin&version=2} {add=[35]} 0 1
[junit4:junit4]   2> 4229 T1517 C111 UPDATE [collection1] webapp=/solr path=/update params={wt=javabin&version=2} {add=[36]} 0 0
[junit4:junit4]   2> 4236 T1518 C111 UPDATE [collection1] webapp=/solr path=/update params={wt=javabin&version=2} {add=[37]} 0 1
[junit4:junit4]   2> 4239 T1520 C111 UPDATE [collection1] webapp=/solr path=/update params={wt=javabin&version=2} {add=[38]} 0 0
[junit4:junit4]   2> 4243 T1521 C111 UPDATE [collection1] webapp=/solr path=/update params={wt=javabin&version=2} {add=[39]} 0 1
[junit4:junit4]   2> 4247 T1519 C111 UPDATE [collection1] webapp=/solr path=/update params={wt=javabin&version=2} {add=[40]} 0 1
[junit4:junit4]   2> 4251 T1516 C111 UPDATE [collection1] webapp=/solr path=/update params={wt=javabin&version=2} {add=[41]} 0 0
[junit4:junit4]   2> 4256 T1517 C111 UPDATE [collection1] webapp=/solr path=/update params={wt=javabin&version=2} {add=[42]} 0 0
[junit4:junit4]   2> 4260 T1518 C111 UPDATE [collection1] webapp=/solr path=/update params={wt=javabin&version=2} {add=[43]} 0 0
[junit4:junit4]   2> 4265 T1520 C111 UPDATE [collection1] webapp=/solr path=/update params={wt=javabin&version=2} {add=[44]} 0 0
[junit4:junit4]   2> 4269 T1521 C111 UPDATE [collection1] webapp=/solr path=/update params={wt=javabin&version=2} {add=[45]} 0 0
[junit4:junit4]   2> 4275 T1519 C111 UPDATE [collection1] webapp=/solr path=/update params={wt=javabin&version=2} {add=[46]} 0 2
[junit4:junit4]   2> 4278 T1516 C111 UPDATE [collection1] webapp=/solr path=/update params={wt=javabin&version=2} {add=[47]} 0 0
[junit4:junit4]   2> 4282 T1517 C111 UPDATE [collection1] webapp=/solr path=/update params={wt=javabin&version=2} {add=[48]} 0 0
[junit4:junit4]   2> 4287 T1518 C111 UPDATE [collection1] webapp=/solr path=/update params={wt=javabin&version=2} {add=[49]} 0 0
[junit4:junit4]   2> 4293 T1520 C111 UPDATE [collection1] webapp=/solr path=/update params={wt=javabin&version=2} {add=[50]} 0 0
[junit4:junit4]   2> 4298 T1521 C111 UPDATE [collection1] webapp=/solr path=/update params={wt=javabin&version=2} {add=[51]} 0 0
[junit4:junit4]   2> 4304 T1519 C111 UPDATE [collection1] webapp=/solr path=/update params={wt=javabin&version=2} {add=[52]} 0 0
[junit4:junit4]   2> 4309 T1516 C111 UPDATE [collection1] webapp=/solr path=/update params={wt=javabin&version=2} {add=[53]} 0 0
[junit4:junit4]   2> 4314 T1517 C111 UPDATE [collection1] webapp=/solr path=/update params={wt=javabin&version=2} {add=[54]} 0 0
[junit4:junit4]   2> 4319 T1518 C111 UPDATE [collection1] webapp=/solr path=/update params={wt=javabin&version=2} {add=[55]} 0 0
[junit4:junit4]   2> 4325 T1520 C111 UPDATE [collection1] webapp=/solr path=/update params={wt=javabin&version=2} {add=[56]} 0 1
[junit4:junit4]   2> 4329 T1521 C111 UPDATE [collection1] webapp=/solr path=/update params={wt=javabin&version=2} {add=[57]} 0 1
[junit4:junit4]   2> 4332 T1519 C111 UPDATE [collection1] webapp=/solr path=/update params={wt=javabin&version=2} {add=[58]} 0 0
[junit4:junit4]   2> 4338 T1516 C111 UPDATE [collection1] webapp=/solr path=/update params={wt=javabin&version=2} {add=[59]} 0 1
[junit4:junit4]   2> 4342 T1517 C111 UPDATE [collection1] webapp=/solr path=/update params={wt=javabin&version=2} {add=[60]} 0 1
[junit4:junit4]   2> 4346 T1520 C111 UPDATE [collection1] webapp=/solr path=/update params={wt=javabin&version=2} {add=[61]} 0 1
[junit4:junit4]   2> 4351 T1521 C111 UPDATE [collection1] webapp=/solr path=/update params={wt=javabin&version=2} {add=[62]} 0 1
[junit4:junit4]   2> 4356 T1519 C111 UPDATE [collection1] webapp=/solr path=/update params={wt=javabin&version=2} {add=[63]} 0 2
[junit4:junit4]   2> 4360 T1516 C111 UPDATE [collection1] webapp=/solr path=/update params={wt=javabin&version=2} {add=[64]} 0 0
[junit4:junit4]   2> 4363 T1518 C111 UPDATE [collection1] webapp=/solr path=/update params={wt=javabin&version=2} {add=[65]} 0 0
[junit4:junit4]   2> 4368 T1517 C111 UPDATE [collection1] webapp=/solr path=/update params={wt=javabin&version=2} {add=[66]} 0 1
[junit4:junit4]   2> 4372 T1520 C111 UPDATE [collection1] webapp=/solr path=/update params={wt=javabin&version=2} {add=[67]} 0 0
[junit4:junit4]   2> 4377 T1521 C111 UPDATE [collection1] webapp=/solr path=/update params={wt=javabin&version=2} {add=[68]} 0 0
[junit4:junit4]   2> 4380 T1519 C111 UPDATE [collection1] webapp=/solr path=/update params={wt=javabin&version=2} {add=[69]} 0 0
[junit4:junit4]   2> 4385 T1516 C111 UPDATE [collection1] webapp=/solr path=/update params={wt=javabin&version=2} {add=[70]} 0 0
[junit4:junit4]   2> 4390 T1518 C111 UPDATE [collection1] webapp=/solr path=/update params={wt=javabin&version=2} {add=[71]} 0 0
[junit4:junit4]   2> 4393 T1517 C111 UPDATE [collection1] webapp=/solr path=/update params={wt=javabin&version=2} {add=[72]} 0 0
[junit4:junit4]   2> 4397 T1520 C111 UPDATE [collection1] webapp=/solr path=/update params={wt=javabin&version=2} {add=[73]} 0 0
[junit4:junit4]   2> 4401 T1521 C111 UPDATE [collection1] webapp=/solr path=/update params={wt=javabin&version=2} {add=[74]} 0 1
[junit4:junit4]   2> 4406 T1519 C111 UPDATE [collection1] webapp=/solr path=/update params={wt=javabin&version=2} {add=[75]} 0 0
[junit4:junit4]   2> 4409 T1516 C111 UPDATE [collection1] webapp=/solr path=/update params={wt=javabin&version=2} {add=[76]} 0 0
[junit4:junit4]   2> 4413 T1518 C111 UPDATE [collection1] webapp=/solr path=/update params={wt=javabin&version=2} {add=[77]} 0 0
[junit4:junit4]   2> 4418 T1517 C111 UPDATE [collection1] webapp=/solr path=/update params={wt=javabin&version=2} {add=[78]} 0 0
[junit4:junit4]   2> 4422 T1520 C111 UPDATE [collection1] webapp=/solr path=/update params={wt=javabin&version=2} {add=[79]} 0 0
[junit4:junit4]   2> 4426 T1521 C111 UPDATE [collection1] webapp=/solr path=/update params={wt=javabin&version=2} {add=[80]} 0 0
[junit4:junit4]   2> 4429 T1519 C111 UPDATE [collection1] webapp=/solr path=/update params={wt=javabin&version=2} {add=[81]} 0 0
[junit4:junit4]   2> 4435 T1516 C111 UPDATE [collection1] webapp=/solr path=/update params={wt=javabin&version=2} {add=[82]} 0 1
[junit4:junit4]   2> 4439 T1518 C111 UPDATE [collection1] webapp=/solr path=/update params={wt=javabin&version=2} {add=[83]} 0 1
[junit4:junit4]   2> 4443 T1517 C111 UPDATE [collection1] webapp=/solr path=/update params={wt=javabin&version=2} {add=[84]} 0 1
[junit4:junit4]   2> 4448 T1520 C111 UPDATE [collection1] webapp=/solr path=/update params={wt=javabin&version=2} {add=[85]} 0 2
[junit4:junit4]   2> 4452 T1521 C111 UPDATE [collection1] webapp=/solr path=/update params={wt=javabin&version=2} {add=[86]} 0 1
[junit4:junit4]   2> 4455 T1519 C111 UPDATE [collection1] webapp=/solr path=/update params={wt=javabin&version=2} {add=[87]} 0 0
[junit4:junit4]   2> 4461 T1516 C111 UPDATE [collection1] webapp=/solr path=/update params={wt=javabin&version=2} {add=[88]} 0 3
[junit4:junit4]   2> 4465 T1518 C111 UPDATE [collection1] webapp=/solr path=/update params={wt=javabin&version=2} {add=[89]} 0 1
[junit4:junit4]   2> 4469 T1517 C111 UPDATE [collection1] webapp=/solr path=/update params={wt=javabin&version=2} {add=[90]} 0 0
[junit4:junit4]   2> 4473 T1520 C111 UPDATE [collection1] webapp=/solr path=/update params={wt=javabin&version=2} {add=[91]} 0 1
[junit4:junit4]   2> 4476 T1521 C111 UPDATE [collection1] webapp=/solr path=/update params={wt=javabin&version=2} {add=[92]} 0 0
[junit4:junit4]   2> 4482 T1519 C111 UPDATE [collection1] webapp=/solr path=/update params={wt=javabin&version=2} {add=[93]} 0 0
[junit4:junit4]   2> 4486 T1516 C111 UPDATE [collection1] webapp=/solr path=/update params={wt=javabin&version=2} {add=[94]} 0 1
[junit4:junit4]   2> 4490 T1518 C111 UPDATE [collection1] webapp=/solr path=/update params={wt=javabin&version=2} {add=[95]} 0 0
[junit4:junit4]   2> 4494 T1517 C111 UPDATE [collection1] webapp=/solr path=/update params={wt=javabin&version=2} {add=[96]} 0 1
[junit4:junit4]   2> 4499 T1520 C111 UPDATE [collection1] webapp=/solr path=/update params={wt=javabin&version=2} {add=[97]} 0 1
[junit4:junit4]   2> 4502 T1521 C111 UPDATE [collection1] webapp=/solr path=/update params={wt=javabin&version=2} {add=[98]} 0 0
[junit4:junit4]   2> 4506 T1519 C111 UPDATE [collection1] webapp=/solr path=/update params={wt=javabin&version=2} {add=[99]} 0 0
[junit4:junit4]   2> 4509 T1516 C111 UPDATE [collection1] webapp=/solr path=/update params={wt=javabin&version=2} {add=[100]} 0 0
[junit4:junit4]   2> 4517 T1518 C111 UPDATE [collection1] webapp=/solr path=/update params={wt=javabin&version=2} {add=[101]} 0 1
[junit4:junit4]   2> 4520 T1517 C111 UPDATE [collection1] webapp=/solr path=/update params={wt=javabin&version=2} {add=[102]} 0 0
[junit4:junit4]   2> 4524 T1520 C111 UPDATE [collection1] webapp=/solr path=/update params={wt=javabin&version=2} {add=[103]} 0 0
[junit4:junit4]   2> 4528 T1521 C111 UPDATE [collection1] webapp=/solr path=/update params={wt=javabin&version=2} {add=[104]} 0 0
[junit4:junit4]   2> 4532 T1519 C111 UPDATE [collection1] webapp=/solr path=/update params={wt=javabin&version=2} {add=[105]} 0 0
[junit4:junit4]   2> 4537 T1516 C111 UPDATE [collection1] webapp=/solr path=/update params={wt=javabin&version=2} {add=[106]} 0 0
[junit4:junit4]   2> 4542 T1518 C111 UPDATE [collection1] webapp=/solr path=/update params={wt=javabin&version=2} {add=[107]} 0 1
[junit4:junit4]   2> 4546 T1517 C111 UPDATE [collection1] webapp=/solr path=/update params={wt=javabin&version=2} {add=[108]} 0 0
[junit4:junit4]   2> 4550 T1520 C111 UPDATE [collection1] webapp=/solr path=/update params={wt=javabin&version=2} {add=[109]} 0 1
[junit4:junit4]   2> 4553 T1521 C111 UPDATE [collection1] webapp=/solr path=/update params={wt=javabin&version=2} {add=[110]} 0 0
[junit4:junit4]   2> 4557 T1519 C111 UPDATE [collection1] webapp=/solr path=/update params={wt=javabin&version=2} {add=[111]} 0 0
[junit4:junit4]   2> 4562 T1516 C111 UPDATE [collection1] webapp=/solr path=/update params={wt=javabin&version=2} {add=[112]} 0 0
[junit4:junit4]   2> 4566 T1518 C111 UPDATE [collection1] webapp=/solr path=/update params={wt=javabin&version=2} {add=[113]} 0 0
[junit4:junit4]   2> 4570 T1517 C111 UPDATE [collection1] webapp=/solr path=/update params={wt=javabin&version=2} {add=[114]} 0 1
[junit4:junit4]   2> 4575 T1520 C111 UPDATE [collection1] webapp=/solr path=/update params={wt=javabin&version=2} {add=[115]} 0 1
[junit4:junit4]   2> 4579 T1521 C111 UPDATE [collection1] webapp=/solr path=/update params={wt=javabin&version=2} {add=[116]} 0 0
[junit4:junit4]   2> 4583 T1519 C111 UPDATE [collection1] webapp=/solr path=/update params={wt=javabin&version=2} {add=[117]} 0 0
[junit4:junit4]   2> 4587 T1516 C111 UPDATE [collection1] webapp=/solr path=/update params={wt=javabin&version=2} {add=[118]} 0 0
[junit4:junit4]   2> 4591 T1518 C111 UPDATE [collection1] webapp=/solr path=/update params={wt=javabin&version=2} {add=[119]} 0 0
[junit4:junit4]   2> 4596 T1517 C111 UPDATE [collection1] webapp=/solr path=/update params={wt=javabin&version=2} {add=[120]} 0 0
[junit4:junit4]   2> 4601 T1520 C111 UPDATE [collection1] webapp=/solr path=/update params={wt=javabin&version=2} {add=[121]} 0 1
[junit4:junit4]   2> 4605 T1521 C111 UPDATE [collection1] webapp=/solr path=/update params={wt=javabin&version=2} {add=[122]} 0 1
[junit4:junit4]   2> 4609 T1519 C111 UPDATE [collection1] webapp=/solr path=/update params={wt=javabin&version=2} {add=[123]} 0 0
[junit4:junit4]   2> 4614 T1516 C111 UPDATE [collection1] webapp=/solr path=/update params={wt=javabin&version=2} {add=[124]} 0 1
[junit4:junit4]   2> 4617 T1518 C111 UPDATE [collection1] webapp=/solr path=/update params={wt=javabin&version=2} {add=[125]} 0 0
[junit4:junit4]   2> 4622 T1517 C111 UPDATE [collection1] webapp=/solr path=/update params={wt=javabin&version=2} {add=[126]} 0 0
[junit4:junit4]   2> 4626 T1520 C111 UPDATE [collection1] webapp=/solr path=/update params={wt=javabin&version=2} {add=[127]} 0 1
[junit4:junit4]   2> 4630 T1521 C111 UPDATE [collection1] webapp=/solr path=/update params={wt=javabin&version=2} {add=[128]} 0 0
[junit4:junit4]   2> 4635 T1519 C111 UPDATE [collection1] webapp=/solr path=/update params={wt=javabin&version=2} {add=[129]} 0 0
[junit4:junit4]   2> 4638 T1516 C111 UPDATE [collection1] webapp=/solr path=/update params={wt=javabin&version=2} {add=[130]} 0 0
[junit4:junit4]   2> 4642 T1518 C111 UPDATE [collection1] webapp=/solr path=/update params={wt=javabin&version=2} {add=[131]} 0 0
[junit4:junit4]   2> 4645 T1517 C111 UPDATE [collection1] webapp=/solr path=/update params={wt=javabin&version=2} {add=[132]} 0 0
[junit4:junit4]   2> 4648 T1520 C111 UPDATE [collection1] webapp=/solr path=/update params={wt=javabin&version=2} {add=[133]} 0 0
[junit4:junit4]   2> 4651 T1521 C111 UPDATE [collection1] webapp=/solr path=/update params={wt=javabin&version=2} {add=[134]} 0 0
[junit4:junit4]   2> 4654 T1519 C111 UPDATE [collection1] webapp=/solr path=/update params={wt=javabin&version=2} {add=[135]} 0 0
[junit4:junit4]   2> 4658 T1516 C111 UPDATE [collection1] webapp=/solr path=/update params={wt=javabin&version=2} {add=[136]} 0 0
[junit4:junit4]   2> 4661 T1518 C111 UPDATE [collection1] webapp=/solr path=/update params={wt=javabin&version=2} {add=[137]} 0 0
[junit4:junit4]   2> 4664 T1517 C111 UPDATE [collection1] webapp=/solr path=/update params={wt=javabin&version=2} {add=[138]} 0 0
[junit4:junit4]   2> 4667 T1520 C111 UPDATE [collection1] webapp=/solr path=/update params={wt=javabin&version=2} {add=[139]} 0 0
[junit4:junit4]   2> 4670 T1521 C111 UPDATE [collection1] webapp=/solr path=/update params={wt=javabin&version=2} {add=[140]} 0 0
[junit4:junit4]   2> 4674 T1519 C111 UPDATE [collection1] webapp=/solr path=/update params={wt=javabin&version=2} {add=[141]} 0 0
[junit4:junit4]   2> 4677 T1516 C111 UPDATE [collection1] webapp=/solr path=/update params={wt=javabin&version=2} {add=[142]} 0 0
[junit4:junit4]   2> 4681 T1518 C111 UPDATE [collection1] webapp=/solr path=/update params={wt=javabin&version=2} {add=[143]} 0 0
[junit4:junit4]   2> 4685 T1517 C111 UPDATE [collection1] webapp=/solr path=/update params={wt=javabin&version=2} {add=[144]} 0 0
[junit4:junit4]   2> 4689 T1520 C111 UPDATE [collection1] webapp=/solr path=/update params={wt=javabin&version=2} {add=[145]} 0 0
[junit4:junit4]   2> 4692 T1521 C111 UPDATE [collection1] webapp=/solr path=/update params={wt=javabin&version=2} {add=[146]} 0 0
[junit4:junit4]   2> 4695 T1519 C111 UPDATE [collection1] webapp=/solr path=/update params={wt=javabin&version=2} {add=[147]} 0 0
[junit4:junit4]   2> 4698 T1516 C111 UPDATE [collection1] webapp=/solr path=/update params={wt=javabin&version=2} {add=[148]} 0 0
[junit4:junit4]   2> 4701 T1518 C111 UPDATE [collection1] webapp=/solr path=/update params={wt=javabin&version=2} {add=[149]} 0 0
[junit4:junit4]   2> 4704 T1517 C111 UPDATE [collection1] webapp=/solr path=/update params={wt=javabin&version=2} {add=[150]} 0 0
[junit4:junit4]   2> 4707 T1520 C111 UPDATE [collection1] webapp=/solr path=/update params={wt=javabin&version=2} {add=[151]} 0 0
[junit4:junit4]   2> 4711 T1521 C111 UPDATE [collection1] webapp=/solr path=/update params={wt=javabin&version=2} {add=[152]} 0 0
[junit4:junit4]   2> 4715 T1519 C111 UPDATE [collection1] webapp=/solr path=/update params={wt=javabin&version=2} {add=[153]} 0 0
[junit4:junit4]   2> 4717 T1516 C111 REQ [collection1] webapp=/solr path=/replication params={command=indexversion&wt=javabin&qt=/replication&version=2} status=0 QTime=0 
[junit4:junit4]   2> 4718 T1518 C111 UPDATE [collection1] webapp=/solr path=/update params={wt=javabin&version=2} {add=[154]} 0 0
[junit4:junit4]   2> 4721 T1517 C111 UPDATE [collection1] webapp=/solr path=/update params={wt=javabin&version=2} {add=[155]} 0 0
[junit4:junit4]   2> 4724 T1520 C111 UPDATE [collection1] webapp=/solr path=/update params={wt=javabin&version=2} {add=[156]} 0 0
[junit4:junit4]   2> 4727 T1521 C111 UPDATE [collection1] webapp=/solr path=/update params={wt=javabin&version=2} {add=[157]} 0 0
[junit4:junit4]   2> 4730 T1519 C111 UPDATE [collection1] webapp=/solr path=/update params={wt=javabin&version=2} {add=[158]} 0 0
[junit4:junit4]   2> 4733 T1516 C111 UPDATE [collection1] webapp=/solr path=/update params={wt=javabin&version=2} {add=[159]} 0 0
[junit4:junit4]   2> 4736 T1518 C111 UPDATE [collection1] webapp=/solr path=/update params={wt=javabin&version=2} {add=[160]} 0 0
[junit4:junit4]   2> 4739 T1517 C111 UPDATE [collection1] webapp=/solr path=/update params={wt=javabin&version=2} {add=[161]} 0 0
[junit4:junit4]   2> 4743 T1520 C111 UPDATE [collection1] webapp=/solr path=/update params={wt=javabin&version=2} {add=[162]} 0 0
[junit4:junit4]   2> 4746 T1519 C111 UPDATE [collection1] webapp=/solr path=/update params={wt=javabin&version=2} {add=[163]} 0 0
[junit4:junit4]   2> 4749 T1516 C111 UPDATE [collection1] webapp=/solr path=/update params={wt=javabin&version=2} {add=[164]} 0 0
[junit4:junit4]   2> 4752 T1518 C111 UPDATE [collection1] webapp=/solr path=/update params={wt=javabin&version=2} {add=[165]} 0 0
[junit4:junit4]   2> 4755 T1517 C111 UPDATE [collection1] webapp=/solr path=/update params={wt=javabin&version=2} {add=[166]} 0 0
[junit4:junit4]   2> 4758 T1521 C111 UPDATE [collection1] webapp=/solr path=/update params={wt=javabin&version=2} {add=[167]} 0 0
[junit4:junit4]   2> 4762 T1520 C111 UPDATE [collection1] webapp=/solr path=/update params={wt=javabin&version=2} {add=[168]} 0 0
[junit4:junit4]   2> 4765 T1519 C111 UPDATE [collection1] webapp=/solr path=/update params={wt=javabin&version=2} {add=[169]} 0 0
[junit4:junit4]   2> 4769 T1516 C111 UPDATE [collection1] webapp=/solr path=/update params={wt=javabin&version=2} {add=[170]} 0 0
[junit4:junit4]   2> 4772 T1518 C111 UPDATE [collection1] webapp=/solr path=/update params={wt=javabin&version=2} {add=[171]} 0 0
[junit4:junit4]   2> 4775 T1517 C111 UPDATE [collection1] webapp=/solr path=/update params={wt=javabin&version=2} {add=[172]} 0 0
[junit4:junit4]   2> 4779 T1521 C111 UPDATE [collection1] webapp=/solr path=/update params={wt=javabin&version=2} {add=[173]} 0 0
[junit4:junit4]   2> 4782 T1520 C111 UPDATE [collection1] webapp=/solr path=/update params={wt=javabin&version=2} {add=[174]} 0 0
[junit4:junit4]   2> 4785 T1519 C111 UPDATE [collection1] webapp=/solr path=/update params={wt=javabin&version=2} {add=[175]} 0 0
[junit4:junit4]   2> 4788 T1516 C111 UPDATE [collection1] webapp=/solr path=/update params={wt=javabin&version=2} {add=[176]} 0 0
[junit4:junit4]   2> 4792 T1518 C111 UPDATE [collection1] webapp=/solr path=/update params={wt=javabin&version=2} {add=[177]} 0 0
[junit4:junit4]   2> 4797 T1517 C111 UPDATE [collection1] webapp=/solr path=/update params={wt=javabin&version=2} {add=[178]} 0 0
[junit4:junit4]   2> 4801 T1521 C111 UPDATE [collection1] webapp=/solr path=/update params={wt=javabin&version=2} {add=[179]} 0 0
[junit4:junit4]   2> 4804 T1520 C111 UPDATE [collection1] webapp=/solr path=/update params={wt=javabin&version=2} {add=[180]} 0 0
[junit4:junit4]   2> 4808 T1519 C111 UPDATE [collection1] webapp=/solr path=/update params={wt=javabin&version=2} {add=[181]} 0 0
[junit4:junit4]   2> 4811 T1516 C111 UPDATE [collection1] webapp=/solr path=/update params={wt=javabin&version=2} {add=[182]} 0 0
[junit4:junit4]   2> 4814 T1518 C111 UPDATE [collection1] webapp=/solr path=/update params={wt=javabin&version=2} {add=[183]} 0 0
[junit4:junit4]   2> 4817 T1517 C111 UPDATE [collection1] webapp=/solr path=/update params={wt=javabin&version=2} {add=[184]} 0 0
[junit4:junit4]   2> 4820 T1521 C111 UPDATE [collection1] webapp=/solr path=/update params={wt=javabin&version=2} {add=[185]} 0 0
[junit4:junit4]   2> 4825 T1520 C111 UPDATE [collection1] webapp=/solr path=/update params={wt=javabin&version=2} {add=[186]} 0 0
[junit4:junit4]   2> 4828 T1519 C111 UPDATE [collection1] webapp=/solr path=/update params={wt=javabin&version=2} {add=[187]} 0 0
[junit4:junit4]   2> 4831 T1516 C111 UPDATE [collection1] webapp=/solr path=/update params={wt=javabin&version=2} {add=[188]} 0 0
[junit4:junit4]   2> 4834 T1518 C111 UPDATE [collection1] webapp=/solr path=/update params={wt=javabin&version=2} {add=[189]} 0 0
[junit4:junit4]   2> 4837 T1517 C111 UPDATE [collection1] webapp=/solr path=/update params={wt=javabin&version=2} {add=[190]} 0 0
[junit4:junit4]   2> 4840 T1521 C111 UPDATE [collection1] webapp=/solr path=/update params={wt=javabin&version=2} {add=[191]} 0 0
[junit4:junit4]   2> 4843 T1520 C111 UPDATE [collection1] webapp=/solr path=/update params={wt=javabin&version=2} {add=[192]} 0 0
[junit4:junit4]   2> 4846 T1519 C111 UPDATE [collection1] webapp=/solr path=/update params={wt=javabin&version=2} {add=[193]} 0 0
[junit4:junit4]   2> 4850 T1516 C111 UPDATE [collection1] webapp=/solr path=/update params={wt=javabin&version=2} {add=[194]} 0 0
[junit4:junit4]   2> 4854 T1518 C111 UPDATE [collection1] webapp=/solr path=/update params={wt=javabin&version=2} {add=[195]} 0 0
[junit4:junit4]   2> 4857 T1517 C111 UPDATE [collection1] webapp=/solr path=/update params={wt=javabin&version=2} {add=[196]} 0 0
[junit4:junit4]   2> 4860 T1521 C111 UPDATE [collection1] webapp=/solr path=/update params={wt=javabin&version=2} {add=[197]} 0 0
[junit4:junit4]   2> 4863 T1520 C111 UPDATE [collection1] webapp=/solr path=/update params={wt=javabin&version=2} {add=[198]} 0 0
[junit4:junit4]   2> 4866 T1519 C111 UPDATE [collection1] webapp=/solr path=/update params={wt=javabin&version=2} {add=[199]} 0 0
[junit4:junit4]   2> 4869 T1516 C111 UPDATE [collection1] webapp=/solr path=/update params={wt=javabin&version=2} {add=[200]} 0 0
[junit4:junit4]   2> 4872 T1518 C111 UPDATE [collection1] webapp=/solr path=/update params={wt=javabin&version=2} {add=[201]} 0 0
[junit4:junit4]   2> 4876 T1517 C111 UPDATE [collection1] webapp=/solr path=/update params={wt=javabin&version=2} {add=[202]} 0 1
[junit4:junit4]   2> 4881 T1521 C111 UPDATE [collection1] webapp=/solr path=/update params={wt=javabin&version=2} {add=[203]} 0 0
[junit4:junit4]   2> 4885 T1520 C111 UPDATE [collection1] webapp=/solr path=/update params={wt=javabin&version=2} {add=[204]} 0 0
[junit4:junit4]   2> 4888 T1519 C111 UPDATE [collection1] webapp=/solr path=/update params={wt=javabin&version=2} {add=[205]} 0 0
[junit4:junit4]   2> 4891 T1516 C111 UPDATE [collection1] webapp=/solr path=/update params={wt=javabin&version=2} {add=[206]} 0 0
[junit4:junit4]   2> 4894 T1518 C111 UPDATE [collection1] webapp=/solr path=/update params={wt=javabin&version=2} {add=[207]} 0 0
[junit4:junit4]   2> 4898 T1517 C111 UPDATE [collection1] webapp=/solr path=/update params={wt=javabin&version=2} {add=[208]} 0 0
[junit4:junit4]   2> 4901 T1521 C111 UPDATE [collection1] webapp=/solr path=/update params={wt=javabin&version=2} {add=[209]} 0 0
[junit4:junit4]   2> 4904 T1520 C111 UPDATE [collection1] webapp=/solr path=/update params={wt=javabin&version=2} {add=[210]} 0 0
[junit4:junit4]   2> 4908 T1519 C111 UPDATE [collection1] webapp=/solr path=/update params={wt=javabin&version=2} {add=[211]} 0 0
[junit4:junit4]   2> 4912 T1516 C111 UPDATE [collection1] webapp=/solr path=/update params={wt=javabin&version=2} {add=[212]} 0 0
[junit4:junit4]   2> 4915 T1518 C111 UPDATE [collection1] webapp=/solr path=/update params={wt=javabin&version=2} {add=[213]} 0 0
[junit4:junit4]   2> 4918 T1517 C111 UPDATE [collection1] webapp=/solr path=/update params={wt=javabin&version=2} {add=[214]} 0 0
[junit4:junit4]   2> 4921 T1521 C111 UPDATE [collection1] webapp=/solr path=/update params={wt=javabin&version=2} {add=[215]} 0 0
[junit4:junit4]   2> 4925 T1520 C111 UPDATE [collection1] webapp=/solr path=/update params={wt=javabin&version=2} {add=[216]} 0 0
[junit4:junit4]   2> 4928 T1519 C111 UPDATE [collection1] webapp=/solr path=/update params={wt=javabin&version=2} {add=[217]} 0 0
[junit4:junit4]   2> 4931 T1516 C111 UPDATE [collection1] webapp=/solr path=/update params={wt=javabin&version=2} {add=[218]} 0 0
[junit4:junit4]   2> 4934 T1518 C111 UPDATE [collection1] webapp=/solr path=/update params={wt=javabin&version=2} {add=[219]} 0 0
[junit4:junit4]   2> 4938 T1517 C111 UPDATE [collection1] webapp=/solr path=/update params={wt=javabin&version=2} {add=[220]} 0 0
[junit4:junit4]   2> 4941 T1521 C111 UPDATE [collection1] webapp=/solr path=/update params={wt=javabin&version=2} {add=[221]} 0 0
[junit4:junit4]   2> 4944 T1520 C111 UPDATE [collection1] webapp=/solr path=/update params={wt=javabin&version=2} {add=[222]} 0 0
[junit4:junit4]   2> 4947 T1519 C111 UPDATE [collection1] webapp=/solr path=/update params={wt=javabin&version=2} {add=[223]} 0 0
[junit4:junit4]   2> 4950 T1516 C111 UPDATE [collection1] webapp=/solr path=/update params={wt=javabin&version=2} {add=[224]} 0 0
[junit4:junit4]   2> 4953 T1518 C111 UPDATE [collection1] webapp=/solr path=/update params={wt=javabin&version=2} {add=[225]} 0 0
[junit4:junit4]   2> 4956 T1517 C111 UPDATE [collection1] webapp=/solr path=/update params={wt=javabin&version=2} {add=[226]} 0 0
[junit4:junit4]   2> 4959 T1521 C111 UPDATE [collection1] webapp=/solr path=/update params={wt=javabin&version=2} {add=[227]} 0 0
[junit4:junit4]   2> 4962 T1520 C111 UPDATE [collection1] webapp=/solr path=/update params={wt=javabin&version=2} {add=[228]} 0 0
[junit4:junit4]   2> 4966 T1519 C111 UPDATE [collection1] webapp=/solr path=/update params={wt=javabin&version=2} {add=[229]} 0 0
[junit4:junit4]   2> 4969 T1516 C111 UPDATE [collection1] webapp=/solr path=/update params={wt=javabin&version=2} {add=[230]} 0 0
[junit4:junit4]   2> 4972 T1518 C111 UPDATE [collection1] webapp=/solr path=/update params={wt=javabin&version=2} {add=[231]} 0 0
[junit4:junit4]   2> 4975 T1517 C111 UPDATE [collection1] webapp=/solr path=/update params={wt=javabin&version=2} {add=[232]} 0 0
[junit4:junit4]   2> 4978 T1521 C111 UPDATE [collection1] webapp=/solr path=/update params={wt=javabin&version=2} {add=[233]} 0 0
[junit4:junit4]   2> 4981 T1520 C111 UPDATE [collection1] webapp=/solr path=/update params={wt=javabin&version=2} {add=[234]} 0 0
[junit4:junit4]   2> 4985 T1519 C111 UPDATE [collection1] webapp=/solr path=/update params={wt=javabin&version=2} {add=[235]} 0 1
[junit4:junit4]   2> 4988 T1516 C111 UPDATE [collection1] webapp=/solr path=/update params={wt=javabin&version=2} {add=[236]} 0 0
[junit4:junit4]   2> 4991 T1518 C111 UPDATE [collection1] webapp=/solr path=/update params={wt=javabin&version=2} {add=[237]} 0 0
[junit4:junit4]   2> 4995 T1517 C111 UPDATE [collection1] webapp=/solr path=/update params={wt=javabin&version=2} {add=[238]} 0 0
[junit4:junit4]   2> 4998 T1521 C111 UPDATE [collection1] webapp=/solr path=/update params={wt=javabin&version=2} {add=[239]} 0 0
[junit4:junit4]   2> 5002 T1520 C111 UPDATE [collection1] webapp=/solr path=/update params={wt=javabin&version=2} {add=[240]} 0 0
[junit4:junit4]   2> 5005 T1519 C111 UPDATE [collection1] webapp=/solr path=/update params={wt=javabin&version=2} {add=[241]} 0 0
[junit4:junit4]   2> 5008 T1516 C111 UPDATE [collection1] webapp=/solr path=/update params={wt=javabin&version=2} {add=[242]} 0 0
[junit4:junit4]   2> 5011 T1518 C111 UPDATE [collection1] webapp=/solr path=/update params={wt=javabin&version=2} {add=[243]} 0 0
[junit4:junit4]   2> 5015 T1517 C111 UPDATE [collection1] webapp=/solr path=/update params={wt=javabin&version=2} {add=[244]} 0 0
[junit4:junit4]   2> 5018 T1521 C111 UPDATE [collection1] webapp=/solr path=/update params={wt=javabin&version=2} {add=[245]} 0 0
[junit4:junit4]   2> 5022 T1520 C111 UPDATE [collection1] webapp=/solr path=/update params={wt=javabin&version=2} {add=[246]} 0 0
[junit4:junit4]   2> 5025 T1519 C111 UPDATE [collection1] webapp=/solr path=/update params={wt=javabin&version=2} {add=[247]} 0 0
[junit4:junit4]   2> 5028 T1516 C111 UPDATE [collection1] webapp=/solr path=/update params={wt=javabin&version=2} {add=[248]} 0 0
[junit4:junit4]   2> 5031 T1518 C111 UPDATE [collection1] webapp=/solr path=/update params={wt=javabin&version=2} {add=[249]} 0 0
[junit4:junit4]   2> 5034 T1517 C111 UPDATE [collection1] webapp=/solr path=/update params={wt=javabin&version=2} {add=[250]} 0 0
[junit4:junit4]   2> 5037 T1521 C111 UPDATE [collection1] webapp=/solr path=/update params={wt=javabin&version=2} {add=[251]} 0 0
[junit4:junit4]   2> 5040 T1520 C111 UPDATE [collection1] webapp=/solr path=/update params={wt=javabin&version=2} {add=[252]} 0 0
[junit4:junit4]   2> 5043 T1519 C111 UPDATE [collection1] webapp=/solr path=/update params={wt=javabin&version=2} {add=[253]} 0 0
[junit4:junit4]   2> 5046 T1516 C111 UPDATE [collection1] webapp=/solr path=/update params={wt=javabin&version=2} {add=[254]} 0 0
[junit4:junit4]   2> 5051 T1518 C111 UPDATE [collection1] webapp=/solr path=/update params={wt=javabin&version=2} {add=[255]} 0 1
[junit4:junit4]   2> 5055 T1517 C111 UPDATE [collection1] webapp=/solr path=/update params={wt=javabin&version=2} {add=[256]} 0 0
[junit4:junit4]   2> 5058 T1521 C111 UPDATE [collection1] webapp=/solr path=/update params={wt=javabin&version=2} {add=[257]} 0 0
[junit4:junit4]   2> 5061 T1520 C111 UPDATE [collection1] webapp=/solr path=/update params={wt=javabin&version=2} {add=[258]} 0 0
[junit4:junit4]   2> 5065 T1519 C111 UPDATE [collection1] webapp=/solr path=/update params={wt=javabin&version=2} {add=[259]} 0 0
[junit4:junit4]   2> 5068 T1516 C111 UPDATE [collection1] webapp=/solr path=/update params={wt=javabin&version=2} {add=[260]} 0 0
[junit4:junit4]   2> 5071 T1518 C111 UPDATE [collection1] webapp=/solr path=/update params={wt=javabin&version=2} {add=[261]} 0 0
[junit4:junit4]   2> 5074 T1517 C111 UPDATE [collection1] webapp=/solr path=/update params={wt=javabin&version=2} {add=[262]} 0 0
[junit4:junit4]   2> 5078 T1521 C111 UPDATE [collection1] webapp=/solr path=/update params={wt=javabin&version=2} {add=[263]} 0 0
[junit4:junit4]   2> 5082 T1520 C111 UPDATE [collection1] webapp=/solr path=/update params={wt=javabin&version=2} {add=[264]} 0 0
[junit4:junit4]   2> 5085 T1519 C111 UPDATE [collection1] webapp=/solr path=/update params={wt=javabin&version=2} {add=[265]} 0 0
[junit4:junit4]   2> 5088 T1516 C111 UPDATE [collection1] webapp=/solr path=/update params={wt=javabin&version=2} {add=[266]} 0 0
[junit4:junit4]   2> 5091 T1518 C111 UPDATE [collection1] webapp=/solr path=/update params={wt=javabin&version=2} {add=[267]} 0 0
[junit4:junit4]   2> 5094 T1517 C111 UPDATE [collection1] webapp=/solr path=/update params={wt=javabin&version=2} {add=[268]} 0 0
[junit4:junit4]   2> 5098 T1521 C111 UPDATE [collection1] webapp=/solr path=/update params={wt=javabin&version=2} {add=[269]} 0 0
[junit4:junit4]   2> 5102 T1520 C111 UPDATE [collection1] webapp=/solr path=/update params={wt=javabin&version=2} {add=[270]} 0 1
[junit4:junit4]   2> 5104 T1519 C111 UPDATE [collection1] webapp=/solr path=/update params={wt=javabin&version=2} {add=[271]} 0 0
[junit4:junit4]   2> 5109 T1516 C111 UPDATE [collection1] webapp=/solr path=/update params={wt=javabin&version=2} {add=[272]} 0 0
[junit4:junit4]   2> 5112 T1518 C111 UPDATE [collection1] webapp=/solr path=/update params={wt=javabin&version=2} {add=[273]} 0 0
[junit4:junit4]   2> 5115 T1517 C111 UPDATE [collection1] webapp=/solr path=/update params={wt=javabin&version=2} {add=[274]} 0 0
[junit4:junit4]   2> 5118 T1521 C111 UPDATE [collection1] webapp=/solr path=/update params={wt=javabin&version=2} {add=[275]} 0 0
[junit4:junit4]   2> 5122 T1520 C111 UPDATE [collection1] webapp=/solr path=/update params={wt=javabin&version=2} {add=[276]} 0 0
[junit4:junit4]   2> 5125 T1519 C111 UPDATE [collection1] webapp=/solr path=/update params={wt=javabin&version=2} {add=[277]} 0 0
[junit4:junit4]   2> 5128 T1516 C111 UPDATE [collection1] webapp=/solr path=/update params={wt=javabin&version=2} {add=[278]} 0 0
[junit4:junit4]   2> 5131 T1518 C111 UPDATE [collection1] webapp=/solr path=/update params={wt=javabin&version=2} {add=[279]} 0 0
[junit4:junit4]   2> 5135 T1517 C111 UPDATE [collection1] webapp=/solr path=/update params={wt=javabin&version=2} {add=[280]} 0 0
[junit4:junit4]   2> 5138 T1521 C111 UPDATE [collection1] webapp=/solr path=/update params={wt=javabin&version=2} {add=[281]} 0 0
[junit4:junit4]   2> 5141 T1520 C111 UPDATE [collection1] webapp=/solr path=/update params={wt=javabin&version=2} {add=[282]} 0 0
[junit4:junit4]   2> 5144 T1519 C111 UPDATE [collection1] webapp=/solr path=/update params={wt=javabin&version=2} {add=[283]} 0 0
[junit4:junit4]   2> 5147 T1518 C111 UPDATE [collection1] webapp=/solr path=/update params={wt=javabin&version=2} {add=[284]} 0 0
[junit4:junit4]   2> 5151 T1517 C111 UPDATE [collection1] webapp=/solr path=/update params={wt=javabin&version=2} {add=[285]} 0 0
[junit4:junit4]   2> 5154 T1521 C111 UPDATE [collection1] webapp=/solr path=/update params={wt=javabin&version=2} {add=[286]} 0 0
[junit4:junit4]   2> 5157 T1520 C111 UPDATE [collection1] webapp=/solr path=/update params={wt=javabin&version=2} {add=[287]} 0 0
[junit4:junit4]   2> 5160 T1516 C111 UPDATE [collection1] webapp=/solr path=/update params={wt=javabin&version=2} {add=[288]} 0 0
[junit4:junit4]   2> 5164 T1519 C111 UPDATE [collection1] webapp=/solr path=/update params={wt=javabin&version=2} {add=[289]} 0 0
[junit4:junit4]   2> 5167 T1518 C111 UPDATE [collection1] webapp=/solr path=/update params={wt=javabin&version=2} {add=[290]} 0 0
[junit4:junit4]   2> 5170 T1517 C111 UPDATE [collection1] webapp=/solr path=/update params={wt=javabin&version=2} {add=[291]} 0 0
[junit4:junit4]   2> 5173 T1521 C111 UPDATE [collection1] webapp=/solr path=/update params={wt=javabin&version=2} {add=[292]} 0 0
[junit4:junit4]   2> 5176 T1520 C111 UPDATE [collection1] webapp=/solr path=/update params={wt=javabin&version=2} {add=[293]} 0 0
[junit4:junit4]   2> 5180 T1516 C111 UPDATE [collection1] webapp=/solr path=/update params={wt=javabin&version=2} {add=[294]} 0 1
[junit4:junit4]   2> 5182 T1519 C111 UPDATE [collection1] webapp=/solr path=/update params={wt=javabin&version=2} {add=[295]} 0 0
[junit4:junit4]   2> 5186 T1518 C111 UPDATE [collection1] webapp=/solr path=/update params={wt=javabin&version=2} {add=[296]} 0 0
[junit4:junit4]   2> 5191 T1517 C111 UPDATE [collection1] webapp=/solr path=/update params={wt=javabin&version=2} {add=[297]} 0 0
[junit4:junit4]   2> 5194 T1521 C111 UPDATE [collection1] webapp=/solr path=/update params={wt=javabin&version=2} {add=[298]} 0 0
[junit4:junit4]   2> 5197 T1520 C111 UPDATE [collection1] webapp=/solr path=/update params={wt=javabin&version=2} {add=[299]} 0 0
[junit4:junit4]   2> 5200 T1516 C111 UPDATE [collection1] webapp=/solr path=/update params={wt=javabin&version=2} {add=[300]} 0 0
[junit4:junit4]   2> 5204 T1519 C111 UPDATE [collection1] webapp=/solr path=/update params={wt=javabin&version=2} {add=[301]} 0 0
[junit4:junit4]   2> 5207 T1518 C111 UPDATE [collection1] webapp=/solr path=/update params={wt=javabin&version=2} {add=[302]} 0 0
[junit4:junit4]   2> 5210 T1517 C111 UPDATE [collection1] webapp=/solr path=/update params={wt=javabin&version=2} {add=[303]} 0 0
[junit4:junit4]   2> 5213 T1521 C111 UPDATE [collection1] webapp=/solr path=/update params={wt=javabin&version=2} {add=[304]} 0 0
[junit4:junit4]   2> 5216 T1520 C111 UPDATE [collection1] webapp=/solr path=/update params={wt=javabin&version=2} {add=[305]} 0 0
[junit4:junit4]   2> 5220 T1516 C111 UPDATE [collection1] webapp=/solr path=/update params={wt=javabin&version=2} {add=[306]} 0 0
[junit4:junit4]   2> 5223 T1519 C111 UPDATE [collection1] webapp=/solr path=/update params={wt=javabin&version=2} {add=[307]} 0 0
[junit4:junit4]   2> 5226 T1518 C111 UPDATE [collection1] webapp=/solr path=/update params={wt=javabin&version=2} {add=[308]} 0 0
[junit4:junit4]   2> 5230 T1517 C111 UPDATE [collection1] webapp=/solr path=/update params={wt=javabin&version=2} {add=[309]} 0 0
[junit4:junit4]   2> 5233 T1521 C111 UPDATE [collection1] webapp=/solr path=/update params={wt=javabin&version=2} {add=[310]} 0 0
[junit4:junit4]   2> 5236 T1520 C111 UPDATE [collection1] webapp=/solr path=/update params={wt=javabin&version=2} {add=[311]} 0 0
[junit4:junit4]   2> 5240 T1516 C111 UPDATE [collection1] webapp=/solr path=/update params={wt=javabin&version=2} {add=[312]} 0 0
[junit4:junit4]   2> 5243 T1519 C111 UPDATE [collection1] webapp=/solr path=/update params={wt=javabin&version=2} {add=[313]} 0 0
[junit4:junit4]   2> 5247 T1518 C111 UPDATE [collection1] webapp=/solr path=/update params={wt=javabin&version=2} {add=[314]} 0 0
[junit4:junit4]   2> 5250 T1517 C111 UPDATE [collection1] webapp=/solr path=/update params={wt=javabin&version=2} {add=[315]} 0 0
[junit4:junit4]   2> 5253 T1521 C111 UPDATE [collection1] webapp=/solr path=/update params={wt=javabin&version=2} {add=[316]} 0 0
[junit4:junit4]   2> 5256 T1520 C111 UPDATE [collection1] webapp=/solr path=/update params={wt=javabin&version=2} {add=[317]} 0 0
[junit4:junit4]   2> 5259 T1516 C111 UPDATE [collection1] webapp=/solr path=/update params={wt=javabin&version=2} {add=[318]} 0 0
[junit4:junit4]   2> 5262 T1519 C111 UPDATE [collection1] webapp=/solr path=/update params={wt=javabin&version=2} {add=[319]} 0 0
[junit4:junit4]   2> 5265 T1518 C111 UPDATE [collection1] webapp=/solr path=/update params={wt=javabin&version=2} {add=[320]} 0 0
[junit4:junit4]   2> 5268 T1517 C111 UPDATE [collection1] webapp=/solr path=/update params={wt=javabin&version=2} {add=[321]} 0 0
[junit4:junit4]   2> 5271 T1521 C111 UPDATE [collection1] webapp=/solr path=/update params={wt=javabin&version=2} {add=[322]} 0 0
[junit4:junit4]   2> 5275 T1520 C111 UPDATE [collection1] webapp=/solr path=/update params={wt=javabin&version=2} {add=[323]} 0 0
[junit4:junit4]   2> 5279 T1516 C111 UPDATE [collection1] webapp=/solr path=/update params={wt=javabin&version=2} {add=[324]} 0 0
[junit4:junit4]   2> 5284 T1519 C111 UPDATE [collection1] webapp=/solr path=/update params={wt=javabin&version=2} {add=[325]} 0 0
[junit4:junit4]   2> 5286 T1518 C111 UPDATE [collection1] webapp=/solr path=/update params={wt=javabin&version=2} {add=[326]} 0 0
[junit4:junit4]   2> 5289 T1517 C111 UPDATE [collection1] webapp=/solr path=/update params={wt=javabin&version=2} {add=[327]} 0 0
[junit4:junit4]   2> 5292 T1521 C111 UPDATE [collection1] webapp=/solr path=/update params={wt=javabin&version=2} {add=[328]} 0 0
[junit4:junit4]   2> 5298 T1520 C111 UPDATE [collection1] webapp=/solr path=/update params={wt=javabin&version=2} {add=[329]} 0 0
[junit4:junit4]   2> 5303 T1516 C111 UPDATE [collection1] webapp=/solr path=/update params={wt=javabin&version=2} {add=[330]} 0 0
[junit4:junit4]   2> 5306 T1519 C111 UPDATE [collection1] webapp=/solr path=/update params={wt=javabin&version=2} {add=[331]} 0 0
[junit4:junit4]   2> 5310 T1518 C111 UPDATE [collection1] webapp=/solr path=/update params={wt=javabin&version=2} {add=[332]} 0 0
[junit4:junit4]   2> 5314 T1517 C111 UPDATE [collection1] webapp=/solr path=/update params={wt=javabin&version=2} {add=[333]} 0 0
[junit4:junit4]   2> 5317 T1521 C111 UPDATE [collection1] webapp=/solr path=/update params={wt=javabin&version=2} {add=[334]} 0 0
[junit4:junit4]   2> 5321 T1520 C111 UPDATE [collection1] webapp=/solr path=/update params={wt=javabin&version=2} {add=[335]} 0 0
[junit4:junit4]   2> 5324 T1516 C111 UPDATE [collection1] webapp=/solr path=/update params={wt=javabin&version=2} {add=[336]} 0 0
[junit4:junit4]   2> 5328 T1519 C111 UPDATE [collection1] webapp=/solr path=/update params={wt=javabin&version=2} {add=[337]} 0 0
[junit4:junit4]   2> 5332 T1518 C111 UPDATE [collection1] webapp=/solr path=/update params={wt=javabin&version=2} {add=[338]} 0 0
[junit4:junit4]   2> 5335 T1517 C111 UPDATE [collection1] webapp=/solr path=/update params={wt=javabin&version=2} {add=[339]} 0 0
[junit4:junit4]   2> 5340 T1521 C111 UPDATE [collection1] webapp=/solr path=/update params={wt=javabin&version=2} {add=[340]} 0 1
[junit4:junit4]   2> 5342 T1520 C111 UPDATE [collection1] webapp=/solr path=/update params={wt=javabin&version=2} {add=[341]} 0 0
[junit4:junit4]   2> 5347 T1516 C111 UPDATE [collection1] webapp=/solr path=/update params={wt=javabin&version=2} {add=[342]} 0 0
[junit4:junit4]   2> 5350 T1519 C111 UPDATE [collection1] webapp=/solr path=/update params={wt=javabin&version=2} {add=[343]} 0 0
[junit4:junit4]   2> 5353 T1518 C111 UPDATE [collection1] webapp=/solr path=/update params={wt=javabin&version=2} {add=[344]} 0 0
[junit4:junit4]   2> 5356 T1517 C111 UPDATE [collection1] webapp=/solr path=/update params={wt=javabin&version=2} {add=[345]} 0 0
[junit4:junit4]   2> 5360 T1521 C111 UPDATE [collection1] webapp=/solr path=/update params={wt=javabin&version=2} {add=[346]} 0 0
[junit4:junit4]   2> 5363 T1520 C111 UPDATE [collection1] webapp=/solr path=/update params={wt=javabin&version=2} {add=[347]} 0 0
[junit4:junit4]   2> 5366 T1516 C111 UPDATE [collection1] webapp=/solr path=/update params={wt=javabin&version=2} {add=[348]} 0 0
[junit4:junit4]   2> 5370 T1519 C111 UPDATE [collection1] webapp=/solr path=/update params={wt=javabin&version=2} {add=[349]} 0 0
[junit4:junit4]   2> 5373 T1518 C111 UPDATE [collection1] webapp=/solr path=/update params={wt=javabin&version=2} {add=[350]} 0 0
[junit4:junit4]   2> 5376 T1517 C111 UPDATE [collection1] webapp=/solr path=/update params={wt=javabin&version=2} {add=[351]} 0 0
[junit4:junit4]   2> 5379 T1521 C111 UPDATE [collection1] webapp=/solr path=/update params={wt=javabin&version=2} {add=[352]} 0 0
[junit4:junit4]   2> 5382 T1520 C111 UPDATE [collection1] webapp=/solr path=/update params={wt=javabin&version=2} {add=[353]} 0 0
[junit4:junit4]   2> 5385 T1516 C111 UPDATE [collection1] webapp=/solr path=/update params={wt=javabin&version=2} {add=[354]} 0 0
[junit4:junit4]   2> 5390 T1519 C111 UPDATE [collection1] webapp=/solr path=/update params={wt=javabin&version=2} {add=[355]} 0 0
[junit4:junit4]   2> 5392 T1518 C111 UPDATE [collection1] webapp=/solr path=/update params={wt=javabin&version=2} {add=[356]} 0 0
[junit4:junit4]   2> 5395 T1517 C111 UPDATE [collection1] webapp=/solr path=/update params={wt=javabin&version=2} {add=[357]} 0 0
[junit4:junit4]   2> 5399 T1521 C111 UPDATE [collection1] webapp=/solr path=/update params={wt=javabin&version=2} {add=[358]} 0 1
[junit4:junit4]   2> 5402 T1520 C111 UPDATE [collection1] webapp=/solr path=/update params={wt=javabin&version=2} {add=[359]} 0 0
[junit4:junit4]   2> 5405 T1516 C111 UPDATE [collection1] webapp=/solr path=/update params={wt=javabin&version=2} {add=[360]} 0 0
[junit4:junit4]   2> 5408 T1519 C111 UPDATE [collection1] webapp=/solr path=/update params={wt=javabin&version=2} {add=[361]} 0 0
[junit4:junit4]   2> 5411 T1518 C111 UPDATE [collection1] webapp=/solr path=/update params={wt=javabin&version=2} {add=[362]} 0 0
[junit4:junit4]   2> 5416 T1517 C111 UPDATE [collection1] webapp=/solr path=/update params={wt=javabin&version=2} {add=[363]} 0 0
[junit4:junit4]   2> 5419 T1521 C111 UPDATE [collection1] webapp=/solr path=/update params={wt=javabin&version=2} {add=[364]} 0 0
[junit4:junit4]   2> 5422 T1520 C111 UPDATE [collection1] webapp=/solr path=/update params={wt=javabin&version=2} {add=[365]} 0 0
[junit4:junit4]   2> 5428 T1516 C111 UPDATE [collection1] webapp=/solr path=/update params={wt=javabin&version=2} {add=[366]} 0 1
[junit4:junit4]   2> 5431 T1519 C111 UPDATE [collection1] webapp=/solr path=/update params={wt=javabin&version=2} {add=[367]} 0 0
[junit4:junit4]   2> 5434 T1518 C111 UPDATE [collection1] webapp=/solr path=/update params={wt=javabin&version=2} {add=[368]} 0 0
[junit4:junit4]   2> 5438 T1517 C111 UPDATE [collection1] webapp=/solr path=/update params={wt=javabin&version=2} {add=[369]} 0 0
[junit4:junit4]   2> 5441 T1521 C111 UPDATE [collection1] webapp=/solr path=/update params={wt=javabin&version=2} {add=[370]} 0 0
[junit4:junit4]   2> 5447 T1520 C111 UPDATE [collection1] webapp=/solr path=/update params={wt=javabin&version=2} {add=[371]} 0 1
[junit4:junit4]   2> 5451 T1516 C111 UPDATE [collection1] webapp=/solr path=/update params={wt=javabin&version=2} {add=[372]} 0 1
[junit4:junit4]   2> 5455 T1519 C111 UPDATE [collection1] webapp=/solr path=/update params={wt=javabin&version=2} {add=[373]} 0 1
[junit4:junit4]   2> 5460 T1518 C111 UPDATE [collection1] webapp=/solr path=/update params={wt=javabin&version=2} {add=[374]} 0 1
[junit4:junit4]   2> 5464 T1517 C111 UPDATE [collection1] webapp=/solr path=/update params={wt=javabin&version=2} {add=[375]} 0 0
[junit4:junit4]   2> 5467 T1521 C111 UPDATE [collection1] webapp=/solr path=/update params={wt=javabin&version=2} {add=[376]} 0 0
[junit4:junit4]   2> 5473 T1520 C111 UPDATE [collection1] webapp=/solr path=/update params={wt=javabin&version=2} {add=[377]} 0 0
[junit4:junit4]   2> 5476 T1516 C111 UPDATE [collection1] webapp=/solr path=/update params={wt=javabin&version=2} {add=[378]} 0 0
[junit4:junit4]   2> 5480 T1519 C111 UPDATE [collection1] webapp=/solr path=/update params={wt=javabin&version=2} {add=[379]} 0 0
[junit4:junit4]   2> 5484 T1518 C111 UPDATE [collection1] webapp=/solr path=/update params={wt=javabin&version=2} {add=[380]} 0 1
[junit4:junit4]   2> 5490 T1517 C111 UPDATE [collection1] webapp=/solr path=/update params={wt=javabin&version=2} {add=[381]} 0 1
[junit4:junit4]   2> 5495 T1521 C111 UPDATE [collection1] webapp=/solr path=/update params={wt=javabin&version=2} {add=[382]} 0 1
[junit4:junit4]   2> 5498 T1520 C111 UPDATE [collection1] webapp=/solr path=/update params={wt=javabin&version=2} {add=[383]} 0 0
[junit4:junit4]   2> 5504 T1516 C111 UPDATE [collection1] webapp=/solr path=/update params={wt=javabin&version=2} {add=[384]} 0 0
[junit4:junit4]   2> 5508 T1519 C111 UPDATE [collection1] webapp=/solr path=/update params={wt=javabin&version=2} {add=[385]} 0 0
[junit4:junit4]   2> 5511 T1518 C111 UPDATE [collection1] webapp=/solr path=/update params={wt=javabin&version=2} {add=[386]} 0 0
[junit4:junit4]   2> 5514 T1517 C111 UPDATE [collection1] webapp=/solr path=/update params={wt=javabin&version=2} {add=[387]} 0 0
[junit4:junit4]   2> 5517 T1521 C111 UPDATE [collection1] webapp=/solr path=/update params={wt=javabin&version=2} {add=[388]} 0 0
[junit4:junit4]   2> 5521 T1520 C111 UPDATE [collection1] webapp=/solr path=/update params={wt=javabin&version=2} {add=[389]} 0 0
[junit4:junit4]   2> 5526 T1516 C111 UPDATE [collection1] webapp=/solr path=/update params={wt=javabin&version=2} {add=[390]} 0 0
[junit4:junit4]   2> 5530 T1519 C111 UPDATE [collection1] webapp=/solr path=/update params={wt=javabin&version=2} {add=[391]} 0 0
[junit4:junit4]   2> 5534 T1518 C111 UPDATE [collection1] webapp=/solr path=/update params={wt=javabin&version=2} {add=[392]} 0 0
[junit4:junit4]   2> 5539 T1517 C111 UPDATE [collection1] webapp=/solr path=/update params={wt=javabin&version=2} {add=[393]} 0 0
[junit4:junit4]   2> 5543 T1521 C111 UPDATE [collection1] webapp=/solr path=/update params={wt=javabin&version=2} {add=[394]} 0 0
[junit4:junit4]   2> 5547 T1520 C111 UPDATE [collection1] webapp=/solr path=/update params={wt=javabin&version=2} {add=[395]} 0 0
[junit4:junit4]   2> 5552 T1519 C111 UPDATE [collection1] webapp=/solr path=/update params={wt=javabin&version=2} {add=[396]} 0 1
[junit4:junit4]   2> 5556 T1518 C111 UPDATE [collection1] webapp=/solr path=/update params={wt=javabin&version=2} {add=[397]} 0 0
[junit4:junit4]   2> 5559 T1517 C111 UPDATE [collection1] webapp=/solr path=/update params={wt=javabin&version=2} {add=[398]} 0 0
[junit4:junit4]   2> 5563 T1521 C111 UPDATE [collection1] webapp=/solr path=/update params={wt=javabin&version=2} {add=[399]} 0 0
[junit4:junit4]   2> 5566 T1516 C111 UPDATE [collection1] webapp=/solr path=/update params={wt=javabin&version=2} {add=[400]} 0 0
[junit4:junit4]   2> 5571 T1520 C111 UPDATE [collection1] webapp=/solr path=/update params={wt=javabin&version=2} {add=[401]} 0 0
[junit4:junit4]   2> 5576 T1519 C111 UPDATE [collection1] webapp=/solr path=/update params={wt=javabin&version=2} {add=[402]} 0 0
[junit4:junit4]   2> 5579 T1518 C111 UPDATE [collection1] webapp=/solr path=/update params={wt=javabin&version=2} {add=[403]} 0 0
[junit4:junit4]   2> 5584 T1517 C111 UPDATE [collection1] webapp=/solr path=/update params={wt=javabin&version=2} {add=[404]} 0 0
[junit4:junit4]   2> 5587 T1521 C111 UPDATE [collection1] webapp=/solr path=/update params={wt=javabin&version=2} {add=[405]} 0 0
[junit4:junit4]   2> 5590 T1516 C111 UPDATE [collection1] webapp=/solr path=/update params={wt=javabin&version=2} {add=[406]} 0 0
[junit4:junit4]   2> 5594 T1520 C111 UPDATE [collection1] webapp=/solr path=/update params={wt=javabin&version=2} {add=[407]} 0 0
[junit4:junit4]   2> 5599 T1519 C111 UPDATE [collection1] webapp=/solr path=/update params={wt=javabin&version=2} {add=[408]} 0 2
[junit4:junit4]   2> 5603 T1518 C111 UPDATE [collection1] webapp=/solr path=/update params={wt=javabin&version=2} {add=[409]} 0 0
[junit4:junit4]   2> 5610 T1517 C111 UPDATE [collection1] webapp=/solr path=/update params={wt=javabin&version=2} {add=[410]} 0 0
[junit4:junit4]   2> 5614 T1521 C111 UPDATE [collection1] webapp=/solr path=/update params={wt=javabin&version=2} {add=[411]} 0 0
[junit4:junit4]   2> 5621 T1516 C111 UPDATE [collection1] webapp=/solr path=/update params={wt=javabin&version=2} {add=[412]} 0 1
[junit4:junit4]   2> 5626 T1520 C111 UPDATE [collection1] webapp=/solr path=/update params={wt=javabin&version=2} {add=[413]} 0 0
[junit4:junit4]   2> 5629 T1519 C111 UPDATE [collection1] webapp=/solr path=/update params={wt=javabin&version=2} {add=[414]} 0 0
[junit4:junit4]   2> 5632 T1518 C111 UPDATE [collection1] webapp=/solr path=/update params={wt=javabin&version=2} {add=[415]} 0 0
[junit4:junit4]   2> 5635 T1517 C111 UPDATE [collection1] webapp=/solr path=/update params={wt=javabin&version=2} {add=[416]} 0 0
[junit4:junit4]   2> 5640 T1521 C111 UPDATE [collection1] webapp=/solr path=/update params={wt=javabin&version=2} {add=[417]} 0 0
[junit4:junit4]   2> 5645 T1516 C111 UPDATE [collection1] webapp=/solr path=/update params={wt=javabin&version=2} {add=[418]} 0 0
[junit4:junit4]   2> 5649 T1520 C111 UPDATE [collection1] webapp=/solr path=/update params={wt=javabin&version=2} {add=[419]} 0 0
[junit4:junit4]   2> 5654 T1519 C111 UPDATE [collection1] webapp=/solr path=/update params={wt=javabin&version=2} {add=[420]} 0 1
[junit4:junit4]   2> 5658 T1518 C111 UPDATE [collection1] webapp=/solr path=/update params={wt=javabin&version=2} {add=[421]} 0 0
[junit4:junit4]   2> 5661 T1517 C111 UPDATE [collection1] webapp=/solr path=/update params={wt=javabin&version=2} {add=[422]} 0 0
[junit4:junit4]   2> 5664 T1521 C111 UPDATE [collection1] webapp=/solr path=/update params={wt=javabin&version=2} {add=[423]} 0 0
[junit4:junit4]   2> 5669 T1516 C111 UPDATE [collection1] webapp=/solr path=/update params={wt=javabin&version=2} {add=[424]} 0 0
[junit4:junit4]   2> 5672 T1520 C111 UPDATE [collection1] webapp=/solr path=/update params={wt=javabin&version=2} {add=[425]} 0 0
[junit4:junit4]   2> 5675 T1519 C111 UPDATE [collection1] webapp=/solr path=/update params={wt=javabin&version=2} {add=[426]} 0 0
[junit4:junit4]   2> 5679 T1518 C111 UPDATE [collection1] webapp=/solr path=/update params={wt=javabin&version=2} {add=[427]} 0 1
[junit4:junit4]   2> 5682 T1517 C111 UPDATE [collection1] webapp=/solr path=/update params={wt=javabin&version=2} {add=[428]} 0 0
[junit4:junit4]   2> 5685 T1521 C111 UPDATE [collection1] webapp=/solr path=/update params={wt=javabin&version=2} {add=[429]} 0 0
[junit4:junit4]   2> 5688 T1516 C111 UPDATE [collection1] webapp=/solr path=/update params={wt=javabin&version=2} {add=[430]} 0 0
[junit4:junit4]   2> 5691 T1520 C111 UPDATE [collection1] webapp=/solr path=/update params={wt=javabin&version=2} {add=[431]} 0 0
[junit4:junit4]   2> 5694 T1519 C111 UPDATE [collection1] webapp=/solr path=/update params={wt=javabin&version=2} {add=[432]} 0 0
[junit4:junit4]   2> 5698 T1518 C111 UPDATE [collection1] webapp=/solr path=/update params={wt=javabin&version=2} {add=[433]} 0 0
[junit4:junit4]   2> 5701 T1517 C111 UPDATE [collection1] webapp=/solr path=/update params={wt=javabin&version=2} {add=[434]} 0 0
[junit4:junit4]   2> 5704 T1521 C111 UPDATE [collection1] webapp=/solr path=/update params={wt=javabin&version=2} {add=[435]} 0 0
[junit4:junit4]   2> 5707 T1516 C111 UPDATE [collection1] webapp=/solr path=/update params={wt=javabin&version=2} {add=[436]} 0 0
[junit4:junit4]   2> 5710 T1520 C111 UPDATE [collection1] webapp=/solr path=/update params={wt=javabin&version=2} {add=[437]} 0 0
[junit4:junit4]   2> 5711 T1519 C111 REQ [collection1] webapp=/solr path=/replication params={command=indexversion&wt=javabin&qt=/replication&version=2} status=0 QTime=0 
[junit4:junit4]   2> 5713 T1518 C111 UPDATE [collection1] webapp=/solr path=/update params={wt=javabin&version=2} {add=[438]} 0 0
[junit4:junit4]   2> 5716 T1517 C111 UPDATE [collection1] webapp=/solr path=/update params={wt=javabin&version=2} {add=[439]} 0 0
[junit4:junit4]   2> 5720 T1521 C111 UPDATE [collection1] webapp=/solr path=/update params={wt=javabin&version=2} {add=[440]} 0 0
[junit4:junit4]   2> 5724 T1516 C111 UPDATE [collection1] webapp=/solr path=/update params={wt=javabin&version=2} {add=[441]} 0 0
[junit4:junit4]   2> 5727 T1520 C111 UPDATE [collection1] webapp=/solr path=/update params={wt=javabin&version=2} {add=[442]} 0 0
[junit4:junit4]   2> 5731 T1519 C111 UPDATE [collection1] webapp=/solr path=/update params={wt=javabin&version=2} {add=[443]} 0 0
[junit4:junit4]   2> 5736 T1518 C111 UPDATE [collection1] webapp=/solr path=/update params={wt=javabin&version=2} {add=[444]} 0 1
[junit4:junit4]   2> 5741 T1517 C111 UPDATE [collection1] webapp=/solr path=/update params={wt=javabin&version=2} {add=[445]} 0 2
[junit4:junit4]   2> 5745 T1521 C111 UPDATE [collection1] webapp=/solr path=/update params={wt=javabin&version=2} {add=[446]} 0 0
[junit4:junit4]   2> 5750 T1516 C111 UPDATE [collection1] webapp=/solr path=/update params={wt=javabin&version=2} {add=[447]} 0 0
[junit4:junit4]   2> 5755 T1520 C111 UPDATE [collection1] webapp=/solr path=/update params={wt=javabin&version=2} {add=[448]} 0 0
[junit4:junit4]   2> 5759 T1519 C111 UPDATE [collection1] webapp=/solr path=/update params={wt=javabin&version=2} {add=[449]} 0 0
[junit4:junit4]   2> 5763 T1518 C111 UPDATE [collection1] webapp=/solr path=/update params={wt=javabin&version=2} {add=[450]} 0 0
[junit4:junit4]   2> 5771 T1517 C111 UPDATE [collection1] webapp=/solr path=/update params={wt=javabin&version=2} {add=[451]} 0 0
[junit4:junit4]   2> 5776 T1521 C111 UPDATE [collection1] webapp=/solr path=/update params={wt=javabin&version=2} {add=[452]} 0 0
[junit4:junit4]   2> 5781 T1516 C111 UPDATE [collection1] webapp=/solr path=/update params={wt=javabin&version=2} {add=[453]} 0 0
[junit4:junit4]   2> 5785 T1520 C111 UPDATE [collection1] webapp=/solr path=/update params={wt=javabin&version=2} {add=[454]} 0 0
[junit4:junit4]   2> 5788 T1519 C111 UPDATE [collection1] webapp=/solr path=/update params={wt=javabin&version=2} {add=[455]} 0 0
[junit4:junit4]   2> 5791 T1518 C111 UPDATE [collection1] webapp=/solr path=/update params={wt=javabin&version=2} {add=[456]} 0 0
[junit4:junit4]   2> 5794 T1517 C111 UPDATE [collection1] webapp=/solr path=/update params={wt=javabin&version=2} {add=[457]} 0 0
[junit4:junit4]   2> 5797 T1521 C111 UPDATE [collection1] webapp=/solr path=/update params={wt=javabin&version=2} {add=[458]} 0 0
[junit4:junit4]   2> 5810 T1516 C111 UPDATE [collection1] webapp=/solr path=/update params={wt=javabin&version=2} {add=[459]} 0 1
[junit4:junit4]   2> 5814 T1520 C111 UPDATE [collection1] webapp=/solr path=/update params={wt=javabin&version=2} {add=[460]} 0 0
[junit4:junit4]   2> 5818 T1519 C111 UPDATE [collection1] webapp=/solr path=/update params={wt=javabin&version=2} {add=[461]} 0 0
[junit4:junit4]   2> 5821 T1518 C111 UPDATE [collection1] webapp=/solr path=/update params={wt=javabin&version=2} {add=[462]

[...truncated too long message...]

:48)
[junit4:junit4]    > 	at org.apache.lucene.util.TestRuleIgnoreAfterMaxFailures$1.evaluate(TestRuleIgnoreAfterMaxFailures.java:70)
[junit4:junit4]    > 	at org.apache.lucene.util.TestRuleMarkFailure$1.evaluate(TestRuleMarkFailure.java:48)
[junit4:junit4]    > 	at com.carrotsearch.randomizedtesting.rules.StatementAdapter.evaluate(StatementAdapter.java:36)
[junit4:junit4]    > 	at com.carrotsearch.randomizedtesting.ThreadLeakControl$StatementRunner.run(ThreadLeakControl.java:358)
[junit4:junit4]    > 	at com.carrotsearch.randomizedtesting.ThreadLeakControl.forkTimeoutingTask(ThreadLeakControl.java:782)
[junit4:junit4]    > 	at com.carrotsearch.randomizedtesting.ThreadLeakControl$3.evaluate(ThreadLeakControl.java:442)
[junit4:junit4]    > 	at com.carrotsearch.randomizedtesting.RandomizedRunner.runSingleTest(RandomizedRunner.java:746)
[junit4:junit4]    > 	at com.carrotsearch.randomizedtesting.RandomizedRunner$3.evaluate(RandomizedRunner.java:648)
[junit4:junit4]    > 	at com.carrotsearch.randomizedtesting.RandomizedRunner$4.evaluate(RandomizedRunner.java:682)
[junit4:junit4]    > 	at com.carrotsearch.randomizedtesting.RandomizedRunner$5.evaluate(RandomizedRunner.java:693)
[junit4:junit4]    > 	at com.carrotsearch.randomizedtesting.rules.StatementAdapter.evaluate(StatementAdapter.java:36)
[junit4:junit4]    > 	at com.carrotsearch.randomizedtesting.rules.SystemPropertiesRestoreRule$1.evaluate(SystemPropertiesRestoreRule.java:53)
[junit4:junit4]    > 	at org.apache.lucene.util.AbstractBeforeAfterRule$1.evaluate(AbstractBeforeAfterRule.java:45)
[junit4:junit4]    > 	at org.apache.lucene.util.TestRuleStoreClassName$1.evaluate(TestRuleStoreClassName.java:42)
[junit4:junit4]    > 	at com.carrotsearch.randomizedtesting.rules.SystemPropertiesInvariantRule$1.evaluate(SystemPropertiesInvariantRule.java:55)
[junit4:junit4]    > 	at com.carrotsearch.randomizedtesting.rules.NoShadowingOrOverridesOnMethodsRule$1.evaluate(NoShadowingOrOverridesOnMethodsRule.java:39)
[junit4:junit4]    > 	at com.carrotsearch.randomizedtesting.rules.NoShadowingOrOverridesOnMethodsRule$1.evaluate(NoShadowingOrOverridesOnMethodsRule.java:39)
[junit4:junit4]    > 	at com.carrotsearch.randomizedtesting.rules.StatementAdapter.evaluate(StatementAdapter.java:36)
[junit4:junit4]    > 	at org.apache.lucene.util.TestRuleAssertionsRequired$1.evaluate(TestRuleAssertionsRequired.java:43)
[junit4:junit4]    > 	at org.apache.lucene.util.TestRuleMarkFailure$1.evaluate(TestRuleMarkFailure.java:48)
[junit4:junit4]    > 	at org.apache.lucene.util.TestRuleIgnoreAfterMaxFailures$1.evaluate(TestRuleIgnoreAfterMaxFailures.java:70)
[junit4:junit4]    > 	at org.apache.lucene.util.TestRuleIgnoreTestSuites$1.evaluate(TestRuleIgnoreTestSuites.java:55)
[junit4:junit4]    > 	at com.carrotsearch.randomizedtesting.rules.StatementAdapter.evaluate(StatementAdapter.java:36)
[junit4:junit4]    > 	at com.carrotsearch.randomizedtesting.ThreadLeakControl$StatementRunner.run(ThreadLeakControl.java:358)
[junit4:junit4]    > 	at java.lang.Thread.run(Thread.java:662)
[junit4:junit4]   2> 31145 T3686 oas.SolrTestCaseJ4.deleteCore ###deleteCore
[junit4:junit4]   2> NOTE: test params are: codec=Lucene41: {range_facet_l=PostingsFormat(name=Asserting), text=MockFixedIntBlock(blockSize=146), _version_=PostingsFormat(name=Asserting), rnd_b=PostingsFormat(name=Lucene41WithOrds), intDefault=PostingsFormat(name=Asserting), id=PostingsFormat(name=Lucene41WithOrds), timestamp=PostingsFormat(name=Asserting), a_t=PostingsFormat(name=Asserting), range_facet_sl=MockFixedIntBlock(blockSize=146), range_facet_si=PostingsFormat(name=Memory doPackFST= false), other_tl1=PostingsFormat(name=Asserting), multiDefault=PostingsFormat(name=Memory doPackFST= false), a_si=PostingsFormat(name=Memory doPackFST= false)}, sim=RandomSimilarityProvider(queryNorm=true,coord=crazy): {}, locale=ar_SY, timezone=Etc/GMT+1
[junit4:junit4]   2> NOTE: Windows 7 6.1 amd64/Sun Microsystems Inc. 1.6.0_35 (64-bit)/cpus=2,threads=1,free=154557896,total=355688448
[junit4:junit4]   2> NOTE: All tests run in this JVM: [SuggesterWFSTTest, TestCodecSupport, DateMathParserTest, TestIndexSearcher, BadComponentTest, DistributedTermsComponentTest, DirectSolrSpellCheckerTest, TestDistributedGrouping, CircularListTest, TestDistributedSearch, LukeRequestHandlerTest, TestPseudoReturnFields, OutputWriterTest, TestIndexingPerformance, TestDocSet, TestFastLRUCache, IndexSchemaRuntimeFieldTest, DOMUtilTest, ConvertedLegacyTest, TestSolr4Spatial, DisMaxRequestHandlerTest, SampleTest, TestCSVResponseWriter, TestDocumentBuilder, SolrCmdDistributorTest, PeerSyncTest, UniqFieldsUpdateProcessorFactoryTest, BasicFunctionalityTest, TestElisionMultitermQuery, NoCacheHeaderTest, TestDefaultSimilarityFactory, SimpleFacetsTest, SOLR749Test, DefaultValueUpdateProcessorTest, TermVectorComponentDistributedTest, TestJoin, ResourceLoaderTest, TestFunctionQuery, TestPerFieldSimilarity, TestRTGBase, TestSurroundQueryParser, TestSolrXMLSerializer, TestConfig, TestStressReorder, SpatialFilterTest, SpellCheckCollatorTest, QueryElevationComponentTest, BadIndexSchemaTest, CurrencyFieldTest, NumericFieldsTest, PrimUtilsTest, TestWordDelimiterFilterFactory, DistanceFunctionTest, TestStressVersions, CSVRequestHandlerTest, RAMDirectoryFactoryTest, TestStressLucene, TestLuceneMatchVersion, DebugComponentTest, TestAnalyzedSuggestions, LegacyHTMLStripCharFilterTest, TestExtendedDismaxParser, SimplePostToolTest, TestDFRSimilarityFactory, FileBasedSpellCheckerTest, ZkSolrClientTest, OpenExchangeRatesOrgProviderTest, TestFaceting, SpellingQueryConverterTest, ReturnFieldsTest, SearchHandlerTest, TestFastWriter, TestWriterPerf, TestSolrDeletionPolicy1, TestOmitPositions, AlternateDirectoryTest, TestSolrCoreProperties, TestCoreContainer, TestNumberUtils, TestBadConfig, TestRealTimeGet, DistributedSpellCheckComponentTest, TestXIncludeConfig, SolrInfoMBeanTest, SolrRequestParserTest, SignatureUpdateProcessorFactoryTest, TestSolrIndexConfig, TestFastOutputStream, SystemInfoHandlerTest, HighlighterConfigTest, TestValueSourceCache, TestMergePolicyConfig, TestSolrQueryParser, SolrCoreCheckLockOnStartupTest, ZkControllerTest, RequiredFieldsTest, CoreAdminHandlerTest, BasicZkTest, FieldMutatingUpdateProcessorTest, TestReplicationHandler, DirectUpdateHandlerTest, TestQueryTypes, TestPHPSerializedResponseWriter, ClusterStateUpdateTest, DocumentBuilderTest, JSONWriterTest, SuggesterFSTTest, ShowFileRequestHandlerTest, PrimitiveFieldTypeTest, SortByFunctionTest, TestFiltering, BasicDistributedZkTest, OverseerTest, RecoveryZkTest, SpellCheckComponentTest, FullSolrCloudDistribCmdsTest, LeaderElectionIntegrationTest, LeaderElectionTest, TestRandomFaceting, SoftAutoCommitTest, AutoCommitTest, WordBreakSolrSpellCheckerTest, TestHashPartitioner, StatsComponentTest, TestRecovery, SolrCoreTest, IndexBasedSpellCheckerTest, TestRangeQuery, TestMultiCoreConfBootstrap, TestSort, TestGroupingSearch, TestBinaryResponseWriter, TestJmxIntegration, HighlighterTest, TestTrie, DirectSolrConnectionTest, TestRemoteStreaming, CacheHeaderTest, QueryEqualityTest, TestCSVLoader, PolyFieldTest, MoreLikeThisHandlerTest, MBeansHandlerTest, DistributedQueryElevationComponentTest, IndexSchemaTest, BinaryUpdateRequestHandlerTest, QueryParsingTest, TermsComponentTest, XsltUpdateRequestHandlerTest, MinimalSchemaTest, StandardRequestHandlerTest, XmlUpdateRequestHandlerTest, FieldAnalysisRequestHandlerTest, PingRequestHandlerTest, TermVectorComponentTest, JsonLoaderTest, DocumentAnalysisRequestHandlerTest, DirectUpdateHandlerOptimizeTest, SolrPluginUtilsTest, FastVectorHighlighterTest, TestReversedWildcardFilterFactory, RequestHandlersTest, CopyFieldTest, TestArbitraryIndexDir, TestQueryUtils, LoggingHandlerTest, SuggesterTSTTest, UpdateParamsTest, SuggesterTest, TestSearchPerf, NotRequiredUniqueKeyTest, TestFoldingMultitermQuery, UpdateRequestProcessorFactoryTest, TestPropInject, TestUpdate, TestBinaryField, TestSolrDeletionPolicy2, TestPropInjectDefaults, TestLFUCache, TestQuerySenderListener, TestCollationField, SolrIndexConfigTest, TestQuerySenderNoQuery, IndexReaderFactoryTest, MultiTermTest, TestJmxMonitoredMap, EchoParamsTest, SpellPossibilityIteratorTest, TestBM25SimilarityFactory, TestPhraseSuggestions, TestLMDirichletSimilarityFactory, TestPluginEnable, TestLMJelinekMercerSimilarityFactory, TestIBSimilarityFactory, TimeZoneUtilsTest, URLClassifyProcessorTest, PluginInfoTest, FileUtilsTest, TestSystemIdResolver, DateFieldTest, TestSuggestSpellingConverter, TestLRUCache, UUIDFieldTest, TestUtils, PreAnalyzedFieldTest, ZkNodePropsTest, AnalysisAfterCoreReloadTest, PathHierarchyTokenizerFactoryTest, TestCharFilters, BasicDistributedZk2Test, ClusterStateTest, SyncSliceTest]
[junit4:junit4] Completed in 31.17s, 1 test, 1 failure <<< FAILURES!

[...truncated 39 lines...]
BUILD FAILED
C:\Users\JenkinsSlave\workspace\Lucene-Solr-trunk-Windows\build.xml:335: The following error occurred while executing this line:
C:\Users\JenkinsSlave\workspace\Lucene-Solr-trunk-Windows\build.xml:39: The following error occurred while executing this line:
C:\Users\JenkinsSlave\workspace\Lucene-Solr-trunk-Windows\solr\build.xml:178: The following error occurred while executing this line:
C:\Users\JenkinsSlave\workspace\Lucene-Solr-trunk-Windows\lucene\module-build.xml:61: The following error occurred while executing this line:
C:\Users\JenkinsSlave\workspace\Lucene-Solr-trunk-Windows\lucene\common-build.xml:1159: The following error occurred while executing this line:
C:\Users\JenkinsSlave\workspace\Lucene-Solr-trunk-Windows\lucene\common-build.xml:827: There were test failures: 232 suites, 961 tests, 2 suite-level errors, 2 failures, 12 ignored (7 assumptions)

Total time: 38 minutes 37 seconds
Build step 'Invoke Ant' marked build as failure
Archiving artifacts
Recording test results
Description set: Java: 64bit/jdk1.6.0_35 -XX:+UseSerialGC
Email was triggered for: Failure
Sending email for trigger: Failure



Mime
View raw message