lucene-dev mailing list archives

Site index · List index
Message view « Date » · « Thread »
Top « Date » · « Thread »
From Charlie Cron <hudsonsevilt...@gmail.com>
Subject Build failed in Jenkins: slow-io-beasting #4998
Date Sun, 28 Oct 2012 16:21:47 GMT
See <http://sierranevada.servebeer.com:8080/job/slow-io-beasting/4998/>

------------------------------------------
[...truncated 479927 lines...]
[junit4:junit4]   2> 1050031 T245 oazs.NIOServerCnxn.closeSock Closed socket connection
for client /127.0.0.1:50577 which had sessionid 0x13aa81b3d080003
[junit4:junit4]   2> 1050031 T247 oazs.NIOServerCnxn$Factory.run NIOServerCnxn factory
exited run method
[junit4:junit4]   2> 1050031 T278 oaz.ClientCnxn$SendThread.run Unable to read additional
data from server sessionid 0x13aa81b3d080003, likely server has closed socket, closing socket
connection and attempting reconnect
[junit4:junit4]   2> 1050031 T245 oazs.FinalRequestProcessor.shutdown shutdown of request
processor complete
[junit4:junit4]   2> 1050031 T245 oasc.ChaosMonkey.monkeyLog monkey: stop shard! 50539
[junit4:junit4]   2> 1050031 T245 oasc.CoreContainer.shutdown Shutting down CoreContainer
instance=21770149
[junit4:junit4]   2> 1050031 T245 oasc.SolrCore.close [collection1]  CLOSING SolrCore org.apache.solr.core.SolrCore@1b0a038
[junit4:junit4]   2> 1050031 T245 oasu.DirectUpdateHandler2.close closing DirectUpdateHandler2{commits=0,autocommits=0,soft
autocommits=0,optimizes=0,rollbacks=0,expungeDeletes=0,docsPending=35881,adds=35881,deletesById=17662,deletesByQuery=0,errors=0,cumulative_adds=35881,cumulative_deletesById=17662,cumulative_deletesByQuery=0,cumulative_errors=0}
[junit4:junit4]   2> 1050031 T245 oasc.SolrCore.decrefSolrCoreState Closing SolrCoreState
[junit4:junit4]   2> 1050031 T245 oasu.DefaultSolrCoreState.closeIndexWriter SolrCoreState
ref count has reached 0 - closing IndexWriter
[junit4:junit4]   2> 1050031 T245 oasu.DefaultSolrCoreState.closeIndexWriter closing IndexWriter
with IndexWriterCloser
[junit4:junit4]   2> 1050140 T279 oascc.ConnectionManager.process Watcher org.apache.solr.common.cloud.ConnectionManager@b285b6
name:ZooKeeperConnection Watcher:127.0.0.1:50523/solr got event WatchedEvent state:Disconnected
type:None path:null path:null type:None
[junit4:junit4]   2> 1050140 T265 oascc.ConnectionManager.process Watcher org.apache.solr.common.cloud.ConnectionManager@114069b
name:ZooKeeperConnection Watcher:127.0.0.1:50523/solr got event WatchedEvent state:Disconnected
type:None path:null path:null type:None
[junit4:junit4]   2> 1050140 T338 oascc.ConnectionManager.process Watcher org.apache.solr.common.cloud.ConnectionManager@13c470b
name:ZooKeeperConnection Watcher:127.0.0.1:50523/solr got event WatchedEvent state:Disconnected
type:None path:null path:null type:None
[junit4:junit4]   2> 1050140 T279 oascc.ConnectionManager.process zkClient has disconnected
[junit4:junit4]   2> 1050140 T265 oascc.ConnectionManager.process zkClient has disconnected
[junit4:junit4]   2> 1050140 T338 oascc.ConnectionManager.process zkClient has disconnected
[junit4:junit4]   2> 1050494 T245 C13 P50539 oasc.SolrDeletionPolicy.onCommit SolrDeletionPolicy.onCommit:
commits:num=2
[junit4:junit4]   2> 		commit{dir=NRTCachingDirectory(org.apache.lucene.store.SimpleFSDirectory@<http://sierranevada.servebeer.com:8080/job/slow-io-beasting/ws/solr/build/solr-core/test/J2/org.apache.solr.cloud.RecoveryZkTest-1351440088296/control/data/index>
lockFactory=org.apache.lucene.store.NativeFSLockFactory@8a8b07; maxCacheMB=48.0 maxMergeSizeMB=4.0),segFN=segments_1,generation=1,filenames=[segments_1]
[junit4:junit4]   2> 		commit{dir=NRTCachingDirectory(org.apache.lucene.store.SimpleFSDirectory@<http://sierranevada.servebeer.com:8080/job/slow-io-beasting/ws/solr/build/solr-core/test/J2/org.apache.solr.cloud.RecoveryZkTest-1351440088296/control/data/index>
lockFactory=org.apache.lucene.store.NativeFSLockFactory@8a8b07; maxCacheMB=48.0 maxMergeSizeMB=4.0),segFN=segments_2,generation=2,filenames=[_35t.fdx,
_34t.fdt, _35t.fdt, _34t.fnm, _1c9_1.del, _2zo_Lucene40_0.prx, _2pe_1.del, _2kb.fnm, _1c9.fnm,
_2zo.fnm, _34t_nrm.cfe, _34t_Lucene40_0.tim, _34t_Lucene40_0.tip, _35r.fdx, _35r.fdt, _1c9.si,
_35u.si, _34t_nrm.cfs, _35r_Lucene40_0.prx, _35q.fnm, _35v_nrm.cfs, _35t.si, _35u_Lucene40_0.prx,
_2kb.fdx, _35q.si, _2kb.fdt, _35q_Lucene40_0.prx, _35u_nrm.cfe, _1c9_Lucene40_0.frq, _34t_1.del,
_2uk.si, _2uk_Lucene40_0.frq, _34t.fdx, _35t_Lucene40_0.tim, _35t.fnm, _35u_Lucene40_0.frq,
_35t_Lucene40_0.tip, _35s_nrm.cfs, _35v_Lucene40_0.prx, _2zo_1.del, _2kb_Lucene40_0.frq, _35q_Lucene40_0.frq,
_35v.fdx, _35s_nrm.cfe, _35v.fdt, _2zo_nrm.cfs, _34t_Lucene40_0.frq, _2uk_1.del, _2kb_nrm.cfe,
_35q.fdx, _2zo_Lucene40_0.frq, _35t_Lucene40_0.prx, _35q.fdt, _2zo.fdx, _2zo_nrm.cfe, _2zo.fdt,
_35r.fnm, _2pe.fdt, _2pe_Lucene40_0.frq, _2kb_nrm.cfs, _2pe.fdx, _35u_Lucene40_0.tip, _2kb.si,
_2pe_Lucene40_0.tip, _2uk.fdx, _35u_Lucene40_0.tim, _35u.fnm, _2uk_Lucene40_0.tip, _2pe_Lucene40_0.tim,
_1c9.fdt, _2kb_Lucene40_0.tip, _2uk.fdt, _1c9.fdx, _35v_Lucene40_0.tip, _35t_Lucene40_0.frq,
_1c9_Lucene40_0.prx, _35v_Lucene40_0.tim, _35q_nrm.cfs, _35r_Lucene40_0.tip, _35s_Lucene40_0.prx,
_35s.fdt, _2zo.si, _35r_Lucene40_0.frq, _35s.fdx, _2kb_Lucene40_0.tim, _35r_Lucene40_0.tim,
_35q_nrm.cfe, _2uk_Lucene40_0.tim, _35v.si, _2pe.fnm, _2zo_Lucene40_0.tim, _2pe_Lucene40_0.prx,
_35s_Lucene40_0.tip, _35s.si, _2zo_Lucene40_0.tip, _2kb_Lucene40_0.prx, _35v_Lucene40_0.frq,
_2uk_Lucene40_0.prx, _35q_Lucene40_0.tip, _35s_Lucene40_0.tim, _35q_Lucene40_0.tim, _35u.fdt,
_35t_nrm.cfs, _2pe.si, _35t_nrm.cfe, _2pe_nrm.cfs, _35u_nrm.cfs, _35s_Lucene40_0.frq, _35v_nrm.cfe,
_35v.fnm, _2pe_nrm.cfe, _35r_nrm.cfe, _35r.si, _2uk.fnm, _1c9_nrm.cfs, _2kb_1.del, _2uk_nrm.cfs,
_34t.si, _35s.fnm, _35r_nrm.cfs, _1c9_Lucene40_0.tip, _1c9_Lucene40_0.tim, _34t_Lucene40_0.prx,
_1c9_nrm.cfe, segments_2, _35u.fdx, _2uk_nrm.cfe]
[junit4:junit4]   2> 1050495 T245 C13 P50539 oasc.SolrDeletionPolicy.updateCommits newest
commit = 2
[junit4:junit4]   2> 1050528 T245 C13 P50539 oasc.SolrDeletionPolicy.onCommit SolrDeletionPolicy.onCommit:
commits:num=2
[junit4:junit4]   2> 		commit{dir=NRTCachingDirectory(org.apache.lucene.store.SimpleFSDirectory@<http://sierranevada.servebeer.com:8080/job/slow-io-beasting/ws/solr/build/solr-core/test/J2/org.apache.solr.cloud.RecoveryZkTest-1351440088296/control/data/index>
lockFactory=org.apache.lucene.store.NativeFSLockFactory@8a8b07; maxCacheMB=48.0 maxMergeSizeMB=4.0),segFN=segments_2,generation=2,filenames=[_35t.fdx,
_34t.fdt, _35t.fdt, _34t.fnm, _1c9_1.del, _2zo_Lucene40_0.prx, _2pe_1.del, _2kb.fnm, _1c9.fnm,
_2zo.fnm, _34t_nrm.cfe, _34t_Lucene40_0.tim, _34t_Lucene40_0.tip, _35r.fdx, _35r.fdt, _1c9.si,
_35u.si, _34t_nrm.cfs, _35r_Lucene40_0.prx, _35q.fnm, _35v_nrm.cfs, _35t.si, _35u_Lucene40_0.prx,
_2kb.fdx, _35q.si, _2kb.fdt, _35q_Lucene40_0.prx, _35u_nrm.cfe, _1c9_Lucene40_0.frq, _34t_1.del,
_2uk.si, _2uk_Lucene40_0.frq, _34t.fdx, _35t_Lucene40_0.tim, _35t.fnm, _35u_Lucene40_0.frq,
_35t_Lucene40_0.tip, _35s_nrm.cfs, _35v_Lucene40_0.prx, _2zo_1.del, _2kb_Lucene40_0.frq, _35q_Lucene40_0.frq,
_35v.fdx, _35s_nrm.cfe, _35v.fdt, _2zo_nrm.cfs, _34t_Lucene40_0.frq, _2uk_1.del, _2kb_nrm.cfe,
_35q.fdx, _2zo_Lucene40_0.frq, _35t_Lucene40_0.prx, _35q.fdt, _2zo.fdx, _2zo_nrm.cfe, _2zo.fdt,
_35r.fnm, _2pe.fdt, _2pe_Lucene40_0.frq, _2kb_nrm.cfs, _2pe.fdx, _35u_Lucene40_0.tip, _2kb.si,
_2pe_Lucene40_0.tip, _2uk.fdx, _35u_Lucene40_0.tim, _35u.fnm, _2uk_Lucene40_0.tip, _2pe_Lucene40_0.tim,
_1c9.fdt, _2kb_Lucene40_0.tip, _2uk.fdt, _1c9.fdx, _35v_Lucene40_0.tip, _35t_Lucene40_0.frq,
_1c9_Lucene40_0.prx, _35v_Lucene40_0.tim, _35q_nrm.cfs, _35r_Lucene40_0.tip, _35s_Lucene40_0.prx,
_35s.fdt, _2zo.si, _35r_Lucene40_0.frq, _35s.fdx, _2kb_Lucene40_0.tim, _35r_Lucene40_0.tim,
_35q_nrm.cfe, _2uk_Lucene40_0.tim, _35v.si, _2pe.fnm, _2zo_Lucene40_0.tim, _2pe_Lucene40_0.prx,
_35s_Lucene40_0.tip, _35s.si, _2zo_Lucene40_0.tip, _2kb_Lucene40_0.prx, _35v_Lucene40_0.frq,
_2uk_Lucene40_0.prx, _35q_Lucene40_0.tip, _35s_Lucene40_0.tim, _35q_Lucene40_0.tim, _35u.fdt,
_35t_nrm.cfs, _2pe.si, _35t_nrm.cfe, _2pe_nrm.cfs, _35u_nrm.cfs, _35s_Lucene40_0.frq, _35v_nrm.cfe,
_35v.fnm, _2pe_nrm.cfe, _35r_nrm.cfe, _35r.si, _2uk.fnm, _1c9_nrm.cfs, _2kb_1.del, _2uk_nrm.cfs,
_34t.si, _35s.fnm, _35r_nrm.cfs, _1c9_Lucene40_0.tip, _1c9_Lucene40_0.tim, _34t_Lucene40_0.prx,
_1c9_nrm.cfe, segments_2, _35u.fdx, _2uk_nrm.cfe]
[junit4:junit4]   2> 		commit{dir=NRTCachingDirectory(org.apache.lucene.store.SimpleFSDirectory@<http://sierranevada.servebeer.com:8080/job/slow-io-beasting/ws/solr/build/solr-core/test/J2/org.apache.solr.cloud.RecoveryZkTest-1351440088296/control/data/index>
lockFactory=org.apache.lucene.store.NativeFSLockFactory@8a8b07; maxCacheMB=48.0 maxMergeSizeMB=4.0),segFN=segments_3,generation=3,filenames=[_2kb.si,
_35u_Lucene40_0.tip, _1c9.fdt, _35u.fnm, _35u_Lucene40_0.tim, _2kb_Lucene40_0.tip, _1c9_1.del,
_1c9.fdx, _35v_Lucene40_0.tip, _1c9_Lucene40_0.prx, _35v_Lucene40_0.tim, _2kb.fnm, _1c9.fnm,
_35w_nrm.cfe, _2kb_Lucene40_0.tim, _1c9.si, _35u.si, _35v_nrm.cfs, _35u_Lucene40_0.prx, _35v.si,
_2kb.fdx, _2kb.fdt, _35u_nrm.cfe, _2kb_Lucene40_0.prx, _1c9_Lucene40_0.frq, _35w_Lucene40_0.prx,
_35v_Lucene40_0.frq, _35w.fnm, _35u.fdt, _35w_Lucene40_0.tip, _35u_Lucene40_0.frq, _35w_Lucene40_0.tim,
_35u_nrm.cfs, _35v_Lucene40_0.prx, _2kb_Lucene40_0.frq, _35v_nrm.cfe, _35v.fnm, _35w.fdt,
_35v.fdx, _35v.fdt, _1c9_nrm.cfs, _35w.fdx, _35w.si, _2kb_nrm.cfe, _2kb_1.del, _35w_nrm.cfs,
_35w_Lucene40_0.frq, _1c9_Lucene40_0.tip, _1c9_Lucene40_0.tim, _1c9_nrm.cfe, _2kb_nrm.cfs,
_35u.fdx, segments_3]
[junit4:junit4]   2> 1050529 T245 C13 P50539 oasc.SolrDeletionPolicy.updateCommits newest
commit = 3
[junit4:junit4]   2> 1050588 T245 oasc.SolrCore.closeSearcher [collection1] Closing main
searcher on request.
[junit4:junit4]   2> 1050588 T266 oasc.Overseer$ClusterStateUpdater.amILeader According
to ZK I (id=88567977628663810-127.0.0.1:50539_solr-n_0000000000) am no longer a leader.
[junit4:junit4]   2> 1051621 T264 oaz.ClientCnxn$SendThread.startConnect Opening socket
connection to server 127.0.0.1/127.0.0.1:50523
[junit4:junit4]   2> 1052058 T278 oaz.ClientCnxn$SendThread.startConnect Opening socket
connection to server 127.0.0.1/127.0.0.1:50523
[junit4:junit4]   2> 1052136 T337 oaz.ClientCnxn$SendThread.startConnect Opening socket
connection to server 127.0.0.1/127.0.0.1:50523
[junit4:junit4]   2> 1052728 T265 oaz.ClientCnxn$EventThread.run EventThread shut down
[junit4:junit4]   2> 1052728 T245 oaz.ZooKeeper.close Session: 0x13aa81b3d080002 closed
[junit4:junit4]   2> 1052744 T245 oejsh.ContextHandler.doStop stopped o.e.j.s.ServletContextHandler{/solr,null}
[junit4:junit4]   2> 1052795 T245 oasc.ChaosMonkey.monkeyLog monkey: stop shard! 50572
[junit4:junit4]   2> 1052795 T245 oasc.CoreContainer.shutdown Shutting down CoreContainer
instance=25667076
[junit4:junit4]   2> 1053138 T337 oaz.ClientCnxn$SendThread.run WARNING Session 0x13aa81b3d080007
for server null, unexpected error, closing socket connection and attempting reconnect java.net.ConnectException:
Connection refused: no further information
[junit4:junit4]   2> 	at sun.nio.ch.SocketChannelImpl.checkConnect(Native Method)
[junit4:junit4]   2> 	at sun.nio.ch.SocketChannelImpl.finishConnect(SocketChannelImpl.java:567)
[junit4:junit4]   2> 	at org.apache.zookeeper.ClientCnxn$SendThread.run(ClientCnxn.java:1143)
[junit4:junit4]   2> 
[junit4:junit4]   2> 1053169 T279 oaz.ClientCnxn$EventThread.run EventThread shut down
[junit4:junit4]   2> 1053169 T245 oaz.ZooKeeper.close Session: 0x13aa81b3d080003 closed
[junit4:junit4]   2> 1053185 T245 oejsh.ContextHandler.doStop stopped o.e.j.s.ServletContextHandler{/solr,null}
[junit4:junit4]   2> 1053236 T245 oasc.ChaosMonkey.monkeyLog monkey: stop shard! 51311
[junit4:junit4]   2> 1053236 T245 oasc.CoreContainer.shutdown Shutting down CoreContainer
instance=22157425
[junit4:junit4]   2> 1053236 T245 oasc.SolrCore.close [collection1]  CLOSING SolrCore org.apache.solr.core.SolrCore@180f3e6
[junit4:junit4]   2> 1053267 T245 oasu.DirectUpdateHandler2.close closing DirectUpdateHandler2{commits=0,autocommits=0,soft
autocommits=0,optimizes=0,rollbacks=0,expungeDeletes=0,docsPending=26098,adds=26098,deletesById=12885,deletesByQuery=0,errors=0,cumulative_adds=26098,cumulative_deletesById=12885,cumulative_deletesByQuery=0,cumulative_errors=0}
[junit4:junit4]   2> 1053267 T245 oasc.SolrCore.decrefSolrCoreState Closing SolrCoreState
[junit4:junit4]   2> 1053267 T245 oasu.DefaultSolrCoreState.closeIndexWriter SolrCoreState
ref count has reached 0 - closing IndexWriter
[junit4:junit4]   2> 1053267 T245 oasu.DefaultSolrCoreState.closeIndexWriter closing IndexWriter
with IndexWriterCloser
[junit4:junit4]   2> 1053688 T245 C14 P51311 oasc.SolrDeletionPolicy.onCommit SolrDeletionPolicy.onCommit:
commits:num=2
[junit4:junit4]   2> 		commit{dir=NRTCachingDirectory(org.apache.lucene.store.SimpleFSDirectory@<http://sierranevada.servebeer.com:8080/job/slow-io-beasting/ws/solr/build/solr-core/test/J2/org.apache.solr.cloud.RecoveryZkTest-1351440088296/jetty2/index>
lockFactory=org.apache.lucene.store.NativeFSLockFactory@530306; maxCacheMB=48.0 maxMergeSizeMB=4.0),segFN=segments_1,generation=1,filenames=[segments_1]
[junit4:junit4]   2> 		commit{dir=NRTCachingDirectory(org.apache.lucene.store.SimpleFSDirectory@<http://sierranevada.servebeer.com:8080/job/slow-io-beasting/ws/solr/build/solr-core/test/J2/org.apache.solr.cloud.RecoveryZkTest-1351440088296/jetty2/index>
lockFactory=org.apache.lucene.store.NativeFSLockFactory@530306; maxCacheMB=48.0 maxMergeSizeMB=4.0),segFN=segments_2,generation=2,filenames=[_1a2.fnm,
_1f5_1.del, _1zx_Lucene40_0.frq, _1f5_Lucene40_0.prx, _1us_nrm.cfe, _2as_Lucene40_0.frq, _1ka.si,
_1zx_Lucene40_0.tim, _1pn_Lucene40_0.prx, _1zx_Lucene40_0.tip, _2ao_Lucene40_0.prx, _1f5_nrm.cfs,
_252_Lucene40_0.prx, _1us_nrm.cfs, _1ka_Lucene40_0.prx, _2a7_1.del, _1a2_nrm.cfe, _2aq_Lucene40_0.tim,
_2a7_Lucene40_0.tim, _2aq_nrm.cfe, _1ka_Lucene40_0.tip, _2aq_nrm.cfs, _1ka_Lucene40_0.tim,
_2ar_nrm.cfe, _1f5_nrm.cfe, _2ar.fnm, _1a2_nrm.cfs, _2aq_Lucene40_0.tip, _2ao_Lucene40_0.frq,
_2aq.fdt, _2ap_nrm.cfs, _1a2_1.del, _2aq.fdx, _1f5.si, _1pn_1.del, _1f5.fnm, _2ar_nrm.cfs,
_2ap.fnm, _2ap_nrm.cfe, _2a7_Lucene40_0.tip, _2ap_Lucene40_0.tip, _1f5_Lucene40_0.frq, _2aq_Lucene40_0.frq,
_2ao_nrm.cfe, _1us_Lucene40_0.prx, _2ap_Lucene40_0.tim, _1zx.fnm, _2aq.fnm, _2ap.fdt, _2ap.fdx,
_1us_Lucene40_0.tim, _1a2.fdx, _1us_Lucene40_0.tip, _1a2.fdt, _1zx_nrm.cfe, _2ar.fdt, _1ka_nrm.cfs,
_2ap_Lucene40_0.prx, _1us.fdt, _252.si, _1zx_nrm.cfs, _2ar.fdx, _1us.fdx, _1ka_nrm.cfe, _1a2.si,
_2a7.fnm, _2a7.fdt, _1zx_Lucene40_0.prx, _2aq.si, _2a7.fdx, _1ka.fnm, _2ao_Lucene40_0.tim,
_2as.fdt, _1f5.fdt, _2as.si, _1f5.fdx, _2ao_Lucene40_0.tip, _1pn.fnm, _2as_Lucene40_0.prx,
_1us_1.del, _1a2_Lucene40_0.tim, _2as.fdx, _1ka.fdt, _1a2_Lucene40_0.tip, _2ap_Lucene40_0.frq,
_1ka.fdx, _1us_Lucene40_0.frq, _1ka_1.del, _1f5_Lucene40_0.tim, _1zx_1.del, _2ao_nrm.cfs,
_2ar_Lucene40_0.frq, _252_nrm.cfe, _1f5_Lucene40_0.tip, _1us.fnm, _1pn.si, _2ar_Lucene40_0.tip,
_2ar_Lucene40_0.tim, _2ap.si, _252_Lucene40_0.tim, _1a2_Lucene40_0.prx, _252_Lucene40_0.tip,
_252_1.del, _252_nrm.cfs, _2aq_Lucene40_0.prx, _1a2_Lucene40_0.frq, _252.fnm, _1zx.si, _2as.fnm,
_2as_nrm.cfe, _1us.si, _2as_Lucene40_0.tip, _2ar.si, _2as_Lucene40_0.tim, _2ao.fdx, _2as_nrm.cfs,
_2ar_Lucene40_0.prx, _2ao.fdt, _1pn_Lucene40_0.frq, _2ao.fnm, _1pn_Lucene40_0.tip, _1pn_nrm.cfe,
_1pn_Lucene40_0.tim, _2a7_nrm.cfe, _2a7.si, _2ao.si, _1pn_nrm.cfs, _1zx.fdt, _252.fdx, _2a7_Lucene40_0.prx,
_1zx.fdx, _252.fdt, _2a7_nrm.cfs, _1pn.fdx, segments_2, _1ka_Lucene40_0.frq, _1pn.fdt, _252_Lucene40_0.frq,
_2a7_Lucene40_0.frq]
[junit4:junit4]   2> 1053688 T245 C14 P51311 oasc.SolrDeletionPolicy.updateCommits newest
commit = 2
[junit4:junit4]   2> 1053720 T245 C14 P51311 oasc.SolrDeletionPolicy.onCommit SolrDeletionPolicy.onCommit:
commits:num=2
[junit4:junit4]   2> 		commit{dir=NRTCachingDirectory(org.apache.lucene.store.SimpleFSDirectory@<http://sierranevada.servebeer.com:8080/job/slow-io-beasting/ws/solr/build/solr-core/test/J2/org.apache.solr.cloud.RecoveryZkTest-1351440088296/jetty2/index>
lockFactory=org.apache.lucene.store.NativeFSLockFactory@530306; maxCacheMB=48.0 maxMergeSizeMB=4.0),segFN=segments_2,generation=2,filenames=[_1a2.fnm,
_1f5_1.del, _1zx_Lucene40_0.frq, _1f5_Lucene40_0.prx, _1us_nrm.cfe, _2as_Lucene40_0.frq, _1ka.si,
_1zx_Lucene40_0.tim, _1pn_Lucene40_0.prx, _1zx_Lucene40_0.tip, _2ao_Lucene40_0.prx, _1f5_nrm.cfs,
_252_Lucene40_0.prx, _1us_nrm.cfs, _1ka_Lucene40_0.prx, _2a7_1.del, _1a2_nrm.cfe, _2aq_Lucene40_0.tim,
_2a7_Lucene40_0.tim, _2aq_nrm.cfe, _1ka_Lucene40_0.tip, _2aq_nrm.cfs, _1ka_Lucene40_0.tim,
_2ar_nrm.cfe, _1f5_nrm.cfe, _2ar.fnm, _1a2_nrm.cfs, _2aq_Lucene40_0.tip, _2ao_Lucene40_0.frq,
_2aq.fdt, _2ap_nrm.cfs, _1a2_1.del, _2aq.fdx, _1f5.si, _1pn_1.del, _1f5.fnm, _2ar_nrm.cfs,
_2ap.fnm, _2ap_nrm.cfe, _2a7_Lucene40_0.tip, _2ap_Lucene40_0.tip, _1f5_Lucene40_0.frq, _2aq_Lucene40_0.frq,
_2ao_nrm.cfe, _1us_Lucene40_0.prx, _2ap_Lucene40_0.tim, _1zx.fnm, _2aq.fnm, _2ap.fdt, _2ap.fdx,
_1us_Lucene40_0.tim, _1a2.fdx, _1us_Lucene40_0.tip, _1a2.fdt, _1zx_nrm.cfe, _2ar.fdt, _1ka_nrm.cfs,
_2ap_Lucene40_0.prx, _1us.fdt, _252.si, _1zx_nrm.cfs, _2ar.fdx, _1us.fdx, _1ka_nrm.cfe, _1a2.si,
_2a7.fnm, _2a7.fdt, _1zx_Lucene40_0.prx, _2aq.si, _2a7.fdx, _1ka.fnm, _2ao_Lucene40_0.tim,
_2as.fdt, _1f5.fdt, _2as.si, _1f5.fdx, _2ao_Lucene40_0.tip, _1pn.fnm, _2as_Lucene40_0.prx,
_1us_1.del, _1a2_Lucene40_0.tim, _2as.fdx, _1ka.fdt, _1a2_Lucene40_0.tip, _2ap_Lucene40_0.frq,
_1ka.fdx, _1us_Lucene40_0.frq, _1ka_1.del, _1f5_Lucene40_0.tim, _1zx_1.del, _2ao_nrm.cfs,
_2ar_Lucene40_0.frq, _252_nrm.cfe, _1f5_Lucene40_0.tip, _1us.fnm, _1pn.si, _2ar_Lucene40_0.tip,
_2ar_Lucene40_0.tim, _2ap.si, _252_Lucene40_0.tim, _1a2_Lucene40_0.prx, _252_Lucene40_0.tip,
_252_1.del, _252_nrm.cfs, _2aq_Lucene40_0.prx, _1a2_Lucene40_0.frq, _252.fnm, _1zx.si, _2as.fnm,
_2as_nrm.cfe, _1us.si, _2as_Lucene40_0.tip, _2ar.si, _2as_Lucene40_0.tim, _2ao.fdx, _2as_nrm.cfs,
_2ar_Lucene40_0.prx, _2ao.fdt, _1pn_Lucene40_0.frq, _2ao.fnm, _1pn_Lucene40_0.tip, _1pn_nrm.cfe,
_1pn_Lucene40_0.tim, _2a7_nrm.cfe, _2a7.si, _2ao.si, _1pn_nrm.cfs, _1zx.fdt, _252.fdx, _2a7_Lucene40_0.prx,
_1zx.fdx, _252.fdt, _2a7_nrm.cfs, _1pn.fdx, segments_2, _1ka_Lucene40_0.frq, _1pn.fdt, _252_Lucene40_0.frq,
_2a7_Lucene40_0.frq]
[junit4:junit4]   2> 		commit{dir=NRTCachingDirectory(org.apache.lucene.store.SimpleFSDirectory@<http://sierranevada.servebeer.com:8080/job/slow-io-beasting/ws/solr/build/solr-core/test/J2/org.apache.solr.cloud.RecoveryZkTest-1351440088296/jetty2/index>
lockFactory=org.apache.lucene.store.NativeFSLockFactory@530306; maxCacheMB=48.0 maxMergeSizeMB=4.0),segFN=segments_3,generation=3,filenames=[_1a2.fnm,
_2as.fdt, _2at.fnm, _2as.si, _2as_Lucene40_0.frq, _2as_Lucene40_0.prx, _1a2_Lucene40_0.tim,
_2as.fdx, _1a2_Lucene40_0.tip, _2ap_Lucene40_0.frq, _1a2_nrm.cfe, _2at_Lucene40_0.tip, _2aq_Lucene40_0.tim,
_2aq_nrm.cfe, _2at_Lucene40_0.tim, _2aq_nrm.cfs, _2ar_nrm.cfe, _2ar_Lucene40_0.frq, _2ar.fnm,
_1a2_nrm.cfs, _2aq_Lucene40_0.tip, _2aq.fdt, _2ap_nrm.cfs, _1a2_1.del, _2aq.fdx, _2ar_Lucene40_0.tip,
_2ap.si, _2ar_Lucene40_0.tim, _2ar_nrm.cfs, _1a2_Lucene40_0.prx, _2ap.fnm, _2ap_nrm.cfe, _2aq_Lucene40_0.prx,
_1a2_Lucene40_0.frq, _2at_Lucene40_0.prx, _2as.fnm, _2ap_Lucene40_0.tip, _2as_nrm.cfe, _2aq_Lucene40_0.frq,
_2as_Lucene40_0.tip, _2ar.si, _2ap_Lucene40_0.tim, _2as_Lucene40_0.tim, _2as_nrm.cfs, _2aq.fnm,
_2ar_Lucene40_0.prx, _2ap.fdt, _2at_Lucene40_0.frq, _2ap.fdx, _1a2.fdx, _2at.si, _2at.fdt,
_1a2.fdt, _2at_nrm.cfe, _2ar.fdt, _2ap_Lucene40_0.prx, _2ar.fdx, _1a2.si, _2at.fdx, _2aq.si,
_2at_nrm.cfs, segments_3]
[junit4:junit4]   2> 1053735 T245 C14 P51311 oasc.SolrDeletionPolicy.updateCommits newest
commit = 3
[junit4:junit4]   2> 1053782 T245 oasc.SolrCore.closeSearcher [collection1] Closing main
searcher on request.
[junit4:junit4]   2> 1054624 T337 oaz.ClientCnxn$SendThread.startConnect Opening socket
connection to server 127.0.0.1/127.0.0.1:50523
[junit4:junit4]   2> 1055748 T338 oaz.ClientCnxn$EventThread.run EventThread shut down
[junit4:junit4]   2> 1055748 T245 oaz.ZooKeeper.close Session: 0x13aa81b3d080007 closed
[junit4:junit4]   2> 1055763 T245 oejsh.ContextHandler.doStop stopped o.e.j.s.ServletContextHandler{/solr,null}
[junit4:junit4]   2> 1056079 T245 oas.SolrTestCaseJ4.tearDown ###Ending testDistribSearch
[junit4:junit4]   2> NOTE: reproduce with: ant test  -Dtestcase=RecoveryZkTest -Dtests.method=testDistribSearch
-Dtests.seed=7BB9EFAE0923C062 -Dtests.slow=true -Dtests.locale=fr_BE -Dtests.timezone=Africa/Mogadishu
-Dtests.file.encoding=UTF-8
[junit4:junit4] FAILURE 1056s J2 | RecoveryZkTest.testDistribSearch <<<
[junit4:junit4]    > Throwable #1: java.lang.AssertionError: There are still nodes recoverying
[junit4:junit4]    > 	at __randomizedtesting.SeedInfo.seed([7BB9EFAE0923C062:FA5F61B67E7CA05E]:0)
[junit4:junit4]    > 	at org.junit.Assert.fail(Assert.java:93)
[junit4:junit4]    > 	at org.apache.solr.cloud.AbstractDistribZkTestBase.waitForRecoveriesToFinish(AbstractDistribZkTestBase.java:154)
[junit4:junit4]    > 	at org.apache.solr.cloud.AbstractDistribZkTestBase.waitForRecoveriesToFinish(AbstractDistribZkTestBase.java:115)
[junit4:junit4]    > 	at org.apache.solr.cloud.RecoveryZkTest.doTest(RecoveryZkTest.java:75)
[junit4:junit4]    > 	at org.apache.solr.BaseDistributedSearchTestCase.testDistribSearch(BaseDistributedSearchTestCase.java:695)
[junit4:junit4]    > 	at sun.reflect.NativeMethodAccessorImpl.invoke0(Native Method)
[junit4:junit4]    > 	at sun.reflect.NativeMethodAccessorImpl.invoke(NativeMethodAccessorImpl.java:39)
[junit4:junit4]    > 	at sun.reflect.DelegatingMethodAccessorImpl.invoke(DelegatingMethodAccessorImpl.java:25)
[junit4:junit4]    > 	at java.lang.reflect.Method.invoke(Method.java:597)
[junit4:junit4]    > 	at com.carrotsearch.randomizedtesting.RandomizedRunner.invoke(RandomizedRunner.java:1559)
[junit4:junit4]    > 	at com.carrotsearch.randomizedtesting.RandomizedRunner.access$600(RandomizedRunner.java:79)
[junit4:junit4]    > 	at com.carrotsearch.randomizedtesting.RandomizedRunner$6.evaluate(RandomizedRunner.java:737)
[junit4:junit4]    > 	at com.carrotsearch.randomizedtesting.RandomizedRunner$7.evaluate(RandomizedRunner.java:773)
[junit4:junit4]    > 	at com.carrotsearch.randomizedtesting.RandomizedRunner$8.evaluate(RandomizedRunner.java:787)
[junit4:junit4]    > 	at com.carrotsearch.randomizedtesting.rules.SystemPropertiesRestoreRule$1.evaluate(SystemPropertiesRestoreRule.java:53)
[junit4:junit4]    > 	at org.apache.lucene.util.TestRuleSetupTeardownChained$1.evaluate(TestRuleSetupTeardownChained.java:50)
[junit4:junit4]    > 	at org.apache.lucene.util.TestRuleFieldCacheSanity$1.evaluate(TestRuleFieldCacheSanity.java:51)
[junit4:junit4]    > 	at org.apache.lucene.util.AbstractBeforeAfterRule$1.evaluate(AbstractBeforeAfterRule.java:45)
[junit4:junit4]    > 	at com.carrotsearch.randomizedtesting.rules.SystemPropertiesInvariantRule$1.evaluate(SystemPropertiesInvariantRule.java:55)
[junit4:junit4]    > 	at org.apache.lucene.util.TestRuleThreadAndTestName$1.evaluate(TestRuleThreadAndTestName.java:48)
[junit4:junit4]    > 	at org.apache.lucene.util.TestRuleIgnoreAfterMaxFailures$1.evaluate(TestRuleIgnoreAfterMaxFailures.java:70)
[junit4:junit4]    > 	at org.apache.lucene.util.TestRuleMarkFailure$1.evaluate(TestRuleMarkFailure.java:48)
[junit4:junit4]    > 	at com.carrotsearch.randomizedtesting.rules.StatementAdapter.evaluate(StatementAdapter.java:36)
[junit4:junit4]    > 	at com.carrotsearch.randomizedtesting.ThreadLeakControl$StatementRunner.run(ThreadLeakControl.java:358)
[junit4:junit4]    > 	at com.carrotsearch.randomizedtesting.ThreadLeakControl.forkTimeoutingTask(ThreadLeakControl.java:782)
[junit4:junit4]    > 	at com.carrotsearch.randomizedtesting.ThreadLeakControl$3.evaluate(ThreadLeakControl.java:442)
[junit4:junit4]    > 	at com.carrotsearch.randomizedtesting.RandomizedRunner.runSingleTest(RandomizedRunner.java:746)
[junit4:junit4]    > 	at com.carrotsearch.randomizedtesting.RandomizedRunner$3.evaluate(RandomizedRunner.java:648)
[junit4:junit4]    > 	at com.carrotsearch.randomizedtesting.RandomizedRunner$4.evaluate(RandomizedRunner.java:682)
[junit4:junit4]    > 	at com.carrotsearch.randomizedtesting.RandomizedRunner$5.evaluate(RandomizedRunner.java:693)
[junit4:junit4]    > 	at com.carrotsearch.randomizedtesting.rules.StatementAdapter.evaluate(StatementAdapter.java:36)
[junit4:junit4]    > 	at com.carrotsearch.randomizedtesting.rules.SystemPropertiesRestoreRule$1.evaluate(SystemPropertiesRestoreRule.java:53)
[junit4:junit4]    > 	at org.apache.lucene.util.AbstractBeforeAfterRule$1.evaluate(AbstractBeforeAfterRule.java:45)
[junit4:junit4]    > 	at org.apache.lucene.util.TestRuleStoreClassName$1.evaluate(TestRuleStoreClassName.java:42)
[junit4:junit4]    > 	at com.carrotsearch.randomizedtesting.rules.SystemPropertiesInvariantRule$1.evaluate(SystemPropertiesInvariantRule.java:55)
[junit4:junit4]    > 	at com.carrotsearch.randomizedtesting.rules.NoShadowingOrOverridesOnMethodsRule$1.evaluate(NoShadowingOrOverridesOnMethodsRule.java:39)
[junit4:junit4]    > 	at com.carrotsearch.randomizedtesting.rules.NoShadowingOrOverridesOnMethodsRule$1.evaluate(NoShadowingOrOverridesOnMethodsRule.java:39)
[junit4:junit4]    > 	at com.carrotsearch.randomizedtesting.rules.StatementAdapter.evaluate(StatementAdapter.java:36)
[junit4:junit4]    > 	at org.apache.lucene.util.TestRuleAssertionsRequired$1.evaluate(TestRuleAssertionsRequired.java:43)
[junit4:junit4]    > 	at org.apache.lucene.util.TestRuleMarkFailure$1.evaluate(TestRuleMarkFailure.java:48)
[junit4:junit4]    > 	at org.apache.lucene.util.TestRuleIgnoreAfterMaxFailures$1.evaluate(TestRuleIgnoreAfterMaxFailures.java:70)
[junit4:junit4]    > 	at org.apache.lucene.util.TestRuleIgnoreTestSuites$1.evaluate(TestRuleIgnoreTestSuites.java:55)
[junit4:junit4]    > 	at com.carrotsearch.randomizedtesting.rules.StatementAdapter.evaluate(StatementAdapter.java:36)
[junit4:junit4]    > 	at com.carrotsearch.randomizedtesting.ThreadLeakControl$StatementRunner.run(ThreadLeakControl.java:358)
[junit4:junit4]    > 	at java.lang.Thread.run(Thread.java:662)
[junit4:junit4]   2> 1056126 T245 oas.SolrTestCaseJ4.deleteCore ###deleteCore
[junit4:junit4]   2> 1178820 T245 oas.SolrTestCaseJ4.endTrackingSearchers SEVERE ERROR:
SolrIndexSearcher opens=4 closes=3
[junit4:junit4]   2> 1178820 T244 ccr.ThreadLeakControl.checkThreadLeaks WARNING Will linger
awaiting termination of 1 leaked thread(s).
[junit4:junit4]   2> 1198975 T244 ccr.ThreadLeakControl.checkThreadLeaks SEVERE 1 thread
leaked from SUITE scope at org.apache.solr.cloud.RecoveryZkTest: 
[junit4:junit4]   2> 	   1) Thread[id=280, name=searcherExecutor-122-thread-1, state=WAITING,
group=TGRP-RecoveryZkTest]
[junit4:junit4]   2> 	        at sun.misc.Unsafe.park(Native Method)
[junit4:junit4]   2> 	        at java.util.concurrent.locks.LockSupport.park(LockSupport.java:158)
[junit4:junit4]   2> 	        at java.util.concurrent.locks.AbstractQueuedSynchronizer$ConditionObject.await(AbstractQueuedSynchronizer.java:1987)
[junit4:junit4]   2> 	        at java.util.concurrent.LinkedBlockingQueue.take(LinkedBlockingQueue.java:399)
[junit4:junit4]   2> 	        at java.util.concurrent.ThreadPoolExecutor.getTask(ThreadPoolExecutor.java:947)
[junit4:junit4]   2> 	        at java.util.concurrent.ThreadPoolExecutor$Worker.run(ThreadPoolExecutor.java:907)
[junit4:junit4]   2> 	        at java.lang.Thread.run(Thread.java:662)
[junit4:junit4]   2> 1198975 T244 ccr.ThreadLeakControl.tryToInterruptAll Starting to interrupt
leaked threads:
[junit4:junit4]   2> 	   1) Thread[id=280, name=searcherExecutor-122-thread-1, state=WAITING,
group=TGRP-RecoveryZkTest]
[junit4:junit4]   2> 1202064 T244 ccr.ThreadLeakControl.tryToInterruptAll SEVERE There
are still zombie threads that couldn't be terminated:
[junit4:junit4]   2> 	   1) Thread[id=280, name=searcherExecutor-122-thread-1, state=WAITING,
group=TGRP-RecoveryZkTest]
[junit4:junit4]   2> 	        at sun.misc.Unsafe.park(Native Method)
[junit4:junit4]   2> 	        at java.util.concurrent.locks.LockSupport.park(LockSupport.java:158)
[junit4:junit4]   2> 	        at java.util.concurrent.locks.AbstractQueuedSynchronizer$ConditionObject.await(AbstractQueuedSynchronizer.java:1987)
[junit4:junit4]   2> 	        at java.util.concurrent.LinkedBlockingQueue.take(LinkedBlockingQueue.java:399)
[junit4:junit4]   2> 	        at java.util.concurrent.ThreadPoolExecutor.getTask(ThreadPoolExecutor.java:947)
[junit4:junit4]   2> 	        at java.util.concurrent.ThreadPoolExecutor$Worker.run(ThreadPoolExecutor.java:907)
[junit4:junit4]   2> 	        at java.lang.Thread.run(Thread.java:662)
[junit4:junit4]   2> NOTE: test params are: codec=Lucene40, sim=RandomSimilarityProvider(queryNorm=false,coord=crazy):
{}, locale=fr_BE, timezone=Africa/Mogadishu
[junit4:junit4]   2> NOTE: Windows Vista 6.0 x86/Sun Microsystems Inc. 1.6.0_23 (32-bit)/cpus=4,threads=3,free=32560752,total=61292544
[junit4:junit4]   2> NOTE: All tests run in this JVM: [AnalysisAfterCoreReloadTest, TestQueryUtils,
BasicDistributedZk2Test, SuggesterWFSTTest, RecoveryZkTest]
[junit4:junit4]   2> NOTE: reproduce with: ant test  -Dtestcase=RecoveryZkTest -Dtests.seed=7BB9EFAE0923C062
-Dtests.slow=true -Dtests.locale=fr_BE -Dtests.timezone=Africa/Mogadishu -Dtests.file.encoding=UTF-8
[junit4:junit4] ERROR   0.00s J2 | RecoveryZkTest (suite) <<<
[junit4:junit4]    > Throwable #1: java.lang.AssertionError: ERROR: SolrIndexSearcher opens=4
closes=3
[junit4:junit4]    > 	at __randomizedtesting.SeedInfo.seed([7BB9EFAE0923C062]:0)
[junit4:junit4]    > 	at org.junit.Assert.fail(Assert.java:93)
[junit4:junit4]    > 	at org.apache.solr.SolrTestCaseJ4.endTrackingSearchers(SolrTestCaseJ4.java:242)
[junit4:junit4]    > 	at org.apache.solr.SolrTestCaseJ4.afterClass(SolrTestCaseJ4.java:97)
[junit4:junit4]    > 	at sun.reflect.NativeMethodAccessorImpl.invoke0(Native Method)
[junit4:junit4]    > 	at sun.reflect.NativeMethodAccessorImpl.invoke(NativeMethodAccessorImpl.java:39)
[junit4:junit4]    > 	at sun.reflect.DelegatingMethodAccessorImpl.invoke(DelegatingMethodAccessorImpl.java:25)
[junit4:junit4]    > 	at java.lang.reflect.Method.invoke(Method.java:597)
[junit4:junit4]    > 	at com.carrotsearch.randomizedtesting.RandomizedRunner.invoke(RandomizedRunner.java:1559)
[junit4:junit4]    > 	at com.carrotsearch.randomizedtesting.RandomizedRunner.access$600(RandomizedRunner.java:79)
[junit4:junit4]    > 	at com.carrotsearch.randomizedtesting.RandomizedRunner$5.evaluate(RandomizedRunner.java:700)
[junit4:junit4]    > 	at com.carrotsearch.randomizedtesting.rules.StatementAdapter.evaluate(StatementAdapter.java:36)
[junit4:junit4]    > 	at com.carrotsearch.randomizedtesting.rules.SystemPropertiesRestoreRule$1.evaluate(SystemPropertiesRestoreRule.java:53)
[junit4:junit4]    > 	at org.apache.lucene.util.AbstractBeforeAfterRule$1.evaluate(AbstractBeforeAfterRule.java:45)
[junit4:junit4]    > 	at org.apache.lucene.util.TestRuleStoreClassName$1.evaluate(TestRuleStoreClassName.java:42)
[junit4:junit4]    > 	at com.carrotsearch.randomizedtesting.rules.SystemPropertiesInvariantRule$1.evaluate(SystemPropertiesInvariantRule.java:55)
[junit4:junit4]    > 	at com.carrotsearch.randomizedtesting.rules.NoShadowingOrOverridesOnMethodsRule$1.evaluate(NoShadowingOrOverridesOnMethodsRule.java:39)
[junit4:junit4]    > 	at com.carrotsearch.randomizedtesting.rules.NoShadowingOrOverridesOnMethodsRule$1.evaluate(NoShadowingOrOverridesOnMethodsRule.java:39)
[junit4:junit4]    > 	at com.carrotsearch.randomizedtesting.rules.StatementAdapter.evaluate(StatementAdapter.java:36)
[junit4:junit4]    > 	at org.apache.lucene.util.TestRuleAssertionsRequired$1.evaluate(TestRuleAssertionsRequired.java:43)
[junit4:junit4]    > 	at org.apache.lucene.util.TestRuleMarkFailure$1.evaluate(TestRuleMarkFailure.java:48)
[junit4:junit4]    > 	at org.apache.lucene.util.TestRuleIgnoreAfterMaxFailures$1.evaluate(TestRuleIgnoreAfterMaxFailures.java:70)
[junit4:junit4]    > 	at org.apache.lucene.util.TestRuleIgnoreTestSuites$1.evaluate(TestRuleIgnoreTestSuites.java:55)
[junit4:junit4]    > 	at com.carrotsearch.randomizedtesting.rules.StatementAdapter.evaluate(StatementAdapter.java:36)
[junit4:junit4]    > 	at com.carrotsearch.randomizedtesting.ThreadLeakControl$StatementRunner.run(ThreadLeakControl.java:358)
[junit4:junit4]    > 	at java.lang.Thread.run(Thread.java:662)
[junit4:junit4]    > Throwable #2: com.carrotsearch.randomizedtesting.ThreadLeakError:
1 thread leaked from SUITE scope at org.apache.solr.cloud.RecoveryZkTest: 
[junit4:junit4]    >    1) Thread[id=280, name=searcherExecutor-122-thread-1, state=WAITING,
group=TGRP-RecoveryZkTest]
[junit4:junit4]    >         at sun.misc.Unsafe.park(Native Method)
[junit4:junit4]    >         at java.util.concurrent.locks.LockSupport.park(LockSupport.java:158)
[junit4:junit4]    >         at java.util.concurrent.locks.AbstractQueuedSynchronizer$ConditionObject.await(AbstractQueuedSynchronizer.java:1987)
[junit4:junit4]    >         at java.util.concurrent.LinkedBlockingQueue.take(LinkedBlockingQueue.java:399)
[junit4:junit4]    >         at java.util.concurrent.ThreadPoolExecutor.getTask(ThreadPoolExecutor.java:947)
[junit4:junit4]    >         at java.util.concurrent.ThreadPoolExecutor$Worker.run(ThreadPoolExecutor.java:907)
[junit4:junit4]    >         at java.lang.Thread.run(Thread.java:662)
[junit4:junit4]    > 	at __randomizedtesting.SeedInfo.seed([7BB9EFAE0923C062]:0)
[junit4:junit4]    > Throwable #3: com.carrotsearch.randomizedtesting.ThreadLeakError:
There are still zombie threads that couldn't be terminated:
[junit4:junit4]    >    1) Thread[id=280, name=searcherExecutor-122-thread-1, state=WAITING,
group=TGRP-RecoveryZkTest]
[junit4:junit4]    >         at sun.misc.Unsafe.park(Native Method)
[junit4:junit4]    >         at java.util.concurrent.locks.LockSupport.park(LockSupport.java:158)
[junit4:junit4]    >         at java.util.concurrent.locks.AbstractQueuedSynchronizer$ConditionObject.await(AbstractQueuedSynchronizer.java:1987)
[junit4:junit4]    >         at java.util.concurrent.LinkedBlockingQueue.take(LinkedBlockingQueue.java:399)
[junit4:junit4]    >         at java.util.concurrent.ThreadPoolExecutor.getTask(ThreadPoolExecutor.java:947)
[junit4:junit4]    >         at java.util.concurrent.ThreadPoolExecutor$Worker.run(ThreadPoolExecutor.java:907)
[junit4:junit4]    >         at java.lang.Thread.run(Thread.java:662)
[junit4:junit4]    > 	at __randomizedtesting.SeedInfo.seed([7BB9EFAE0923C062]:0)
[junit4:junit4] Completed on J2 in 1202.13s, 1 test, 2 failures, 2 errors <<< FAILURES!
[junit4:junit4] 
[junit4:junit4] Suite: org.apache.solr.handler.component.ResponseLogComponentTest
[junit4:junit4] Completed on J2 in 0.03s, 3 tests, 3 skipped
[junit4:junit4] 
[junit4:junit4] Suite: org.apache.solr.util.PrimUtilsTest
[junit4:junit4] Completed on J2 in 0.00s, 2 tests, 2 skipped
[junit4:junit4] 
[junit4:junit4] Suite: org.apache.solr.core.SolrCoreCheckLockOnStartupTest
[junit4:junit4] Completed on J2 in 0.02s, 2 tests, 2 skipped
[junit4:junit4] 
[junit4:junit4] Suite: org.apache.solr.util.SolrPluginUtilsTest
[junit4:junit4] Completed on J2 in 0.02s, 7 tests, 7 skipped
[junit4:junit4] 
[junit4:junit4] Suite: org.apache.solr.handler.MoreLikeThisHandlerTest
[junit4:junit4] Completed on J2 in 0.02s, 1 test, 1 skipped
[junit4:junit4] 
[junit4:junit4] Suite: org.apache.solr.core.TestCodecSupport
[junit4:junit4] Completed on J2 in 0.02s, 3 tests, 3 skipped
[junit4:junit4] 
[junit4:junit4] Suite: org.apache.solr.search.TestSort
[junit4:junit4] Completed on J2 in 0.00s, 2 tests, 2 skipped
[junit4:junit4] 
[junit4:junit4] Suite: org.apache.solr.OutputWriterTest
[junit4:junit4] Completed on J2 in 0.00s, 5 tests, 5 skipped
[junit4:junit4] 
[junit4:junit4] Suite: org.apache.solr.analysis.TestWordDelimiterFilterFactory
[junit4:junit4] Completed on J2 in 0.02s, 7 tests, 7 skipped
[junit4:junit4] 
[junit4:junit4] Suite: org.apache.solr.update.AutoCommitTest
[junit4:junit4] Completed on J2 in 0.02s, 3 tests, 3 skipped
[junit4:junit4] 
[junit4:junit4] Suite: org.apache.solr.cloud.ChaosMonkeyNothingIsSafeTest
[junit4:junit4] Completed on J2 in 0.00s, 0 tests
[junit4:junit4] 
[junit4:junit4] 
[junit4:junit4] Tests with failures:
[junit4:junit4]   - org.apache.solr.cloud.RecoveryZkTest.testDistribSearch
[junit4:junit4]   - org.apache.solr.cloud.RecoveryZkTest (suite)
[junit4:junit4] 
[junit4:junit4] 
[junit4:junit4] JVM J0:     2.64 ..   279.60 =   276.96s
[junit4:junit4] JVM J1:     2.62 ..   284.54 =   281.92s
[junit4:junit4] JVM J2:     2.64 ..  1379.11 =  1376.47s
[junit4:junit4] JVM J3:     4.48 ..   297.68 =   293.20s
[junit4:junit4] JVM J4:     2.62 ..   285.16 =   282.54s
[junit4:junit4] JVM J5:     2.36 ..   271.01 =   268.66s
[junit4:junit4] JVM J6:     2.36 ..   277.21 =   274.85s
[junit4:junit4] JVM J7:     2.11 ..   270.48 =   268.38s
[junit4:junit4] Execution time total: 22 minutes 59 seconds
[junit4:junit4] Tests summary: 233 suites, 965 tests, 3 suite-level errors, 1 failure, 47
ignored (7 assumptions)

BUILD FAILED
<http://sierranevada.servebeer.com:8080/job/slow-io-beasting/ws/build.xml>:39: The following
error occurred while executing this line:
<http://sierranevada.servebeer.com:8080/job/slow-io-beasting/ws/solr/build.xml>:178:
The following error occurred while executing this line:
<http://sierranevada.servebeer.com:8080/job/slow-io-beasting/ws/lucene/module-build.xml>:61:
The following error occurred while executing this line:
<http://sierranevada.servebeer.com:8080/job/slow-io-beasting/ws/lucene/common-build.xml>:1159:
The following error occurred while executing this line:
<http://sierranevada.servebeer.com:8080/job/slow-io-beasting/ws/lucene/common-build.xml>:827:
There were test failures: 233 suites, 965 tests, 3 suite-level errors, 1 failure, 47 ignored
(7 assumptions)

Total time: 31 minutes 26 seconds
Build step 'Invoke Ant' marked build as failure

---------------------------------------------------------------------
To unsubscribe, e-mail: dev-unsubscribe@lucene.apache.org
For additional commands, e-mail: dev-help@lucene.apache.org


Mime
View raw message