lucene-dev mailing list archives

Site index · List index
Message view « Date » · « Thread »
Top « Date » · « Thread »
From Charlie Cron <hudsonsevilt...@gmail.com>
Subject Build failed in Jenkins: fast-io-beasting #6016
Date Sat, 27 Oct 2012 14:21:04 GMT
See <http://sierranevada.servebeer.com/job/fast-io-beasting/6016/>

------------------------------------------
[...truncated 11718 lines...]
[junit4:junit4]   2> 8458 T16 oass.SolrIndexSearcher.getIndexDir WARNING WARNING: Directory
impl does not support setting indexDir: org.apache.lucene.store.MockDirectoryWrapper
[junit4:junit4]   2> 8466 T14 oasc.SolrCore.registerSearcher [collection1] Registered new
searcher Searcher@12fcdf5 main{StandardDirectoryReader(segments_2:7:nrt _1(4.1):C1)}
[junit4:junit4]   2> 8467 T16 oasu.DirectUpdateHandler2.commit end_commit_flush
[junit4:junit4]   2> 8585 T15 oasu.DirectUpdateHandler2.commit start commit{flags=0,_version_=0,optimize=false,openSearcher=true,waitSearcher=true,expungeDeletes=false,softCommit=false}
[junit4:junit4]   2> 8591 T15 oasc.SolrDeletionPolicy.onCommit SolrDeletionPolicy.onCommit:
commits:num=2
[junit4:junit4]   2> 		commit{dir=MockDirWrapper(org.apache.lucene.store.RAMDirectory@1efd9b97
lockFactory=org.apache.lucene.store.NativeFSLockFactory@264d40df),segFN=segments_2,generation=2,filenames=[_0_Lucene40_0.tim,
_0.fnm, _0_Lucene40_0.frq, _0_nrm.cfe, segments_2, _0.fdx, _0_nrm.cfs, _0.si, _0_Lucene40_0.prx,
_0.fdt, _0_Lucene40_0.tip]
[junit4:junit4]   2> 		commit{dir=MockDirWrapper(org.apache.lucene.store.RAMDirectory@1efd9b97
lockFactory=org.apache.lucene.store.NativeFSLockFactory@264d40df),segFN=segments_3,generation=3,filenames=[_1_Lucene40_0.tim,
_1.fdx, _1_nrm.cfs, _1.fdt, _1.si, _1_Lucene40_0.frq, _1.fnm, segments_3, _1_Lucene40_0.prx,
_1_Lucene40_0.tip, _1_nrm.cfe]
[junit4:junit4]   2> 8591 T15 oasc.SolrDeletionPolicy.updateCommits newest commit = 3
[junit4:junit4]   2> 8599 T15 oass.SolrIndexSearcher.<init> Opening Searcher@2f2e43f1
main
[junit4:junit4]   2> 8600 T15 oass.SolrIndexSearcher.getIndexDir WARNING WARNING: Directory
impl does not support setting indexDir: org.apache.lucene.store.MockDirectoryWrapper
[junit4:junit4]   2> 8600 T15 oasu.DirectUpdateHandler2.commit end_commit_flush
[junit4:junit4]   2> 8604 T14 oasc.SolrCore.registerSearcher [collection1] Registered new
searcher Searcher@2f2e43f1 main{StandardDirectoryReader(segments_2:7:nrt _1(4.1):C1)}
[junit4:junit4]   2> 10599 T10 oasu.AbstractSolrTestCase.tearDown ####TEARDOWN_START testSoftAndHardCommitMaxTimeDelete
[junit4:junit4]   2> 10600 T10 oasc.CoreContainer.shutdown Shutting down CoreContainer
instance=1085837532
[junit4:junit4]   2> 10600 T10 oasc.SolrCore.close [collection1]  CLOSING SolrCore org.apache.solr.core.SolrCore@152e7cb6
[junit4:junit4]   2> 10626 T10 oasu.DirectUpdateHandler2.close closing DirectUpdateHandler2{commits=4,autocommit
maxTime=1200ms,autocommits=1,soft autocommit maxTime=500ms,soft autocommits=2,optimizes=0,rollbacks=0,expungeDeletes=0,docsPending=0,adds=0,deletesById=0,deletesByQuery=0,errors=0,cumulative_adds=2,cumulative_deletesById=1,cumulative_deletesByQuery=0,cumulative_errors=0}
[junit4:junit4]   2> 10655 T10 oasc.SolrCore.decrefSolrCoreState Closing SolrCoreState
[junit4:junit4]   2> 10655 T10 oasu.DefaultSolrCoreState.closeIndexWriter SolrCoreState
ref count has reached 0 - closing IndexWriter
[junit4:junit4]   2> 10656 T10 oasu.DefaultSolrCoreState.closeIndexWriter closing IndexWriter
with IndexWriterCloser
[junit4:junit4]   2> 10679 T10 oasc.SolrCore.closeSearcher [collection1] Closing main searcher
on request.
[junit4:junit4]   2> 10889 T10 oasu.AbstractSolrTestCase.setUp ####SETUP_START testSoftAndHardCommitMaxTimeMixedAdds
[junit4:junit4]   2> 10890 T10 oasc.SolrResourceLoader.<init> new SolrResourceLoader
for directory: '<http://sierranevada.servebeer.com/job/fast-io-beasting/ws/solr/build/solr-core/test-files/solr/collection1/'>
[junit4:junit4]   2> 10891 T10 oasc.SolrResourceLoader.replaceClassLoader Adding '<http://sierranevada.servebeer.com/job/fast-io-beasting/ws/solr/build/solr-core/test-files/solr/collection1/lib/classes/'>
to classloader
[junit4:junit4]   2> 10892 T10 oasc.SolrResourceLoader.replaceClassLoader Adding '<http://sierranevada.servebeer.com/job/fast-io-beasting/ws/solr/build/solr-core/test-files/solr/collection1/lib/README'>
to classloader
[junit4:junit4]   2> 11107 T10 oasc.SolrConfig.<init> Using Lucene MatchVersion:
LUCENE_41
[junit4:junit4]   2> 11245 T10 oasc.SolrConfig.<init> Loaded SolrConfig: solrconfig.xml
[junit4:junit4]   2> 11246 T10 oass.IndexSchema.readSchema Reading Solr Schema
[junit4:junit4]   2> 11319 T10 oass.IndexSchema.readSchema Schema name=test
[junit4:junit4]   2> 12671 T10 oass.OpenExchangeRatesOrgProvider.init Initialized with
rates=open-exchange-rates.json, refreshInterval=1440.
[junit4:junit4]   2> 12701 T10 oass.IndexSchema.readSchema default search field in schema
is text
[junit4:junit4]   2> 12704 T10 oass.IndexSchema.readSchema unique key field: id
[junit4:junit4]   2> 12744 T10 oass.FileExchangeRateProvider.reload Reloading exchange
rates from file currency.xml
[junit4:junit4]   2> 12748 T10 oass.FileExchangeRateProvider.reload Reloading exchange
rates from file currency.xml
[junit4:junit4]   2> 12752 T10 oass.OpenExchangeRatesOrgProvider.reload Reloading exchange
rates from open-exchange-rates.json
[junit4:junit4]   2> 12756 T10 oass.OpenExchangeRatesOrgProvider.reload Reloading exchange
rates from open-exchange-rates.json
[junit4:junit4]   2> 12758 T10 oasc.SolrResourceLoader.locateSolrHome JNDI not configured
for solr (NoInitialContextEx)
[junit4:junit4]   2> 12759 T10 oasc.SolrResourceLoader.locateSolrHome using system property
solr.solr.home: <http://sierranevada.servebeer.com/job/fast-io-beasting/ws/solr/build/solr-core/test-files/solr>
[junit4:junit4]   2> 12759 T10 oasc.SolrResourceLoader.<init> new SolrResourceLoader
for directory: '<http://sierranevada.servebeer.com/job/fast-io-beasting/ws/solr/build/solr-core/test-files/solr/'>
[junit4:junit4]   2> 12770 T10 oasc.CoreContainer.<init> New CoreContainer 1615782385
[junit4:junit4]   2> 12770 T10 oasc.SolrCore.<init> [collection1] Opening new SolrCore
at <http://sierranevada.servebeer.com/job/fast-io-beasting/ws/solr/build/solr-core/test-files/solr/collection1/,>
dataDir=<http://sierranevada.servebeer.com/job/fast-io-beasting/ws/solr/build/solr-core/test/J6/./org.apache.solr.update.SoftAutoCommitTest-1351347494057/>
[junit4:junit4]   2> 12771 T10 oasc.JmxMonitoredMap.<init> JMX monitoring is enabled.
Adding Solr mbeans to JMX Server: com.sun.jmx.mbeanserver.JmxMBeanServer@1b5b8520
[junit4:junit4]   2> 12772 T10 oasc.SolrCore.getNewIndexDir New index directory detected:
old=null new=<http://sierranevada.servebeer.com/job/fast-io-beasting/ws/solr/build/solr-core/test/J6/./org.apache.solr.update.SoftAutoCommitTest-1351347494057/index/>
[junit4:junit4]   2> 12772 T10 oasc.SolrCore.initIndex WARNING [collection1] Solr index
directory '<http://sierranevada.servebeer.com/job/fast-io-beasting/ws/solr/build/solr-core/test/J6/./org.apache.solr.update.SoftAutoCommitTest-1351347494057/index'>
doesn't exist. Creating new index...
[junit4:junit4]   2> 12773 T10 oasc.CachingDirectoryFactory.get return new directory for
<http://sierranevada.servebeer.com/job/fast-io-beasting/ws/solr/build/solr-core/test/J6/./org.apache.solr.update.SoftAutoCommitTest-1351347494057/index>
forceNew:false
[junit4:junit4]   2> 12780 T10 oasc.SolrDeletionPolicy.onCommit SolrDeletionPolicy.onCommit:
commits:num=1
[junit4:junit4]   2> 		commit{dir=MockDirWrapper(org.apache.lucene.store.RAMDirectory@5945a5a
lockFactory=org.apache.lucene.store.NativeFSLockFactory@519549e),segFN=segments_1,generation=1,filenames=[segments_1]
[junit4:junit4]   2> 12781 T10 oasc.SolrDeletionPolicy.updateCommits newest commit = 1
[junit4:junit4]   2> 12782 T10 oasc.SolrCore.initWriters created xml: solr.XMLResponseWriter
[junit4:junit4]   2> 12784 T10 oasup.UpdateRequestProcessorChain.init inserting DistributedUpdateProcessorFactory
into updateRequestProcessorChain "dedupe"
[junit4:junit4]   2> 12802 T10 oasup.UpdateRequestProcessorChain.init inserting DistributedUpdateProcessorFactory
into updateRequestProcessorChain "dedupe-allfields"
[junit4:junit4]   2> 12806 T10 oasup.UpdateRequestProcessorChain.init inserting DistributedUpdateProcessorFactory
into updateRequestProcessorChain "stored_sig"
[junit4:junit4]   2> 12807 T10 oasup.UpdateRequestProcessorChain.init inserting DistributedUpdateProcessorFactory
into updateRequestProcessorChain "uniq-fields"
[junit4:junit4]   2> 12808 T10 oasup.UpdateRequestProcessorChain.init inserting DistributedUpdateProcessorFactory
into updateRequestProcessorChain "distrib-dup-test-chain-implicit"
[junit4:junit4]   2> 12809 T10 oasc.RequestHandlers.initHandlersFromConfig adding lazy
requestHandler: solr.ReplicationHandler
[junit4:junit4]   2> 12811 T10 oasc.RequestHandlers.initHandlersFromConfig created /replication:
solr.ReplicationHandler
[junit4:junit4]   2> 12811 T10 oasc.RequestHandlers.initHandlersFromConfig created standard:
solr.StandardRequestHandler
[junit4:junit4]   2> 12812 T10 oasc.RequestHandlers.initHandlersFromConfig created /get:
solr.RealTimeGetHandler
[junit4:junit4]   2> 12813 T10 oasc.RequestHandlers.initHandlersFromConfig created dismax:
solr.SearchHandler
[junit4:junit4]   2> 12814 T10 oasc.RequestHandlers.initHandlersFromConfig created mock:
org.apache.solr.core.MockQuerySenderListenerReqHandler
[junit4:junit4]   2> 12819 T10 oasc.RequestHandlers.initHandlersFromConfig created /admin/:
org.apache.solr.handler.admin.AdminHandlers
[junit4:junit4]   2> 12820 T10 oasc.RequestHandlers.initHandlersFromConfig created defaults:
solr.StandardRequestHandler
[junit4:junit4]   2> 12820 T10 oasc.RequestHandlers.initHandlersFromConfig adding lazy
requestHandler: solr.StandardRequestHandler
[junit4:junit4]   2> 12821 T10 oasc.RequestHandlers.initHandlersFromConfig created lazy:
solr.StandardRequestHandler
[junit4:junit4]   2> 12822 T10 oasc.RequestHandlers.initHandlersFromConfig created /update:
solr.UpdateRequestHandler
[junit4:junit4]   2> 12822 T10 oasc.RequestHandlers.initHandlersFromConfig created /terms:
org.apache.solr.handler.component.SearchHandler
[junit4:junit4]   2> 12823 T10 oasc.RequestHandlers.initHandlersFromConfig created spellCheckCompRH:
org.apache.solr.handler.component.SearchHandler
[junit4:junit4]   2> 12824 T10 oasc.RequestHandlers.initHandlersFromConfig created spellCheckCompRH_Direct:
org.apache.solr.handler.component.SearchHandler
[junit4:junit4]   2> 12824 T10 oasc.RequestHandlers.initHandlersFromConfig created spellCheckWithWordbreak:
org.apache.solr.handler.component.SearchHandler
[junit4:junit4]   2> 12825 T10 oasc.RequestHandlers.initHandlersFromConfig created spellCheckWithWordbreak_Direct:
org.apache.solr.handler.component.SearchHandler
[junit4:junit4]   2> 12826 T10 oasc.RequestHandlers.initHandlersFromConfig created spellCheckCompRH1:
org.apache.solr.handler.component.SearchHandler
[junit4:junit4]   2> 12827 T10 oasc.RequestHandlers.initHandlersFromConfig created tvrh:
org.apache.solr.handler.component.SearchHandler
[junit4:junit4]   2> 12827 T10 oasc.RequestHandlers.initHandlersFromConfig created /mlt:
solr.MoreLikeThisHandler
[junit4:junit4]   2> 12836 T10 oasc.RequestHandlers.initHandlersFromConfig created /debug/dump:
solr.DumpRequestHandler
[junit4:junit4]   2> 12838 T10 oashl.XMLLoader.init xsltCacheLifetimeSeconds=60
[junit4:junit4]   2> 12843 T10 oasc.SolrCore.initDeprecatedSupport WARNING solrconfig.xml
uses deprecated <admin/gettableFiles>, Please update your config to use the ShowFileRequestHandler.
[junit4:junit4]   2> 12845 T10 oasc.SolrCore.initDeprecatedSupport WARNING adding ShowFileRequestHandler
with hidden files: [THROW.ERROR.ON.ADD.UPDATEPROCESSOR.JS, SOLRCONFIG-HIGHLIGHT.XML, SCHEMA-REQUIRED-FIELDS.XML,
BAD-SCHEMA-DUP-DYNAMICFIELD.XML, SCHEMA-MINIMAL.XML, SCHEMA-REPLICATION2.XML, TRIVIAL.UPDATEPROCESSOR1.JS,
SOLRCONFIG-CACHING.XML, SOLRCONFIG-REPEATER.XML, SOLRCONFIG-MERGEPOLICY.XML, BAD-SCHEMA-NONTEXT-ANALYZER.XML,
CURRENCY.XML, SOLRCONFIG-TLOG.XML, SOLRCONFIG-MASTER.XML, BAD-SCHEMA-UNIQUEKEY-MULTIVALUED.XML,
SCHEMA11.XML, SOLRCONFIG-BASIC.XML, DA_COMPOUNDDICTIONARY.TXT, MISSLEADING.EXTENSION.UPDATEPROCESSOR.JS.TXT,
SCHEMA-COPYFIELD-TEST.XML, SOLRCONFIG-SLAVE.XML, SOLRCONFIG-PROPINJECT-INDEXDEFAULT.XML, ELEVATE.XML,
TRIVIAL.UPDATEPROCESSOR0.JS, BAD-SOLRCONFIG-BOGUS-SCRIPTENGINE-NAME.XML, SCHEMA-IB.XML, SCHEMA-CHARFILTERS.XML,
SOLRCONFIG-QUERYSENDER.XML, SCHEMA-REPLICATION1.XML, DA_UTF8.XML, SOLRCONFIG-SNIPPET-PROCESSOR.XML,
CONDITIONAL.UPDATEPROCESSOR.JS, MISSING.FUNCTIONS.UPDATEPROCESSOR.JS, SOLRCONFIG-ENABLEPLUGIN.XML,
HYPHENATION.DTD, SCHEMA-PHRASESUGGEST.XML, STEMDICT.TXT, HUNSPELL-TEST.AFF, SCHEMA-SNIPPET-TYPE.XML,
STOPTYPES-1.TXT, STOPWORDSWRONGENCODING.TXT, SCHEMA-NUMERIC.XML, SOLRCONFIG-TRANSFORMERS.XML,
SOLRCONFIG-PROPINJECT.XML, BAD-SCHEMA-NOT-INDEXED-BUT-TF.XML, SOLRCONFIG-SIMPLELOCK.XML, WDFTYPES.TXT,
SCHEMA-REVERSED.XML, STOPTYPES-2.TXT, BAD-SCHEMA-CURRENCY-FT-MULTIVALUED.XML, SOLRCONFIG-SPELLCHECKCOMPONENT.XML,
BAD-SCHEMA-CURRENCY-MULTIVALUED.XML, SCHEMA-DFR.XML, SOLRCONFIG-PHRASESUGGEST.XML, BAD-SCHEMA-NOT-INDEXED-BUT-POS.XML,
KEEP-1.TXT, OPEN-EXCHANGE-RATES.JSON, SCHEMA-SPATIAL.XML, STOPWITHBOM.TXT, SCHEMA-BINARYFIELD.XML,
SOLRCONFIG-SPELLCHECKER.XML, SOLRCONFIG-UPDATE-PROCESSOR-CHAINS.XML, BAD-SCHEMA-OMIT-TF-BUT-NOT-POS.XML,
SCHEMA-XINCLUDE.XML, BAD-SCHEMA-DUP-FIELDTYPE.XML, SOLRCONFIG-MASTER1.XML, SYNONYMS.TXT, BAD-SCHEMA-CURRENCY-DYNAMIC-MULTIVALUED.XML,
SCHEMA.XML, SCHEMA_CODEC.XML, SOLRCONFIG-SOLR-749.XML, SOLRCONFIG-MASTER1-KEEPONEBACKUP.XML,
STOP-2.TXT, SOLRCONFIG-FUNCTIONQUERY.XML, SOLRCONFIG-TERMINDEX.XML, SCHEMA-LMDIRICHLET.XML,
SOLRCONFIG-ELEVATE.XML, SCHEMA-FOLDING.XML, STOPWORDS.TXT, SCHEMA-STOP-KEEP.XML, BAD-SCHEMA-NOT-INDEXED-BUT-NORMS.XML,
SOLRCONFIG-SOLCOREPROPERTIES.XML, STOP-1.TXT, SOLRCONFIG-MASTER2.XML, SCHEMA-SPELLCHECKER.XML,
SOLRCONFIG-RESPONSE-LOG-COMPONENT.XML, SOLRCONFIG-LAZYWRITER.XML, SCHEMA-LUCENEMATCHVERSION.XML,
BAD-MP-SOLRCONFIG.XML, FRENCHARTICLES.TXT, SCHEMA15.XML, SOLRCONFIG-REQHANDLER.INCL, SCHEMASURROUND.XML,
SCHEMA-COLLATEFILTER.XML, SOLRCONFIG-MASTER3.XML, HUNSPELL-TEST.DIC, SOLRCONFIG-XINCLUDE.XML,
BAD-SCHEMA-CODEC-GLOBAL-VS-FT-MISMATCH.XML, SOLRCONFIG-DELPOLICY1.XML, SOLRCONFIG-SLAVE1.XML,
SCHEMA-SIM.XML, SCHEMA-SNIPPET-FIELD.XML, SCHEMA-COLLATE.XML, STOP-SNOWBALL.TXT, BAD-SCHEMA-SIM-GLOBAL-VS-FT-MISMATCH.XML,
PROTWORDS.TXT, SCHEMA-TRIE.XML, SOLRCONFIG_CODEC.XML, BAD-SOLRCONFIG-INVALID-SCRIPTFILE.XML,
JASUGGEST.TXT, SCHEMA-TFIDF.XML, SOLRCONFIG-SCRIPT-UPDATEPROCESSOR.XML, SCHEMA-LMJELINEKMERCER.XML,
PHRASESUGGEST.TXT, BAD-SOLRCONFIG-MISSING-SCRIPTFILE.XML, SOLRCONFIG-BASIC-LUCENEVERSION31.XML,
BAD-SCHEMA-UNIQUEKEY-USES-DEFAULT.XML, OLD_SYNONYMS.TXT, SOLRCONFIG-DELPOLICY2.XML, XSLT,
SOLRCONFIG-NATIVELOCK.XML, BAD-SCHEMA-DUP-FIELD.XML, SOLRCONFIG-NOCACHE.XML, SCHEMA-BM25.XML,
ADDFIELDS.UPDATEPROCESSOR.JS, SOLRCONFIG-QUERYSENDER-NOQUERY.XML, SOLRCONFIG-ALTDIRECTORY.XML,
COMPOUNDDICTIONARY.TXT, SOLRCONFIG_PERF.XML, SOLRCONFIG-INDEXCONFIG.XML, SCHEMA-NOT-REQUIRED-UNIQUE-KEY.XML,
BAD-SCHEMA-ANALYZER-CLASS-AND-NESTED.XML, KEEP-2.TXT, BAD-SCHEMA-UNIQUEKEY-IS-COPYFIELD-DEST.XML,
SCHEMA12.XML, MAPPING-ISOLATIN1ACCENT.TXT, BAD_SOLRCONFIG.XML, BAD-SCHEMA-EXTERNAL-FILEFIELD.XML]
[junit4:junit4]   2> 12893 T10 oass.SolrIndexSearcher.<init> Opening Searcher@3c9ce70
main
[junit4:junit4]   2> 12894 T10 oass.SolrIndexSearcher.getIndexDir WARNING WARNING: Directory
impl does not support setting indexDir: org.apache.lucene.store.MockDirectoryWrapper
[junit4:junit4]   2> 12895 T10 oasu.CommitTracker.<init> Hard AutoCommit: disabled
[junit4:junit4]   2> 12896 T10 oasu.CommitTracker.<init> Soft AutoCommit: disabled
[junit4:junit4]   2> 12897 T10 oashc.SpellCheckComponent.inform Initializing spell checkers
[junit4:junit4]   2> 12928 T10 oass.DirectSolrSpellChecker.init init: {name=direct,classname=DirectSolrSpellChecker,field=lowerfilt,minQueryLength=3}
[junit4:junit4]   2> 12980 T10 oashc.HttpShardHandlerFactory.getParameter Setting socketTimeout
to: 0
[junit4:junit4]   2> 12980 T10 oashc.HttpShardHandlerFactory.getParameter Setting urlScheme
to: http://
[junit4:junit4]   2> 12981 T10 oashc.HttpShardHandlerFactory.getParameter Setting connTimeout
to: 0
[junit4:junit4]   2> 12981 T10 oashc.HttpShardHandlerFactory.getParameter Setting maxConnectionsPerHost
to: 20
[junit4:junit4]   2> 12982 T10 oashc.HttpShardHandlerFactory.getParameter Setting corePoolSize
to: 0
[junit4:junit4]   2> 12982 T10 oashc.HttpShardHandlerFactory.getParameter Setting maximumPoolSize
to: 2147483647
[junit4:junit4]   2> 12982 T10 oashc.HttpShardHandlerFactory.getParameter Setting maxThreadIdleTime
to: 5
[junit4:junit4]   2> 12991 T10 oashc.HttpShardHandlerFactory.getParameter Setting sizeOfQueue
to: -1
[junit4:junit4]   2> 12991 T10 oashc.HttpShardHandlerFactory.getParameter Setting fairnessPolicy
to: false
[junit4:junit4]   2> 12992 T10 oascsi.HttpClientUtil.createClient Creating new http client,
config:maxConnectionsPerHost=20&maxConnections=10000&socketTimeout=0&connTimeout=0&retry=false
[junit4:junit4]   2> 13016 T17 oasc.SolrCore.registerSearcher [collection1] Registered
new searcher Searcher@3c9ce70 main{StandardDirectoryReader(segments_1:1)}
[junit4:junit4]   2> 13042 T10 oasc.CoreContainer.register registering core: collection1
[junit4:junit4]   2> 13066 T10 oasu.AbstractSolrTestCase.setUp ####SETUP_END testSoftAndHardCommitMaxTimeMixedAdds
[junit4:junit4]   2> ASYNC  NEW_CORE C2 name=collection1 org.apache.solr.core.SolrCore@5ad3c69c
[junit4:junit4]   2> 13076 T10 C2 oasc.SolrDeletionPolicy.onInit SolrDeletionPolicy.onInit:
commits:num=1
[junit4:junit4]   2> 		commit{dir=MockDirWrapper(org.apache.lucene.store.RAMDirectory@5945a5a
lockFactory=org.apache.lucene.store.NativeFSLockFactory@519549e),segFN=segments_1,generation=1,filenames=[segments_1]
[junit4:junit4]   2> 13076 T10 C2 oasc.SolrDeletionPolicy.updateCommits newest commit =
1
[junit4:junit4]   2> 13082 T10 C2 UPDATE [collection1] webapp=null path=null params={}
{add=[529]} 0 12
[junit4:junit4]   2> 13583 T19 oasu.DirectUpdateHandler2.commit start commit{flags=0,_version_=0,optimize=false,openSearcher=true,waitSearcher=true,expungeDeletes=false,softCommit=true}
[junit4:junit4]   2> 13646 T19 oass.SolrIndexSearcher.<init> Opening Searcher@2d44b624
main
[junit4:junit4]   2> 13651 T19 oass.SolrIndexSearcher.getIndexDir WARNING WARNING: Directory
impl does not support setting indexDir: org.apache.lucene.store.MockDirectoryWrapper
[junit4:junit4]   2> 13652 T19 oasu.DirectUpdateHandler2.commit end_commit_flush
[junit4:junit4]   2> 13657 T17 oasc.SolrCore.registerSearcher [collection1] Registered
new searcher Searcher@2d44b624 main{StandardDirectoryReader(segments_1:3:nrt _0(4.1):C1)}
[junit4:junit4]   2> 13664 T10 C2 UPDATE [collection1] webapp=null path=null params={}
{add=[530]} 0 4
[junit4:junit4]   2> 14165 T19 oasu.DirectUpdateHandler2.commit start commit{flags=0,_version_=0,optimize=false,openSearcher=true,waitSearcher=true,expungeDeletes=false,softCommit=true}
[junit4:junit4]   2> 14173 T19 oass.SolrIndexSearcher.<init> Opening Searcher@ed6ee28
main
[junit4:junit4]   2> 14173 T19 oass.SolrIndexSearcher.getIndexDir WARNING WARNING: Directory
impl does not support setting indexDir: org.apache.lucene.store.MockDirectoryWrapper
[junit4:junit4]   2> 14176 T17 oasc.SolrCore.registerSearcher [collection1] Registered
new searcher Searcher@ed6ee28 main{StandardDirectoryReader(segments_1:5:nrt _0(4.1):C1 _1(4.1):C1)}
[junit4:junit4]   2> 14177 T19 oasu.DirectUpdateHandler2.commit end_commit_flush
[junit4:junit4]   2> 14282 T18 oasu.DirectUpdateHandler2.commit start commit{flags=0,_version_=0,optimize=false,openSearcher=true,waitSearcher=true,expungeDeletes=false,softCommit=false}
[junit4:junit4]   2> 14284 T18 oasc.SolrDeletionPolicy.onCommit SolrDeletionPolicy.onCommit:
commits:num=2
[junit4:junit4]   2> 		commit{dir=MockDirWrapper(org.apache.lucene.store.RAMDirectory@5945a5a
lockFactory=org.apache.lucene.store.NativeFSLockFactory@519549e),segFN=segments_1,generation=1,filenames=[segments_1]
[junit4:junit4]   2> 		commit{dir=MockDirWrapper(org.apache.lucene.store.RAMDirectory@5945a5a
lockFactory=org.apache.lucene.store.NativeFSLockFactory@519549e),segFN=segments_2,generation=2,filenames=[_1_Lucene40_0.tim,
_1_nrm.cfs, _0_Lucene40_0.tim, _0.fnm, _1_Lucene40_0.frq, _0_nrm.cfs, _0_Lucene40_0.prx, _1.fnm,
_1_Lucene40_0.prx, _1_Lucene40_0.tip, _1_nrm.cfe, _0_Lucene40_0.tip, _1.fdx, _0_Lucene40_0.frq,
_1.fdt, _1.si, _0_nrm.cfe, segments_2, _0.fdx, _0.si, _0.fdt]
[junit4:junit4]   2> 14284 T18 oasc.SolrDeletionPolicy.updateCommits newest commit = 2
[junit4:junit4]   2> 14285 T18 oass.SolrIndexSearcher.<init> Opening Searcher@10ddcd98
main
[junit4:junit4]   2> 14285 T18 oass.SolrIndexSearcher.getIndexDir WARNING WARNING: Directory
impl does not support setting indexDir: org.apache.lucene.store.MockDirectoryWrapper
[junit4:junit4]   2> 14286 T18 oasu.DirectUpdateHandler2.commit end_commit_flush
[junit4:junit4]   2> 14289 T17 oasc.SolrCore.registerSearcher [collection1] Registered
new searcher Searcher@10ddcd98 main{StandardDirectoryReader(segments_1:5:nrt _0(4.1):C1 _1(4.1):C1)}
[junit4:junit4]   2> 17485 T10 oasu.AbstractSolrTestCase.tearDown ####TEARDOWN_START testSoftAndHardCommitMaxTimeMixedAdds
[junit4:junit4]   2> 17486 T10 oasc.CoreContainer.shutdown Shutting down CoreContainer
instance=1615782385
[junit4:junit4]   2> 17486 T10 oasc.SolrCore.close [collection1]  CLOSING SolrCore org.apache.solr.core.SolrCore@5ad3c69c
[junit4:junit4]   2> 17519 T10 oasu.DirectUpdateHandler2.close closing DirectUpdateHandler2{commits=3,autocommit
maxTime=1200ms,autocommits=1,soft autocommit maxTime=500ms,soft autocommits=2,optimizes=0,rollbacks=0,expungeDeletes=0,docsPending=0,adds=0,deletesById=0,deletesByQuery=0,errors=0,cumulative_adds=2,cumulative_deletesById=0,cumulative_deletesByQuery=0,cumulative_errors=0}
[junit4:junit4]   2> 17520 T10 oasc.SolrCore.decrefSolrCoreState Closing SolrCoreState
[junit4:junit4]   2> 17520 T10 oasu.DefaultSolrCoreState.closeIndexWriter SolrCoreState
ref count has reached 0 - closing IndexWriter
[junit4:junit4]   2> 17521 T10 oasu.DefaultSolrCoreState.closeIndexWriter closing IndexWriter
with IndexWriterCloser
[junit4:junit4]   2> 17522 T10 oasc.SolrCore.closeSearcher [collection1] Closing main searcher
on request.
[junit4:junit4]   2> 138560 T10 oas.SolrTestCaseJ4.endTrackingSearchers SEVERE ERROR: SolrIndexSearcher
opens=11 closes=9
[junit4:junit4]   2> NOTE: test params are: codec=Lucene40, sim=RandomSimilarityProvider(queryNorm=false,coord=crazy):
{}, locale=el_CY, timezone=Asia/Macao
[junit4:junit4]   2> NOTE: Linux 3.2.0-24-generic amd64/Sun Microsystems Inc. 1.6.0_27
(64-bit)/cpus=8,threads=1,free=248490368,total=349962240
[junit4:junit4]   2> NOTE: All tests run in this JVM: [SoftAutoCommitTest]
[junit4:junit4]   2> NOTE: reproduce with: ant test  -Dtestcase=SoftAutoCommitTest -Dtests.seed=DC8D278CC4EA95BC
-Dtests.slow=true -Dtests.locale=el_CY -Dtests.timezone=Asia/Macao -Dtests.file.encoding=UTF-8
[junit4:junit4] ERROR   0.00s J6 | SoftAutoCommitTest (suite) <<<
[junit4:junit4]    > Throwable #1: java.lang.AssertionError: ERROR: SolrIndexSearcher opens=11
closes=9
[junit4:junit4]    > 	at __randomizedtesting.SeedInfo.seed([DC8D278CC4EA95BC]:0)
[junit4:junit4]    > 	at org.junit.Assert.fail(Assert.java:93)
[junit4:junit4]    > 	at org.apache.solr.SolrTestCaseJ4.endTrackingSearchers(SolrTestCaseJ4.java:242)
[junit4:junit4]    > 	at org.apache.solr.util.AbstractSolrTestCase.afterClassAbstractSolrTestCase(AbstractSolrTestCase.java:121)
[junit4:junit4]    > 	at sun.reflect.NativeMethodAccessorImpl.invoke0(Native Method)
[junit4:junit4]    > 	at sun.reflect.NativeMethodAccessorImpl.invoke(NativeMethodAccessorImpl.java:39)
[junit4:junit4]    > 	at sun.reflect.DelegatingMethodAccessorImpl.invoke(DelegatingMethodAccessorImpl.java:25)
[junit4:junit4]    > 	at java.lang.reflect.Method.invoke(Method.java:597)
[junit4:junit4]    > 	at com.carrotsearch.randomizedtesting.RandomizedRunner.invoke(RandomizedRunner.java:1559)
[junit4:junit4]    > 	at com.carrotsearch.randomizedtesting.RandomizedRunner.access$600(RandomizedRunner.java:79)
[junit4:junit4]    > 	at com.carrotsearch.randomizedtesting.RandomizedRunner$5.evaluate(RandomizedRunner.java:700)
[junit4:junit4]    > 	at com.carrotsearch.randomizedtesting.rules.StatementAdapter.evaluate(StatementAdapter.java:36)
[junit4:junit4]    > 	at com.carrotsearch.randomizedtesting.rules.SystemPropertiesRestoreRule$1.evaluate(SystemPropertiesRestoreRule.java:53)
[junit4:junit4]    > 	at org.apache.lucene.util.AbstractBeforeAfterRule$1.evaluate(AbstractBeforeAfterRule.java:45)
[junit4:junit4]    > 	at org.apache.lucene.util.TestRuleStoreClassName$1.evaluate(TestRuleStoreClassName.java:42)
[junit4:junit4]    > 	at com.carrotsearch.randomizedtesting.rules.SystemPropertiesInvariantRule$1.evaluate(SystemPropertiesInvariantRule.java:55)
[junit4:junit4]    > 	at com.carrotsearch.randomizedtesting.rules.NoShadowingOrOverridesOnMethodsRule$1.evaluate(NoShadowingOrOverridesOnMethodsRule.java:39)
[junit4:junit4]    > 	at com.carrotsearch.randomizedtesting.rules.NoShadowingOrOverridesOnMethodsRule$1.evaluate(NoShadowingOrOverridesOnMethodsRule.java:39)
[junit4:junit4]    > 	at com.carrotsearch.randomizedtesting.rules.StatementAdapter.evaluate(StatementAdapter.java:36)
[junit4:junit4]    > 	at org.apache.lucene.util.TestRuleAssertionsRequired$1.evaluate(TestRuleAssertionsRequired.java:43)
[junit4:junit4]    > 	at org.apache.lucene.util.TestRuleMarkFailure$1.evaluate(TestRuleMarkFailure.java:48)
[junit4:junit4]    > 	at org.apache.lucene.util.TestRuleIgnoreAfterMaxFailures$1.evaluate(TestRuleIgnoreAfterMaxFailures.java:70)
[junit4:junit4]    > 	at org.apache.lucene.util.TestRuleIgnoreTestSuites$1.evaluate(TestRuleIgnoreTestSuites.java:55)
[junit4:junit4]    > 	at com.carrotsearch.randomizedtesting.rules.StatementAdapter.evaluate(StatementAdapter.java:36)
[junit4:junit4]    > 	at com.carrotsearch.randomizedtesting.ThreadLeakControl$StatementRunner.run(ThreadLeakControl.java:358)
[junit4:junit4]    > 	at java.lang.Thread.run(Thread.java:662)
[junit4:junit4] Completed on J6 in 139.66s, 3 tests, 2 failures <<< FAILURES!
[junit4:junit4] 
[junit4:junit4] Suite: org.apache.solr.cloud.BasicDistributedZk2Test
[junit4:junit4] Completed on J4 in 32.96s, 1 test
[junit4:junit4] 
[junit4:junit4] Suite: org.apache.solr.MinimalSchemaTest
[junit4:junit4] Completed on J6 in 0.52s, 3 tests
[junit4:junit4] 
[junit4:junit4] Suite: org.apache.solr.search.function.SortByFunctionTest
[junit4:junit4] Completed on J6 in 1.10s, 2 tests
[junit4:junit4] 
[junit4:junit4] Suite: org.apache.solr.core.SolrCoreTest
[junit4:junit4] Completed on J6 in 2.99s, 6 tests
[junit4:junit4] 
[junit4:junit4] Suite: org.apache.solr.handler.CSVRequestHandlerTest
[junit4:junit4] Completed on J6 in 0.38s, 1 test
[junit4:junit4] 
[junit4:junit4] Suite: org.apache.solr.internal.csv.CSVParserTest
[junit4:junit4] Completed on J6 in 0.02s, 23 tests
[junit4:junit4] 
[junit4:junit4] Suite: org.apache.solr.schema.IndexSchemaRuntimeFieldTest
[junit4:junit4] Completed on J6 in 0.42s, 1 test
[junit4:junit4] 
[junit4:junit4] Suite: org.apache.solr.cloud.TestHashPartitioner
[junit4:junit4] Completed on J6 in 8.48s, 1 test
[junit4:junit4] 
[junit4:junit4] Suite: org.apache.solr.core.TestXIncludeConfig
[junit4:junit4] Completed on J6 in 0.10s, 1 test
[junit4:junit4] 
[junit4:junit4] Suite: org.apache.solr.search.similarities.TestBM25SimilarityFactory
[junit4:junit4] Completed on J6 in 0.10s, 2 tests
[junit4:junit4] 
[junit4:junit4] Suite: org.apache.solr.schema.CurrencyFieldTest
[junit4:junit4] Completed on J6 in 0.62s, 8 tests, 1 skipped
[junit4:junit4] 
[junit4:junit4] Suite: org.apache.solr.cloud.BasicDistributedZkTest
[junit4:junit4] Completed on J0 in 155.07s, 1 test
[junit4:junit4] 
[junit4:junit4] Suite: org.apache.solr.util.SimplePostToolTest
[junit4:junit4] Completed on J0 in 0.89s, 11 tests
[junit4:junit4] 
[junit4:junit4] Suite: org.apache.solr.core.CoreContainerCoreInitFailuresTest
[junit4:junit4] Completed on J0 in 0.33s, 2 tests
[junit4:junit4] 
[junit4:junit4] Suite: org.apache.solr.cloud.LeaderElectionIntegrationTest
[junit4:junit4] Completed on J6 in 20.60s, 2 tests
[junit4:junit4] 
[junit4:junit4] Suite: org.apache.solr.cloud.ClusterStateUpdateTest
[junit4:junit4] Completed on J6 in 5.98s, 1 test
[junit4:junit4] 
[junit4:junit4] Suite: org.apache.solr.internal.csv.writer.CSVWriterTest
[junit4:junit4] Completed on J6 in 0.01s, 2 tests
[junit4:junit4] 
[junit4:junit4] Suite: org.apache.solr.core.RAMDirectoryFactoryTest
[junit4:junit4] Completed on J6 in 0.02s, 1 test
[junit4:junit4] 
[junit4:junit4] Suite: org.apache.solr.request.JSONWriterTest
[junit4:junit4] Completed on J6 in 0.34s, 3 tests
[junit4:junit4] 
[junit4:junit4] Suite: org.apache.solr.highlight.HighlighterConfigTest
[junit4:junit4] Completed on J6 in 0.28s, 1 test
[junit4:junit4] 
[junit4:junit4] 
[junit4:junit4] Tests with failures:
[junit4:junit4]   - org.apache.solr.update.SoftAutoCommitTest.testSoftAndHardCommitMaxTimeRapidAdds
[junit4:junit4]   - org.apache.solr.update.SoftAutoCommitTest (suite)
[junit4:junit4] 
[junit4:junit4] 
[junit4:junit4] JVM J0:     1.12 ..   158.24 =   157.13s
[junit4:junit4] JVM J1:     0.87 ..   113.03 =   112.16s
[junit4:junit4] JVM J2:     1.12 ..   110.44 =   109.32s
[junit4:junit4] JVM J3:     1.10 ..   109.92 =   108.82s
[junit4:junit4] JVM J4:     0.86 ..   141.69 =   140.83s
[junit4:junit4] JVM J5:     0.87 ..   111.13 =   110.27s
[junit4:junit4] JVM J6:     0.87 ..   183.40 =   182.54s
[junit4:junit4] JVM J7:     1.10 ..   113.96 =   112.87s
[junit4:junit4] Execution time total: 3 minutes 3 seconds
[junit4:junit4] Tests summary: 233 suites, 965 tests, 1 suite-level error, 1 failure, 7 ignored
(2 assumptions)

BUILD FAILED
<http://sierranevada.servebeer.com/job/fast-io-beasting/ws/build.xml>:39: The following
error occurred while executing this line:
<http://sierranevada.servebeer.com/job/fast-io-beasting/ws/solr/build.xml>:178: The
following error occurred while executing this line:
<http://sierranevada.servebeer.com/job/fast-io-beasting/ws/lucene/module-build.xml>:61:
The following error occurred while executing this line:
<http://sierranevada.servebeer.com/job/fast-io-beasting/ws/lucene/common-build.xml>:1159:
The following error occurred while executing this line:
<http://sierranevada.servebeer.com/job/fast-io-beasting/ws/lucene/common-build.xml>:827:
There were test failures: 233 suites, 965 tests, 1 suite-level error, 1 failure, 7 ignored
(2 assumptions)

Total time: 7 minutes 56 seconds
Build step 'Invoke Ant' marked build as failure

---------------------------------------------------------------------
To unsubscribe, e-mail: dev-unsubscribe@lucene.apache.org
For additional commands, e-mail: dev-help@lucene.apache.org


Mime
View raw message