lucene-dev mailing list archives

Site index · List index
Message view « Date » · « Thread »
Top « Date » · « Thread »
From hudsonsevilt...@gmail.com
Subject Build failed in Jenkins: slow-io-beasting #668
Date Thu, 04 Oct 2012 15:48:13 GMT
See <http://sierranevada.servebeer.com:8080/job/slow-io-beasting/668/>

------------------------------------------
[...truncated 934 lines...]
[junit4:junit4] Completed on J3 in 0.03s, 2 tests
[junit4:junit4] 
[junit4:junit4] Suite: org.apache.lucene.search.TestFilteredSearch
[junit4:junit4] Completed on J0 in 0.03s, 1 test
[junit4:junit4] 
[junit4:junit4] Suite: org.apache.lucene.util.junitcompat.TestSetupTeardownChaining
[junit4:junit4] Completed on J1 in 0.03s, 2 tests
[junit4:junit4] 
[junit4:junit4] Suite: org.apache.lucene.search.TestDocIdSet
[junit4:junit4] Completed on J3 in 0.11s, 3 tests
[junit4:junit4] 
[junit4:junit4] Suite: org.apache.lucene.search.TestTermScorer
[junit4:junit4] Completed on J0 in 0.10s, 3 tests
[junit4:junit4] 
[junit4:junit4] Suite: org.apache.lucene.index.Test2BPostings
[junit4:junit4] IGNOR/A 0.02s J1 | Test2BPostings.test
[junit4:junit4]    > Assumption #1: 'nightly' test group is disabled (@Nightly)
[junit4:junit4] Completed on J1 in 0.03s, 1 test, 1 skipped
[junit4:junit4] 
[junit4:junit4] Suite: org.apache.lucene.index.TestFilterAtomicReader
[junit4:junit4] Completed on J3 in 0.09s, 2 tests
[junit4:junit4] 
[junit4:junit4] Suite: org.apache.lucene.search.TestFieldValueFilter
[junit4:junit4] Completed on J0 in 0.05s, 2 tests
[junit4:junit4] 
[junit4:junit4] Suite: org.apache.lucene.store.TestFileSwitchDirectory
[junit4:junit4] Completed on J1 in 0.05s, 4 tests
[junit4:junit4] 
[junit4:junit4] Suite: org.apache.lucene.search.TestDateFilter
[junit4:junit4] Completed on J3 in 0.03s, 2 tests
[junit4:junit4] 
[junit4:junit4] Suite: org.apache.lucene.search.TestMultiTermQueryRewrites
[junit4:junit4] Completed on J0 in 0.03s, 3 tests
[junit4:junit4] 
[junit4:junit4] Suite: org.apache.lucene.index.TestSegmentTermEnum
[junit4:junit4] Completed on J1 in 0.03s, 2 tests
[junit4:junit4] 
[junit4:junit4] Suite: org.apache.lucene.search.TestConstantScoreQuery
[junit4:junit4] Completed on J3 in 0.05s, 3 tests
[junit4:junit4] 
[junit4:junit4] Suite: org.apache.lucene.search.TestPhrasePrefixQuery
[junit4:junit4] Completed on J0 in 0.02s, 1 test
[junit4:junit4] 
[junit4:junit4] Suite: org.apache.lucene.document.TestDateTools
[junit4:junit4] Completed on J1 in 0.03s, 5 tests
[junit4:junit4] 
[junit4:junit4] Suite: org.apache.lucene.index.TestReaderClosed
[junit4:junit4] Completed on J3 in 0.02s, 2 tests
[junit4:junit4] 
[junit4:junit4] Suite: org.apache.lucene.search.TestElevationComparator
[junit4:junit4] Completed on J0 in 0.08s, 1 test
[junit4:junit4] 
[junit4:junit4] Suite: org.apache.lucene.search.TestExplanations
[junit4:junit4] Completed on J1 in 0.02s, 1 test
[junit4:junit4] 
[junit4:junit4] Suite: org.apache.lucene.search.TestMatchAllDocsQuery
[junit4:junit4] Completed on J3 in 0.02s, 2 tests
[junit4:junit4] 
[junit4:junit4] Suite: org.apache.lucene.search.TestNot
[junit4:junit4] Completed on J0 in 0.02s, 1 test
[junit4:junit4] 
[junit4:junit4] Suite: org.apache.lucene.util.TestAttributeSource
[junit4:junit4] Completed on J1 in 0.02s, 5 tests
[junit4:junit4] 
[junit4:junit4] Suite: org.apache.lucene.store.TestLock
[junit4:junit4] Completed on J3 in 0.03s, 1 test
[junit4:junit4] 
[junit4:junit4] Suite: org.apache.lucene.util.TestIntsRef
[junit4:junit4] Completed on J0 in 0.02s, 2 tests
[junit4:junit4] 
[junit4:junit4] Suite: org.apache.lucene.util.TestVirtualMethod
[junit4:junit4] Completed on J1 in 0.03s, 2 tests
[junit4:junit4] 
[junit4:junit4] Suite: org.apache.lucene.search.TestDocBoost
[junit4:junit4] Completed on J3 in 0.02s, 1 test
[junit4:junit4] 
[junit4:junit4] Suite: org.apache.lucene.util.TestNamedSPILoader
[junit4:junit4] Completed on J0 in 0.02s, 3 tests
[junit4:junit4] 
[junit4:junit4] Suite: org.apache.lucene.index.TestFieldInfos
[junit4:junit4] Completed on J1 in 0.02s, 2 tests
[junit4:junit4] 
[junit4:junit4] Suite: org.apache.lucene.index.TestRollback
[junit4:junit4] Completed on J3 in 0.02s, 1 test
[junit4:junit4] 
[junit4:junit4] Suite: org.apache.lucene.search.TestPositiveScoresOnlyCollector
[junit4:junit4] Completed on J0 in 0.02s, 1 test
[junit4:junit4] 
[junit4:junit4] Suite: org.apache.lucene.search.TestPrefixFilter
[junit4:junit4] Completed on J1 in 0.02s, 1 test
[junit4:junit4] 
[junit4:junit4] Suite: org.apache.lucene.util.TestVersion
[junit4:junit4] Completed on J3 in 0.02s, 2 tests
[junit4:junit4] 
[junit4:junit4] Suite: org.apache.lucene.index.TestIndexWriterLockRelease
[junit4:junit4] Completed on J0 in 0.02s, 1 test
[junit4:junit4] 
[junit4:junit4] Suite: org.apache.lucene.util.TestCloseableThreadLocal
[junit4:junit4] Completed on J1 in 0.02s, 3 tests
[junit4:junit4] 
[junit4:junit4] Suite: org.apache.lucene.util.TestVersionComparator
[junit4:junit4] Completed on J3 in 0.02s, 1 test
[junit4:junit4] 
[junit4:junit4] Suite: org.apache.lucene.index.TestNewestSegment
[junit4:junit4] Completed on J0 in 0.02s, 1 test
[junit4:junit4] 
[junit4:junit4] Suite: org.apache.lucene.analysis.TestCachingTokenFilter
[junit4:junit4] Completed on J1 in 0.02s, 1 test
[junit4:junit4] 
[junit4:junit4] Suite: org.apache.lucene.index.TestTermdocPerf
[junit4:junit4] Completed on J3 in 0.02s, 1 test
[junit4:junit4] 
[junit4:junit4] Suite: org.apache.lucene.index.TestTerm
[junit4:junit4] Completed on J0 in 0.02s, 1 test
[junit4:junit4] 
[junit4:junit4] Suite: org.apache.lucene.TestWorstCaseTestBehavior
[junit4:junit4] Completed on J1 in 0.02s, 6 tests, 6 skipped
[junit4:junit4] 
[junit4:junit4] Suite: org.apache.lucene.codecs.lucene3x.TestTermInfosReaderIndex
[junit4:junit4] Completed on J3 in 0.20s, 3 tests
[junit4:junit4] 
[junit4:junit4] Suite: org.apache.lucene.index.TestPayloadsOnVectors
[junit4:junit4] Completed on J1 in 0.03s, 3 tests
[junit4:junit4] 
[junit4:junit4] Suite: org.apache.lucene.search.TestConjunctions
[junit4:junit4] Completed on J1 in 0.05s, 1 test
[junit4:junit4] 
[junit4:junit4] Suite: org.apache.lucene.store.TestMockDirectoryWrapper
[junit4:junit4] Completed on J1 in 0.02s, 2 tests
[junit4:junit4] 
[junit4:junit4] Suite: org.apache.lucene.util.TestFilterIterator
[junit4:junit4] Completed on J1 in 0.05s, 8 tests
[junit4:junit4] 
[junit4:junit4] Suite: org.apache.lucene.util.junitcompat.TestFailIfDirectoryNotClosed
[junit4:junit4] Completed on J1 in 0.02s, 1 test
[junit4:junit4] 
[junit4:junit4] Suite: org.apache.lucene.util.junitcompat.TestLeaveFilesIfTestFails
[junit4:junit4] Completed on J1 in 0.02s, 1 test
[junit4:junit4] 
[junit4:junit4] Suite: org.apache.lucene.index.TestPostingsFormat
[junit4:junit4] Completed on J3 in 1.79s, 1 test
[junit4:junit4] 
[junit4:junit4] Suite: org.apache.lucene.index.TestDocumentsWriterStallControl
[junit4:junit4]   2> NOTE: reproduce with: ant test  -Dtestcase=TestDocumentsWriterStallControl
-Dtests.method=testSimpleStall -Dtests.seed=E24C659A4D806BF -Dtests.slow=true -Dtests.locale=ja_JP
-Dtests.timezone=Asia/Calcutta -Dtests.file.encoding=Cp1252
[junit4:junit4] FAILURE 0.19s J2 | TestDocumentsWriterStallControl.testSimpleStall <<<
[junit4:junit4]    > Throwable #1: java.lang.AssertionError: timed out waiting for state:
WAITING timeout: 100 ms
[junit4:junit4]    > 	at __randomizedtesting.SeedInfo.seed([E24C659A4D806BF:5DB3D0C125D6D388]:0)
[junit4:junit4]    > 	at org.junit.Assert.fail(Assert.java:93)
[junit4:junit4]    > 	at org.apache.lucene.index.TestDocumentsWriterStallControl.awaitState(TestDocumentsWriterStallControl.java:348)
[junit4:junit4]    > 	at org.apache.lucene.index.TestDocumentsWriterStallControl.testSimpleStall(TestDocumentsWriterStallControl.java:49)
[junit4:junit4]    > 	at sun.reflect.NativeMethodAccessorImpl.invoke0(Native Method)
[junit4:junit4]    > 	at sun.reflect.NativeMethodAccessorImpl.invoke(NativeMethodAccessorImpl.java:39)
[junit4:junit4]    > 	at sun.reflect.DelegatingMethodAccessorImpl.invoke(DelegatingMethodAccessorImpl.java:25)
[junit4:junit4]    > 	at java.lang.reflect.Method.invoke(Method.java:597)
[junit4:junit4]    > 	at com.carrotsearch.randomizedtesting.RandomizedRunner.invoke(RandomizedRunner.java:1559)
[junit4:junit4]    > 	at com.carrotsearch.randomizedtesting.RandomizedRunner.access$600(RandomizedRunner.java:79)
[junit4:junit4]    > 	at com.carrotsearch.randomizedtesting.RandomizedRunner$6.evaluate(RandomizedRunner.java:737)
[junit4:junit4]    > 	at com.carrotsearch.randomizedtesting.RandomizedRunner$7.evaluate(RandomizedRunner.java:773)
[junit4:junit4]    > 	at com.carrotsearch.randomizedtesting.RandomizedRunner$8.evaluate(RandomizedRunner.java:787)
[junit4:junit4]    > 	at org.apache.lucene.util.TestRuleSetupTeardownChained$1.evaluate(TestRuleSetupTeardownChained.java:50)
[junit4:junit4]    > 	at org.apache.lucene.util.TestRuleFieldCacheSanity$1.evaluate(TestRuleFieldCacheSanity.java:51)
[junit4:junit4]    > 	at org.apache.lucene.util.AbstractBeforeAfterRule$1.evaluate(AbstractBeforeAfterRule.java:45)
[junit4:junit4]    > 	at com.carrotsearch.randomizedtesting.rules.SystemPropertiesInvariantRule$1.evaluate(SystemPropertiesInvariantRule.java:55)
[junit4:junit4]    > 	at org.apache.lucene.util.TestRuleThreadAndTestName$1.evaluate(TestRuleThreadAndTestName.java:48)
[junit4:junit4]    > 	at org.apache.lucene.util.TestRuleIgnoreAfterMaxFailures$1.evaluate(TestRuleIgnoreAfterMaxFailures.java:70)
[junit4:junit4]    > 	at org.apache.lucene.util.TestRuleMarkFailure$1.evaluate(TestRuleMarkFailure.java:48)
[junit4:junit4]    > 	at com.carrotsearch.randomizedtesting.rules.StatementAdapter.evaluate(StatementAdapter.java:36)
[junit4:junit4]    > 	at com.carrotsearch.randomizedtesting.ThreadLeakControl$StatementRunner.run(ThreadLeakControl.java:358)
[junit4:junit4]    > 	at com.carrotsearch.randomizedtesting.ThreadLeakControl.forkTimeoutingTask(ThreadLeakControl.java:782)
[junit4:junit4]    > 	at com.carrotsearch.randomizedtesting.ThreadLeakControl$3.evaluate(ThreadLeakControl.java:442)
[junit4:junit4]    > 	at com.carrotsearch.randomizedtesting.RandomizedRunner.runSingleTest(RandomizedRunner.java:746)
[junit4:junit4]    > 	at com.carrotsearch.randomizedtesting.RandomizedRunner$3.evaluate(RandomizedRunner.java:648)
[junit4:junit4]    > 	at com.carrotsearch.randomizedtesting.RandomizedRunner$4.evaluate(RandomizedRunner.java:682)
[junit4:junit4]    > 	at com.carrotsearch.randomizedtesting.RandomizedRunner$5.evaluate(RandomizedRunner.java:693)
[junit4:junit4]    > 	at org.apache.lucene.util.AbstractBeforeAfterRule$1.evaluate(AbstractBeforeAfterRule.java:45)
[junit4:junit4]    > 	at org.apache.lucene.util.TestRuleStoreClassName$1.evaluate(TestRuleStoreClassName.java:42)
[junit4:junit4]    > 	at com.carrotsearch.randomizedtesting.rules.SystemPropertiesInvariantRule$1.evaluate(SystemPropertiesInvariantRule.java:55)
[junit4:junit4]    > 	at com.carrotsearch.randomizedtesting.rules.NoShadowingOrOverridesOnMethodsRule$1.evaluate(NoShadowingOrOverridesOnMethodsRule.java:39)
[junit4:junit4]    > 	at com.carrotsearch.randomizedtesting.rules.NoShadowingOrOverridesOnMethodsRule$1.evaluate(NoShadowingOrOverridesOnMethodsRule.java:39)
[junit4:junit4]    > 	at com.carrotsearch.randomizedtesting.rules.StatementAdapter.evaluate(StatementAdapter.java:36)
[junit4:junit4]    > 	at org.apache.lucene.util.TestRuleAssertionsRequired$1.evaluate(TestRuleAssertionsRequired.java:43)
[junit4:junit4]    > 	at org.apache.lucene.util.TestRuleMarkFailure$1.evaluate(TestRuleMarkFailure.java:48)
[junit4:junit4]    > 	at org.apache.lucene.util.TestRuleIgnoreAfterMaxFailures$1.evaluate(TestRuleIgnoreAfterMaxFailures.java:70)
[junit4:junit4]    > 	at org.apache.lucene.util.TestRuleIgnoreTestSuites$1.evaluate(TestRuleIgnoreTestSuites.java:55)
[junit4:junit4]    > 	at com.carrotsearch.randomizedtesting.rules.StatementAdapter.evaluate(StatementAdapter.java:36)
[junit4:junit4]    > 	at com.carrotsearch.randomizedtesting.ThreadLeakControl$StatementRunner.run(ThreadLeakControl.java:358)
[junit4:junit4]    > 	at java.lang.Thread.run(Thread.java:662)
[junit4:junit4]   2> Oct 4, 2012 11:47:50 AM com.carrotsearch.randomizedtesting.ThreadLeakControl
checkThreadLeaks
[junit4:junit4]   2> WARNING: Will linger awaiting termination of 2 leaked thread(s).
[junit4:junit4]   2> Oct 4, 2012 11:48:10 AM com.carrotsearch.randomizedtesting.ThreadLeakControl
checkThreadLeaks
[junit4:junit4]   2> SEVERE: 2 threads leaked from SUITE scope at org.apache.lucene.index.TestDocumentsWriterStallControl:

[junit4:junit4]   2>    1) Thread[id=413, name=Thread-244, state=WAITING, group=TGRP-TestDocumentsWriterStallControl]
[junit4:junit4]   2>         at java.lang.Object.wait(Native Method)
[junit4:junit4]   2>         at java.lang.Object.wait(Object.java:485)
[junit4:junit4]   2>         at org.apache.lucene.index.DocumentsWriterStallControl.waitIfStalled(DocumentsWriterStallControl.java:74)
[junit4:junit4]   2>         at org.apache.lucene.index.TestDocumentsWriterStallControl$2.run(TestDocumentsWriterStallControl.java:322)
[junit4:junit4]   2>    2) Thread[id=414, name=Thread-245, state=WAITING, group=TGRP-TestDocumentsWriterStallControl]
[junit4:junit4]   2>         at java.lang.Object.wait(Native Method)
[junit4:junit4]   2>         at java.lang.Object.wait(Object.java:485)
[junit4:junit4]   2>         at org.apache.lucene.index.DocumentsWriterStallControl.waitIfStalled(DocumentsWriterStallControl.java:74)
[junit4:junit4]   2>         at org.apache.lucene.index.TestDocumentsWriterStallControl$2.run(TestDocumentsWriterStallControl.java:322)
[junit4:junit4]   2> Oct 4, 2012 11:48:10 AM com.carrotsearch.randomizedtesting.ThreadLeakControl
tryToInterruptAll
[junit4:junit4]   2> INFO: Starting to interrupt leaked threads:
[junit4:junit4]   2>    1) Thread[id=413, name=Thread-244, state=WAITING, group=TGRP-TestDocumentsWriterStallControl]
[junit4:junit4]   2>    2) Thread[id=414, name=Thread-245, state=WAITING, group=TGRP-TestDocumentsWriterStallControl]
[junit4:junit4]   2> Oct 4, 2012 11:48:10 AM com.carrotsearch.randomizedtesting.ThreadLeakControl
tryToInterruptAll
[junit4:junit4]   2> INFO: All leaked threads terminated.
[junit4:junit4]   2> NOTE: test params are: codec=Lucene40: {}, sim=RandomSimilarityProvider(queryNorm=false,coord=crazy):
{}, locale=ja_JP, timezone=Asia/Calcutta
[junit4:junit4]   2> NOTE: Windows Vista 6.0 x86/Sun Microsystems Inc. 1.6.0_23 (32-bit)/cpus=4,threads=1,free=13840808,total=52891648
[junit4:junit4]   2> NOTE: All tests run in this JVM: [TestUTF32ToUTF8, TestStressNRT,
MultiCollectorTest, TestTermVectorsReader, TestMockCharFilter, TestTransactions, TestFSTs,
TestComplexExplanations, TestMultiLevelSkipList, TestQueryWrapperFilter, TestSetOnce, TestSimilarityBase,
TestFieldCacheRewriteMethod, TestScoreCachingWrappingScorer, Nested, Nested, TestBoolean2,
TestTypePromotion, TestIndexWriterNRTIsCurrent, TestSimilarityProvider, TestTopScoreDocCollector,
TestSimpleAttributeImpl, TestFieldCacheTermsFilter, TestMultiThreadTermVectors, TestIndexWriterOnJRECrash,
TestTwoPhaseCommitTool, TestCharFilter, TestNoMergeScheduler, TestNRTManager, TestFilteredQuery,
TestSpanExplanations, TestRegexpQuery, TestIndexFileDeleter, TestTermsEnum, TestSpanExplanationsOfNonMatches,
TestNoMergePolicy, TestUnicodeUtil, TestCachingCollector, TestField, TestRegexpRandom, TestNeverDelete,
TestSearcherManager, TestByteSlices, TestIndexWriterMerging, TestOpenBitSet, TestTimeLimitingCollector,
TestDirectoryReaderReopen, TestCollectionUtil, TestDocumentsWriterStallControl]
[junit4:junit4]   2> NOTE: reproduce with: ant test  -Dtestcase=TestDocumentsWriterStallControl
-Dtests.seed=E24C659A4D806BF -Dtests.slow=true -Dtests.locale=ja_JP -Dtests.timezone=Asia/Calcutta
-Dtests.file.encoding=Cp1252
[junit4:junit4] ERROR   0.00s J2 | TestDocumentsWriterStallControl (suite) <<<
[junit4:junit4]    > Throwable #1: com.carrotsearch.randomizedtesting.ThreadLeakError:
2 threads leaked from SUITE scope at org.apache.lucene.index.TestDocumentsWriterStallControl:

[junit4:junit4]    >    1) Thread[id=413, name=Thread-244, state=WAITING, group=TGRP-TestDocumentsWriterStallControl]
[junit4:junit4]    >         at java.lang.Object.wait(Native Method)
[junit4:junit4]    >         at java.lang.Object.wait(Object.java:485)
[junit4:junit4]    >         at org.apache.lucene.index.DocumentsWriterStallControl.waitIfStalled(DocumentsWriterStallControl.java:74)
[junit4:junit4]    >         at org.apache.lucene.index.TestDocumentsWriterStallControl$2.run(TestDocumentsWriterStallControl.java:322)
[junit4:junit4]    >    2) Thread[id=414, name=Thread-245, state=WAITING, group=TGRP-TestDocumentsWriterStallControl]
[junit4:junit4]    >         at java.lang.Object.wait(Native Method)
[junit4:junit4]    >         at java.lang.Object.wait(Object.java:485)
[junit4:junit4]    >         at org.apache.lucene.index.DocumentsWriterStallControl.waitIfStalled(DocumentsWriterStallControl.java:74)
[junit4:junit4]    >         at org.apache.lucene.index.TestDocumentsWriterStallControl$2.run(TestDocumentsWriterStallControl.java:322)
[junit4:junit4]    > 	at __randomizedtesting.SeedInfo.seed([E24C659A4D806BF]:0)
[junit4:junit4] Completed on J2 in 21.56s, 3 tests, 1 failure, 1 error <<< FAILURES!
[junit4:junit4] 
[junit4:junit4] Suite: org.apache.lucene.index.TestBackwardsCompatibility3x
[junit4:junit4] Completed on J0 in 5.91s, 16 tests
[junit4:junit4] 
[junit4:junit4] 
[junit4:junit4] Tests with failures:
[junit4:junit4]   - org.apache.lucene.index.TestDocumentsWriterStallControl.testSimpleStall
[junit4:junit4]   - org.apache.lucene.index.TestDocumentsWriterStallControl (suite)
[junit4:junit4] 
[junit4:junit4] 
[junit4:junit4] JVM J0:     1.01 ..    97.30 =    96.29s
[junit4:junit4] JVM J1:     1.01 ..    92.90 =    91.89s
[junit4:junit4] JVM J2:     0.76 ..    94.48 =    93.72s
[junit4:junit4] JVM J3:     0.76 ..    93.28 =    92.51s
[junit4:junit4] Execution time total: 1 minute 37 seconds
[junit4:junit4] Tests summary: 311 suites, 1790 tests, 1 suite-level error, 1 failure, 17
ignored (9 assumptions)

BUILD FAILED
<http://sierranevada.servebeer.com:8080/job/slow-io-beasting/ws/build.xml>:49: The following
error occurred while executing this line:
<http://sierranevada.servebeer.com:8080/job/slow-io-beasting/ws/common-build.xml>:1142:
The following error occurred while executing this line:
<http://sierranevada.servebeer.com:8080/job/slow-io-beasting/ws/common-build.xml>:815:
There were test failures: 311 suites, 1790 tests, 1 suite-level error, 1 failure, 17 ignored
(9 assumptions)

Total time: 1 minute 46 seconds
Build step 'Invoke Ant' marked build as failure

---------------------------------------------------------------------
To unsubscribe, e-mail: dev-unsubscribe@lucene.apache.org
For additional commands, e-mail: dev-help@lucene.apache.org


Mime
View raw message