lucene-dev mailing list archives

Site index · List index
Message view « Date » · « Thread »
Top « Date » · « Thread »
From Policeman Jenkins Server <jenk...@sd-datasolutions.de>
Subject [JENKINS] Lucene-Solr-trunk-Windows (32bit/jdk1.7.0_07) - Build # 1325 - Still Failing!
Date Sat, 27 Oct 2012 10:09:33 GMT
Build: http://jenkins.sd-datasolutions.de/job/Lucene-Solr-trunk-Windows/1325/
Java: 32bit/jdk1.7.0_07 -client -XX:+UseG1GC

3 tests failed.
REGRESSION:  org.apache.solr.cloud.SyncSliceTest.testDistribSearch

Error Message:
Shard still reported as live in zk - 0 jetty

Stack Trace:
java.lang.AssertionError: Shard still reported as live in zk - 0 jetty
	at __randomizedtesting.SeedInfo.seed([1ECA0BCAF88E7D7D:9F2C85D28FD11D41]:0)
	at org.junit.Assert.fail(Assert.java:93)
	at org.apache.solr.cloud.AbstractFullDistribZkTestBase.waitToSeeNotLive(AbstractFullDistribZkTestBase.java:1231)
	at org.apache.solr.cloud.AbstractFullDistribZkTestBase.waitToSeeNotLive(AbstractFullDistribZkTestBase.java:1216)
	at org.apache.solr.cloud.SyncSliceTest.waitToSeeDownInClusterState(SyncSliceTest.java:259)
	at org.apache.solr.cloud.SyncSliceTest.doTest(SyncSliceTest.java:163)
	at org.apache.solr.BaseDistributedSearchTestCase.testDistribSearch(BaseDistributedSearchTestCase.java:695)
	at sun.reflect.NativeMethodAccessorImpl.invoke0(Native Method)
	at sun.reflect.NativeMethodAccessorImpl.invoke(NativeMethodAccessorImpl.java:57)
	at sun.reflect.DelegatingMethodAccessorImpl.invoke(DelegatingMethodAccessorImpl.java:43)
	at java.lang.reflect.Method.invoke(Method.java:601)
	at com.carrotsearch.randomizedtesting.RandomizedRunner.invoke(RandomizedRunner.java:1559)
	at com.carrotsearch.randomizedtesting.RandomizedRunner.access$600(RandomizedRunner.java:79)
	at com.carrotsearch.randomizedtesting.RandomizedRunner$6.evaluate(RandomizedRunner.java:737)
	at com.carrotsearch.randomizedtesting.RandomizedRunner$7.evaluate(RandomizedRunner.java:773)
	at com.carrotsearch.randomizedtesting.RandomizedRunner$8.evaluate(RandomizedRunner.java:787)
	at com.carrotsearch.randomizedtesting.rules.SystemPropertiesRestoreRule$1.evaluate(SystemPropertiesRestoreRule.java:53)
	at org.apache.lucene.util.TestRuleSetupTeardownChained$1.evaluate(TestRuleSetupTeardownChained.java:50)
	at org.apache.lucene.util.TestRuleFieldCacheSanity$1.evaluate(TestRuleFieldCacheSanity.java:51)
	at org.apache.lucene.util.AbstractBeforeAfterRule$1.evaluate(AbstractBeforeAfterRule.java:45)
	at com.carrotsearch.randomizedtesting.rules.SystemPropertiesInvariantRule$1.evaluate(SystemPropertiesInvariantRule.java:55)
	at org.apache.lucene.util.TestRuleThreadAndTestName$1.evaluate(TestRuleThreadAndTestName.java:48)
	at org.apache.lucene.util.TestRuleIgnoreAfterMaxFailures$1.evaluate(TestRuleIgnoreAfterMaxFailures.java:70)
	at org.apache.lucene.util.TestRuleMarkFailure$1.evaluate(TestRuleMarkFailure.java:48)
	at com.carrotsearch.randomizedtesting.rules.StatementAdapter.evaluate(StatementAdapter.java:36)
	at com.carrotsearch.randomizedtesting.ThreadLeakControl$StatementRunner.run(ThreadLeakControl.java:358)
	at com.carrotsearch.randomizedtesting.ThreadLeakControl.forkTimeoutingTask(ThreadLeakControl.java:782)
	at com.carrotsearch.randomizedtesting.ThreadLeakControl$3.evaluate(ThreadLeakControl.java:442)
	at com.carrotsearch.randomizedtesting.RandomizedRunner.runSingleTest(RandomizedRunner.java:746)
	at com.carrotsearch.randomizedtesting.RandomizedRunner$3.evaluate(RandomizedRunner.java:648)
	at com.carrotsearch.randomizedtesting.RandomizedRunner$4.evaluate(RandomizedRunner.java:682)
	at com.carrotsearch.randomizedtesting.RandomizedRunner$5.evaluate(RandomizedRunner.java:693)
	at com.carrotsearch.randomizedtesting.rules.StatementAdapter.evaluate(StatementAdapter.java:36)
	at com.carrotsearch.randomizedtesting.rules.SystemPropertiesRestoreRule$1.evaluate(SystemPropertiesRestoreRule.java:53)
	at org.apache.lucene.util.AbstractBeforeAfterRule$1.evaluate(AbstractBeforeAfterRule.java:45)
	at org.apache.lucene.util.TestRuleStoreClassName$1.evaluate(TestRuleStoreClassName.java:42)
	at com.carrotsearch.randomizedtesting.rules.SystemPropertiesInvariantRule$1.evaluate(SystemPropertiesInvariantRule.java:55)
	at com.carrotsearch.randomizedtesting.rules.NoShadowingOrOverridesOnMethodsRule$1.evaluate(NoShadowingOrOverridesOnMethodsRule.java:39)
	at com.carrotsearch.randomizedtesting.rules.NoShadowingOrOverridesOnMethodsRule$1.evaluate(NoShadowingOrOverridesOnMethodsRule.java:39)
	at com.carrotsearch.randomizedtesting.rules.StatementAdapter.evaluate(StatementAdapter.java:36)
	at org.apache.lucene.util.TestRuleAssertionsRequired$1.evaluate(TestRuleAssertionsRequired.java:43)
	at org.apache.lucene.util.TestRuleMarkFailure$1.evaluate(TestRuleMarkFailure.java:48)
	at org.apache.lucene.util.TestRuleIgnoreAfterMaxFailures$1.evaluate(TestRuleIgnoreAfterMaxFailures.java:70)
	at org.apache.lucene.util.TestRuleIgnoreTestSuites$1.evaluate(TestRuleIgnoreTestSuites.java:55)
	at com.carrotsearch.randomizedtesting.rules.StatementAdapter.evaluate(StatementAdapter.java:36)
	at com.carrotsearch.randomizedtesting.ThreadLeakControl$StatementRunner.run(ThreadLeakControl.java:358)
	at java.lang.Thread.run(Thread.java:722)


FAILED:  junit.framework.TestSuite.org.apache.solr.handler.TestReplicationHandler

Error Message:
Resource in scope SUITE failed to close. Resource was registered from thread Thread[id=2712, name=TEST-TestReplicationHandler.test-seed#[1ECA0BCAF88E7D7D], state=RUNNABLE, group=TGRP-TestReplicationHandler], registration stack trace below.

Stack Trace:
com.carrotsearch.randomizedtesting.ResourceDisposalError: Resource in scope SUITE failed to close. Resource was registered from thread Thread[id=2712, name=TEST-TestReplicationHandler.test-seed#[1ECA0BCAF88E7D7D], state=RUNNABLE, group=TGRP-TestReplicationHandler], registration stack trace below.
	at java.lang.Thread.getStackTrace(Thread.java:1567)
	at com.carrotsearch.randomizedtesting.RandomizedContext.closeAtEnd(RandomizedContext.java:150)
	at org.apache.lucene.util.LuceneTestCase.closeAfterSuite(LuceneTestCase.java:514)
	at org.apache.lucene.util.LuceneTestCase.wrapDirectory(LuceneTestCase.java:958)
	at org.apache.lucene.util.LuceneTestCase.newDirectory(LuceneTestCase.java:872)
	at org.apache.lucene.util.LuceneTestCase.newDirectory(LuceneTestCase.java:864)
	at org.apache.solr.core.MockDirectoryFactory.create(MockDirectoryFactory.java:33)
	at org.apache.solr.core.CachingDirectoryFactory.get(CachingDirectoryFactory.java:221)
	at org.apache.solr.update.SolrIndexWriter.create(SolrIndexWriter.java:60)
	at org.apache.solr.core.SolrCore.initIndex(SolrCore.java:502)
	at org.apache.solr.core.SolrCore.<init>(SolrCore.java:705)
	at org.apache.solr.core.SolrCore.<init>(SolrCore.java:618)
	at org.apache.solr.core.CoreContainer.create(CoreContainer.java:842)
	at org.apache.solr.core.CoreContainer.load(CoreContainer.java:529)
	at org.apache.solr.core.CoreContainer$Initializer.initialize(CoreContainer.java:306)
	at org.apache.solr.servlet.SolrDispatchFilter.init(SolrDispatchFilter.java:107)
	at org.eclipse.jetty.servlet.FilterHolder.doStart(FilterHolder.java:114)
	at org.eclipse.jetty.util.component.AbstractLifeCycle.start(AbstractLifeCycle.java:59)
	at org.eclipse.jetty.servlet.ServletHandler.initialize(ServletHandler.java:754)
	at org.eclipse.jetty.servlet.ServletHandler.updateMappings(ServletHandler.java:1227)
	at org.eclipse.jetty.servlet.ServletHandler.setFilterMappings(ServletHandler.java:1263)
	at org.eclipse.jetty.servlet.ServletHandler.addFilterWithMapping(ServletHandler.java:965)
	at org.eclipse.jetty.servlet.ServletHandler.addFilterWithMapping(ServletHandler.java:923)
	at org.eclipse.jetty.servlet.ServletContextHandler.addFilter(ServletContextHandler.java:333)
	at org.apache.solr.client.solrj.embedded.JettySolrRunner$1.lifeCycleStarted(JettySolrRunner.java:173)
	at org.eclipse.jetty.util.component.AbstractLifeCycle.setStarted(AbstractLifeCycle.java:169)
	at org.eclipse.jetty.util.component.AbstractLifeCycle.start(AbstractLifeCycle.java:60)
	at org.apache.solr.client.solrj.embedded.JettySolrRunner.start(JettySolrRunner.java:225)
	at org.apache.solr.client.solrj.embedded.JettySolrRunner.start(JettySolrRunner.java:205)
	at org.apache.solr.handler.TestReplicationHandler.createJetty(TestReplicationHandler.java:131)
	at org.apache.solr.handler.TestReplicationHandler.doTestIndexAndConfigReplication(TestReplicationHandler.java:410)
	at org.apache.solr.handler.TestReplicationHandler.test(TestReplicationHandler.java:254)
	at sun.reflect.NativeMethodAccessorImpl.invoke0(Native Method)
	at sun.reflect.NativeMethodAccessorImpl.invoke(NativeMethodAccessorImpl.java:57)
	at sun.reflect.DelegatingMethodAccessorImpl.invoke(DelegatingMethodAccessorImpl.java:43)
	at java.lang.reflect.Method.invoke(Method.java:601)
	at com.carrotsearch.randomizedtesting.RandomizedRunner.invoke(RandomizedRunner.java:1559)
	at com.carrotsearch.randomizedtesting.RandomizedRunner.access$600(RandomizedRunner.java:79)
	at com.carrotsearch.randomizedtesting.RandomizedRunner$6.evaluate(RandomizedRunner.java:737)
	at com.carrotsearch.randomizedtesting.RandomizedRunner$7.evaluate(RandomizedRunner.java:773)
	at com.carrotsearch.randomizedtesting.RandomizedRunner$8.evaluate(RandomizedRunner.java:787)
	at com.carrotsearch.randomizedtesting.rules.SystemPropertiesRestoreRule$1.evaluate(SystemPropertiesRestoreRule.java:53)
	at org.apache.lucene.util.TestRuleSetupTeardownChained$1.evaluate(TestRuleSetupTeardownChained.java:50)
	at org.apache.lucene.util.TestRuleFieldCacheSanity$1.evaluate(TestRuleFieldCacheSanity.java:51)
	at org.apache.lucene.util.AbstractBeforeAfterRule$1.evaluate(AbstractBeforeAfterRule.java:45)
	at com.carrotsearch.randomizedtesting.rules.SystemPropertiesInvariantRule$1.evaluate(SystemPropertiesInvariantRule.java:55)
	at org.apache.lucene.util.TestRuleThreadAndTestName$1.evaluate(TestRuleThreadAndTestName.java:48)
	at org.apache.lucene.util.TestRuleIgnoreAfterMaxFailures$1.evaluate(TestRuleIgnoreAfterMaxFailures.java:70)
	at org.apache.lucene.util.TestRuleMarkFailure$1.evaluate(TestRuleMarkFailure.java:48)
	at com.carrotsearch.randomizedtesting.rules.StatementAdapter.evaluate(StatementAdapter.java:36)
	at com.carrotsearch.randomizedtesting.ThreadLeakControl$StatementRunner.run(ThreadLeakControl.java:358)
	at com.carrotsearch.randomizedtesting.ThreadLeakControl.forkTimeoutingTask(ThreadLeakControl.java:782)
	at com.carrotsearch.randomizedtesting.ThreadLeakControl$3.evaluate(ThreadLeakControl.java:442)
	at com.carrotsearch.randomizedtesting.RandomizedRunner.runSingleTest(RandomizedRunner.java:746)
	at com.carrotsearch.randomizedtesting.RandomizedRunner$3.evaluate(RandomizedRunner.java:648)
	at com.carrotsearch.randomizedtesting.RandomizedRunner$4.evaluate(RandomizedRunner.java:682)
	at com.carrotsearch.randomizedtesting.RandomizedRunner$5.evaluate(RandomizedRunner.java:693)
	at com.carrotsearch.randomizedtesting.rules.StatementAdapter.evaluate(StatementAdapter.java:36)
	at com.carrotsearch.randomizedtesting.rules.SystemPropertiesRestoreRule$1.evaluate(SystemPropertiesRestoreRule.java:53)
	at org.apache.lucene.util.AbstractBeforeAfterRule$1.evaluate(AbstractBeforeAfterRule.java:45)
	at org.apache.lucene.util.TestRuleStoreClassName$1.evaluate(TestRuleStoreClassName.java:42)
	at com.carrotsearch.randomizedtesting.rules.SystemPropertiesInvariantRule$1.evaluate(SystemPropertiesInvariantRule.java:55)
	at com.carrotsearch.randomizedtesting.rules.NoShadowingOrOverridesOnMethodsRule$1.evaluate(NoShadowingOrOverridesOnMethodsRule.java:39)
	at com.carrotsearch.randomizedtesting.rules.NoShadowingOrOverridesOnMethodsRule$1.evaluate(NoShadowingOrOverridesOnMethodsRule.java:39)
	at com.carrotsearch.randomizedtesting.rules.StatementAdapter.evaluate(StatementAdapter.java:36)
	at org.apache.lucene.util.TestRuleAssertionsRequired$1.evaluate(TestRuleAssertionsRequired.java:43)
	at org.apache.lucene.util.TestRuleMarkFailure$1.evaluate(TestRuleMarkFailure.java:48)
	at org.apache.lucene.util.TestRuleIgnoreAfterMaxFailures$1.evaluate(TestRuleIgnoreAfterMaxFailures.java:70)
	at org.apache.lucene.util.TestRuleIgnoreTestSuites$1.evaluate(TestRuleIgnoreTestSuites.java:55)
	at com.carrotsearch.randomizedtesting.rules.StatementAdapter.evaluate(StatementAdapter.java:36)
	at com.carrotsearch.randomizedtesting.ThreadLeakControl$StatementRunner.run(ThreadLeakControl.java:358)
	at java.lang.Thread.run(Thread.java:722)
Caused by: java.lang.AssertionError: Directory not closed: MockDirWrapper(org.apache.lucene.store.RAMDirectory@f82334 lockFactory=org.apache.lucene.store.SingleInstanceLockFactory@1e7033a)
	at org.junit.Assert.fail(Assert.java:93)
	at org.apache.lucene.util.CloseableDirectory.close(CloseableDirectory.java:47)
	at com.carrotsearch.randomizedtesting.RandomizedRunner$2$1.apply(RandomizedRunner.java:602)
	at com.carrotsearch.randomizedtesting.RandomizedRunner$2$1.apply(RandomizedRunner.java:599)
	at com.carrotsearch.randomizedtesting.RandomizedContext.closeResources(RandomizedContext.java:167)
	at com.carrotsearch.randomizedtesting.RandomizedRunner$2.afterAlways(RandomizedRunner.java:615)
	at com.carrotsearch.randomizedtesting.rules.StatementAdapter.evaluate(StatementAdapter.java:43)
	... 2 more


FAILED:  junit.framework.TestSuite.org.apache.solr.handler.TestReplicationHandler

Error Message:
Resource in scope SUITE failed to close. Resource was registered from thread Thread[id=2835, name=Thread-1193, state=RUNNABLE, group=TGRP-TestReplicationHandler], registration stack trace below.

Stack Trace:
com.carrotsearch.randomizedtesting.ResourceDisposalError: Resource in scope SUITE failed to close. Resource was registered from thread Thread[id=2835, name=Thread-1193, state=RUNNABLE, group=TGRP-TestReplicationHandler], registration stack trace below.
	at java.lang.Thread.getStackTrace(Thread.java:1567)
	at com.carrotsearch.randomizedtesting.RandomizedContext.closeAtEnd(RandomizedContext.java:150)
	at org.apache.lucene.util.LuceneTestCase.closeAfterSuite(LuceneTestCase.java:514)
	at org.apache.lucene.util.LuceneTestCase.wrapDirectory(LuceneTestCase.java:958)
	at org.apache.lucene.util.LuceneTestCase.newDirectory(LuceneTestCase.java:872)
	at org.apache.lucene.util.LuceneTestCase.newDirectory(LuceneTestCase.java:864)
	at org.apache.solr.core.MockDirectoryFactory.create(MockDirectoryFactory.java:33)
	at org.apache.solr.core.CachingDirectoryFactory.get(CachingDirectoryFactory.java:221)
	at org.apache.solr.core.CachingDirectoryFactory.get(CachingDirectoryFactory.java:181)
	at org.apache.solr.handler.SnapPuller.fetchLatestIndex(SnapPuller.java:373)
	at org.apache.solr.handler.ReplicationHandler.doFetch(ReplicationHandler.java:273)
	at org.apache.solr.handler.ReplicationHandler$1.run(ReplicationHandler.java:181)
Caused by: java.lang.AssertionError: Directory not closed: MockDirWrapper(org.apache.lucene.store.RAMDirectory@86219e lockFactory=org.apache.lucene.store.SimpleFSLockFactory@b78cd4)
	at org.junit.Assert.fail(Assert.java:93)
	at org.apache.lucene.util.CloseableDirectory.close(CloseableDirectory.java:47)
	at com.carrotsearch.randomizedtesting.RandomizedRunner$2$1.apply(RandomizedRunner.java:602)
	at com.carrotsearch.randomizedtesting.RandomizedRunner$2$1.apply(RandomizedRunner.java:599)
	at com.carrotsearch.randomizedtesting.RandomizedContext.closeResources(RandomizedContext.java:167)
	at com.carrotsearch.randomizedtesting.RandomizedRunner$2.afterAlways(RandomizedRunner.java:615)
	at com.carrotsearch.randomizedtesting.rules.StatementAdapter.evaluate(StatementAdapter.java:43)
	at com.carrotsearch.randomizedtesting.ThreadLeakControl$StatementRunner.run(ThreadLeakControl.java:358)
	at java.lang.Thread.run(Thread.java:722)




Build Log:
[...truncated 8735 lines...]
[junit4:junit4] Suite: org.apache.solr.handler.TestReplicationHandler
[junit4:junit4]   2> 3 T2712 oas.SolrTestCaseJ4.setUp ###Starting test
[junit4:junit4]   2> 3 T2712 oas.SolrTestCaseJ4.setUp ###Starting test
[junit4:junit4]   2> 19 T2712 oejs.Server.doStart jetty-8.1.2.v20120308
[junit4:junit4]   2> 30 T2712 oejs.AbstractConnector.doStart Started SelectChannelConnector@0.0.0.0:50454
[junit4:junit4]   2> 32 T2712 oasc.SolrResourceLoader.locateSolrHome JNDI not configured for solr (NoInitialContextEx)
[junit4:junit4]   2> 32 T2712 oasc.SolrResourceLoader.locateSolrHome using system property solr.solr.home: .\org.apache.solr.handler.TestReplicationHandler$SolrInstance-1351332128579\master
[junit4:junit4]   2> 33 T2712 oasc.SolrResourceLoader.<init> new SolrResourceLoader for deduced Solr Home: '.\org.apache.solr.handler.TestReplicationHandler$SolrInstance-1351332128579\master\'
[junit4:junit4]   2> 80 T2712 oass.SolrDispatchFilter.init SolrDispatchFilter.init()
[junit4:junit4]   2> 81 T2712 oasc.SolrResourceLoader.locateSolrHome JNDI not configured for solr (NoInitialContextEx)
[junit4:junit4]   2> 81 T2712 oasc.SolrResourceLoader.locateSolrHome using system property solr.solr.home: .\org.apache.solr.handler.TestReplicationHandler$SolrInstance-1351332128579\master
[junit4:junit4]   2> 82 T2712 oasc.CoreContainer$Initializer.initialize looking for solr.xml: C:\Users\JenkinsSlave\workspace\Lucene-Solr-trunk-Windows\solr\build\solr-core\test\J0\.\org.apache.solr.handler.TestReplicationHandler$SolrInstance-1351332128579\master\solr.xml
[junit4:junit4]   2> 82 T2712 oasc.CoreContainer.<init> New CoreContainer 11332308
[junit4:junit4]   2> 85 T2712 oasc.CoreContainer$Initializer.initialize no solr.xml file found - using default
[junit4:junit4]   2> 85 T2712 oasc.CoreContainer.load Loading CoreContainer using Solr Home: '.\org.apache.solr.handler.TestReplicationHandler$SolrInstance-1351332128579\master\'
[junit4:junit4]   2> 85 T2712 oasc.SolrResourceLoader.<init> new SolrResourceLoader for directory: '.\org.apache.solr.handler.TestReplicationHandler$SolrInstance-1351332128579\master\'
[junit4:junit4]   2> 119 T2712 oasc.CoreContainer.load Registering Log Listener
[junit4:junit4]   2> 148 T2712 oasc.CoreContainer.create Creating SolrCore 'collection1' using instanceDir: .\org.apache.solr.handler.TestReplicationHandler$SolrInstance-1351332128579\master\collection1
[junit4:junit4]   2> 150 T2712 oasc.SolrResourceLoader.<init> new SolrResourceLoader for directory: '.\org.apache.solr.handler.TestReplicationHandler$SolrInstance-1351332128579\master\collection1\'
[junit4:junit4]   2> 203 T2712 oasc.SolrConfig.<init> Using Lucene MatchVersion: LUCENE_50
[junit4:junit4]   2> 283 T2712 oasc.SolrConfig.<init> Loaded SolrConfig: solrconfig.xml
[junit4:junit4]   2> 285 T2712 oass.IndexSchema.readSchema Reading Solr Schema
[junit4:junit4]   2> 290 T2712 oass.IndexSchema.readSchema Schema name=test
[junit4:junit4]   2> 317 T2712 oass.IndexSchema.readSchema unique key field: id
[junit4:junit4]   2> 320 T2712 oasc.SolrCore.<init> [collection1] Opening new SolrCore at .\org.apache.solr.handler.TestReplicationHandler$SolrInstance-1351332128579\master\collection1\, dataDir=.\org.apache.solr.handler.TestReplicationHandler$SolrInstance-1351332128579\master\collection1\data\
[junit4:junit4]   2> 320 T2712 oasc.SolrCore.<init> JMX monitoring not detected for core: collection1
[junit4:junit4]   2> 321 T2712 oasc.SolrCore.initDirectoryFactory org.apache.solr.core.MockDirectoryFactory
[junit4:junit4]   2> 322 T2712 oasc.CachingDirectoryFactory.injectLockFactory WARNING No lockType configured for MockDirWrapper(org.apache.lucene.store.RAMDirectory@eefd94 lockFactory=org.apache.lucene.store.SingleInstanceLockFactory@4a031a) assuming 'simple'
[junit4:junit4]   2> 322 T2712 oasc.CachingDirectoryFactory.get return new directory for C:\Users\JenkinsSlave\workspace\Lucene-Solr-trunk-Windows\solr\build\solr-core\test\J0\.\org.apache.solr.handler.TestReplicationHandler$SolrInstance-1351332128579\master\collection1\data forceNew:false
[junit4:junit4]   2> 323 T2712 oasc.CachingDirectoryFactory.close Releasing directory:C:\Users\JenkinsSlave\workspace\Lucene-Solr-trunk-Windows\solr\build\solr-core\test\J0\.\org.apache.solr.handler.TestReplicationHandler$SolrInstance-1351332128579\master\collection1\data
[junit4:junit4]   2> 323 T2712 oasc.SolrCore.getNewIndexDir New index directory detected: old=null new=.\org.apache.solr.handler.TestReplicationHandler$SolrInstance-1351332128579\master\collection1\data\index/
[junit4:junit4]   2> 324 T2712 oasc.SolrCore.initIndex WARNING [collection1] Solr index directory '.\org.apache.solr.handler.TestReplicationHandler$SolrInstance-1351332128579\master\collection1\data\index' doesn't exist. Creating new index...
[junit4:junit4]   2> 327 T2712 oasc.CachingDirectoryFactory.get return new directory for C:\Users\JenkinsSlave\workspace\Lucene-Solr-trunk-Windows\solr\build\solr-core\test\J0\.\org.apache.solr.handler.TestReplicationHandler$SolrInstance-1351332128579\master\collection1\data\index forceNew:false
[junit4:junit4]   2> 327 T2712 oasc.SolrDeletionPolicy.onCommit SolrDeletionPolicy.onCommit: commits:num=1
[junit4:junit4]   2> 		commit{dir=MockDirWrapper(org.apache.lucene.store.RAMDirectory@1eaa3ca lockFactory=org.apache.lucene.store.SingleInstanceLockFactory@1a2ca26),segFN=segments_1,generation=1,filenames=[segments_1]
[junit4:junit4]   2> 329 T2712 oasc.SolrDeletionPolicy.updateCommits newest commit = 1[segments_1]
[junit4:junit4]   2> 329 T2712 oasc.CachingDirectoryFactory.close Releasing directory:C:\Users\JenkinsSlave\workspace\Lucene-Solr-trunk-Windows\solr\build\solr-core\test\J0\.\org.apache.solr.handler.TestReplicationHandler$SolrInstance-1351332128579\master\collection1\data\index
[junit4:junit4]   2> 330 T2712 oasc.RequestHandlers.initHandlersFromConfig created standard: solr.StandardRequestHandler
[junit4:junit4]   2> 330 T2712 oasc.RequestHandlers.initHandlersFromConfig created /replication: solr.ReplicationHandler
[junit4:junit4]   2> 330 T2712 oasc.RequestHandlers.initHandlersFromConfig created defaults: solr.StandardRequestHandler
[junit4:junit4]   2> 331 T2712 oasc.RequestHandlers.initHandlersFromConfig adding lazy requestHandler: solr.StandardRequestHandler
[junit4:junit4]   2> 331 T2712 oasc.RequestHandlers.initHandlersFromConfig created lazy: solr.StandardRequestHandler
[junit4:junit4]   2> 331 T2712 oasc.RequestHandlers.initHandlersFromConfig created /update: solr.UpdateRequestHandler
[junit4:junit4]   2> 345 T2712 oashl.XMLLoader.init xsltCacheLifetimeSeconds=60
[junit4:junit4]   2> 352 T2712 oasc.CachingDirectoryFactory.close Releasing directory:C:\Users\JenkinsSlave\workspace\Lucene-Solr-trunk-Windows\solr\build\solr-core\test\J0\.\org.apache.solr.handler.TestReplicationHandler$SolrInstance-1351332128579\master\collection1\data
[junit4:junit4]   2> 352 T2712 oass.SolrIndexSearcher.<init> Opening Searcher@e8b893 main
[junit4:junit4]   2> 354 T2712 oasu.CommitTracker.<init> Hard AutoCommit: disabled
[junit4:junit4]   2> 354 T2712 oasu.CommitTracker.<init> Soft AutoCommit: disabled
[junit4:junit4]   2> 355 T2712 oashc.HttpShardHandlerFactory.getParameter Setting socketTimeout to: 0
[junit4:junit4]   2> 355 T2712 oashc.HttpShardHandlerFactory.getParameter Setting urlScheme to: http://
[junit4:junit4]   2> 356 T2712 oashc.HttpShardHandlerFactory.getParameter Setting connTimeout to: 0
[junit4:junit4]   2> 356 T2712 oashc.HttpShardHandlerFactory.getParameter Setting maxConnectionsPerHost to: 20
[junit4:junit4]   2> 356 T2712 oashc.HttpShardHandlerFactory.getParameter Setting corePoolSize to: 0
[junit4:junit4]   2> 358 T2712 oashc.HttpShardHandlerFactory.getParameter Setting maximumPoolSize to: 2147483647
[junit4:junit4]   2> 358 T2712 oashc.HttpShardHandlerFactory.getParameter Setting maxThreadIdleTime to: 5
[junit4:junit4]   2> 359 T2712 oashc.HttpShardHandlerFactory.getParameter Setting sizeOfQueue to: -1
[junit4:junit4]   2> 359 T2712 oashc.HttpShardHandlerFactory.getParameter Setting fairnessPolicy to: false
[junit4:junit4]   2> 359 T2712 oascsi.HttpClientUtil.createClient Creating new http client, config:maxConnectionsPerHost=20&maxConnections=10000&socketTimeout=0&connTimeout=0&retry=false
[junit4:junit4]   2> 369 T2712 oash.ReplicationHandler.inform Replication enabled for following config files: schema.xml,xslt/dummy.xsl
[junit4:junit4]   2> 370 T2712 oash.ReplicationHandler.inform Commits will be reserved for  10000
[junit4:junit4]   2> 370 T2722 oasc.SolrCore.registerSearcher [collection1] Registered new searcher Searcher@e8b893 main{StandardDirectoryReader(segments_1:1)}
[junit4:junit4]   2> 370 T2712 oasc.CoreContainer.register registering core: collection1
[junit4:junit4]   2> 371 T2712 oass.SolrDispatchFilter.init user.dir=C:\Users\JenkinsSlave\workspace\Lucene-Solr-trunk-Windows\solr\build\solr-core\test\J0
[junit4:junit4]   2> 371 T2712 oass.SolrDispatchFilter.init SolrDispatchFilter.init() done
[junit4:junit4]   2> 374 T2712 oascsi.HttpClientUtil.createClient Creating new http client, config:maxConnections=128&maxConnectionsPerHost=32&followRedirects=false
[junit4:junit4]   2> 392 T2712 oejs.Server.doStart jetty-8.1.2.v20120308
[junit4:junit4]   2> 396 T2712 oejs.AbstractConnector.doStart Started SelectChannelConnector@0.0.0.0:50457
[junit4:junit4]   2> 397 T2712 oasc.SolrResourceLoader.locateSolrHome JNDI not configured for solr (NoInitialContextEx)
[junit4:junit4]   2> 398 T2712 oasc.SolrResourceLoader.locateSolrHome using system property solr.solr.home: .\org.apache.solr.handler.TestReplicationHandler$SolrInstance-1351332128953\slave
[junit4:junit4]   2> 399 T2712 oasc.SolrResourceLoader.<init> new SolrResourceLoader for deduced Solr Home: '.\org.apache.solr.handler.TestReplicationHandler$SolrInstance-1351332128953\slave\'
[junit4:junit4]   2> 429 T2712 oass.SolrDispatchFilter.init SolrDispatchFilter.init()
[junit4:junit4]   2> 429 T2712 oasc.SolrResourceLoader.locateSolrHome JNDI not configured for solr (NoInitialContextEx)
[junit4:junit4]   2> 430 T2712 oasc.SolrResourceLoader.locateSolrHome using system property solr.solr.home: .\org.apache.solr.handler.TestReplicationHandler$SolrInstance-1351332128953\slave
[junit4:junit4]   2> 430 T2712 oasc.CoreContainer$Initializer.initialize looking for solr.xml: C:\Users\JenkinsSlave\workspace\Lucene-Solr-trunk-Windows\solr\build\solr-core\test\J0\.\org.apache.solr.handler.TestReplicationHandler$SolrInstance-1351332128953\slave\solr.xml
[junit4:junit4]   2> 431 T2712 oasc.CoreContainer.<init> New CoreContainer 22704307
[junit4:junit4]   2> 433 T2712 oasc.CoreContainer$Initializer.initialize no solr.xml file found - using default
[junit4:junit4]   2> 433 T2712 oasc.CoreContainer.load Loading CoreContainer using Solr Home: '.\org.apache.solr.handler.TestReplicationHandler$SolrInstance-1351332128953\slave\'
[junit4:junit4]   2> 434 T2712 oasc.SolrResourceLoader.<init> new SolrResourceLoader for directory: '.\org.apache.solr.handler.TestReplicationHandler$SolrInstance-1351332128953\slave\'
[junit4:junit4]   2> 458 T2712 oasc.CoreContainer.load Registering Log Listener
[junit4:junit4]   2> 487 T2712 oasc.CoreContainer.create Creating SolrCore 'collection1' using instanceDir: .\org.apache.solr.handler.TestReplicationHandler$SolrInstance-1351332128953\slave\collection1
[junit4:junit4]   2> 489 T2712 oasc.SolrResourceLoader.<init> new SolrResourceLoader for directory: '.\org.apache.solr.handler.TestReplicationHandler$SolrInstance-1351332128953\slave\collection1\'
[junit4:junit4]   2> 542 T2712 oasc.SolrConfig.<init> Using Lucene MatchVersion: LUCENE_50
[junit4:junit4]   2> 686 T2712 oasc.SolrConfig.<init> Loaded SolrConfig: solrconfig.xml
[junit4:junit4]   2> 688 T2712 oass.IndexSchema.readSchema Reading Solr Schema
[junit4:junit4]   2> 694 T2712 oass.IndexSchema.readSchema Schema name=test
[junit4:junit4]   2> 714 T2712 oass.IndexSchema.readSchema unique key field: id
[junit4:junit4]   2> 715 T2712 oasc.SolrCore.<init> [collection1] Opening new SolrCore at .\org.apache.solr.handler.TestReplicationHandler$SolrInstance-1351332128953\slave\collection1\, dataDir=.\org.apache.solr.handler.TestReplicationHandler$SolrInstance-1351332128953\slave\collection1\data\
[junit4:junit4]   2> 716 T2712 oasc.SolrCore.<init> JMX monitoring not detected for core: collection1
[junit4:junit4]   2> 716 T2712 oasc.SolrCore.initDirectoryFactory org.apache.solr.core.MockDirectoryFactory
[junit4:junit4]   2> 716 T2712 oasc.CachingDirectoryFactory.injectLockFactory WARNING No lockType configured for MockDirWrapper(org.apache.lucene.store.RAMDirectory@111da2e lockFactory=org.apache.lucene.store.SingleInstanceLockFactory@10b2da4) assuming 'simple'
[junit4:junit4]   2> 717 T2712 oasc.CachingDirectoryFactory.get return new directory for C:\Users\JenkinsSlave\workspace\Lucene-Solr-trunk-Windows\solr\build\solr-core\test\J0\.\org.apache.solr.handler.TestReplicationHandler$SolrInstance-1351332128953\slave\collection1\data forceNew:false
[junit4:junit4]   2> 717 T2712 oasc.CachingDirectoryFactory.close Releasing directory:C:\Users\JenkinsSlave\workspace\Lucene-Solr-trunk-Windows\solr\build\solr-core\test\J0\.\org.apache.solr.handler.TestReplicationHandler$SolrInstance-1351332128953\slave\collection1\data
[junit4:junit4]   2> 717 T2712 oasc.SolrCore.getNewIndexDir New index directory detected: old=null new=.\org.apache.solr.handler.TestReplicationHandler$SolrInstance-1351332128953\slave\collection1\data\index/
[junit4:junit4]   2> 718 T2712 oasc.SolrCore.initIndex WARNING [collection1] Solr index directory '.\org.apache.solr.handler.TestReplicationHandler$SolrInstance-1351332128953\slave\collection1\data\index' doesn't exist. Creating new index...
[junit4:junit4]   2> 719 T2712 oasc.CachingDirectoryFactory.get return new directory for C:\Users\JenkinsSlave\workspace\Lucene-Solr-trunk-Windows\solr\build\solr-core\test\J0\.\org.apache.solr.handler.TestReplicationHandler$SolrInstance-1351332128953\slave\collection1\data\index forceNew:false
[junit4:junit4]   2> 719 T2712 oasc.SolrDeletionPolicy.onCommit SolrDeletionPolicy.onCommit: commits:num=1
[junit4:junit4]   2> 		commit{dir=MockDirWrapper(org.apache.lucene.store.RAMDirectory@b25dbd lockFactory=org.apache.lucene.store.SingleInstanceLockFactory@17215e7),segFN=segments_1,generation=1,filenames=[segments_1]
[junit4:junit4]   2> 719 T2712 oasc.SolrDeletionPolicy.updateCommits newest commit = 1[segments_1]
[junit4:junit4]   2> 721 T2712 oasc.CachingDirectoryFactory.close Releasing directory:C:\Users\JenkinsSlave\workspace\Lucene-Solr-trunk-Windows\solr\build\solr-core\test\J0\.\org.apache.solr.handler.TestReplicationHandler$SolrInstance-1351332128953\slave\collection1\data\index
[junit4:junit4]   2> 722 T2712 oasc.RequestHandlers.initHandlersFromConfig created standard: solr.StandardRequestHandler
[junit4:junit4]   2> 722 T2712 oasc.RequestHandlers.initHandlersFromConfig created defaults: solr.StandardRequestHandler
[junit4:junit4]   2> 722 T2712 oasc.RequestHandlers.initHandlersFromConfig adding lazy requestHandler: solr.StandardRequestHandler
[junit4:junit4]   2> 722 T2712 oasc.RequestHandlers.initHandlersFromConfig created lazy: solr.StandardRequestHandler
[junit4:junit4]   2> 723 T2712 oasc.RequestHandlers.initHandlersFromConfig created /update: solr.UpdateRequestHandler
[junit4:junit4]   2> 723 T2712 oasc.RequestHandlers.initHandlersFromConfig created /replication: solr.ReplicationHandler
[junit4:junit4]   2> 725 T2712 oashl.XMLLoader.init xsltCacheLifetimeSeconds=60
[junit4:junit4]   2> 727 T2712 oasc.CachingDirectoryFactory.close Releasing directory:C:\Users\JenkinsSlave\workspace\Lucene-Solr-trunk-Windows\solr\build\solr-core\test\J0\.\org.apache.solr.handler.TestReplicationHandler$SolrInstance-1351332128953\slave\collection1\data
[junit4:junit4]   2> 729 T2712 oass.SolrIndexSearcher.<init> Opening Searcher@1def38a main
[junit4:junit4]   2> 729 T2712 oasu.CommitTracker.<init> Hard AutoCommit: disabled
[junit4:junit4]   2> 729 T2712 oasu.CommitTracker.<init> Soft AutoCommit: disabled
[junit4:junit4]   2> 729 T2712 oashc.HttpShardHandlerFactory.getParameter Setting socketTimeout to: 0
[junit4:junit4]   2> 731 T2712 oashc.HttpShardHandlerFactory.getParameter Setting urlScheme to: http://
[junit4:junit4]   2> 731 T2712 oashc.HttpShardHandlerFactory.getParameter Setting connTimeout to: 0
[junit4:junit4]   2> 731 T2712 oashc.HttpShardHandlerFactory.getParameter Setting maxConnectionsPerHost to: 20
[junit4:junit4]   2> 732 T2712 oashc.HttpShardHandlerFactory.getParameter Setting corePoolSize to: 0
[junit4:junit4]   2> 732 T2712 oashc.HttpShardHandlerFactory.getParameter Setting maximumPoolSize to: 2147483647
[junit4:junit4]   2> 732 T2712 oashc.HttpShardHandlerFactory.getParameter Setting maxThreadIdleTime to: 5
[junit4:junit4]   2> 733 T2712 oashc.HttpShardHandlerFactory.getParameter Setting sizeOfQueue to: -1
[junit4:junit4]   2> 733 T2712 oashc.HttpShardHandlerFactory.getParameter Setting fairnessPolicy to: false
[junit4:junit4]   2> 733 T2712 oascsi.HttpClientUtil.createClient Creating new http client, config:maxConnectionsPerHost=20&maxConnections=10000&socketTimeout=0&connTimeout=0&retry=false
[junit4:junit4]   2> 740 T2712 oash.SnapPuller.startExecutorService Poll Scheduled at an interval of 1000ms
[junit4:junit4]   2> 740 T2732 oasc.SolrCore.registerSearcher [collection1] Registered new searcher Searcher@1def38a main{StandardDirectoryReader(segments_1:1)}
[junit4:junit4]   2> 740 T2712 oasc.CoreContainer.register registering core: collection1
[junit4:junit4]   2> 741 T2712 oass.SolrDispatchFilter.init user.dir=C:\Users\JenkinsSlave\workspace\Lucene-Solr-trunk-Windows\solr\build\solr-core\test\J0
[junit4:junit4]   2> 741 T2712 oass.SolrDispatchFilter.init SolrDispatchFilter.init() done
[junit4:junit4]   2> 742 T2712 oascsi.HttpClientUtil.createClient Creating new http client, config:maxConnections=128&maxConnectionsPerHost=32&followRedirects=false
[junit4:junit4]   2> 761 T2712 oasc.CoreContainer.shutdown Shutting down CoreContainer instance=22704307
[junit4:junit4]   2> 762 T2712 oasc.SolrCore.close [collection1]  CLOSING SolrCore org.apache.solr.core.SolrCore@1c5c543
[junit4:junit4]   2> 762 T2712 oasu.DirectUpdateHandler2.close closing DirectUpdateHandler2{commits=0,autocommits=0,soft autocommits=0,optimizes=0,rollbacks=0,expungeDeletes=0,docsPending=0,adds=0,deletesById=0,deletesByQuery=0,errors=0,cumulative_adds=0,cumulative_deletesById=0,cumulative_deletesByQuery=0,cumulative_errors=0}
[junit4:junit4]   2> 763 T2712 oasc.SolrCore.decrefSolrCoreState Closing SolrCoreState
[junit4:junit4]   2> 763 T2712 oasu.DefaultSolrCoreState.closeIndexWriter SolrCoreState ref count has reached 0 - closing IndexWriter
[junit4:junit4]   2> 763 T2712 oasu.DefaultSolrCoreState.closeIndexWriter closing IndexWriter with IndexWriterCloser
[junit4:junit4]   2> 764 T2712 oasc.SolrCore.closeSearcher [collection1] Closing main searcher on request.
[junit4:junit4]   2> 764 T2712 oasc.CachingDirectoryFactory.close Releasing directory:C:\Users\JenkinsSlave\workspace\Lucene-Solr-trunk-Windows\solr\build\solr-core\test\J0\.\org.apache.solr.handler.TestReplicationHandler$SolrInstance-1351332128953\slave\collection1\data\index
[junit4:junit4]   2> 764 T2712 oejsh.ContextHandler.doStop stopped o.e.j.s.ServletContextHandler{/solr,null}
[junit4:junit4]   2> 844 T2712 oasc.CoreContainer.shutdown Shutting down CoreContainer instance=11332308
[junit4:junit4]   2> 845 T2712 oasc.SolrCore.close [collection1]  CLOSING SolrCore org.apache.solr.core.SolrCore@1c4d7a1
[junit4:junit4]   2> 845 T2712 oasu.DirectUpdateHandler2.close closing DirectUpdateHandler2{commits=0,autocommits=0,soft autocommits=0,optimizes=0,rollbacks=0,expungeDeletes=0,docsPending=0,adds=0,deletesById=0,deletesByQuery=0,errors=0,cumulative_adds=0,cumulative_deletesById=0,cumulative_deletesByQuery=0,cumulative_errors=0}
[junit4:junit4]   2> 846 T2712 oasc.SolrCore.decrefSolrCoreState Closing SolrCoreState
[junit4:junit4]   2> 846 T2712 oasu.DefaultSolrCoreState.closeIndexWriter SolrCoreState ref count has reached 0 - closing IndexWriter
[junit4:junit4]   2> 846 T2712 oasu.DefaultSolrCoreState.closeIndexWriter closing IndexWriter with IndexWriterCloser
[junit4:junit4]   2> 847 T2712 oasc.SolrCore.closeSearcher [collection1] Closing main searcher on request.
[junit4:junit4]   2> 847 T2712 oasc.CachingDirectoryFactory.close Releasing directory:C:\Users\JenkinsSlave\workspace\Lucene-Solr-trunk-Windows\solr\build\solr-core\test\J0\.\org.apache.solr.handler.TestReplicationHandler$SolrInstance-1351332128579\master\collection1\data\index
[junit4:junit4]   2> 847 T2712 oejsh.ContextHandler.doStop stopped o.e.j.s.ServletContextHandler{/solr,null}
[junit4:junit4]   2> 900 T2712 oejs.Server.doStart jetty-8.1.2.v20120308
[junit4:junit4]   2> 905 T2712 oejs.AbstractConnector.doStart Started SelectChannelConnector@0.0.0.0:50460
[junit4:junit4]   2> 906 T2712 oasc.SolrResourceLoader.locateSolrHome JNDI not configured for solr (NoInitialContextEx)
[junit4:junit4]   2> 906 T2712 oasc.SolrResourceLoader.locateSolrHome using system property solr.solr.home: .\org.apache.solr.handler.TestReplicationHandler$SolrInstance-1351332128579\master
[junit4:junit4]   2> 907 T2712 oasc.SolrResourceLoader.<init> new SolrResourceLoader for deduced Solr Home: '.\org.apache.solr.handler.TestReplicationHandler$SolrInstance-1351332128579\master\'
[junit4:junit4]   2> 927 T2712 oass.SolrDispatchFilter.init SolrDispatchFilter.init()
[junit4:junit4]   2> 927 T2712 oasc.SolrResourceLoader.locateSolrHome JNDI not configured for solr (NoInitialContextEx)
[junit4:junit4]   2> 927 T2712 oasc.SolrResourceLoader.locateSolrHome using system property solr.solr.home: .\org.apache.solr.handler.TestReplicationHandler$SolrInstance-1351332128579\master
[junit4:junit4]   2> 928 T2712 oasc.CoreContainer$Initializer.initialize looking for solr.xml: C:\Users\JenkinsSlave\workspace\Lucene-Solr-trunk-Windows\solr\build\solr-core\test\J0\.\org.apache.solr.handler.TestReplicationHandler$SolrInstance-1351332128579\master\solr.xml
[junit4:junit4]   2> 928 T2712 oasc.CoreContainer.<init> New CoreContainer 10757903
[junit4:junit4]   2> 929 T2712 oasc.CoreContainer$Initializer.initialize no solr.xml file found - using default
[junit4:junit4]   2> 929 T2712 oasc.CoreContainer.load Loading CoreContainer using Solr Home: '.\org.apache.solr.handler.TestReplicationHandler$SolrInstance-1351332128579\master\'
[junit4:junit4]   2> 929 T2712 oasc.SolrResourceLoader.<init> new SolrResourceLoader for directory: '.\org.apache.solr.handler.TestReplicationHandler$SolrInstance-1351332128579\master\'
[junit4:junit4]   2> 954 T2712 oasc.CoreContainer.load Registering Log Listener
[junit4:junit4]   2> 983 T2712 oasc.CoreContainer.create Creating SolrCore 'collection1' using instanceDir: .\org.apache.solr.handler.TestReplicationHandler$SolrInstance-1351332128579\master\collection1
[junit4:junit4]   2> 984 T2712 oasc.SolrResourceLoader.<init> new SolrResourceLoader for directory: '.\org.apache.solr.handler.TestReplicationHandler$SolrInstance-1351332128579\master\collection1\'
[junit4:junit4]   2> 1037 T2712 oasc.SolrConfig.<init> Using Lucene MatchVersion: LUCENE_50
[junit4:junit4]   2> 1097 T2712 oasc.SolrConfig.<init> Loaded SolrConfig: solrconfig.xml
[junit4:junit4]   2> 1097 T2712 oass.IndexSchema.readSchema Reading Solr Schema
[junit4:junit4]   2> 1102 T2712 oass.IndexSchema.readSchema Schema name=test
[junit4:junit4]   2> 1123 T2712 oass.IndexSchema.readSchema unique key field: id
[junit4:junit4]   2> 1125 T2712 oasc.SolrCore.<init> [collection1] Opening new SolrCore at .\org.apache.solr.handler.TestReplicationHandler$SolrInstance-1351332128579\master\collection1\, dataDir=.\org.apache.solr.handler.TestReplicationHandler$SolrInstance-1351332128579\master\collection1\data\
[junit4:junit4]   2> 1125 T2712 oasc.SolrCore.<init> JMX monitoring not detected for core: collection1
[junit4:junit4]   2> 1126 T2712 oasc.SolrCore.initDirectoryFactory org.apache.solr.core.MockDirectoryFactory
[junit4:junit4]   2> 1126 T2712 oasc.CachingDirectoryFactory.injectLockFactory WARNING No lockType configured for MockDirWrapper(org.apache.lucene.store.RAMDirectory@16316e0 lockFactory=org.apache.lucene.store.SingleInstanceLockFactory@730020) assuming 'simple'
[junit4:junit4]   2> 1127 T2712 oasc.CachingDirectoryFactory.get return new directory for C:\Users\JenkinsSlave\workspace\Lucene-Solr-trunk-Windows\solr\build\solr-core\test\J0\.\org.apache.solr.handler.TestReplicationHandler$SolrInstance-1351332128579\master\collection1\data forceNew:false
[junit4:junit4]   2> 1128 T2712 oasc.CachingDirectoryFactory.close Releasing directory:C:\Users\JenkinsSlave\workspace\Lucene-Solr-trunk-Windows\solr\build\solr-core\test\J0\.\org.apache.solr.handler.TestReplicationHandler$SolrInstance-1351332128579\master\collection1\data
[junit4:junit4]   2> 1128 T2712 oasc.SolrCore.getNewIndexDir New index directory detected: old=null new=.\org.apache.solr.handler.TestReplicationHandler$SolrInstance-1351332128579\master\collection1\data\index/
[junit4:junit4]   2> 1128 T2712 oasc.SolrCore.initIndex WARNING [collection1] Solr index directory '.\org.apache.solr.handler.TestReplicationHandler$SolrInstance-1351332128579\master\collection1\data\index' doesn't exist. Creating new index...
[junit4:junit4]   2> 1131 T2712 oasc.CachingDirectoryFactory.get return new directory for C:\Users\JenkinsSlave\workspace\Lucene-Solr-trunk-Windows\solr\build\solr-core\test\J0\.\org.apache.solr.handler.TestReplicationHandler$SolrInstance-1351332128579\master\collection1\data\index forceNew:false
[junit4:junit4]   2> 1132 T2712 oasc.SolrDeletionPolicy.onCommit SolrDeletionPolicy.onCommit: commits:num=1
[junit4:junit4]   2> 		commit{dir=MockDirWrapper(org.apache.lucene.store.RAMDirectory@348ede lockFactory=org.apache.lucene.store.SingleInstanceLockFactory@57b9f1),segFN=segments_1,generation=1,filenames=[segments_1]
[junit4:junit4]   2> 1133 T2712 oasc.SolrDeletionPolicy.updateCommits newest commit = 1[segments_1]
[junit4:junit4]   2> 1133 T2712 oasc.CachingDirectoryFactory.close Releasing directory:C:\Users\JenkinsSlave\workspace\Lucene-Solr-trunk-Windows\solr\build\solr-core\test\J0\.\org.apache.solr.handler.TestReplicationHandler$SolrInstance-1351332128579\master\collection1\data\index
[junit4:junit4]   2> 1135 T2712 oasc.RequestHandlers.initHandlersFromConfig created standard: solr.StandardRequestHandler
[junit4:junit4]   2> 1135 T2712 oasc.RequestHandlers.initHandlersFromConfig created /replication: solr.ReplicationHandler
[junit4:junit4]   2> 1136 T2712 oasc.RequestHandlers.initHandlersFromConfig created defaults: solr.StandardRequestHandler
[junit4:junit4]   2> 1136 T2712 oasc.RequestHandlers.initHandlersFromConfig adding lazy requestHandler: solr.StandardRequestHandler
[junit4:junit4]   2> 1138 T2712 oasc.RequestHandlers.initHandlersFromConfig created lazy: solr.StandardRequestHandler
[junit4:junit4]   2> 1138 T2712 oasc.RequestHandlers.initHandlersFromConfig created /update: solr.UpdateRequestHandler
[junit4:junit4]   2> 1142 T2712 oashl.XMLLoader.init xsltCacheLifetimeSeconds=60
[junit4:junit4]   2> 1147 T2712 oasc.CachingDirectoryFactory.close Releasing directory:C:\Users\JenkinsSlave\workspace\Lucene-Solr-trunk-Windows\solr\build\solr-core\test\J0\.\org.apache.solr.handler.TestReplicationHandler$SolrInstance-1351332128579\master\collection1\data
[junit4:junit4]   2> 1147 T2712 oass.SolrIndexSearcher.<init> Opening Searcher@29365f main
[junit4:junit4]   2> 1148 T2712 oasu.CommitTracker.<init> Hard AutoCommit: disabled
[junit4:junit4]   2> 1148 T2712 oasu.CommitTracker.<init> Soft AutoCommit: disabled
[junit4:junit4]   2> 1149 T2712 oashc.HttpShardHandlerFactory.getParameter Setting socketTimeout to: 0
[junit4:junit4]   2> 1149 T2712 oashc.HttpShardHandlerFactory.getParameter Setting urlScheme to: http://
[junit4:junit4]   2> 1149 T2712 oashc.HttpShardHandlerFactory.getParameter Setting connTimeout to: 0
[junit4:junit4]   2> 1150 T2712 oashc.HttpShardHandlerFactory.getParameter Setting maxConnectionsPerHost to: 20
[junit4:junit4]   2> 1151 T2712 oashc.HttpShardHandlerFactory.getParameter Setting corePoolSize to: 0
[junit4:junit4]   2> 1151 T2712 oashc.HttpShardHandlerFactory.getParameter Setting maximumPoolSize to: 2147483647
[junit4:junit4]   2> 1151 T2712 oashc.HttpShardHandlerFactory.getParameter Setting maxThreadIdleTime to: 5
[junit4:junit4]   2> 1151 T2712 oashc.HttpShardHandlerFactory.getParameter Setting sizeOfQueue to: -1
[junit4:junit4]   2> 1153 T2712 oashc.HttpShardHandlerFactory.getParameter Setting fairnessPolicy to: false
[junit4:junit4]   2> 1153 T2712 oascsi.HttpClientUtil.createClient Creating new http client, config:maxConnectionsPerHost=20&maxConnections=10000&socketTimeout=0&connTimeout=0&retry=false
[junit4:junit4]   2> 1158 T2712 oash.ReplicationHandler.inform Replication enabled for following config files: schema.xml
[junit4:junit4]   2> 1159 T2712 oash.ReplicationHandler.inform Commits will be reserved for  10000
[junit4:junit4]   2> 1161 T2743 oasc.SolrCore.registerSearcher [collection1] Registered new searcher Searcher@29365f main{StandardDirectoryReader(segments_1:1)}
[junit4:junit4]   2> 1159 T2712 oasc.CoreContainer.register registering core: collection1
[junit4:junit4]   2> 1162 T2712 oass.SolrDispatchFilter.init user.dir=C:\Users\JenkinsSlave\workspace\Lucene-Solr-trunk-Windows\solr\build\solr-core\test\J0
[junit4:junit4]   2> 1162 T2712 oass.SolrDispatchFilter.init SolrDispatchFilter.init() done
[junit4:junit4]   2> 1163 T2712 oascsi.HttpClientUtil.createClient Creating new http client, config:maxConnections=128&maxConnectionsPerHost=32&followRedirects=false
[junit4:junit4]   2> ASYNC  NEW_CORE C198 name=collection1 org.apache.solr.core.SolrCore@1f413f2
[junit4:junit4]   2> 1177 T2737 C198 oasu.DirectUpdateHandler2.deleteAll [collection1] REMOVING ALL DOCUMENTS FROM INDEX
[junit4:junit4]   2> 1178 T2737 C198 oasc.CachingDirectoryFactory.close Releasing directory:C:\Users\JenkinsSlave\workspace\Lucene-Solr-trunk-Windows\solr\build\solr-core\test\J0\.\org.apache.solr.handler.TestReplicationHandler$SolrInstance-1351332128579\master\collection1\data
[junit4:junit4]   2> 1180 T2737 C198 oasc.SolrDeletionPolicy.onInit SolrDeletionPolicy.onInit: commits:num=1
[junit4:junit4]   2> 		commit{dir=MockDirWrapper(org.apache.lucene.store.RAMDirectory@348ede lockFactory=org.apache.lucene.store.SingleInstanceLockFactory@57b9f1),segFN=segments_1,generation=1,filenames=[segments_1]
[junit4:junit4]   2> 1181 T2737 C198 oasc.SolrDeletionPolicy.updateCommits newest commit = 1[segments_1]
[junit4:junit4]   2> 1181 T2737 C198 UPDATE [collection1] webapp=/solr path=/update params={wt=javabin&version=2} {deleteByQuery=*:*} 0 4
[junit4:junit4]   2> 1185 T2739 C198 UPDATE [collection1] webapp=/solr path=/update params={wt=javabin&version=2} {add=[0]} 0 0
[junit4:junit4]   2> 1188 T2738 C198 UPDATE [collection1] webapp=/solr path=/update params={wt=javabin&version=2} {add=[1]} 0 0
[junit4:junit4]   2> 1192 T2741 C198 UPDATE [collection1] webapp=/solr path=/update params={wt=javabin&version=2} {add=[2]} 0 0
[junit4:junit4]   2> 1196 T2740 C198 UPDATE [collection1] webapp=/solr path=/update params={wt=javabin&version=2} {add=[3]} 0 0
[junit4:junit4]   2> 1200 T2742 C198 UPDATE [collection1] webapp=/solr path=/update params={wt=javabin&version=2} {add=[4]} 0 0
[junit4:junit4]   2> 1203 T2737 C198 UPDATE [collection1] webapp=/solr path=/update params={wt=javabin&version=2} {add=[5]} 0 0
[junit4:junit4]   2> 1207 T2739 C198 UPDATE [collection1] webapp=/solr path=/update params={wt=javabin&version=2} {add=[6]} 0 0
[junit4:junit4]   2> 1211 T2738 C198 UPDATE [collection1] webapp=/solr path=/update params={wt=javabin&version=2} {add=[7]} 0 0
[junit4:junit4]   2> 1215 T2741 C198 UPDATE [collection1] webapp=/solr path=/update params={wt=javabin&version=2} {add=[8]} 0 0
[junit4:junit4]   2> 1218 T2740 C198 UPDATE [collection1] webapp=/solr path=/update params={wt=javabin&version=2} {add=[9]} 0 0
[junit4:junit4]   2> 1222 T2742 C198 oasu.DirectUpdateHandler2.commit start commit{flags=0,_version_=0,optimize=false,openSearcher=true,waitSearcher=true,expungeDeletes=false,softCommit=false}
[junit4:junit4]   2> 1224 T2742 C198 oasc.SolrDeletionPolicy.onCommit SolrDeletionPolicy.onCommit: commits:num=2
[junit4:junit4]   2> 		commit{dir=MockDirWrapper(org.apache.lucene.store.RAMDirectory@348ede lockFactory=org.apache.lucene.store.SingleInstanceLockFactory@57b9f1),segFN=segments_1,generation=1,filenames=[segments_1]
[junit4:junit4]   2> 		commit{dir=MockDirWrapper(org.apache.lucene.store.RAMDirectory@348ede lockFactory=org.apache.lucene.store.SingleInstanceLockFactory@57b9f1),segFN=segments_2,generation=2,filenames=[_0_1.len, _0_0.len, segments_2, _0.inf, _0.si, _0.pst, _0.fld]
[junit4:junit4]   2> 1224 T2742 C198 oasc.SolrDeletionPolicy.updateCommits newest commit = 2[_0_1.len, _0_0.len, segments_2, _0.inf, _0.si, _0.pst, _0.fld]
[junit4:junit4]   2> 1225 T2742 C198 oasc.CachingDirectoryFactory.close Releasing directory:C:\Users\JenkinsSlave\workspace\Lucene-Solr-trunk-Windows\solr\build\solr-core\test\J0\.\org.apache.solr.handler.TestReplicationHandler$SolrInstance-1351332128579\master\collection1\data
[junit4:junit4]   2> 1226 T2742 C198 oass.SolrIndexSearcher.<init> Opening Searcher@6691ac main
[junit4:junit4]   2> 1227 T2743 oasc.SolrCore.registerSearcher [collection1] Registered new searcher Searcher@6691ac main{StandardDirectoryReader(segments_2:4 _0(5.0):C10)}
[junit4:junit4]   2> 1226 T2742 C198 oasu.DirectUpdateHandler2.commit end_commit_flush
[junit4:junit4]   2> 1227 T2743 oasc.CachingDirectoryFactory.close Releasing directory:C:\Users\JenkinsSlave\workspace\Lucene-Solr-trunk-Windows\solr\build\solr-core\test\J0\.\org.apache.solr.handler.TestReplicationHandler$SolrInstance-1351332128579\master\collection1\data\index
[junit4:junit4]   2> 1227 T2742 C198 UPDATE [collection1] webapp=/solr path=/update params={waitSearcher=true&wt=javabin&commit=true&softCommit=false&version=2} {commit=} 0 5
[junit4:junit4]   2> 1232 T2737 C198 REQ [collection1] webapp=/solr path=/select params={wt=javabin&q=*:*&version=2} hits=10 status=0 QTime=0 
[junit4:junit4]   2> 1354 T2712 oejs.Server.doStart jetty-8.1.2.v20120308
[junit4:junit4]   2> 1358 T2712 oejs.AbstractConnector.doStart Started SelectChannelConnector@0.0.0.0:50464
[junit4:junit4]   2> 1359 T2712 oasc.SolrResourceLoader.locateSolrHome JNDI not configured for solr (NoInitialContextEx)
[junit4:junit4]   2> 1360 T2712 oasc.SolrResourceLoader.locateSolrHome using system property solr.solr.home: .\org.apache.solr.handler.TestReplicationHandler$SolrInstance-1351332128953\slave
[junit4:junit4]   2> 1360 T2712 oasc.SolrResourceLoader.<init> new SolrResourceLoader for deduced Solr Home: '.\org.apache.solr.handler.TestReplicationHandler$SolrInstance-1351332128953\slave\'
[junit4:junit4]   2> 1380 T2712 oass.SolrDispatchFilter.init SolrDispatchFilter.init()
[junit4:junit4]   2> 1381 T2712 oasc.SolrResourceLoader.locateSolrHome JNDI not configured for solr (NoInitialContextEx)
[junit4:junit4]   2> 1381 T2712 oasc.SolrResourceLoader.locateSolrHome using system property solr.solr.home: .\org.apache.solr.handler.TestReplicationHandler$SolrInstance-1351332128953\slave
[junit4:junit4]   2> 1381 T2712 oasc.CoreContainer$Initializer.initialize looking for solr.xml: C:\Users\JenkinsSlave\workspace\Lucene-Solr-trunk-Windows\solr\build\solr-core\test\J0\.\org.apache.solr.handler.TestReplicationHandler$SolrInstance-1351332128953\slave\solr.xml
[junit4:junit4]   2> 1382 T2712 oasc.CoreContainer.<init> New CoreContainer 23860739
[junit4:junit4]   2> 1382 T2712 oasc.CoreContainer$Initializer.initialize no solr.xml file found - using default
[junit4:junit4]   2> 1383 T2712 oasc.CoreContainer.load Loading CoreContainer using Solr Home: '.\org.apache.solr.handler.TestReplicationHandler$SolrInstance-1351332128953\slave\'
[junit4:junit4]   2> 1383 T2712 oasc.SolrResourceLoader.<init> new SolrResourceLoader for directory: '.\org.apache.solr.handler.TestReplicationHandler$SolrInstance-1351332128953\slave\'
[junit4:junit4]   2> 1408 T2712 oasc.CoreContainer.load Registering Log Listener
[junit4:junit4]   2> 1442 T2712 oasc.CoreContainer.create Creating SolrCore 'collection1' using instanceDir: .\org.apache.solr.handler.TestReplicationHandler$SolrInstance-1351332128953\slave\collection1
[junit4:junit4]   2> 1443 T2712 oasc.SolrResourceLoader.<init> new SolrResourceLoader for directory: '.\org.apache.solr.handler.TestReplicationHandler$SolrInstance-1351332128953\slave\collection1\'
[junit4:junit4]   2> 1496 T2712 oasc.SolrConfig.<init> Using Lucene MatchVersion: LUCENE_50
[junit4:junit4]   2> 1577 T2712 oasc.SolrConfig.<init> Loaded SolrConfig: solrconfig.xml
[junit4:junit4]   2> 1578 T2712 oass.IndexSchema.readSchema Reading Solr Schema
[junit4:junit4]   2> 1582 T2712 oass.IndexSchema.readSchema Schema name=test
[junit4:junit4]   2> 1608 T2712 oass.IndexSchema.readSchema unique key field: id
[junit4:junit4]   2> 1610 T2712 oasc.SolrCore.<init> [collection1] Opening new SolrCore at .\org.apache.solr.handler.TestReplicationHandler$SolrInstance-1351332128953\slave\collection1\, dataDir=.\org.apache.solr.handler.TestReplicationHandler$SolrInstance-1351332128953\slave\collection1\data\
[junit4:junit4]   2> 1610 T2712 oasc.SolrCore.<init> JMX monitoring not detected for core: collection1
[junit4:junit4]   2> 1611 T2712 oasc.SolrCore.initDirectoryFactory org.apache.solr.core.MockDirectoryFactory
[junit4:junit4]   2> 1612 T2712 oasc.CachingDirectoryFactory.injectLockFactory WARNING No lockType configured for MockDirWrapper(org.apache.lucene.store.RAMDirectory@1a45d08 lockFactory=org.apache.lucene.store.SingleInstanceLockFactory@1d7d4c2) assuming 'simple'
[junit4:junit4]   2> 1612 T2712 oasc.CachingDirectoryFactory.get return new directory for C:\Users\JenkinsSlave\workspace\Lucene-Solr-trunk-Windows\solr\build\solr-core\test\J0\.\org.apache.solr.handler.TestReplicationHandler$SolrInstance-1351332128953\slave\collection1\data forceNew:false
[junit4:junit4]   2> 1612 T2712 oasc.CachingDirectoryFactory.close Releasing directory:C:\Users\JenkinsSlave\workspace\Lucene-Solr-trunk-Windows\solr\build\solr-core\test\J0\.\org.apache.solr.handler.TestReplicationHandler$SolrInstance-1351332128953\slave\collection1\data
[junit4:junit4]   2> 1613 T2712 oasc.SolrCore.getNewIndexDir New index directory detected: old=null new=.\org.apache.solr.handler.TestReplicationHandler$SolrInstance-1351332128953\slave\collection1\data\index/
[junit4:junit4]   2> 1613 T2712 oasc.SolrCore.initIndex WARNING [collection1] Solr index directory '.\org.apache.solr.handler.TestReplicationHandler$SolrInstance-1351332128953\slave\collection1\data\index' doesn't exist. Creating new index...
[junit4:junit4]   2> 1615 T2712 oasc.CachingDirectoryFactory.get return new directory for C:\Users\JenkinsSlave\workspace\Lucene-Solr-trunk-Windows\solr\build\solr-core\test\J0\.\org.apache.solr.handler.TestReplicationHandler$SolrInstance-1351332128953\slave\collection1\data\index forceNew:false
[junit4:junit4]   2> 1616 T2712 oasc.SolrDeletionPolicy.onCommit SolrDeletionPolicy.onCommit: commits:num=1
[junit4:junit4]   2> 		commit{dir=MockDirWrapper(org.apache.lucene.store.RAMDirectory@180d12d lockFactory=org.apache.lucene.store.SingleInstanceLockFactory@6d69),segFN=segments_1,generation=1,filenames=[segments_1]
[junit4:junit4]   2> 1617 T2712 oasc.SolrDeletionPolicy.updateCommits newest commit = 1[segments_1]
[junit4:junit4]   2> 1617 T2712 oasc.CachingDirectoryFactory.close Releasing directory:C:\Users\JenkinsSlave\workspace\Lucene-Solr-trunk-Windows\solr\build\solr-core\test\J0\.\org.apache.solr.handler.TestReplicationHandler$SolrInstance-1351332128953\slave\collection1\data\index
[junit4:junit4]   2> 1619 T2712 oasc.RequestHandlers.initHandlersFromConfig created standard: solr.StandardRequestHandler
[junit4:junit4]   2> 1619 T2712 oasc.RequestHandlers.initHandlersFromConfig created defaults: solr.StandardRequestHandler
[junit4:junit4]   2> 1620 T2712 oasc.RequestHandlers.initHandlersFromConfig adding lazy requestHandler: solr.StandardRequestHandler
[junit4:junit4]   2> 1620 T2712 oasc.RequestHandlers.initHandlersFromConfig created lazy: solr.StandardRequestHandler
[junit4:junit4]   2> 1620 T2712 oasc.RequestHandlers.initHandlersFromConfig created /update: solr.UpdateRequestHandler
[junit4:junit4]   2> 1621 T2712 oasc.RequestHandlers.initHandlersFromConfig created /replication: solr.ReplicationHandler
[junit4:junit4]   2> 1625 T2712 oashl.XMLLoader.init xsltCacheLifetimeSeconds=60
[junit4:junit4]   2> 1628 T2712 oasc.CachingDirectoryFactory.close Releasing directory:C:\Users\JenkinsSlave\workspace\Lucene-Solr-trunk-Windows\solr\build\solr-core\test\J0\.\org.apache.solr.handler.TestReplicationHandler$SolrInstance-1351332128953\slave\collection1\data
[junit4:junit4]   2> 1628 T2712 oass.SolrIndexSearcher.<init> Opening Searcher@144a353 main
[junit4:junit4]   2> 1630 T2712 oasu.CommitTracker.<init> Hard AutoCommit: disabled
[junit4:junit4]   2> 1631 T2712 oasu.CommitTracker.<init> Soft AutoCommit: disabled
[junit4:junit4]   2> 1631 T2712 oashc.HttpShardHandlerFactory.getParameter Setting socketTimeout to: 0
[junit4:junit4]   2> 1631 T2712 oashc.HttpShardHandlerFactory.getParameter Setting urlScheme to: http://
[junit4:junit4]   2> 1632 T2712 oashc.HttpShardHandlerFactory.getParameter Setting connTimeout to: 0
[junit4:junit4]   2> 1632 T2712 oashc.HttpShardHandlerFactory.getParameter Setting maxConnectionsPerHost to: 20
[junit4:junit4]   2> 1632 T2712 oashc.HttpShardHandlerFactory.getParameter Setting corePoolSize to: 0
[junit4:junit4]   2> 1633 T2712 oashc.HttpShardHandlerFactory.getParameter Setting maximumPoolSize to: 2147483647
[junit4:junit4]   2> 1633 T2712 oashc.HttpShardHandlerFactory.getParameter Setting maxThreadIdleTime to: 5
[junit4:junit4]   2> 1633 T2712 oashc.HttpShardHandlerFactory.getParameter Setting sizeOfQueue to: -1
[junit4:junit4]   2> 1633 T2712 oashc.HttpShardHandlerFactory.getParameter Setting fairnessPolicy to: false
[junit4:junit4]   2> 1634 T2712 oascsi.HttpClientUtil.createClient Creating new http client, config:maxConnectionsPerHost=20&maxConnections=10000&socketTimeout=0&connTimeout=0&retry=false
[junit4:junit4]   2> 1640 T2712 oash.SnapPuller.startExecutorService Poll Scheduled at an interval of 1000ms
[junit4:junit4]   2> 1640 T2753 oasc.SolrCore.registerSearcher [collection1] Registered new searcher Searcher@144a353 main{StandardDirectoryReader(segments_1:1)}
[junit4:junit4]   2> 1640 T2712 oasc.CoreContainer.register registering core: collection1
[junit4:junit4]   2> 1641 T2712 oass.SolrDispatchFilter.init user.dir=C:\Users\JenkinsSlave\workspace\Lucene-Solr-trunk-Windows\solr\build\solr-core\test\J0
[junit4:junit4]   2> 1642 T2712 oass.SolrDispatchFilter.init SolrDispatchFilter.init() done
[junit4:junit4]   2> 1642 T2712 oascsi.HttpClientUtil.createClient Creating new http client, config:maxConnections=128&maxConnectionsPerHost=32&followRedirects=false
[junit4:junit4]   2> ASYNC  NEW_CORE C199 name=collection1 org.apache.solr.core.SolrCore@11611a2
[junit4:junit4]   2> 1656 T2747 C199 REQ [collection1] webapp=/solr path=/select params={wt=javabin&q=*:*&version=2} hits=0 status=0 QTime=0 
[junit4:junit4]   2> 1780 T2748 C199 REQ [collection1] webapp=/solr path=/select params={wt=javabin&q=*:*&version=2} hits=0 status=0 QTime=0 
[junit4:junit4]   2> 1906 T2750 C199 REQ [collection1] webapp=/solr path=/select params={wt=javabin&q=*:*&version=2} hits=0 status=0 QTime=1 
[junit4:junit4]   2> 2027 T2751 C199 REQ [collection1] webapp=/solr path=/select params={wt=javabin&q=*:*&version=2} hits=0 status=0 QTime=0 
[junit4:junit4]   2> 2149 T2752 C199 REQ [collection1] webapp=/solr path=/select params={wt=javabin&q=*:*&version=2} hits=0 status=0 QTime=0 
[junit4:junit4]   2> 2271 T2747 C199 REQ [collection1] webapp=/solr path=/select params={wt=javabin&q=*:*&version=2} hits=0 status=0 QTime=0 
[junit4:junit4]   2> 2393 T2748 C199 REQ [collection1] webapp=/solr path=/select params={wt=javabin&q=*:*&version=2} hits=0 status=0 QTime=0 
[junit4:junit4]   2> 2516 T2750 C199 REQ [collection1] webapp=/solr path=/select params={wt=javabin&q=*:*&version=2} hits=0 status=0 QTime=0 
[junit4:junit4]   2> 2566 T2741 C198 REQ [collection1] webapp=/solr path=/replication params={command=indexversion&wt=javabin&qt=/replication&version=2} status=0 QTime=0 
[junit4:junit4]   2> 2567 T2754 oash.SnapPuller.fetchLatestIndex Master's generation: 2
[junit4:junit4]   2> 2567 T2754 oash.SnapPuller.fetchLatestIndex Slave's generation: 1
[junit4:junit4]   2> 2569 T2754 oash.SnapPuller.fetchLatestIndex Starting replication process
[junit4:junit4]   2> 2572 T2740 C198 oasc.CachingDirectoryFactory.close Releasing directory:C:\Users\JenkinsSlave\workspace\Lucene-Solr-trunk-Windows\solr\build\solr-core\test\J0\.\org.apache.solr.handler.TestReplicationHandler$SolrInstance-1351332128579\master\collection1\data
[junit4:junit4]   2> 2572 T2740 C198 oasc.CachingDirectoryFactory.close Releasing directory:C:\Users\JenkinsSlave\workspace\Lucene-Solr-trunk-Windows\solr\build\solr-core\test\J0\.\org.apache.solr.handler.TestReplicationHandler$SolrInstance-1351332128579\master\collection1\data\index
[junit4:junit4]   2> 2577 T2740 C198 REQ [collection1] webapp=/solr path=/replication params={command=filelist&generation=2&wt=javabin&qt=/replication&version=2} status=0 QTime=5 
[junit4:junit4]   2> 2578 T2754 oash.SnapPuller.fetchLatestIndex Number of files in latest index in master: 7
[junit4:junit4]   2> 2581 T2754 oasc.CachingDirectoryFactory.injectLockFactory WARNING No lockType configured for MockDirWrapper(org.apache.lucene.store.RAMDirectory@b649bc lockFactory=org.apache.lucene.store.SingleInstanceLockFactory@1a2f1b3) assuming 'simple'
[junit4:junit4]   2> 2581 T2754 oasc.CachingDirectoryFactory.get return new directory for C:\Users\JenkinsSlave\workspace\Lucene-Solr-trunk-Windows\solr\build\solr-core\test\J0\.\org.apache.solr.handler.TestReplicationHandler$SolrInstance-1351332128953\slave\collection1\data\index.20121027060211154 forceNew:false
[junit4:junit4]   2> 2581 T2754 oasc.CachingDirectoryFactory.close Releasing directory:C:\Users\JenkinsSlave\workspace\Lucene-Solr-trunk-Windows\solr\build\solr-core\test\J0\.\org.apache.solr.handler.TestReplicationHandler$SolrInstance-1351332128953\slave\collection1\data
[junit4:junit4]   2> 2582 T2754 oash.SnapPuller.fetchLatestIndex Starting download to MockDirWrapper(org.apache.lucene.store.RAMDirectory@b649bc lockFactory=org.apache.lucene.store.SimpleFSLockFactory@aa5d28) fullCopy=false
[junit4:junit4]   2> 2585 T2742 C198 REQ [collection1] webapp=/solr path=/replication params={file=_0_1.len&command=filecontent&checksum=true&generation=2&qt=/replication&wt=filestream} status=0 QTime=0 
[junit4:junit4]   2> 2590 T2739 C198 REQ [collection1] webapp=/solr path=/replication params={file=_0_0.len&command=filecontent&checksum=true&generation=2&qt=/replication&wt=filestream} status=0 QTime=0 
[junit4:junit4]   2> 2594 T2738 C198 REQ [collection1] webapp=/solr path=/replication params={file=segments_2&command=filecontent&checksum=true&generation=2&qt=/replication&wt=filestream} status=0 QTime=0 
[junit4:junit4]   2> 2598 T2741 C198 REQ [collection1] webapp=/solr path=/replication params={file=_0.inf&command=filecontent&checksum=true&generation=2&qt=/replication&wt=filestream} status=0 QTime=0 
[junit4:junit4]   2> 2602 T2740 C198 REQ [collection1] webapp=/solr path=/replication params={file=_0.si&command=filecontent&checksum=true&generation=2&qt=/replication&wt=filestream} status=0 QTime=0 
[junit4:junit4]   2> 2607 T2737 C198 REQ [collection1] webapp=/solr path=/replication params={file=_0.pst&command=filecontent&checksum=true&generation=2&qt=/replication&wt=filestream} status=0 QTime=0 
[junit4:junit4]   2> 2610 T2742 C198 REQ [collection1] webapp=/solr path=/replication params={file=_0.fld&command=filecontent&checksum=true&generation=2&qt=/replication&wt=filestream} status=0 QTime=0 
[junit4:junit4]   2> 2611 T2754 oasc.CachingDirectoryFactory.close Releasing directory:C:\Users\JenkinsSlave\workspace\Lucene-Solr-trunk-Windows\solr\build\solr-core\test\J0\.\org.apache.solr.handler.TestReplicationHandler$SolrInstance-1351332128953\slave\collection1\data\index
[junit4:junit4]   2> 2611 T2754 oash.SnapPuller.fetchLatestIndex Total time taken for download : 0 secs
[junit4:junit4]   2> 2620 T2754 oasu.DefaultSolrCoreState.newIndexWriter Creating new IndexWriter...
[junit4:junit4]   2> 2622 T2754 oasu.DefaultSolrCoreState.newIndexWriter Waiting until IndexWriter is unused... core=collection1
[junit4:junit4]   2> 2622 T2754 oasc.CachingDirectoryFactory.close Releasing directory:C:\Users\JenkinsSlave\workspace\Lucene-Solr-trunk-Windows\solr\build\solr-core\test\J0\.\org.apache.solr.handler.TestReplicationHandler$SolrInstance-1351332128953\slave\collection1\data
[junit4:junit4]   2> 2624 T2754 oasc.SolrDeletionPolicy.onInit SolrDeletionPolicy.onInit: commits:num=2
[junit4:junit4]   2> 		commit{dir=MockDirWrapper(org.apache.lucene.store.RAMDirectory@180d12d lockFactory=org.apache.lucene.store.SingleInstanceLockFactory@6d69),segFN=segments_1,generation=1,filenames=[segments_1]
[junit4:junit4]   2> 		commit{dir=MockDirWrapper(org.apache.lucene.store.RAMDirectory@180d12d lockFactory=org.apache.lucene.store.SingleInstanceLockFactory@6d69),segFN=segments_2,generation=2,filenames=[_0_1.len, _0_0.len, segments_2, _0.inf, _0.si, _0.pst, _0.fld]
[junit4:junit4]   2> 2625 T2754 oasc.SolrDeletionPolicy.updateCommits newest commit = 2[_0_1.len, _0_0.len, segments_2, _0.inf, _0.si, _0.pst, _0.fld]
[junit4:junit4]   2> 2625 T2754 oasu.DefaultSolrCoreState.newIndexWriter New IndexWriter is ready to be used.
[junit4:junit4]   2> 2626 T2754 oasc.CachingDirectoryFactory.close Releasing directory:C:\Users\JenkinsSlave\workspace\Lucene-Solr-trunk-Windows\solr\build\solr-core\test\J0\.\org.apache.solr.handler.TestReplicationHandler$SolrInstance-1351332128953\slave\collection1\data
[junit4:junit4]   2> 2626 T2754 oass.SolrIndexSearcher.<init> Opening Searcher@187fae3 main
[junit4:junit4]   2> 2627 T2753 oasc.SolrCore.registerSearcher [collection1] Registered new searcher Searcher@187fae3 main{StandardDirectoryReader(segments_2:4:nrt _0(5.0):C10)}
[junit4:junit4]   2> 2627 T2753 oasc.CachingDirectoryFactory.close Releasing directory:C:\Users\JenkinsSlave\workspace\Lucene-Solr-trunk-Windows\solr\build\solr-core\test\J0\.\org.apache.solr.handler.TestReplicationHandler$SolrInstance-1351332128953\slave\collection1\data\index
[junit4:junit4]   2> 2628 T2754 oasu.DirectUpdateHandler2.commit start commit{flags=0,_version_=0,optimize=false,openSearcher=false,waitSearcher=false,expungeDeletes=false,softCommit=false}
[junit4:junit4]   2> 2628 T2754 oasc.CachingDirectoryFactory.close Releasing directory:C:\Users\JenkinsSlave\workspace\Lucene-Solr-trunk-Windows\solr\build\solr-core\test\J0\.\org.apache.solr.handler.TestReplicationHandler$SolrInstance-1351332128953\slave\collection1\data
[junit4:junit4]   2> 2630 T2754 oasu.DirectUpdateHandler2.commit end_commit_flush
[junit4:junit4]   2> 2631 T2754 oash.SnapPuller.fetchLatestIndex removing temporary index download directory files MockDirWrapper(org.apache.lucene.store.RAMDirectory@b649bc lockFactory=org.apache.lucene.store.SimpleFSLockFactory@aa5d28)
[junit4:junit4]   2> 2631 T2754 oasc.CachingDirectoryFactory.close Releasing directory:C:\Users\JenkinsSlave\workspace\Lucene-Solr-trunk-Windows\solr\build\solr-core\test\J0\.\org.apache.solr.handler.TestReplicationHandler$SolrInstance-1351332128953\slave\collection1\data\index.20121027060211154
[junit4:junit4]   2> 2631 T2754 oasc.CachingDirectoryFactory.close Releasing directory:C:\Users\JenkinsSlave\workspace\Lucene-Solr-trunk-Windows\solr\build\solr-core\test\J0\.\org.apache.solr.handler.TestReplicationHandler$SolrInstance-1351332128953\slave\collection1\data\index
[junit4:junit4]   2> 2638 T2751 C199 REQ [collection1] webapp=/solr path=/select params={wt=javabin&q=*:*&version=2} hits=10 status=0 QTime=0 
[junit4:junit4]   2> 2761 T2739 C198 REQ [collection1] webapp=/solr path=/replication params={command=indexversion&qt=/replication&wt=javabin&version=2} status=0 QTime=0 
[junit4:junit4]   2> 2764 T2738 C198 REQ [collection1] webapp=/solr path=/replication params={command=commits&qt=/replication&wt=javabin&version=2} status=0 QTime=0 
[junit4:junit4]   2> 2768 T2741 oasc.CoreContainer.reload Reloading SolrCore 'collection1' using instanceDir: C:\Users\JenkinsSlave\workspace\Lucene-Solr-trunk-Windows\solr\build\solr-core\test\J0\.\org.apache.solr.handler.TestReplicationHandler$SolrInstance-1351332128579\master\collection1
[junit4:junit4]   2> 2769 T2741 oasc.SolrResourceLoader.<init> new SolrResourceLoader for directory: 'C:\Users\JenkinsSlave\workspace\Lucene-Solr-trunk-Windows\solr\build\solr-core\test\J0\.\org.apache.solr.handler.TestReplicationHandler$SolrInstance-1351332128579\master\collection1\'
[junit4:junit4]   2> 2821 T2741 oasc.SolrConfig.<init> Using Lucene MatchVersion: LUCENE_50
[junit4:junit4]   2> 2884 T2741 oasc.SolrConfig.<init> Loaded SolrConfig: solrconfig.xml
[junit4:junit4]   2> 2885 T2741 oass.IndexSchema.readSchema Reading Solr Schema
[junit4:junit4]   2> 2889 T2741 oass.IndexSchema.readSchema Schema name=test
[junit4:junit4]   2> 2911 T2741 oass.IndexSchema.readSchema unique key field: id
[junit4:junit4]   2> 2913 T2741 oasc.SolrCore.<init> [collection1] Opening new SolrCore at C:\Users\JenkinsSlave\workspace\Lucene-Solr-trunk-Windows\solr\build\solr-core\test\J0\.\org.apache.solr.handler.TestReplicationHandler$SolrInstance-1351332128579\master\collection1\, dataDir=.\org.apache.solr.handler.TestReplicationHandler$SolrInstance-1351332128579\master\collection1\data\
[junit4:junit4]   2> 2914 T2741 oasc.SolrCore.<init> JMX monitoring not detected for core: collection1
[junit4:junit4]   2> 2914 T2741 oasc.CachingDirectoryFactory.close Releasing directory:C:\Users\JenkinsSlave\workspace\Lucene-Solr-trunk-Windows\solr\build\solr-core\test\J0\.\org.apache.solr.handler.TestReplicationHandler$SolrInstance-1351332128579\master\collection1\data
[junit4:junit4]   2> 2914 T2741 oasc.SolrCore.getNewIndexDir New index directory detected: old=null new=.\org.apache.solr.handler.TestReplicationHandler$SolrInstance-1351332128579\master\collection1\data\index/
[junit4:junit4]   2> 2914 T2741 oasc.RequestHandlers.initHandlersFromConfig created standard: solr.StandardRequestHandler
[junit4:junit4]   2> 2914 T2741 oasc.RequestHandlers.initHandlersFromConfig created /replication: solr.ReplicationHandler
[junit4:junit4]   2> 2914 T2741 oasc.RequestHandlers.initHandlersFromConfig created defaults: solr.StandardRequestHandler
[junit4:junit4]   2> 2914 T2741 oasc.RequestHandlers.initHandlersFromConfig adding lazy requestHandler: solr.StandardRequestHandler
[junit4:junit4]   2> 2914 T2741 oasc.RequestHandlers.initHandlersFromConfig created lazy: solr.StandardRequestHandler
[junit4:junit4]   2> 2915 T2741 oasc.RequestHandlers.initHandlersFromConfig created /update: solr.UpdateRequestHandler
[junit4:junit4]   2> 2918 T2741 oashl.XMLLoader.init xsltCacheLifetimeSeconds=60
[junit4:junit4]   2> 2923 T2741 oasc.CachingDirectoryFactory.close Releasing directory:C:\Users\JenkinsSlave\workspace\Lucene-Solr-trunk-Windows\solr\build\solr-core\test\J0\.\org.apache.solr.handler.TestReplicationHandler$SolrInstance-1351332128579\master\collection1\data
[junit4:junit4]   2> 2925 T2741 oass.SolrIndexSearcher.<init> Opening Searcher@76e597 main
[junit4:junit4]   2> 2926 T2741 oasu.CommitTracker.<init> Hard AutoCommit: disabled
[junit4:junit4]   2> 2926 T2741 oasu.CommitTracker.<init> Soft AutoCommit: disabled
[junit4:junit4]   2> 2926 T2741 oash.ReplicationHandler.inform Replication enabled for following config files: schema.xml
[junit4:junit4]   2> 2926 T2741 oash.ReplicationHandler.inform Commits will be reserved for  10000
[junit4:junit4]   2> 2927 T2756 oasc.SolrCore.registerSearcher [collection1] Registered new searcher Searcher@76e597 main{StandardDirectoryReader(segments_2:4:nrt _0(5.0):C10)}
[junit4:junit4]   2> 2927 T2741 oasc.CoreContainer.register replacing core: collection1
[junit4:junit4]   2> 2928 T2741 oasc.SolrCore.close [collection1]  CLOSING SolrCore org.apache.solr.core.SolrCore@1f413f2
[junit4:junit4]   2> 2928 T2741 oasu.DirectUpdateHandler2.close closing DirectUpdateHandler2{commits=1,autocommits=0,soft autocommits=0,optimizes=0,rollbacks=0,expungeDeletes=0,docsPending=0,adds=0,deletesById=0,deletesByQuery=0,errors=0,cumulative_adds=10,cumulative_deletesById=0,cumulative_deletesByQuery=1,cumulative_errors=0}
[junit4:junit4]   2> 2930 T2741 oasc.SolrCore.closeSearcher [collection1] Closing main searcher on request.
[junit4:junit4]   2> 2931 T2741 oasc.CachingDirectoryFactory.close Releasing directory:C:\Users\JenkinsSlave\workspace\Lucene-Solr-trunk-Windows\solr\build\solr-core\test\J0\.\org.apache.solr.handler.TestReplicationHandler$SolrInstance-1351332128579\master\collection1\data\index
[junit4:junit4]   2> ASYNC  NEW_CORE C200 name=collection1 org.apache.solr.core.SolrCore@1375e25
[junit4:junit4]   2> 2939 T2740 C200 REQ [collection1] webapp=/solr path=/replication params={command=indexversion&qt=/replication&wt=javabin&version=2} status=0 QTime=0 
[junit4:junit4]   2> 2944 T2737 C200 REQ [collection1] webapp=/solr path=/replication params={command=commits&qt=/replication&wt=javabin&version=2} status=0 QTime=0 
[junit4:junit4]   2> 2949 T2742 C200 UPDATE [collection1] webapp=/solr path=/update params={wt=javabin&version=2} {add=[110]} 0 1
[junit4:junit4]   2> 2952 T2739 C200 UPDATE [collection1] webapp=/solr path=/update params={wt=javabin&version=2} {add=[120]} 0 0
[junit4:junit4]   2> 2957 T2738 C200 oasu.DirectUpdateHandler2.commit start commit{flags=0,_version_=0,optimize=false,openSearcher=true,waitSearcher=true,expungeDeletes=false,softCommit=false}
[junit4:junit4]   2> 2959 T2738 C200 oasc.SolrDeletionPolicy.onCommit SolrDeletionPolicy.onCommit: commits:num=2
[junit4:junit4]   2> 		commit{dir=MockDirWrapper(org.apache.lucene.store.RAMDirectory@348ede lockFactory=org.apache.lucene.store.SingleInstanceLockFactory@57b9f1),segFN=segments_2,generation=2,filenames=[_0_1.len, _0_0.len, segments_2, _0.inf, _0.si, _0.pst, _0.fld]
[junit4:junit4]   2> 		commit{dir=MockDirWrapper(org.apache.lucene.store.RAMDirectory@348ede lockFactory=org.apache.lucene.store.SingleInstanceLockFactory@57b9f1),segFN=segments_3,generation=3,filenames=[_1_1.len, _1.pst, _1.fld, _1_0.len, _0_1.len, _1.si, _0_0.len, _1.inf, _0.inf, _0.si, _0.pst, _0.fld, segments_3]
[junit4:junit4]   2> 2959 T2738 C200 oasc.SolrDeletionPolicy.updateCommits newest commit = 3[_1_1.len, _1.pst, _1.fld, _1_0.len, _0_1.len, _1.si, _0_0.len, _1.inf, _0.inf, _0.si, _0.pst, _0.fld, segments_3]
[junit4:junit4]   2> 2961 T2738 C200 oasc.CachingDirectoryFactory.close Releasing directory:C:\Users\JenkinsSlave\workspace\Lucene-Solr-trunk-Windows\solr\build\solr-core\test\J0\.\org.apache.solr.handler.TestReplicationHandler$SolrInstance-1351332128579\master\collection1\data
[junit4:junit4]   2> 2961 T2738 C200 oass.SolrIndexSearcher.<init> Opening Searcher@afffe7 main
[junit4:junit4]   2> 2963 T2738 C200 oasu.DirectUpdateHandler2.commit end_commit_flush
[junit4:junit4]   2> 2963 T2756 oasc.SolrCore.registerSearcher [collection1] Registered new searcher Searcher@afffe7 main{StandardDirectoryReader(segments_3:6:nrt _0(5.0):C10 _1(5.0):C2)}
[junit4:junit4]   2> 2963 T2756 oasc.CachingDirectoryFactory.close Releasing directory:C:\Users\JenkinsSlave\workspace\Lucene-Solr-trunk-Windows\solr\build\solr-core\test\J0\.\org.apache.solr.handler.TestReplicationHandler$SolrInstance-1351332128579\master\collection1\data\index
[junit4:junit4]   2> 2963 T2738 C200 UPDATE [collection1] webapp=/solr path=/update params={waitSearcher=true&wt=javabin&commit=true&softCommit=false&version=2} {commit=} 0 6
[junit4:junit4]   2> 2966 T2741 C200 REQ [collection1] webapp=/solr path=/select params={wt=javabin&q=*:*&version=2} hits=12 status=0 QTime=0 
[junit4:junit4]   2> 3088 T2752 C199 REQ [collection1] webapp=/solr path=/select params={wt=javabin&q=*:*&version=2} hits=10 status=0 QTime=0 
[junit4:junit4]   2> 3211 T2747 C199 REQ [collection1] webapp=/solr path=/select params={wt=javabin&q=*:*&version=2} hits=10 status=0 QTime=0 
[junit4:junit4]   2> 3335 T2748 C199 REQ [collection1] webapp=/solr path=/select params={wt=javabin&q=*:*&version=2} hits=10 status=0 QTime=0 
[junit4:junit4]   2> 3458 T2750 C199 REQ [collection1] webapp=/solr path=/select params={wt=javabin&q=*:*&version=2} hits=10 status=0 QTime=0 
[junit4:junit4]   2> 3580 T2751 C199 REQ [collection1] webapp=/solr path=/select params={wt=javabin&q=*:*&version=2} hits=10 status=0 QTime=0 
[junit4:junit4]   2> 3703 T2752 C199 REQ [collection1] webapp=/solr path=/select params={wt=javabin&q=*:*&version=2} hits=10 status=0 QTime=0 
[junit4:junit4]   2> 3721 T2737 C200 REQ [collection1] webapp=/solr path=/replication params={command=indexversion&wt=javabin&qt=/replication&version=2} status=0 QTime=0 
[junit4:junit4]   2> 3722 T2754 oash.SnapPuller.fetchLatestIndex Master's generation: 3
[junit4:junit4]   2> 3722 T2754 oash.SnapPuller.fetchLatestIndex Slave's generation: 2
[junit4:junit4]   2> 3722 T2754 oash.SnapPuller.fetchLatestIndex Starting replication process
[junit4:junit4]   2> 3724 T2742 C200 oasc.CachingDirectoryFactory.close Releasing directory:C:\Users\JenkinsSlave\workspace\Lucene-Solr-trunk-Windows\solr\build\solr-core\test\J0\.\org.apache.solr.handler.TestReplicationHandler$SolrInstance-1351332128579\master\collection1\data
[junit4:junit4]   2> 3725 T2742 C200 oasc.CachingDirectoryFactory.close Releasing directory:C:\Users\JenkinsSlave\workspace\Lucene-Solr-trunk-Windows\solr\build\solr-core\test\J0\.\org.apache.solr.handler.TestReplicationHandler$SolrInstance-1351332128579\master\collection1\data\index
[junit4:junit4]   2> 3728 T2742 C200 REQ [collection1] webapp=/solr path=/replication params={command=filelist&generation=3&wt=javabin&qt=/replication&version=2} status=0 QTime=4 
[junit4:junit4]   2> 3729 T2754 oash.SnapPuller.fetchLatestIndex Number of files in latest index in master: 13
[junit4:junit4]   2> 3730 T2754 oasc.CachingDirectoryFactory.injectLockFactory WARNING No lockType configured for MockDirWrapper(org.apache.lucene.store.RAMDirectory@1605d92 lockFactory=org.apache.lucene.store.SingleInstanceLockFactory@19f3dc6) assuming 'simple'
[junit4:junit4]   2> 3730 T2754 oasc.CachingDirectoryFactory.get return new directory for C:\Users\JenkinsSlave\workspace\Lucene-Solr-trunk-Windows\solr\build\solr-core\test\J0\.\org.apache.solr.handler.TestReplicationHandler$SolrInstance-1351332128953\slave\collection1\data\index.20121027060212305 forceNew:false
[junit4:junit4]   2> 3730 T2754 oasc.CachingDirectoryFactory.close Releasing directory:C:\Users\JenkinsSlave\workspace\Lucene-Solr-trunk-Windows\solr\build\solr-core\test\J0\.\org.apache.solr.handler.TestReplicationHandler$SolrInstance-1351332128953\slave\collection1\data
[junit4:junit4]   2> 3730 T2754 oash.SnapPuller.fetchLatestIndex Starting download to MockDirWrapper(org.apache.lucene.store.RAMDirectory@1605d92 lockFactory=org.apache.lucene.store.SimpleFSLockFactory@190a15b) fullCopy=false
[junit4:junit4]   2> 3733 T2739 C200 REQ [collection1] webapp=/solr path=/replication params={file=_1_1.len&command=filecontent&checksum=true&generation=3&qt=/replication&wt=filestream} status=0 QTime=0 
[junit4:junit4]   2> 3737 T2738 C200 REQ [collection1] webapp=/solr path=/replication params={file=_1.fld&command=filecontent&checksum=true&generation=3&qt=/replication&wt=filestream} status=0 QTime=0 
[junit4:junit4]   2> 3738 T2754 oash.SnapPuller.downloadIndexFiles Skipping download for _0_1.len
[junit4:junit4]   2> 3740 T2741 C200 REQ [collection1] webapp=/solr path=/replication params={file=_1.inf&command=filecontent&checksum=true&generation=3&qt=/replication&wt=filestream} status=0 QTime=0 
[junit4:junit4]   2> 3741 T2754 oash.SnapPuller.downloadIndexFiles Skipping download for _0.pst
[junit4:junit4]   2> 3742 T2754 oash.SnapPuller.downloadIndexFiles Skipping download for _0.fld
[junit4:junit4]   2> 3745 T2740 C200 REQ [collection1] webapp=/solr path=/replication params={file=_1.pst&command=filecontent&checksum=true&generation=3&qt=/replication&wt=filestream} status=0 QTime=0 
[junit4:junit4]   2> 3748 T2737 C200 REQ [collection1] webapp=/solr path=/replication params={file=_1_0.len&command=filecontent&checksum=true&generation=3&qt=/replication&wt=filestream} status=0 QTime=0 
[junit4:junit4]   2> 3755 T2742 C200 REQ [collection1] webapp=/solr path=/replication params={file=_1.si&command=filecontent&checksum=true&generation=3&qt=/replication&wt=filestream} status=0 QTime=1 
[junit4:junit4]   2> 3755 T2754 oash.SnapPuller.downloadIndexFiles Skipping download for _0_0.len
[junit4:junit4]   2> 3756 T2754 oash.SnapPuller.downloadIndexFiles Skipping download for _0.inf
[junit4:junit4]   2> 3756 T2754 oash.SnapPuller.downloadIndexFiles Skipping download for _0.si
[junit4:junit4]   2> 3759 T2739 C200 REQ [collection1] webapp=/solr path=/replication params={file=segments_3&command=filecontent&checksum=true&generation=3&qt=/replication&wt=filestream} status=0 QTime=0 
[junit4:junit4]   2> 3760 T2754 oasc.CachingDirectoryFactory.close Releasing directory:C:\Users\JenkinsSlave\workspace\Lucene-Solr-trunk-Windows\solr\build\solr-core\test\J0\.\org.apache.solr.handler.TestReplicationHandler$SolrInstance-1351332128953\slave\collection1\data\index
[junit4:junit4]   2> 3760 T2754 oash.SnapPuller.fetchLatestIndex Total time taken for download : 0 secs
[junit4:junit4]   2> 3761 T2754 oasu.DefaultSolrCoreState.newIndexWriter Creating new IndexWriter...
[junit4:junit4]   2> 3762 T2754 oasu.DefaultSolrCoreState.newIndexWriter Waiting until IndexWriter is unused... core=collection1
[junit4:junit4]   2> 3762 T2754 oasu.DefaultSolrCoreState.newIndexWriter Closing old IndexWriter... core=collection1
[junit4:junit4]   2> 3762 T2754 oasc.CachingDirectoryFactory.close Releasing directory:C:\Users\JenkinsSlave\workspace\Lucene-Solr-trunk-Windows\solr\build\solr-core\test\J0\.\org.apache.solr.handler.TestReplicationHandler$SolrInstance-1351332128953\slave\collection1\data\index
[junit4:junit4]   2> 3763 T2754 oasc.CachingDirectoryFactory.close Releasing directory:C:\Users\JenkinsSlave\workspace\Lucene-Solr-trunk-Windows\solr\build\solr-core\test\J0\.\org.apache.solr.handler.TestReplicationHandler$SolrInstance-1351332128953\slave\collection1\data
[junit4:junit4]   2> 3764 T2754 oasc.SolrDeletionPolicy.onInit SolrDeletionPolicy.onInit: commits:num=2
[junit4:junit4]   2> 		commit{dir=MockDirWrapper(org.apache.lucene.store.RAMDirectory@180d12d lockFactory=org.apache.lucene.store.SingleInstanceLockFactory@6d69),segFN=segments_2,generation=2,filenames=[_0_1.len, _0_0.len, segments_2, _0.inf, _0.si, _0.pst, _0.fld]
[junit4:junit4]   2> 		commit{dir=MockDirWrapper(org.apache.lucene.store.RAMDirectory@180d12d lockFactory=org.apache.lucene.store.SingleInstanceLockFactory@6d69),segFN=segments_3,generation=3,filenames=[_1_1.len, _1.pst, _1.fld, _1_0.len, _0_1.len, _1.si, _0_0.len, _1.inf, _0.inf, _0.si, _0.pst, _0.fld, segments_3]
[junit4:junit4]   2> 3764 T2754 oasc.SolrDeletionPolicy.updateCommits newest commit = 3[_1_1.len, _1.pst, _1.fld, _1_0.len, _0_1.len, _1.si, _0_0.len, _1.inf, _0.inf, _0.si, _0.pst, _0.fld, segments_3]
[junit4:junit4]   2> 3767 T2754 oasu.DefaultSolrCoreState.newIndexWriter New IndexWriter is ready to be used.
[junit4:junit4]   2> 3767 T2754 oasc.CachingDirectoryFactory.close Releasing directory:C:\Users\JenkinsSlave\workspace\Lucene-Solr-trunk-Windows\solr\build\solr-core\test\J0\.\org.apache.solr.handler.TestReplicationHandler$SolrInstance-1351332128953\slave\collection1\data
[junit4:junit4]   2> 3767 T2754 oass.SolrIndexSearcher.<init> Opening Searcher@1522bb8 main
[junit4:junit4]   2> 3768 T2753 oasc.SolrCore.registerSearcher [collection1] Registered new searcher Searcher@1522bb8 main{StandardDirectoryReader(segments_3:6:nrt _0(5.0):C10 _1(5.0):C2)}
[junit4:junit4]   2> 3768 T2753 oasc.CachingDirectoryFactory.close Releasing directory:C:\Users\JenkinsSlave\workspace\Lucene-Solr-trunk-Windows\solr\build\solr-core\test\J0\.\org.apache.solr.handler.TestReplicationHandler$SolrInstance-1351332128953\slave\collection1\data\index
[junit4:junit4]   2> 3769 T2754 oasu.DirectUpdateHandler2.commit start commit{flags=0,_version_=0,optimize=false,openSearcher=false,waitSearcher=false,expungeDeletes=false,softCommit=false}
[junit4:junit4]   2> 3769 T2754 oasc.CachingDirectoryFactory.close Releasing directory:C:\Users\JenkinsSlave\workspace\Lucene-Solr-trunk-Windows\solr\build\solr-core\test\J0\.\org.apache.solr.handler.TestReplicationHandler$SolrInstance-1351332128953\slave\collection1\data
[junit4:junit4]   2> 3769 T2754 oasu.DirectUpdateHandler2.commit end_commit_flush
[junit4:junit4]   2> 3769 T2754 oash.SnapPuller.fetchLatestIndex removing temporary index download directory files MockDirWrapper(org.apache.lucene.store.RAMDirectory@1605d92 lockFactory=org.apache.lucene.store.SimpleFSLockFactory@190a15b)
[junit4:junit4]   2> 3770 T2754 oasc.CachingDirectoryFactory.close Releasing directory:C:\Users\JenkinsSlave\workspace\Lucene-Solr-trunk-Windows\solr\build\solr-core\test\J0\.\org.apache.solr.handler.TestReplicationHandler$SolrInstance-1351332128953\slave\collection1\data\index.20121027060212305
[junit4:junit4]   2> 3770 T2754 oasc.CachingDirectoryFactory.close Releasing directory:C:\Users\JenkinsSlave\workspace\Lucene-Solr-trunk-Windows\solr\build\solr-core\test\J0\.\org.apache.solr.handler.TestReplicationHandler$SolrInstance-1351332128953\slave\collection1\data\index
[junit4:junit4]   2> 3829 T2747 C199 REQ [collection1] webapp=/solr path=/select params={wt=javabin&q=*:*&version=2} hits=12 status=0 QTime=1 
[junit4:junit4]   2> 3967 T2712 oasc.CoreContainer.shutdown Shutting down CoreContainer instance=10757903
[junit4:junit4]   2> 3968 T2712 oasc.SolrCore.close [collection1]  CLOSING SolrCore org.apache.solr.core.SolrCore@1375e25
[junit4:junit4]   2> 3969 T2712 oasu.DirectUpdateHandler2.close closing DirectUpdateHandler2{commits=1,autocommits=0,soft autocommits=0,optimizes=0,rollbacks=0,expungeDeletes=0,docsPending=0,adds=0,deletesById=0,deletesByQuery=0,errors=0,cumulative_adds=2,cumulative_deletesById=0,cumulative_deletesByQuery=0,cumulative_errors=0}
[junit4:junit4]   2> 3971 T2712 oasc.SolrCore.decrefSolrCoreState Closing SolrCoreState
[junit4:junit4]   2> 3971 T2712 oasu.DefaultSolrCoreState.closeIndexWriter SolrCoreState ref count has reached 0 - closing IndexWriter
[junit4:junit4]   2> 3971 T2712 oasu.DefaultSolrCoreState.closeIndexWriter closing IndexWriter with IndexWriterCloser
[junit4:junit4]   2> 3972 T2712 C200 oasc.CachingDirectoryFactory.close Releasing directory:C:\Users\JenkinsSlave\workspace\Lucene-Solr-trunk-Windows\solr\build\solr-core\test\J0\.\org.apache.solr.handler.TestReplicationHandler$SolrInstance-1351332128579\master\collection1\data\index
[junit4:junit4]   2> 3973 T2712 oasc.SolrCore.closeSearcher [collection1] Closing main searcher on request.
[junit4:junit4]   2> 3973 T2712 oasc.CachingDirectoryFactory.close Releasing directory:C:\Users\JenkinsSlave\workspace\Lucene-Solr-trunk-Windows\solr\build\solr-core\test\J0\.\org.apache.solr.handler.TestReplicationHandler$SolrInstance-1351332128579\master\collection1\data\index
[junit4:junit4]   2> 3973 T2712 oejsh.ContextHandler.doStop stopped o.e.j.s.ServletContextHandler{/solr,null}
[junit4:junit4]   2> 4027 T2712 oejs.Server.doStart jetty-8.1.2.v20120308
[junit4:junit4]   2> 4031 T2712 oejs.AbstractConnector.doStart Started SelectChannelConnector@0.0.0.0:50469
[junit4:junit4]   2> 4032 T2712 oasc.SolrResourceLoader.locateSolrHome JNDI not configured for solr (NoInitialContextEx)
[junit4:junit4]   2> 4032 T2712 oasc.SolrResourceLoader.locateSolrHome using system property solr.solr.home: .\org.apache.solr.handler.TestReplicationHandler$SolrInstance-1351332128579\master
[junit4:junit4]   2> 4035 T2712 oasc.SolrResourceLoader.<init> new SolrResourceLoader for deduced Solr Home: '.\org.apache.solr.handler.TestReplicationHandler$SolrInstance-1351332128579\master\'
[junit4:junit4]   2> 4079 T2712 oass.SolrDispatchFilter.init SolrDispatchFilter.init()
[junit4:junit4]   2> 4080 T2712 oasc.SolrResourceLoader.locateSolrHome JNDI not configured for solr (NoInitialContextEx)
[junit4:junit4]   2> 4080 T2712 oasc.SolrResourceLoader.locateSolrHome using system property solr.solr.home: .\org.apache.solr.handler.TestReplicationHandler$SolrInstance-1351332128579\master
[junit4:junit4]   2> 4081 T2712 oasc.CoreContainer$Initializer.initialize looking for solr.xml: C:\Users\JenkinsSlave\workspace\Lucene-Solr-trunk-Windows\solr\build\solr-core\test\J0\.\org.apache.solr.handler.TestReplicationHandler$SolrInstance-1351332128579\master\solr.xml
[junit4:junit4]   2> 4081 T2712 oasc.CoreContainer.<init> New CoreContainer 29654715
[junit4:junit4]   2> 4082 T2712 oasc.CoreContainer$Initializer.initialize no solr.xml file found - using default
[junit4:junit4]   2> 4085 T2712 oasc.CoreContainer.load Loading CoreContainer using Solr Home: '.\org.apache.solr.handler.TestReplicationHandler$SolrInstance-1351332128579\master\'
[junit4:junit4]   2> 4085 T2712 oasc.SolrResourceLoader.<init> new SolrResourceLoader for directory: '.\org.apache.solr.handler.TestReplicationHandler$SolrInstance-1351332128579\master\'
[junit4:junit4]   2> 4111 T2712 oasc.CoreContainer.load Registering Log Listener
[junit4:junit4]   2> 4133 T2712 oasc.CoreContainer.create Creating SolrCore 'collection1' using instanceDir: .\org.apache.solr.handler.TestReplicationHandler$SolrInstance-1351332128579\master\collection1
[junit4:junit4]   2> 4133 T2712 oasc.SolrResourceLoader.<init> new SolrResourceLoader for directory: '.\org.apache.solr.handler.TestReplicationHandler$SolrInstance-1351332128579\master\collection1\'
[junit4:junit4]   2> 4175 T2712 oasc.SolrConfig.<init> Using Lucene MatchVersion: LUCENE_50
[junit4:junit4]   2> 4231 T2712 oasc.SolrConfig.<init> Loaded SolrConfig: solrconfig.xml
[junit4:junit4]   2> 4231 T2712 oass.IndexSchema.readSchema Reading Solr Schema
[junit4:junit4]   2> 4234 T2712 oass.IndexSchema.readSchema Schema name=test
[junit4:junit4]   2> 4255 T2712 oass.IndexSchema.readSchema unique key field: id
[junit4:junit4]   2> 4257 T2712 oasc.SolrCore.<init> [collection1] Opening new SolrCore at .\org.apache.solr.handler.TestReplicationHandler$SolrInstance-1351332128579\master\collection1\, dataDir=.\org.apache.solr.handler.TestReplicationHandler$SolrInstance-1351332128579\master\collection1\data\
[junit4:junit4]   2> 4259 T2712 oasc.SolrCore.<init> JMX monitoring not detected for core: collection1
[junit4:junit4]   2> 4259 T2712 oasc.SolrCore.initDirectoryFactory org.apache.solr.core.MockDirectoryFactory
[junit4:junit4]   2> 4260 T2712 oasc.CachingDirectoryFactory.injectLockFactory WARNING No lockType configured for MockDirWrapper(org.apache.lucene.store.RAMDirectory@2f7bf lockFactory=org.apache.lucene.store.SingleInstanceLockFactory@d75506) assuming 'simple'
[junit4:junit4]   2> 4260 T2712 oasc.CachingDirectoryFactory.get return new directory for C:\Users\JenkinsSlave\workspace\Lucene-Solr-trunk-Windows\solr\build\solr-core\test\J0\.\org.apache.solr.handler.TestReplicationHandler$SolrInstance-1351332128579\master\collection1\data forceNew:false
[junit4:junit4]   2> 4261 T2712 oasc.CachingDirectoryFactory.close Releasing directory:C:\Users\JenkinsSlave\workspace\Lucene-Solr-trunk-Windows\solr\build\solr-core\test\J0\.\org.apache.solr.handler.TestReplicationHandler$SolrInstance-1351332128579\master\collection1\data
[junit4:junit4]   2> 4261 T2712 oasc.SolrCore.getNewIndexDir New index directory detected: old=null new=.\org.apache.solr.handler.TestReplicationHandler$SolrInstance-1351332128579\master\collection1\data\index/
[junit4:junit4]   2> 4263 T2712 oasc.SolrCore.initIndex WARNING [collection1] Solr index directory '.\org.apache.solr.handler.TestReplicationHandler$SolrInstance-1351332128579\master\collection1\data\index' doesn't exist. Creating new index...
[junit4:junit4]   2> 4267 T2712 oasc.CachingDirectoryFactory.get return new directory for C:\Users\JenkinsSlave\workspace\Lucene-Solr-trunk-Windows\solr\build\solr-core\test\J0\.\org.apache.solr.handler.TestReplicationHandler$SolrInstance-1351332128579\master\collection1\data\index forceNew:false
[junit4:junit4]   2> 4271 T2712 oasc.SolrDeletionPolicy.onCommit SolrDeletionPolicy.onCommit: commits:num=1
[junit4:junit4]   2> 		commit{dir=MockDirWrapper(org.apache.lucene.store.NIOFSDirectory@C:\Users\JenkinsSlave\workspace\Lucene-Solr-trunk-Windows\solr\build\solr-core\test\J0\index3169331699tmp lockFactory=org.apache.lucene.store.SingleInstanceLockFactory@c6a676),segFN=segments_1,generation=1,filenames=[segments_1]
[junit4:junit4]   2> 4271 T2712 oasc.SolrDeletionPolicy.updateCommits newest commit = 1[segments_1]
[junit4:junit4]   2> 4271 T2712 oasc.CachingDirectoryFactory.close Releasing directory:C:\Users\JenkinsSlave\workspace\Lucene-Solr-trunk-Windows\solr\build\solr-core\test\J0\.\org.apache.solr.handler.TestReplicationHandler$SolrInstance-1351332128579\master\collection1\data\index
[junit4:junit4]   2> 4274 T2712 oasc.RequestHandlers.initHandlersFromConfig created standard: solr.StandardRequestHandler
[junit4:junit4]   2> 4274 T2712 oasc.RequestHandlers.initHandlersFromConfig created /replication: solr.ReplicationHandler
[junit4:junit4]   2> 4274 T2712 oasc.RequestHandlers.initHandlersFromConfig created defaults: solr.StandardRequestHandler
[junit4:junit4]   2> 4275 T2712 oasc.RequestHandlers.initHandlersFromConfig adding lazy requestHandler: solr.StandardRequestHandler
[junit4:junit4]   2> 4275 T2712 oasc.RequestHandlers.initHandlersFromConfig created lazy: solr.StandardRequestHandler
[junit4:junit4]   2> 4275 T2712 oasc.RequestHandlers.initHandlersFromConfig created /update: solr.UpdateRequestHandler
[junit4:junit4]   2> 4287 T2712 oashl.XMLLoader.init xsltCacheLifetimeSeconds=60
[junit4:junit4]   2> 4293 T2712 oasc.CachingDirectoryFactory.close Releasing directory:C:\Users\JenkinsSlave\workspace\Lucene-Solr-trunk-Windows\solr\build\solr-core\test\J0\.\org.apache.solr.handler.TestReplicationHandler$SolrInstance-1351332128579\master\collection1\data
[junit4:junit4]   2> 4293 T2712 oass.SolrIndexSearcher.<init> Opening Searcher@18d72f0 main
[junit4:junit4]   2> 4294 T2712 oasu.CommitTracker.<init> Hard AutoCommit: disabled
[junit4:junit4]   2> 4294 T2712 oasu.CommitTracker.<init> Soft AutoCommit: disabled
[junit4:junit4]   2> 4296 T2712 oashc.HttpShardHandlerFactory.getParameter Setting socketTimeout to: 0
[junit4:junit4]   2> 4296 T2712 oashc.HttpShardHandlerFactory.getParameter Setting urlScheme to: http://
[junit4:junit4]   2> 4296 T2712 oashc.HttpShardHandlerFactory.getParameter Setting connTimeout to: 0
[junit4:junit4]   2> 4296 T2712 oashc.HttpShardHandlerFactory.getParameter Setting maxConnectionsPerHost to: 20
[junit4:junit4]   2> 4298 T2712 oashc.HttpShardHandlerFactory.getParameter Setting corePoolSize to: 0
[junit4:junit4]   2> 4298 T2712 oashc.HttpShardHandlerFactory.getParameter Setting maximumPoolSize to: 2147483647
[junit4:junit4]   2> 4298 T2712 oashc.HttpShardHandlerFactory.getParameter Setting maxThreadIdleTime to: 5
[junit4:junit4]   2> 4298 T2712 oashc.HttpShardHandlerFactory.getParameter Setting sizeOfQueue to: -1
[junit4:junit4]   2> 4299 T2712 oashc.HttpShardHandlerFactory.getParameter Setting fairnessPolicy to: false
[junit4:junit4]   2> 4299 T2712 oascsi.HttpClientUtil.createClient Creating new http client, config:maxConnectionsPerHost=20&maxConnections=10000&socketTimeout=0&connTimeout=0&retry=false
[junit4:junit4]   2> 4306 T2712 oash.ReplicationHandler.inform Replication enabled for following config files: schema.xml,xslt/dummy.xsl
[junit4:junit4]   2> 4306 T2712 oash.ReplicationHandler.inform Commits will be reserved for  10000
[junit4:junit4]   2> 4307 T2712 oasc.CoreContainer.register registering core: collection1
[junit4:junit4]   2> 4308 T2767 oasc.SolrCore.registerSearcher [collection1] Registered new searcher Searcher@18d72f0 main{StandardDirectoryReader(segments_1:1)}
[junit4:junit4]   2> 4308 T2712 oass.SolrDispatchFilter.init user.dir=C:\Users\JenkinsSlave\workspace\Lucene-Solr-trunk-Windows\solr\build\solr-core\test\J0
[junit4:junit4]   2> 4309 T2712 oass.SolrDispatchFilter.init SolrDispatchFilter.init() done
[junit4:junit4]   2> 4309 T2712 oascsi.HttpClientUtil.createClient Creating new http client, config:maxConnections=128&maxConnectionsPerHost=32&followRedirects=false
[junit4:junit4]   2> 4336 T2712 oasc.CoreContainer.shutdown Shutting down CoreContainer instance=23860739
[junit4:junit4]   2> 4337 T2712 oasc.SolrCore.close [collection1]  CLOSING SolrCore org.apache.solr.core.SolrCore@11611a2
[junit4:junit4]   2> 4338 T2712 oasu.DirectUpdateHandler2.close closing DirectUpdateHandler2{commits=2,autocommits=0,soft autocommits=0,optimizes=0,rollbacks=0,expungeDeletes=0,docsPending=0,adds=0,deletesById=0,deletesByQuery=0,errors=0,cumulative_adds=0,cumulative_deletesById=0,cumulative_deletesByQuery=0,cumulative_errors=0}
[junit4:junit4]   2> 4338 T2712 oasc.SolrCore.decrefSolrCoreState Closing SolrCoreState
[junit4:junit4]   2> 4338 T2712 oasu.DefaultSolrCoreState.closeIndexWriter SolrCoreState ref count has reached 0 - closing IndexWriter
[junit4:junit4]   2> 4340 T2712 oasu.DefaultSolrCoreState.closeIndexWriter closing IndexWriter with IndexWriterCloser
[junit4:junit4]   2> 4342 T2712 C199 oasc.CachingDirectoryFactory.close Releasing directory:C:\Users\JenkinsSlave\workspace\Lucene-Solr-trunk-Windows\solr\build\solr-core\test\J0\.\org.apache.solr.handler.TestReplicationHandler$SolrInstance-1351332128953\slave\collection1\data\index
[junit4:junit4]   2> 4343 T2712 oasc.SolrCore.closeSearcher [collection1] Closing main searcher on request.
[junit4:junit4]   2> 4343 T2712 oasc.CachingDirectoryFactory.close Releasing directory:C:\Users\JenkinsSlave\workspace\Lucene-Solr-trunk-Windows\solr\build\solr-core\test\J0\.\org.apache.solr.handler.TestReplicationHandler$SolrInstance-1351332128953\slave\collection1\data\index
[junit4:junit4]   2> 4343 T2712 oejsh.ContextHandler.doStop stopped o.e.j.s.ServletContextHandler{/solr,null}
[junit4:junit4]   2> 4397 T2712 oejs.Server.doStart jetty-8.1.2.v20120308
[junit4:junit4]   2> 4401 T2712 oejs.AbstractConnector.doStart Started SelectChannelConnector@0.0.0.0:50472
[junit4:junit4]   2> 4403 T2712 oasc.SolrResourceLoader.locateSolrHome JNDI not configured for solr (NoInitialContextEx)
[junit4:junit4]   2> 4403 T2712 oasc.SolrResourceLoader.locateSolrHome using system property solr.solr.home: .\org.apache.solr.handler.TestReplicationHandler$SolrInstance-1351332128953\slave
[junit4:junit4]   2> 4404 T2712 oasc.SolrResourceLoader.<init> new SolrResourceLoader for deduced Solr Home: '.\org.apache.solr.handler.TestReplicationHandler$SolrInstance-1351332128953\slave\'
[junit4:junit4]   2> 4443 T2712 oass.SolrDispatchFilter.init SolrDispatchFilter.init()
[junit4:junit4]   2> 4444 T2712 oasc.SolrResourceLoader.locateSolrHome JNDI not configured for solr (NoInitialContextEx)
[junit4:junit4]   2> 4444 T2712 oasc.SolrResourceLoader.locateSolrHome using system property solr.solr.home: .\org.apache.solr.handler.TestReplicationHandler$SolrInstance-1351332128953\slave
[junit4:junit4]   2> 4444 T2712 oasc.CoreContainer$Initializer.initialize looking for solr.xml: C:\Users\JenkinsSlave\workspace\Lucene-Solr-trunk-Windows\solr\build\solr-core\test\J0\.\org.apache.solr.handler.TestReplicationHandler$SolrInstance-1351332128953\slave\solr.xml
[junit4:junit4]   2> 4445 T2712 oasc.CoreContainer.<init> New CoreContainer 27625669
[junit4:junit4]   2> 4446 T2712 oasc.CoreContainer$Initializer.initialize no solr.xml file found - using default
[junit4:junit4]   2> 4446 T2712 oasc.CoreContainer.load Loading CoreContainer using Solr Home: '.\org.apache.solr.handler.TestReplicationHandler$SolrInstance-1351332128953\slave\'
[junit4:junit4]   2> 4448 T2712 oasc.SolrResourceLoader.<init> new SolrResourceLoader for directory: '.\org.apache.solr.handler.TestReplicationHandler$SolrInstance-1351332128953\slave\'
[junit4:junit4]   2> 4478 T2712 oasc.CoreContainer.load Registering Log Listener
[junit4:junit4]   2> 4505 T2712 oasc.CoreContainer.create Creating SolrCore 'collection1' using instanceDir: .\org.apache.solr.handler.TestReplicationHandler$SolrInstance-1351332128953\slave\collection1
[junit4:junit4]   2> 4506 T2712 oasc.SolrResourceLoader.<init> new SolrResourceLoader for directory: '.\org.apache.solr.handler.TestReplicationHandler$SolrInstance-1351332128953\slave\collection1\'
[junit4:junit4]   2> 4557 T2712 oasc.SolrConfig.<init> Using Lucene MatchVersion: LUCENE_50
[junit4:junit4]   2> 4650 T2712 oasc.SolrConfig.<init> Loaded SolrConfig: solrconfig.xml
[junit4:junit4]   2> 4652 T2712 oass.IndexSchema.readSchema Reading Solr Schema
[junit4:junit4]   2> 4656 T2712 oass.IndexSchema.readSchema Schema name=test
[junit4:junit4]   2> 4680 T2712 oass.IndexSchema.readSchema unique key field: id
[junit4:junit4]   2> 4683 T2712 oasc.SolrCore.<init> [collection1] Opening new SolrCore at .\org.apache.solr.handler.TestReplicationHandler$SolrInstance-1351332128953\slave\collection1\, dataDir=.\org.apache.solr.handler.TestReplicationHandler$SolrInstance-1351332128953\slave\collection1\data\
[junit4:junit4]   2> 4683 T2712 oasc.SolrCore.<init> JMX monitoring not detected for core: collection1
[junit4:junit4]   2> 4684 T2712 oasc.SolrCore.initDirectoryFactory org.apache.solr.core.MockDirectoryFactory
[junit4:junit4]   2> 4684 T2712 oasc.CachingDirectoryFactory.injectLockFactory WARNING No lockType configured for MockDirWrapper(org.apache.lucene.store.RAMDirectory@de90 lockFactory=org.apache.lucene.store.SingleInstanceLockFactory@113ed13) assuming 'simple'
[junit4:junit4]   2> 4685 T2712 oasc.CachingDirectoryFactory.get return new directory for C:\Users\JenkinsSlave\workspace\Lucene-Solr-trunk-Windows\solr\build\solr-core\test\J0\.\org.apache.solr.handler.TestReplicationHandler$SolrInstance-1351332128953\slave\collection1\data forceNew:false
[junit4:junit4]   2> 4685 T2712 oasc.CachingDirectoryFactory.close Releasing directory:C:\Users\JenkinsSlave\workspace\Lucene-Solr-trunk-Windows\solr\build\solr-core\test\J0\.\org.apache.solr.handler.TestReplicationHandler$SolrInstance-1351332128953\slave\collection1\data
[junit4:junit4]   2> 4685 T2712 oasc.SolrCore.getNewIndexDir New index directory detected: old=null new=.\org.apache.solr.handler.TestReplicationHandler$SolrInstance-1351332128953\slave\collection1\data\index/
[junit4:junit4]   2> 4686 T2712 oasc.SolrCore.initIndex WARNING [collection1] Solr index directory '.\org.apache.solr.handler.TestReplicationHandler$SolrInstance-1351332128953\slave\collection1\data\index' doesn't exist. Creating new index...
[junit4:junit4]   2> 4688 T2712 oasc.CachingDirectoryFactory.get return new directory for C:\Users\JenkinsSlave\workspace\Lucene-Solr-trunk-Windows\solr\build\solr-core\test\J0\.\org.apache.solr.handler.TestReplicationHandler$SolrInstance-1351332128953\slave\collection1\data\index forceNew:false
[junit4:junit4]   2> 4690 T2712 oasc.SolrDeletionPolicy.onCommit SolrDeletionPolicy.onCommit: commits:num=1
[junit4:junit4]   2> 		commit{dir=MockDirWrapper(org.apache.lucene.store.RAMDirectory@c02211 lockFactory=org.apache.lucene.store.SingleInstanceLockFactory@d967a5),segFN=segments_1,generation=1,filenames=[segments_1]
[junit4:junit4]   2> 4690 T2712 oasc.SolrDeletionPolicy.updateCommits newest commit = 1[segments_1]
[junit4:junit4]   2> 4690 T2712 oasc.CachingDirectoryFactory.close Releasing directory:C:\Users\JenkinsSlave\workspace\Lucene-Solr-trunk-Windows\solr\build\solr-core\test\J0\.\org.apache.solr.handler.TestReplicationHandler$SolrInstance-1351332128953\slave\collection1\data\index
[junit4:junit4]   2> 4691 T2712 oasc.RequestHandlers.initHandlersFromConfig created standard: solr.StandardRequestHandler
[junit4:junit4]   2> 4691 T2712 oasc.RequestHandlers.initHandlersFromConfig created defaults: solr.StandardRequestHandler
[junit4:junit4]   2> 4691 T2712 oasc.RequestHandlers.initHandlersFromConfig adding lazy requestHandler: solr.StandardRequestHandler
[junit4:junit4]   2> 4692 T2712 oasc.RequestHandlers.initHandlersFromConfig created lazy: solr.StandardRequestHandler
[junit4:junit4]   2> 4692 T2712 oasc.RequestHandlers.initHandlersFromConfig created /update: solr.UpdateRequestHandler
[junit4:junit4]   2> 4692 T2712 oasc.RequestHandlers.initHandlersFromConfig created /replication: solr.ReplicationHandler
[junit4:junit4]   2> 4695 T2712 oashl.XMLLoader.init xsltCacheLifetimeSeconds=60
[junit4:junit4]   2> 4699 T2712 oasc.CachingDirectoryFactory.close Releasing directory:C:\Users\JenkinsSlave\workspace\Lucene-Solr-trunk-Windows\solr\build\solr-core\test\J0\.\org.apache.solr.handler.TestReplicationHandler$SolrInstance-1351332128953\slave\collection1\data
[junit4:junit4]   2> 4699 T2712 oass.SolrIndexSearcher.<init> Opening Searcher@1479a4 main
[junit4:junit4]   2> 4700 T2712 oasu.CommitTracker.<init> Hard AutoCommit: disabled
[junit4:junit4]   2> 4700 T2712 oasu.CommitTracker.<init> Soft AutoCommit: disabled
[junit4:junit4]   2> 4700 T2712 oashc.HttpShardHandlerFactory.getParameter Setting socketTimeout to: 0
[junit4:junit4]   2> 4701 T2712 oashc.HttpShardHandlerFactory.getParameter Setting urlScheme to: http://
[junit4:junit4]   2> 4702 T2712 oashc.HttpShardHandlerFactory.getParameter Setting connTimeout to: 0
[junit4:junit4]   2> 4702 T2712 oashc.HttpShardHandlerFactory.getParameter Setting maxConnectionsPerHost to: 20
[junit4:junit4]   2> 4702 T2712 oashc.HttpShardHandlerFactory.getParameter Setting corePoolSize to: 0
[junit4:junit4]   2> 4702 T2712 oashc.HttpShardHandlerFactory.getParameter Setting maximumPoolSize to: 2147483647
[junit4:junit4]   2> 4703 T2712 oashc.HttpShardHandlerFactory.getParameter Setting maxThreadIdleTime to: 5
[junit4:junit4]   2> 4703 T2712 oashc.HttpShardHandlerFactory.getParameter Setting sizeOfQueue to: -1
[junit4:junit4]   2> 4705 T2712 oashc.HttpShardHandlerFactory.getParameter Setting fairnessPolicy to: false
[junit4:junit4]   2> 4705 T2712 oascsi.HttpClientUtil.createClient Creating new http client, config:maxConnectionsPerHost=20&maxConnections=10000&socketTimeout=0&connTimeout=0&retry=false
[junit4:junit4]   2> 4711 T2712 oash.SnapPuller.startExecutorService Poll Scheduled at an interval of 1000ms
[junit4:junit4]   2> 4711 T2777 oasc.SolrCore.registerSearcher [collection1] Registered new searcher Searcher@1479a4 main{StandardDirectoryReader(segments_1:1)}
[junit4:junit4]   2> 4711 T2712 oasc.CoreContainer.register registering core: collection1
[junit4:junit4]   2> 4714 T2712 oass.SolrDispatchFilter.init user.dir=C:\Users\JenkinsSlave\workspace\Lucene-Solr-trunk-Windows\solr\build\solr-core\test\J0
[junit4:junit4]   2> 4714 T2712 oass.SolrDispatchFilter.init SolrDispatchFilter.init() done
[junit4:junit4]   2> 4715 T2712 oascsi.HttpClientUtil.createClient Creating new http client, config:maxConnections=128&maxConnectionsPerHost=32&followRedirects=false
[junit4:junit4]   2> ASYNC  NEW_CORE C201 name=collection1 org.apache.solr.core.SolrCore@16884e5
[junit4:junit4]   2> 4736 T2762 C201 oasc.CachingDirectoryFactory.close Releasing directory:C:\Users\JenkinsSlave\workspace\Lucene-Solr-trunk-Windows\solr\build\solr-core\test\J0\.\org.apache.solr.handler.TestReplicationHandler$SolrInstance-1351332128579\master\collection1\data\index
[junit4:junit4]   2> 4737 T2762 C201 REQ [collection1] webapp=/solr path=/replication params={command=details&qt=/replication&wt=javabin&version=2} status=0 QTime=3 
[junit4:junit4]   2> ASYNC  NEW_CORE C202 name=collection1 org.apache.solr.core.SolrCore@f62ad6
[junit4:junit4]   2> 4745 T2771 C202 oasc.CachingDirectoryFactory.close Releasing directory:C:\Users\JenkinsSlave\workspace\Lucene-Solr-trunk-Windows\solr\build\solr-core\test\J0\.\org.apache.solr.handler.TestReplicationHandler$SolrInstance-1351332128953\slave\collection1\data\index
[junit4:junit4]   2> 4748 T2763 C201 oasc.CachingDirectoryFactory.close Releasing directory:C:\Users\JenkinsSlave\workspace\Lucene-Solr-trunk-Windows\solr\build\solr-core\test\J0\.\org.apache.solr.handler.TestReplicationHandler$SolrInstance-1351332128579\master\collection1\data\index
[junit4:junit4]   2> 4748 T2763 C201 REQ [collection1] webapp=/solr path=/replication params={command=details&slave=false&qt=/replication&wt=javabin&version=2} status=0 QTime=0 
[junit4:junit4]   2> 4751 T2771 C202 REQ [collection1] webapp=/solr path=/replication params={command=details&qt=/replication&wt=javabin&version=2} status=0 QTime=7 
[junit4:junit4]   2> 4767 T2712 oejs.Server.doStart jetty-8.1.2.v20120308
[junit4:junit4]   2> 4772 T2712 oejs.AbstractConnector.doStart Started SelectChannelConnector@0.0.0.0:50478
[junit4:junit4]   2> 4774 T2712 oasc.SolrResourceLoader.locateSolrHome JNDI not configured for solr (NoInitialContextEx)
[junit4:junit4]   2> 4774 T2712 oasc.SolrResourceLoader.locateSolrHome using system property solr.solr.home: .\org.apache.solr.handler.TestReplicationHandler$SolrInstance-1351332133328\repeater
[junit4:junit4]   2> 4775 T2712 oasc.SolrResourceLoader.<init> new SolrResourceLoader for deduced Solr Home: '.\org.apache.solr.handler.TestReplicationHandler$SolrInstance-1351332133328\repeater\'
[junit4:junit4]   2> 4794 T2712 oass.SolrDispatchFilter.init SolrDispatchFilter.init()
[junit4:junit4]   2> 4796 T2712 oasc.SolrResourceLoader.locateSolrHome JNDI not configured for solr (NoInitialContextEx)
[junit4:junit4]   2> 4796 T2712 oasc.SolrResourceLoader.locateSolrHome using system property solr.solr.home: .\org.apache.solr.handler.TestReplicationHandler$SolrInstance-1351332133328\repeater
[junit4:junit4]   2> 4797 T2712 oasc.CoreContainer$Initializer.initialize looking for solr.xml: C:\Users\JenkinsSlave\workspace\Lucene-Solr-trunk-Windows\solr\build\solr-core\test\J0\.\org.apache.solr.handler.TestReplicationHandler$SolrInstance-1351332133328\repeater\solr.xml
[junit4:junit4]   2> 4797 T2712 oasc.CoreContainer.<init> New CoreContainer 28355061
[junit4:junit4]   2> 4798 T2712 oasc.CoreContainer$Initializer.initialize no solr.xml file found - using default
[junit4:junit4]   2> 4799 T2712 oasc.CoreContainer.load Loading CoreContainer using Solr Home: '.\org.apache.solr.handler.TestReplicationHandler$SolrInstance-1351332133328\repeater\'
[junit4:junit4]   2> 4799 T2712 oasc.SolrResourceLoader.<init> new SolrResourceLoader for directory: '.\org.apache.solr.handler.TestReplicationHandler$SolrInstance-1351332133328\repeater\'
[junit4:junit4]   2> 4825 T2712 oasc.CoreContainer.load Registering Log Listener
[junit4:junit4]   2> 4862 T2712 oasc.CoreContainer.create Creating SolrCore 'collection1' using instanceDir: .\org.apache.solr.handler.TestReplicationHandler$SolrInstance-1351332133328\repeater\collection1
[junit4:junit4]   2> 4866 T2712 oasc.SolrResourceLoader.<init> new SolrResourceLoader for directory: '.\org.apache.solr.handler.TestReplicationHandler$SolrInstance-1351332133328\repeater\collection1\'
[junit4:junit4]   2> 4923 T2712 oasc.SolrConfig.<init> Using Lucene MatchVersion: LUCENE_50
[junit4:junit4]   2> 5234 T2712 oasc.SolrConfig.<init> Loaded SolrConfig: solrconfig.xml
[junit4:junit4]   2> 5234 T2712 oass.IndexSchema.readSchema Reading Solr Schema
[junit4:junit4]   2> 5241 T2712 oass.IndexSchema.readSchema Schema name=test
[junit4:junit4]   2> 5266 T2712 oass.IndexSchema.readSchema unique key field: id
[junit4:junit4]   2> 5268 T2712 oasc.SolrCore.<init> [collection1] Opening new SolrCore at .\org.apache.solr.handler.TestReplicationHandler$SolrInstance-1351332133328\repeater\collection1\, dataDir=.\org.apache.solr.handler.TestReplicationHandler$SolrInstance-1351332133328\repeater\collection1\data\
[junit4:junit4]   2> 5268 T2712 oasc.SolrCore.<init> JMX monitoring not detected for core: collection1
[junit4:junit4]   2> 5268 T2712 oasc.SolrCore.initDirectoryFactory org.apache.solr.core.MockDirectoryFactory
[junit4:junit4]   2> 5270 T2712 oasc.CachingDirectoryFactory.injectLockFactory WARNING No lockType configured for MockDirWrapper(org.apache.lucene.store.RAMDirectory@4eead4 lockFactory=org.apache.lucene.store.SingleInstanceLockFactory@11b37be) assuming 'simple'
[junit4:junit4]   2> 5270 T2712 oasc.CachingDirectoryFactory.get return new directory for C:\Users\JenkinsSlave\workspace\Lucene-Solr-trunk-Windows\solr\build\solr-core\test\J0\.\org.apache.solr.handler.TestReplicationHandler$SolrInstance-1351332133328\repeater\collection1\data forceNew:false
[junit4:junit4]   2> 5271 T2712 oasc.CachingDirectoryFactory.close Releasing directory:C:\Users\JenkinsSlave\workspace\Lucene-Solr-trunk-Windows\solr\build\solr-core\test\J0\.\org.apache.solr.handler.TestReplicationHandler$SolrInstance-1351332133328\repeater\collection1\data
[junit4:junit4]   2> 5271 T2712 oasc.SolrCore.getNewIndexDir New index directory detected: old=null new=.\org.apache.solr.handler.TestReplicationHandler$SolrInstance-1351332133328\repeater\collection1\data\index/
[junit4:junit4]   2> 5272 T2712 oasc.SolrCore.initIndex WARNING [collection1] Solr index directory '.\org.apache.solr.handler.TestReplicationHandler$SolrInstance-1351332133328\repeater\collection1\data\index' doesn't exist. Creating new index...
[junit4:junit4]   2> 5274 T2712 oasc.CachingDirectoryFactory.get return new directory for C:\Users\JenkinsSlave\workspace\Lucene-Solr-trunk-Windows\solr\build\solr-core\test\J0\.\org.apache.solr.handler.TestReplicationHandler$SolrInstance-1351332133328\repeater\collection1\data\index forceNew:false
[junit4:junit4]   2> 5274 T2712 oasc.SolrDeletionPolicy.onCommit SolrDeletionPolicy.onCommit: commits:num=1
[junit4:junit4]   2> 		commit{dir=MockDirWrapper(org.apache.lucene.store.RAMDirectory@1da1a50 lockFactory=org.apache.lucene.store.SingleInstanceLockFactory@8ea024),segFN=segments_1,generation=1,filenames=[segments_1]
[junit4:junit4]   2> 5275 T2712 oasc.SolrDeletionPolicy.updateCommits newest commit = 1[segments_1]
[junit4:junit4]   2> 5275 T2712 oasc.CachingDirectoryFactory.close Releasing directory:C:\Users\JenkinsSlave\workspace\Lucene-Solr-trunk-Windows\solr\build\solr-core\test\J0\.\org.apache.solr.handler.TestReplicationHandler$SolrInstance-1351332133328\repeater\collection1\data\index
[junit4:junit4]   2> 5277 T2712 oasc.RequestHandlers.initHandlersFromConfig created standard: solr.StandardRequestHandler
[junit4:junit4]   2> 5277 T2712 oasc.RequestHandlers.initHandlersFromConfig created defaults: solr.StandardRequestHandler
[junit4:junit4]   2> 5277 T2712 oasc.RequestHandlers.initHandlersFromConfig adding lazy requestHandler: solr.StandardRequestHandler
[junit4:junit4]   2> 5278 T2712 oasc.RequestHandlers.initHandlersFromConfig created lazy: solr.StandardRequestHandler
[junit4:junit4]   2> 5278 T2712 oasc.RequestHandlers.initHandlersFromConfig created /update: solr.UpdateRequestHandler
[junit4:junit4]   2> 5278 T2712 oasc.RequestHandlers.initHandlersFromConfig created /replication: solr.ReplicationHandler
[junit4:junit4]   2> 5281 T2712 oashl.XMLLoader.init xsltCacheLifetimeSeconds=60
[junit4:junit4]   2> 5285 T2712 oasc.CachingDirectoryFactory.close Releasing directory:C:\Users\JenkinsSlave\workspace\Lucene-Solr-trunk-Windows\solr\build\solr-core\test\J0\.\org.apache.solr.handler.TestReplicationHandler$SolrInstance-1351332133328\repeater\collection1\data
[junit4:junit4]   2> 5285 T2712 oass.SolrIndexSearcher.<init> Opening Searcher@87c796 main
[junit4:junit4]   2> 5286 T2712 oasu.CommitTracker.<init> Hard AutoCommit: disabled
[junit4:junit4]   2> 5286 T2712 oasu.CommitTracker.<init> Soft AutoCommit: disabled
[junit4:junit4]   2> 5287 T2712 oashc.HttpShardHandlerFactory.getParameter Setting socketTimeout to: 0
[junit4:junit4]   2> 5287 T2712 oashc.HttpShardHandlerFactory.getParameter Setting urlScheme to: http://
[junit4:junit4]   2> 5287 T2712 oashc.HttpShardHandlerFactory.getParameter Setting connTimeout to: 0
[junit4:junit4]   2> 5287 T2712 oashc.HttpShardHandlerFactory.getParameter Setting maxConnectionsPerHost to: 20
[junit4:junit4]   2> 5289 T2712 oashc.HttpShardHandlerFactory.getParameter Setting corePoolSize to: 0
[junit4:junit4]   2> 5289 T2712 oashc.HttpShardHandlerFactory.getParameter Setting maximumPoolSize to: 2147483647
[junit4:junit4]   2> 5289 T2712 oashc.HttpShardHandlerFactory.getParameter Setting maxThreadIdleTime to: 5
[junit4:junit4]   2> 5290 T2712 oashc.HttpShardHandlerFactory.getParameter Setting sizeOfQueue to: -1
[junit4:junit4]   2> 5290 T2712 oashc.HttpShardHandlerFactory.getParameter Setting fairnessPolicy to: false
[junit4:junit4]   2> 5290 T2712 oascsi.HttpClientUtil.createClient Creating new http client, config:maxConnectionsPerHost=20&maxConnections=10000&socketTimeout=0&connTimeout=0&retry=false
[junit4:junit4]   2> 5296 T2712 oash.SnapPuller.<init> WARNING 'masterUrl' must be specified without the /replication suffix
[junit4:junit4]   2> 5297 T2712 oash.SnapPuller.startExecutorService Poll Scheduled at an interval of 1000ms
[junit4:junit4]   2> 5297 T2712 oash.ReplicationHandler.inform Replication enabled for following config files: schema.xml
[junit4:junit4]   2> 5297 T2712 oash.ReplicationHandler.inform Commits will be reserved for  10000
[junit4:junit4]   2> 5299 T2788 oasc.SolrCore.registerSearcher [collection1] Registered new searcher Searcher@87c796 main{StandardDirectoryReader(segments_1:1)}
[junit4:junit4]   2> 5298 T2712 oasc.CoreContainer.register registering core: collection1
[junit4:junit4]   2> 5300 T2712 oass.SolrDispatchFilter.init user.dir=C:\Users\JenkinsSlave\workspace\Lucene-Solr-trunk-Windows\solr\build\solr-core\test\J0
[junit4:junit4]   2> 5300 T2712 oass.SolrDispatchFilter.init SolrDispatchFilter.init() done
[junit4:junit4]   2> 5301 T2712 oascsi.HttpClientUtil.createClient Creating new http client, config:maxConnections=128&maxConnectionsPerHost=32&followRedirects=false
[junit4:junit4]   2> ASYNC  NEW_CORE C203 name=collection1 org.apache.solr.core.SolrCore@11d5070
[junit4:junit4]   2> 5315 T2783 C203 oasc.CachingDirectoryFactory.close Releasing directory:C:\Users\JenkinsSlave\workspace\Lucene-Solr-trunk-Windows\solr\build\solr-core\test\J0\.\org.apache.solr.handler.TestReplicationHandler$SolrInstance-1351332133328\repeater\collection1\data\index
[junit4:junit4]   2> 5321 T2765 C201 oasc.CachingDirectoryFactory.close Releasing directory:C:\Users\JenkinsSlave\workspace\Lucene-Solr-trunk-Windows\solr\build\solr-core\test\J0\.\org.apache.solr.handler.TestReplicationHandler$SolrInstance-1351332128579\master\collection1\data\index
[junit4:junit4]   2> 5321 T2765 C201 REQ [collection1] webapp=/solr path=/replication params={command=details&slave=false&qt=/replication&wt=javabin&version=2} status=0 QTime=1 
[junit4:junit4]   2> 5322 T2783 C203 REQ [collection1] webapp=/solr path=/replication params={command=details&qt=/replication&wt=javabin&version=2} status=0 QTime=8 
[junit4:junit4]   2> 5337 T2712 oasc.CoreContainer.shutdown Shutting down CoreContainer instance=28355061
[junit4:junit4]   2> 5338 T2712 oasc.SolrCore.close [collection1]  CLOSING SolrCore org.apache.solr.core.SolrCore@11d5070
[junit4:junit4]   2> 5339 T2712 oasu.DirectUpdateHandler2.close closing DirectUpdateHandler2{commits=0,autocommits=0,soft autocommits=0,optimizes=0,rollbacks=0,expungeDeletes=0,docsPending=0,adds=0,deletesById=0,deletesByQuery=0,errors=0,cumulative_adds=0,cumulative_deletesById=0,cumulative_deletesByQuery=0,cumulative_errors=0}
[junit4:junit4]   2> 5339 T2712 oasc.SolrCore.decrefSolrCoreState Closing SolrCoreState
[junit4:junit4]   2> 5339 T2712 oasu.DefaultSolrCoreState.closeIndexWriter SolrCoreState ref count has reached 0 - closing IndexWriter
[junit4:junit4]   2> 5339 T2712 oasu.DefaultSolrCoreState.closeIndexWriter closing IndexWriter with IndexWriterCloser
[junit4:junit4]   2> 5340 T2712 oasc.SolrCore.closeSearcher [collection1] Closing main searcher on request.
[junit4:junit4]   2> 5340 T2712 oasc.CachingDirectoryFactory.close Releasing directory:C:\Users\JenkinsSlave\workspace\Lucene-Solr-trunk-Windows\solr\build\solr-core\test\J0\.\org.apache.solr.handler.TestReplicationHandler$SolrInstance-1351332133328\repeater\collection1\data\index
[junit4:junit4]   2> 5343 T2712 oejsh.ContextHandler.doStop stopped o.e.j.s.ServletContextHandler{/solr,null}
[junit4:junit4]   2> 5413 T2766 C201 REQ [collection1] webapp=/solr path=/select params={wt=javabin&q=*:*&version=2} hits=0 status=0 QTime=0 
[junit4:junit4]   2> 5416 T2761 C201 oasc.CachingDirectoryFactory.close Releasing directory:C:\Users\JenkinsSlave\workspace\Lucene-Solr-trunk-Windows\solr\build\solr-core\test\J0\.\org.apache.solr.handler.TestReplicationHandler$SolrInstance-1351332128579\master\collection1\data
[junit4:junit4]   2> 5421 T2761 C201 oasc.SolrDeletionPolicy.onInit SolrDeletionPolicy.onInit: commits:num=1
[junit4:junit4]   2> 		commit{dir=MockDirWrapper(org.apache.lucene.store.NIOFSDirectory@C:\Users\JenkinsSlave\workspace\Lucene-Solr-trunk-Windows\solr\build\solr-core\test\J0\index3169331699tmp lockFactory=org.apache.lucene.store.SingleInstanceLockFactory@c6a676),segFN=segments_1,generation=1,filenames=[segments_1]
[junit4:junit4]   2> 5422 T2761 C201 oasc.SolrDeletionPolicy.updateCommits newest commit = 1[segments_1]
[junit4:junit4]   2> 5423 T2761 C201 UPDATE [collection1] webapp=/solr path=/update params={wt=javabin&version=2} {add=[0]} 0 7
[junit4:junit4]   2> 5428 T2762 C201 UPDATE [collection1] webapp=/solr path=/update params={wt=javabin&version=2} {add=[1]} 0 1
[junit4:junit4]   2> 5430 T2763 C201 UPDATE [collection1] webapp=/solr path=/update params={wt=javabin&version=2} {add=[2]} 0 0
[junit4:junit4]   2> 5434 T2764 C201 UPDATE [collection1] webapp=/solr path=/update params={wt=javabin&version=2} {add=[3]} 0 0
[junit4:junit4]   2> 5437 T2765 C201 UPDATE [collection1] webapp=/solr path=/update params={wt=javabin&version=2} {add=[4]} 0 0
[junit4:junit4]   2> 5442 T2766 C201 UPDATE [collection1] webapp=/solr path=/update params={wt=javabin&version=2} {add=[5]} 0 0
[junit4:junit4]   2> 5445 T2761 C201 UPDATE [collection1] webapp=/solr path=/update params={wt=javabin&version=2} {add=[6]} 0 0
[junit4:junit4]   2> 5449 T2762 C201 UPDATE [collection1] webapp=/solr path=/update params={wt=javabin&version=2} {add=[7]} 0 0
[junit4:junit4]   2> 5452 T2763 C201 UPDATE [collection1] webapp=/solr path=/update params={wt=javabin&version=2} {add=[8]} 0 0
[junit4:junit4]   2> 5456 T2764 C201 UPDATE [collection1] webapp=/solr path=/update params={wt=javabin&version=2} {add=[9]} 0 0
[junit4:junit4]   2> 5459 T2765 C201 UPDATE [collection1] webapp=/solr path=/update params={wt=javabin&version=2} {add=[10]} 0 0
[junit4:junit4]   2> 5463 T2766 C201 UPDATE [collection1] webapp=/solr path=/update params={wt=javabin&version=2} {add=[11]} 0 0
[junit4:junit4]   2> 5466 T2761 C201 UPDATE [collection1] webapp=/solr path=/update params={wt=javabin&version=2} {add=[12]} 0 0
[junit4:junit4]   2> 5469 T2762 C201 UPDATE [collection1] webapp=/solr path=/update params={wt=javabin&version=2} {add=[13]} 0 0
[junit4:junit4]   2> 5474 T2763 C201 UPDATE [collection1] webapp=/solr path=/update params={wt=javabin&version=2} {add=[14]} 0 0
[junit4:junit4]   2> 5478 T2764 C201 UPDATE [collection1] webapp=/solr path=/update params={wt=javabin&version=2} {add=[15]} 0 0
[junit4:junit4]   2> 5481 T2765 C201 UPDATE [collection1] webapp=/solr path=/update params={wt=javabin&version=2} {add=[16]} 0 0
[junit4:junit4]   2> 5484 T2766 C201 UPDATE [collection1] webapp=/solr path=/update params={wt=javabin&version=2} {add=[17]} 0 0
[junit4:junit4]   2> 5488 T2761 C201 UPDATE [collection1] webapp=/solr path=/update params={wt=javabin&version=2} {add=[18]} 0 0
[junit4:junit4]   2> 5493 T2762 C201 UPDATE [collection1] webapp=/solr path=/update params={wt=javabin&version=2} {add=[19]} 0 0
[junit4:junit4]   2> 5496 T2763 C201 UPDATE [collection1] webapp=/solr path=/update params={wt=javabin&version=2} {add=[20]} 0 0
[junit4:junit4]   2> 5499 T2764 C201 UPDATE [collection1] webapp=/solr path=/update params={wt=javabin&version=2} {add=[21]} 0 0
[junit4:junit4]   2> 5504 T2765 C201 UPDATE [collection1] webapp=/solr path=/update params={wt=javabin&version=2} {add=[22]} 0 0
[junit4:junit4]   2> 5508 T2766 C201 UPDATE [collection1] webapp=/solr path=/update params={wt=javabin&version=2} {add=[23]} 0 0
[junit4:junit4]   2> 5511 T2761 C201 UPDATE [collection1] webapp=/solr path=/update params={wt=javabin&version=2} {add=[24]} 0 0
[junit4:junit4]   2> 5516 T2762 C201 UPDATE [collection1] webapp=/solr path=/update params={wt=javabin&version=2} {add=[25]} 0 0
[junit4:junit4]   2> 5520 T2763 C201 UPDATE [collection1] webapp=/solr path=/update params={wt=javabin&version=2} {add=[26]} 0 0
[junit4:junit4]   2> 5525 T2764 C201 UPDATE [collection1] webapp=/solr path=/update params={wt=javabin&version=2} {add=[27]} 0 0
[junit4:junit4]   2> 5529 T2765 C201 UPDATE [collection1] webapp=/solr path=/update params={wt=javabin&version=2} {add=[28]} 0 0
[junit4:junit4]   2> 5533 T2766 C201 UPDATE [collection1] webapp=/solr path=/update params={wt=javabin&version=2} {add=[29]} 0 0
[junit4:junit4]   2> 5537 T2761 C201 UPDATE [collection1] webapp=/solr path=/update params={wt=javabin&version=2} {add=[30]} 0 0
[junit4:junit4]   2> 5541 T2762 C201 UPDATE [collection1] webapp=/solr path=/update params={wt=javabin&version=2} {add=[31]} 0 0
[junit4:junit4]   2> 5544 T2763 C201 UPDATE [collection1] webapp=/solr path=/update params={wt=javabin&version=2} {add=[32]} 0 0
[junit4:junit4]   2> 5548 T2764 C201 UPDATE [collection1] webapp=/solr path=/update params={wt=javabin&version=2} {add=[33]} 0 0
[junit4:junit4]   2> 5551 T2765 C201 UPDATE [collection1] webapp=/solr path=/update params={wt=javabin&version=2} {add=[34]} 0 0
[junit4:junit4]   2> 5555 T2766 C201 UPDATE [collection1] webapp=/solr path=/update params={wt=javabin&version=2} {add=[35]} 0 0
[junit4:junit4]   2> 5556 T2761 C201 REQ [collection1] webapp=/solr path=/replication params={command=indexversion&wt=javabin&qt=/replication&version=2} status=0 QTime=0 
[junit4:junit4]   2> 5559 T2762 C201 UPDATE [collection1] webapp=/solr path=/update params={wt=javabin&version=2} {add=[36]} 0 0
[junit4:junit4]   2> 5563 T2763 C201 UPDATE [collection1] webapp=/solr path=/update params={wt=javabin&version=2} {add=[37]} 0 0
[junit4:junit4]   2> 5566 T2764 C201 UPDATE [collection1] webapp=/solr path=/update params={wt=javabin&version=2} {add=[38]} 0 0
[junit4:junit4]   2> 5570 T2765 C201 UPDATE [collection1] webapp=/solr path=/update params={wt=javabin&version=2} {add=[39]} 0 0
[junit4:junit4]   2> 5573 T2766 C201 UPDATE [collection1] webapp=/solr path=/update params={wt=javabin&version=2} {add=[40]} 0 0
[junit4:junit4]   2> 5577 T2761 C201 UPDATE [collection1] webapp=/solr path=/update params={wt=javabin&version=2} {add=[41]} 0 0
[junit4:junit4]   2> 5580 T2762 C201 UPDATE [collection1] webapp=/solr path=/update params={wt=javabin&version=2} {add=[42]} 0 0
[junit4:junit4]   2> 5584 T2763 C201 UPDATE [collection1] webapp=/solr path=/update params={wt=javabin&version=2} {add=[43]} 0 0
[junit4:junit4]   2> 5587 T2764 C201 UPDATE [collection1] webapp=/solr path=/update params={wt=javabin&version=2} {add=[44]} 0 0
[junit4:junit4]   2> 5590 T2765 C201 UPDATE [collection1] webapp=/solr path=/update params={wt=javabin&version=2} {add=[45]} 0 0
[junit4:junit4]   2> 5594 T2766 C201 UPDATE [collection1] webapp=/solr path=/update params={wt=javabin&version=2} {add=[46]} 0 0
[junit4:junit4]   2> 5597 T2761 C201 UPDATE [collection1] webapp=/solr path=/update params={wt=javabin&version=2} {add=[47]} 0 0
[junit4:junit4]   2> 5601 T2762 C201 UPDATE [collection1] webapp=/solr path=/update params={wt=javabin&version=2} {add=[48]} 0 0
[junit4:junit4]   2> 5605 T2763 C201 UPDATE [collection1] webapp=/solr path=/update params={wt=javabin&version=2} {add=[49]} 0 0
[junit4:junit4]   2> 5610 T2764 C201 UPDATE [collection1] webapp=/solr path=/update params={wt=javabin&version=2} {add=[50]} 0 0
[junit4:junit4]   2> 5614 T2765 C201 UPDATE [collection1] webapp=/solr path=/update params={wt=javabin&version=2} {add=[51]} 0 0
[junit4:junit4]   2> 5618 T2766 C201 UPDATE [collection1] webapp=/solr path=/update params={wt=javabin&version=2} {add=[52]} 0 0
[junit4:junit4]   2> 5623 T2761 C201 UPDATE [collection1] webapp=/solr path=/update params={wt=javabin&version=2} {add=[53]} 0 0
[junit4:junit4]   2> 5627 T2763 C201 UPDATE [collection1] webapp=/solr path=/update params={wt=javabin&version=2} {add=[54]} 0 0
[junit4:junit4]   2> 5632 T2764 C201 UPDATE [collection1] webapp=/solr path=/update params={wt=javabin&version=2} {add=[55]} 0 0
[junit4:junit4]   2> 5635 T2765 C201 UPDATE [collection1] webapp=/solr path=/update params={wt=javabin&version=2} {add=[56]} 0 0
[junit4:junit4]   2> 5639 T2766 C201 UPDATE [collection1] webapp=/solr path=/update params={wt=javabin&version=2} {add=[57]} 0 0
[junit4:junit4]   2> 5643 T2761 C201 UPDATE [collection1] webapp=/solr path=/update params={wt=javabin&version=2} {add=[58]} 0 0
[junit4:junit4]   2> 5649 T2762 C201 UPDATE [collection1] webapp=/solr path=/update params={wt=javabin&version=2} {add=[59]} 0 1
[junit4:junit4]   2> 5654 T2763 C201 UPDATE [collection1] webapp=/solr path=/update params={wt=javabin&version=2} {add=[60]} 0 0
[junit4:junit4]   2> 5658 T2764 C201 UPDATE [collection1] webapp=/solr path=/update params={wt=javabin&version=2} {add=[61]} 0 0
[junit4:junit4]   2> 5662 T2765 C201 UPDATE [collection1] webapp=/solr path=/update params={wt=javabin&version=2} {add=[62]} 0 0
[junit4:junit4]   2> 5665 T2766 C201 UPDATE [collection1] webapp=/solr path=/update params={wt=javabin&version=2} {add=[63]} 0 0
[junit4:junit4]   2> 5669 T2761 C201 UPDATE [collection1] webapp=/solr path=/update params={wt=javabin&version=2} {add=[64]} 0 0
[junit4:junit4]   2> 5673 T2762 C201 UPDATE [collection1] webapp=/solr path=/update params={wt=javabin&version=2} {add=[65]} 0 0
[junit4:junit4]   2> 5680 T2763 C201 UPDATE [collection1] webapp=/solr path=/update params={wt=javabin&version=2} {add=[66]} 0 1
[junit4:junit4]   2> 5684 T2764 C201 UPDATE [collection1] webapp=/solr path=/update params={wt=javabin&version=2} {add=[67]} 0 0
[junit4:junit4]   2> 5687 T2765 C201 UPDATE [collection1] webapp=/solr path=/update params={wt=javabin&version=2} {add=[68]} 0 0
[junit4:junit4]   2> 5691 T2766 C201 UPDATE [collection1] webapp=/solr path=/update params={wt=javabin&version=2} {add=[69]} 0 0
[junit4:junit4]   2> 5695 T2761 C201 UPDATE [collection1] webapp=/solr path=/update params={wt=javabin&version=2} {add=[70]} 0 0
[junit4:junit4]   2> 5699 T2762 C201 UPDATE [collection1] webapp=/solr path=/update params={wt=javabin&version=2} {add=[71]} 0 0
[junit4:junit4]   2> 5702 T2763 C201 UPDATE [collection1] webapp=/solr path=/update params={wt=javabin&version=2} {add=[72]} 0 0
[junit4:junit4]   2> 5706 T2764 C201 UPDATE [collection1] webapp=/solr path=/update params={wt=javabin&version=2} {add=[73]} 0 0
[junit4:junit4]   2> 5709 T2765 C201 UPDATE [collection1] webapp=/solr path=/update params={wt=javabin&version=2} {add=[74]} 0 0
[junit4:junit4]   2> 5713 T2766 C201 UPDATE [collection1] webapp=/solr path=/update params={wt=javabin&version=2} {add=[75]} 0 0
[junit4:junit4]   2> 5717 T2761 C201 UPDATE [collection1] webapp=/solr path=/update params={wt=javabin&version=2} {add=[76]} 0 0
[junit4:junit4]   2> 5721 T2762 C201 UPDATE [collection1] webapp=/solr path=/update params={wt=javabin&version=2} {add=[77]} 0 0
[junit4:junit4]   2> 5725 T2763 C201 UPDATE [collection1] webapp=/solr path=/update params={wt=javabin&version=2} {add=[78]} 0 0
[junit4:junit4]   2> 5729 T2764 C201 UPDATE [collection1] webapp=/solr path=/update params={wt=javabin&version=2} {add=[79]} 0 0
[junit4:junit4]   2> 5732 T2765 C201 UPDATE [collection1] webapp=/solr path=/update params={wt=javabin&version=2} {add=[80]} 0 0
[junit4:junit4]   2> 5737 T2766 C201 UPDATE [collection1] webapp=/solr path=/update params={wt=javabin&version=2} {add=[81]} 0 0
[junit4:junit4]   2> 5739 T2761 C201 UPDATE [collection1] webapp=/solr path=/update params={wt=javabin&version=2} {add=[82]} 0 0
[junit4:junit4]   2> 5744 T2762 C201 UPDATE [collection1] webapp=/solr path=/update params={wt=javabin&version=2} {add=[83]} 0 0
[junit4:junit4]   2> 5747 T2763 C201 UPDATE [collection1] webapp=/solr path=/update params={wt=javabin&version=2} {add=[84]} 0 0
[junit4:junit4]   2> 5751 T2764 C201 UPDATE [collection1] webapp=/solr path=/update params={wt=javabin&version=2} {add=[85]} 0 0
[junit4:junit4]   2> 5754 T2765 C201 UPDATE [collection1] webapp=/solr path=/update params={wt=javabin&version=2} {add=[86]} 0 0
[junit4:junit4]   2> 5759 T2766 C201 UPDATE [collection1] webapp=/solr path=/update params={wt=javabin&version=2} {add=[87]} 0 0
[junit4:junit4]   2> 5762 T2761 C201 UPDATE [collection1] webapp=/solr path=/update params={wt=javabin&version=2} {add=[88]} 0 0
[junit4:junit4]   2> 5767 T2762 C201 UPDATE [collection1] webapp=/solr path=/update params={wt=javabin&version=2} {add=[89]} 0 0
[junit4:junit4]   2> 5770 T2763 C201 UPDATE [collection1] webapp=/solr path=/update params={wt=javabin&version=2} {add=[90]} 0 0
[junit4:junit4]   2> 5774 T2764 C201 UPDATE [collection1] webapp=/solr path=/update params={wt=javabin&version=2} {add=[91]} 0 0
[junit4:junit4]   2> 5777 T2765 C201 UPDATE [collection1] webapp=/solr path=/update params={wt=javabin&version=2} {add=[92]} 0 0
[junit4:junit4]   2> 5782 T2766 C201 UPDATE [collection1] webapp=/solr path=/update params={wt=javabin&version=2} {add=[93]} 0 0
[junit4:junit4]   2> 5786 T2761 C201 UPDATE [collection1] webapp=/solr path=/update params={wt=javabin&version=2} {add=[94]} 0 0
[junit4:junit4]   2> 5790 T2762 C201 UPDATE [collection1] webapp=/solr path=/update params={wt=javabin&version=2} {add=[95]} 0 0
[junit4:junit4]   2> 5794 T2763 C201 UPDATE [collection1] webapp=/solr path=/update params={wt=javabin&version=2} {add=[96]} 0 0
[junit4:junit4]   2> 5798 T2764 C201 UPDATE [collection1] webapp=/solr path=/update params={wt=javabin&version=2} {add=[97]} 0 0
[junit4:junit4]   2> 5801 T2765 C201 UPDATE [collection1] webapp=/solr path=/update params={wt=javabin&version=2} {add=[98]} 0 0
[junit4:junit4]   2> 5805 T2766 C201 UPDATE [collection1] webapp=/solr path=/update params={wt=javabin&version=2} {add=[99]} 0 0
[junit4:junit4]   2> 5808 T2761 C201 UPDATE [collection1] webapp=/solr path=/update params={wt=javabin&version=2} {add=[100]} 0 0
[junit4:junit4]   2> 5813 T2762 C201 UPDATE [collection1] webapp=/solr path=/update params={wt=javabin&version=2} {add=[101]} 0 0
[junit4:junit4]   2> 5816 T2763 C201 UPDATE [collection1] webapp=/solr path=/update params={wt=javabin&version=2} {add=[102]} 0 0
[junit4:junit4]   2> 5821 T2764 C201 UPDATE [collection1] webapp=/solr path=/update params={wt=javabin&version=2} {add=[103]} 0 0
[junit4:junit4]   2> 5824 T2765 C201 UPDATE [collection1] webapp=/solr path=/update params={wt=javabin&version=2} {add=[104]} 0 0
[junit4:junit4]   2> 5828 T2766 C201 UPDATE [collection1] webapp=/solr path=/update params={wt=javabin&version=2} {add=[105]} 0 0
[junit4:junit4]   2> 5831 T2761 C201 UPDATE [collection1] webapp=/solr path=/update params={wt=javabin&version=2} {add=[106]} 0 0
[junit4:junit4]   2> 5835 T2762 C201 UPDATE [collection1] webapp=/solr path=/update params={wt=javabin&version=2} {add=[107]} 0 0
[junit4:junit4]   2> 5839 T2763 C201 UPDATE [collection1] webapp=/solr path=/update params={wt=javabin&version=2} {add=[108]} 0 0
[junit4:junit4]   2> 5843 T2764 C201 UPDATE [collection1] webapp=/solr path=/update params={wt=javabin&version=2} {add=[109]} 0 0
[junit4:junit4]   2> 5847 T2765 C201 UPDATE [collection1] webapp=/solr path=/update params={wt=javabin&version=2} {add=[110]} 0 0
[junit4:junit4]   2> 5851 T2766 C201 UPDATE [collection1] webapp=/solr path=/update params={wt=javabin&version=2} {add=[111]} 0 0
[junit4:junit4]   2> 5854 T2761 C201 UPDATE [collection1] webapp=/solr path=/update params={wt=javabin&version=2} {add=[112]} 0 0
[junit4:junit4]   2> 5858 T2762 C201 UPDATE [collection1] webapp=/solr path=/update params={wt=javabin&version=2} {add=[113]} 0 0
[junit4:junit4]   2> 5861 T2763 C201 UPDATE [collection1] webapp=/solr path=/update params={wt=javabin&version=2} {add=[114]} 0 0
[junit4:junit4]   2> 5865 T2764 C201 UPDATE [collection1] webapp=/solr path=/update params={wt=javabin&version=2} {add=[115]} 0 0
[junit4:junit4]   2> 5868 T2765 C201 UPDATE [collection1] webapp=/solr path=/update params={wt=javabin&version=2} {add=[116]} 0 0
[junit4:junit4]   2> 5873 T2766 C201 UPDATE [collection1] webapp=/solr path=/update params={wt=javabin&version=2} {add=[117]} 0 0
[junit4:junit4]   2> 5876 T2761 C201 UPDATE [collection1] webapp=/solr path=/update params={wt=javabin&version=2} {add=[118]} 0 0
[junit4:junit4]   2> 5881 T2762 C201 UPDATE [collection1] webapp=/solr path=/update params={wt=javabin&version=2} {add=[119]} 0 0
[junit4:junit4]   2> 5884 T2763 C201 UPDATE [collection1] webapp=/solr path=/update params={wt=javabin&version=2} {add=[120]} 0 0
[junit4:junit4]   2> 5889 T2764 C201 UPDATE [collection1] webapp=/solr path=/update params={wt=javabin&version=2} {add=[121]} 0 0
[junit4:junit4]   2> 5892 T2765 C201 UPDATE [collection1] webapp=/solr path=/update params={wt=javabin&version=2} {add=[122]} 0 0
[junit4:junit4]   2> 5898 T2766 C201 UPDATE [collection1] webapp=/solr path=/update params={wt=javabin&version=2} {add=[123]} 0 1
[junit4:junit4]   2> 5900 T2761 C201 UPDATE [collection1] webapp=/solr path=/update params={wt=javabin&version=2} {add=[124]} 0 0
[junit4:junit4]   2> 5904 T2762 C201 UPDATE [collection1] webapp=/solr path=/update params={wt=javabin&version=2} {add=[125]} 0 0
[junit4:junit4]   2> 5907 T2763 C201 UPDATE [collection1] webapp=/solr path=/update params={wt=javabin&version=2} {add=[126]} 0 0
[junit4:junit4]   2> 5911 T2764 C201 UPDATE [collection1] webapp=/solr path=/update params={wt=javabin&version=2} {add=[127]} 0 0
[junit4:junit4]   2> 5914 T2765 C201 UPDATE [collection1] webapp=/solr path=/update params={wt=javabin&version=2} {add=[128]} 0 0
[junit4:junit4]   2> 5919 T2766 C201 UPDATE [collection1] webapp=/solr path=/update params={wt=javabin&version=2} {add=[129]} 0 0
[junit4:junit4]   2> 5923 T2761 C201 UPDATE [collection1] webapp=/solr path=/update params={wt=javabin&version=2} {add=[130]} 0 0
[junit4:junit4]   2> 5927 T2762 C201 UPDATE [collection1] webapp=/solr path=/update params={wt=javabin&version=2} {add=[131]} 0 0
[junit4:junit4]   2> 5931 T2763 C201 UPDATE [collection1] webapp=/solr path=/update params={wt=javabin&version=2} {add=[132]} 0 0
[junit4:junit4]   2> 5936 T2764 C201 UPDATE [collection1] webapp=/solr path=/update params={wt=javabin&version=2} {add=[133]} 0 1
[junit4:junit4]   2> 5940 T2765 C201 UPDATE [collection1] webapp=/solr path=/update params={wt=javabin&version=2} {add=[134]} 0 0
[junit4:junit4]   2> 5943 T2766 C201 UPDATE [collection1] webapp=/solr path=/update params={wt=javabin&version=2} {add=[135]} 0 0
[junit4:junit4]   2> 5948 T2761 C201 UPDATE [collection1] webapp=/solr path=/update params={wt=javabin&version=2} {add=[136]} 0 0
[junit4:junit4]   2> 5951 T2762 C201 UPDATE [collection1] webapp=/solr path=/update params={wt=javabin&version=2} {add=[137]} 0 0
[junit4:junit4]   2> 5955 T2763 C201 UPDATE [collection1] webapp=/solr path=/update params={wt=javabin&version=2} {add=[138]} 0 0
[junit4:junit4]   2> 5958 T2764 C201 UPDATE [collection1] webapp=/solr path=/update params={wt=javabin&version=2} {add=[139]} 0 0
[junit4:junit4]   2> 5963 T2765 C201 UPDATE [collection1] webapp=/solr path=/update params={wt=javabin&version=2} {add=[140]} 0 2
[junit4:junit4]   2> 5965 T2766 C201 UPDATE [collection1] webapp=/solr path=/update params={wt=javabin&version=2} {add=[141]} 0 0
[junit4:junit4]   2> 5970 T2761 C201 UPDATE [collection1] webapp=/solr path=/update params={wt=javabin&version=2} {add=[142]} 0 0
[junit4:junit4]   2> 5974 T2762 C201 UPDATE [collection1] webapp=/solr path=/update params={wt=javabin&version=2} {add=[143]} 0 0
[junit4:junit4]   2> 5978 T2763 C201 UPDATE [collection1] webapp=/solr path=/update params={wt=javabin&version=2} {add=[144]} 0 0
[junit4:junit4]   2> 5981 T2764 C201 UPDATE [collection1] webapp=/solr path=/update params={wt=javabin&version=2} {add=[145]} 0 0
[junit4:junit4]   2> 5984 T2765 C201 UPDATE [collection1] webapp=/solr path=/update params={wt=javabin&version=2} {add=[146]} 0 0
[junit4:junit4]   2> 5989 T2766 C201 UPDATE [collection1] webapp=/solr path=/update params={wt=javabin&version=2} {add=[147]} 0 0
[junit4:junit4]   2> 5993 T2761 C201 UPDATE [collection1] webapp=/solr path=/update params={wt=javabin&version=2} {add=[148]} 0 0
[junit4:junit4]   2> 5996 T2762 C201 UPDATE [collection1] webapp=/solr path=/update params={wt=javabin&version=2} {add=[149]} 0 0
[junit4:junit4]   2> 5999 T2763 C201 UPDATE [collection1] webapp=/solr path=/update params={wt=javabin&version=2} {add=[150]} 0 0
[junit4:junit4]   2> 6003 T2764 C201 UPDATE [collection1] webapp=/solr path=/update params={wt=javabin&version=2} {add=[151]} 0 0
[junit4:junit4]   2> 6006 T2765 C201 UPDATE [collection1] webapp=/solr path=/update params={wt=javabin&version=2} {add=[152]} 0 0
[junit4:junit4]   2> 6012 T2766 C201 UPDATE [collection1] webapp=/solr path=/update params={wt=javabin&version=2} {add=[153]} 0 0
[junit4:junit4]   2> 6017 T2761 C201 UPDATE [collection1] webapp=/solr path=/update params={wt=javabin&version=2} {add=[154]} 0 0
[junit4:junit4]   2> 6021 T2762 C201 UPDATE [collection1] webapp=/solr path=/update params={wt=javabin&version=2} {add=[155]} 0 0
[junit4:junit4]   2> 6026 T2763 C201 UPDATE [collection1] webapp=/solr path=/update params={wt=javabin&version=2} {add=[156]} 0 0
[junit4:junit4]   2> 6031 T2765 C201 UPDATE [collection1] webapp=/solr path=/update params={wt=javabin&version=2} {add=[157]} 0 0
[junit4:junit4]   2> 6034 T2766 C201 UPDATE [collection1] webapp=/solr path=/update params={wt=javabin&version=2} {add=[158]} 0 0
[junit4:junit4]   2> 6037 T2761 C201 UPDATE [collection1] webapp=/solr path=/update params={wt=javabin&version=2} {add=[159]} 0 0
[junit4:junit4]   2> 6041 T2762 C201 UPDATE [collection1] webapp=/solr path=/update params={wt=javabin&version=2} {add=[160]} 0 0
[junit4:junit4]   2> 6044 T2764 C201 UPDATE [collection1] webapp=/solr path=/update params={wt=javabin&version=2} {add=[161]} 0 0
[junit4:junit4]   2> 6048 T2763 C201 UPDATE [collection1] webapp=/solr path=/update params={wt=javabin&version=2} {add=[162]} 0 0
[junit4:junit4]   2> 6051 T2765 C201 UPDATE [collection1] webapp=/solr path=/update params={wt=javabin&version=2} {add=[163]} 0 0
[junit4:junit4]   2> 6055 T2766 C201 UPDATE [collection1] webapp=/solr path=/update params={wt=javabin&version=2} {add=[164]} 0 0
[junit4:junit4]   2> 6059 T2761 C201 UPDATE [collection1] webapp=/solr path=/update params={wt=javabin&version=2} {add=[165]} 0 0
[junit4:junit4]   2> 6064 T2762 C201 UPDATE [collection1] webapp=/solr path=/update params={wt=javabin&version=2} {add=[166]} 0 1
[junit4:junit4]   2> 6067 T2764 C201 UPDATE [collection1] webapp=/solr path=/update params={wt=javabin&version=2} {add=[167]} 0 0
[junit4:junit4]   2> 6072 T2763 C201 UPDATE [collection1] webapp=/solr path=/update params={wt=javabin&version=2} {add=[168]} 0 0
[junit4:junit4]   2> 6075 T2765 C201 UPDATE [collection1] webapp=/solr path=/update params={wt=javabin&version=2} {add=[169]} 0 0
[junit4:junit4]   2> 6079 T2766 C201 UPDATE [collection1] webapp=/solr path=/update params={wt=javabin&version=2} {add=[170]} 0 0
[junit4:junit4]   2> 6082 T2761 C201 UPDATE [collection1] webapp=/solr path=/update params={wt=javabin&version=2} {add=[171]} 0 0
[junit4:junit4]   2> 6087 T2762 C201 UPDATE [collection1] webapp=/solr path=/update params={wt=javabin&version=2} {add=[172]} 0 0
[junit4:junit4]   2> 6090 T2764 C201 UPDATE [collection1] webapp=/solr path=/update params={wt=javabin&version=2} {add=[173]} 0 0
[junit4:junit4]   2> 6094 T2763 C201 UPDATE [collection1] webapp=/solr path=/update params={wt=javabin&version=2} {add=[174]} 0 0
[junit4:junit4]   2> 6097 T2765 C201 UPDATE [collection1] webapp=/solr path=/update params={wt=javabin&version=2} {add=[175]} 0 0
[junit4:junit4]   2> 6101 T2766 C201 UPDATE [collection1] webapp=/solr path=/update params={wt=javabin&version=2} {add=[176]} 0 0
[junit4:junit4]   2> 6105 T2761 C201 UPDATE [collection1] webapp=/solr path=/update params={wt=javabin&version=2} {add=[177]} 0 0
[junit4:junit4]   2> 6109 T2762 C201 UPDATE [collection1] webapp=/solr path=/update params={wt=javabin&version=2} {add=[178]} 0 0
[junit4:junit4]   2> 6112 T2764 C201 UPDATE [collection1] webapp=/solr path=/update params={wt=javabin&version=2} {add=[179]} 0 0
[junit4:junit4]   2> 6116 T2763 C201 UPDATE [collection1] webapp=/solr path=/update params={wt=javabin&version=2} {add=[180]} 0 0
[junit4:junit4]   2> 6119 T2765 C201 UPDATE [collection1] webapp=/solr path=/update params={wt=javabin&version=2} {add=[181]} 0 0
[junit4:junit4]   2> 6124 T2766 C201 UPDATE [collection1] webapp=/solr path=/update params={wt=javabin&version=2} {add=[182]} 0 0
[junit4:junit4]   2> 6127 T2761 C201 UPDATE [collection1] webapp=/solr path=/update params={wt=javabin&version=2} {add=[183]} 0 0
[junit4:junit4]   2> 6131 T2762 C201 UPDATE [collection1] webapp=/solr path=/update params={wt=javabin&version=2} {add=[184]} 0 0
[junit4:junit4]   2> 6135 T2764 C201 UPDATE [collection1] webapp=/solr path=/update params={wt=javabin&version=2} {add=[185]} 0 0
[junit4:junit4]   2> 6139 T2763 C201 UPDATE [collection1] webapp=/solr path=/update params={wt=javabin&version=2} {add=[186]} 0 0
[junit4:junit4]   2> 6142 T2765 C201 UPDATE [collection1] webapp=/solr path=/update params={wt=javabin&version=2} {add=[187]} 0 0
[junit4:junit4]   2> 6146 T2766 C201 UPDATE [collection1] webapp=/solr path=/update params={wt=javabin&version=2} {add=[188]} 0 0
[junit4:junit4]   2> 6149 T2761 C201 UPDATE [collection1] webapp=/solr path=/update params={wt=javabin&version=2} {add=[189]} 0 0
[junit4:junit4]   2> 6153 T2762 C201 UPDATE [collection1] webapp=/solr path=/update params={wt=javabin&version=2} {add=[190]} 0 0
[junit4:junit4]   2> 6158 T2764 C201 UPDATE [collection1] webapp=/solr path=/update params={wt=javabin&version=2} {add=[191]} 0 0
[junit4:junit4]   2> 6162 T2763 C201 UPDATE [collection1] webapp=/solr path=/update params={wt=javabin&version=2} {add=[192]} 0 0
[junit4:junit4]   2> 6168 T2765 C201 UPDATE [collection1] webapp=/solr path=/update params={wt=javabin&version=2} {add=[193]} 0 0
[junit4:junit4]   2> 6171 T2766 C201 UPDATE [collection1] webapp=/solr path=/update params={wt=javabin&version=2} {add=[194]} 0 0
[junit4:junit4]   2> 6175 T2761 C201 UPDATE [collection1] webapp=/solr path=/update params={wt=javabin&version=2} {add=[195]} 0 0
[junit4:junit4]   2> 6178 T2762 C201 UPDATE [collection1] webapp=/solr path=/update params={wt=javabin&version=2} {add=[196]} 0 0
[junit4:junit4]   2> 6183 T2764 C201 UPDATE [collection1] webapp=/solr path=/update params={wt=javabin&version=2} {add=[197]} 0 2
[junit4:junit4]   2> 6186 T2763 C201 UPDATE [collection1] webapp=/solr path=/update params={wt=javabin&version=2} {add=[198]} 0 0
[junit4:junit4]   2> 6190 T2765 C201 UPDATE [collection1] webapp=/solr path=/update params={wt=javabin&version=2} {add=[199]} 0 0
[junit4:junit4]   2> 6193 T2766 C201 UPDATE [collection1] webapp=/solr path=/update params={wt=javabin&version=2} {add=[200]} 0 0
[junit4:junit4]   2> 6198 T2761 C201 UPDATE [collection1] webapp=/solr path=/update params={wt=javabin&version=2} {add=[201]} 0 0
[junit4:junit4]   2> 6201 T2762 C201 UPDATE [collection1] webapp=/solr path=/update params={wt=javabin&version=2} {add=[202]} 0 0
[junit4:junit4]   2> 6205 T2764 C201 UPDATE [collection1] webapp=/solr path=/update params={wt=javabin&version=2} {add=[203]} 0 0
[junit4:junit4]   2> 6208 T2763 C201 UPDATE [collection1] webapp=/solr path=/update params={wt=javabin&version=2} {add=[204]} 0 0
[junit4:junit4]   2> 6211 T2765 C201 UPDATE [collection1] webapp=/solr path=/update params={wt=javabin&version=2} {add=[205]} 0 0
[junit4:junit4]   2> 6216 T2766 C201 UPDATE [collection1] webapp=/solr path=/update params={wt=javabin&version=2} {add=[206]} 0 0
[junit4:junit4]   2> 6222 T2761 C201 UPDATE [collection1] webapp=/solr path=/update params={wt=javabin&version=2} {add=[207]} 0 1
[junit4:junit4]   2> 6225 T2762 C201 UPDATE [collection1] webapp=/solr path=/update params={wt=javabin&version=2} {add=[208]} 0 0
[junit4:junit4]   2> 6229 T2764 C201 UPDATE [collection1] webapp=/solr path=/update params={wt=javabin&version=2} {add=[209]} 0 0
[junit4:junit4]   2> 6233 T2763 C201 UPDATE [collection1] webapp=/solr path=/update params={wt=javabin&version=2} {add=[210]} 0 0
[junit4:junit4]   2> 6237 T2765 C201 UPDATE [collection1] webapp=/solr path=/update params={wt=javabin&version=2} {add=[211]} 0 0
[junit4:junit4]   2> 6241 T2766 C201 UPDATE [collection1] webapp=/solr path=/update params={wt=javabin&version=2} {add=[212]} 0 0
[junit4:junit4]   2> 6245 T2761 C201 UPDATE [collection1] webapp=/solr path=/update params={wt=javabin&version=2} {add=[213]} 0 0
[junit4:junit4]   2> 6248 T2762 C201 UPDATE [collection1] webapp=/solr path=/update params={wt=javabin&version=2} {add=[214]} 0 0
[junit4:junit4]   2> 6253 T2764 C201 UPDATE [collection1] webapp=/solr path=/update params={wt=javabin&version=2} {add=[215]} 0 0
[junit4:junit4]   2> 6256 T2763 C201 UPDATE [collection1] webapp=/solr path=/update params={wt=javabin&version=2} {add=[216]} 0 0
[junit4:junit4]   2> 6260 T2765 C201 UPDATE [collection1] webapp=/solr path=/update params={wt=javabin&version=2} {add=[217]} 0 0
[junit4:junit4]   2> 6264 T2766 C201 UPDATE [collection1] webapp=/solr path=/update params={wt=javabin&version=2} {add=[218]} 0 1
[junit4:junit4]   2> 6267 T2761 C201 UPDATE [collection1] webapp=/solr path=/update params={wt=javabin&version=2} {add=[219]} 0 0
[junit4:junit4]   2> 6270 T2762 C201 UPDATE [collection1] webapp=/solr path=/update params={wt=javabin&version=2} {add=[220]} 0 0
[junit4:junit4]   2> 6275 T2764 C201 UPDATE [collection1] webapp=/solr path=/update params={wt=javabin&version=2} {add=[221]} 0 0
[junit4:junit4]   2> 6279 T2763 C201 UPDATE [collection1] webapp=/solr path=/update params={wt=javabin&version=2} {add=[222]} 0 0
[junit4:junit4]   2> 6283 T2765 C201 UPDATE [collection1] webapp=/solr path=/update params={wt=javabin&version=2} {add=[223]} 0 0
[junit4:junit4]   2> 6287 T2766 C201 UPDATE [collection1] webapp=/solr path=/update params={wt=javabin&version=2} {add=[224]} 0 0
[junit4:junit4]   2> 6291 T2761 C201 UPDATE [collection1] webapp=/solr path=/update params={wt=javabin&version=2} {add=[225]} 0 0
[junit4:junit4]   2> 6296 T2762 C201 UPDATE [collection1] webapp=/solr path=/update params={wt=javabin&version=2} {add=[226]} 0 0
[junit4:junit4]   2> 6299 T2764 C201 UPDATE [collection1] webapp=/solr path=/update params={wt=javabin&version=2} {add=[227]} 0 0
[junit4:junit4]   2> 6304 T2763 C201 UPDATE [collection1] webapp=/solr path=/update params={wt=javabin&version=2} {add=[228]} 0 0
[junit4:junit4]   2> 6307 T2765 C201 UPDATE [collection1] webapp=/solr path=/update params={wt=javabin&version=2} {add=[229]} 0 0
[junit4:junit4]   2> 6312 T2766 C201 UPDATE [collection1] webapp=/solr path=/update params={wt=javabin&version=2} {add=[230]} 0 0
[junit4:junit4]   2> 6316 T2761 C201 UPDATE [collection1] webapp=/solr path=/update params={wt=javabin&version=2} {add=[231]} 0 0
[junit4:junit4]   2> 6321 T2762 C201 UPDATE [collection1] webapp=/solr path=/update params={wt=javabin&version=2} {add=[232]} 0 0
[junit4:junit4]   2> 6324 T2764 C201 UPDATE [collection1] webapp=/solr path=/update params={wt=javabin&version=2} {add=[233]} 0 0
[junit4:junit4]   2> 6329 T2763 C201 UPDATE [collection1] webapp=/solr path=/update params={wt=javabin&version=2} {add=[234]} 0 0
[junit4:junit4]   2> 6334 T2765 C201 UPDATE [collection1] webapp=/solr path=/update params={wt=javabin&version=2} {add=[235]} 0 0
[junit4:junit4]   2> 6337 T2766 C201 UPDATE [collection1] webapp=/solr path=/update params={wt=javabin&version=2} {add=[236]} 0 0
[junit4:junit4]   2> 6342 T2761 C201 UPDATE [collection1] webapp=/solr path=/update params={wt=javabin&version=2} {add=[237]} 0 0
[junit4:junit4]   2> 6345 T2762 C201 UPDATE [collection1] webapp=/solr path=/update params={wt=javabin&version=2} {add=[238]} 0 0
[junit4:junit4]   2> 6349 T2764 C201 UPDATE [collection1] webapp=/solr path=/update params={wt=javabin&version=2} {add=[239]} 0 0
[junit4:junit4]   2> 6352 T2763 C201 UPDATE [collection1] webapp=/solr path=/update params={wt=javabin&version=2} {add=[240]} 0 0
[junit4:junit4]   2> 6355 T2765 C201 UPDATE [collection1] webapp=/solr path=/update params={wt=javabin&version=2} {add=[241]} 0 0
[junit4:junit4]   2> 6359 T2766 C201 UPDATE [collection1] webapp=/solr path=/update params={wt=javabin&version=2} {add=[242]} 0 0
[junit4:junit4]   2> 6362 T2761 C201 UPDATE [collection1] webapp=/solr path=/update params={wt=javabin&version=2} {add=[243]} 0 0
[junit4:junit4]   2> 6367 T2762 C201 UPDATE [collection1] webapp=/solr path=/update params={wt=javabin&version=2} {add=[244]} 0 0
[junit4:junit4]   2> 6370 T2764 C201 UPDATE [collection1] webapp=/solr path=/update params={wt=javabin&version=2} {add=[245]} 0 0
[junit4:junit4]   2> 6374 T2763 C201 UPDATE [collection1] webapp=/solr path=/update params={wt=javabin&version=2} {add=[246]} 0 0
[junit4:junit4]   2> 6377 T2765 C201 UPDATE [collection1] webapp=/solr path=/update params={wt=javabin&version=2} {add=[247]} 0 0
[junit4:junit4]   2> 6381 T2766 C201 UPDATE [collection1] webapp=/solr path=/update params={wt=javabin&version=2} {add=[248]} 0 0
[junit4:junit4]   2> 6384 T2761 C201 UPDATE [collection1] webapp=/solr path=/update params={wt=javabin&version=2} {add=[249]} 0 0
[junit4:junit4]   2> 6388 T2762 C201 UPDATE [collection1] webapp=/solr path=/update params={wt=javabin&version=2} {add=[250]} 0 0
[junit4:junit4]   2> 6391 T2764 C201 UPDATE [collection1] webapp=/solr path=/update params={wt=javabin&version=2} {add=[251]} 0 0
[junit4:junit4]   2> 6395 T2763 C201 UPDATE [collection1] webapp=/solr path=/update params={wt=javabin&version=2} {add=[252]} 0 0
[junit4:junit4]   2> 6398 T2765 C201 UPDATE [collection1] webapp=/solr path=/update params={wt=javabin&version=2} {add=[253]} 0 0
[junit4:junit4]   2> 6402 T2766 C201 UPDATE [collection1] webapp=/solr path=/update params={wt=javabin&version=2} {add=[254]} 0 0
[junit4:junit4]   2> 6405 T2761 C201 UPDATE [collection1] webapp=/solr path=/update params={wt=javabin&version=2} {add=[255]} 0 0
[junit4:junit4]   2> 6408 T2762 C201 UPDATE [collection1] webapp=/solr path=/update params={wt=javabin&version=2} {add=[256]} 0 0
[junit4:junit4]   2> 6412 T2764 C201 UPDATE [collection1] webapp=/solr path=/update params={wt=javabin&version=2} {add=[257]} 0 0
[junit4:junit4]   2> 6418 T2763 C201 UPDATE [collection1] webapp=/solr path=/update params={wt=javabin&version=2} {add=[258]} 0 0
[junit4:junit4]   2> 6420 T2765 C201 UPDATE [collection1] webapp=/solr path=/update params={wt=javabin&version=2} {add=[259]} 0 0
[junit4:junit4]   2> 6423 T2766 C201 UPDATE [collection1] webapp=/solr path=/update params={wt=javabin&version=2} {add=[260]} 0 0
[junit4:junit4]   2> 6427 T2761 C201 UPDATE [collection1] webapp=/solr path=/update params={wt=javabin&version=2} {add=[261]} 0 0
[junit4:junit4]   2> 6430 T2764 C201 UPDATE [collection1] webapp=/solr path=/update params={wt=javabin&version=2} {add=[262]} 0 0
[junit4:junit4]   2> 6435 T2763 C201 UPDATE [collection1] webapp=/solr path=/update params={wt=javabin&version=2} {add=[263]} 0 0
[junit4:junit4]   2> 6440 T2765 C201 UPDATE [collection1] webapp=/solr path=/update params={wt=javabin&version=2} {add=[264]} 0 0
[junit4:junit4]   2> 6444 T2766 C201 UPDATE [collection1] webapp=/solr path=/update params={wt=javabin&version=2} {add=[265]} 0 0
[junit4:junit4]   2> 6448 T2762 C201 UPDATE [collection1] webapp=/solr path=/update params={wt=javabin&version=2} {add=[266]} 0 0
[junit4:junit4]   2> 6451 T2761 C201 UPDATE [collection1] webapp=/solr path=/update params={wt=javabin&version=2} {add=[267]} 0 0
[junit4:junit4]   2> 6455 T2764 C201 UPDATE [collection1] webapp=/solr path=/update params={wt=javabin&version=2} {add=[268]} 0 0
[junit4:junit4]   2> 6458 T2763 C201 UPDATE [collection1] webapp=/solr path=/update params={wt=javabin&version=2} {add=[269]} 0 0
[junit4:junit4]   2> 6463 T2765 C201 UPDATE [collection1] webapp=/solr path=/update params={wt=javabin&version=2} {add=[270]} 0 0
[junit4:junit4]   2> 6466 T2766 C201 UPDATE [collection1] webapp=/solr path=/update params={wt=javabin&version=2} {add=[271]} 0 0
[junit4:junit4]   2> 6471 T2762 C201 UPDATE [collection1] webapp=/solr path=/update params={wt=javabin&version=2} {add=[272]} 0 0
[junit4:junit4]   2> 6474 T2761 C201 UPDATE [collection1] webapp=/solr path=/update params={wt=javabin&version=2} {add=[273]} 0 0
[junit4:junit4]   2> 6479 T2764 C201 UPDATE [collection1] webapp=/solr path=/update params={wt=javabin&version=2} {add=[274]} 0 0
[junit4:junit4]   2> 6482 T2763 C201 UPDATE [collection1] webapp=/solr path=/update params={wt=javabin&version=2} {add=[275]} 0 0
[junit4:junit4]   2> 6487 T2765 C201 UPDATE [collection1] webapp=/solr path=/update params={wt=javabin&version=2} {add=[276]} 0 0
[junit4:junit4]   2> 6490 T2766 C201 UPDATE [collection1] webapp=/solr path=/update params={wt=javabin&version=2} {add=[277]} 0 0
[junit4:junit4]   2> 6496 T2762 C201 UPDATE [collection1] webapp=/solr path=/update params={wt=javabin&version=2} {add=[278]} 0 1
[junit4:junit4]   2> 6499 T2761 C201 UPDATE [collection1] webapp=/solr path=/update params={wt=javabin&version=2} {add=[279]} 0 0
[junit4:junit4]   2> 6504 T2764 C201 UPDATE [collection1] webapp=/solr path=/update params={wt=javabin&version=2} {add=[280]} 0 0
[junit4:junit4]   2> 6508 T2763 C201 UPDATE [collection1] webapp=/solr path=/update params={wt=javabin&version=2} {add=[281]} 0 0
[junit4:junit4]   2> 6511 T2765 C201 UPDATE [collection1] webapp=/solr path=/update params={wt=javabin&version=2} {add=[282]} 0 0
[junit4:junit4]   2> 6514 T2766 C201 UPDATE [collection1] webapp=/solr path=/update params={wt=javabin&version=2} {add=[283]} 0 0
[junit4:junit4]   2> 6519 T2762 C201 UPDATE [collection1] webapp=/solr path=/update params={wt=javabin&version=2} {add=[284]} 0 0
[junit4:junit4]   2> 6523 T2761 C201 UPDATE [collection1] webapp=/solr path=/update params={wt=javabin&version=2} {add=[285]} 0 0
[junit4:junit4]   2> 6527 T2764 C201 UPDATE [collection1] webapp=/solr path=/update params={wt=javabin&version=2} {add=[286]} 0 0
[junit4:junit4]   2> 6533 T2763 C201 UPDATE [collection1] webapp=/solr path=/update params={wt=javabin&version=2} {add=[287]} 0 0
[junit4:junit4]   2> 6537 T2765 C201 UPDATE [collection1] webapp=/solr path=/update params={wt=javabin&version=2} {add=[288]} 0 0
[junit4:junit4]   2> 6541 T2766 C201 UPDATE [collection1] webapp=/solr path=/update params={wt=javabin&version=2} {add=[289]} 0 0
[junit4:junit4]   2> 6547 T2762 C201 UPDATE [collection1] webapp=/solr path=/update params={wt=javabin&version=2} {add=[290]} 0 0
[junit4:junit4]   2> 6550 T2761 C201 UPDATE [collection1] webapp=/solr path=/update params={wt=javabin&version=2} {add=[291]} 0 0
[junit4:junit4]   2> 6555 T2764 C201 UPDATE [collection1] webapp=/solr path=/update params={wt=javabin&version=2} {add=[292]} 0 0
[junit4:junit4]   2> 6558 T2763 C201 UPDATE [collection1] webapp=/solr path=/update params={wt=javabin&version=2} {add=[293]} 0 0
[junit4:junit4]   2> 6563 T2765 C201 UPDATE [collection1] webapp=/solr path=/update params={wt=javabin&version=2} {add=[294]} 0 0
[junit4:junit4]   2> 6567 T2766 C201 UPDATE [collection1] webapp=/solr path=/update params={wt=javabin&version=2} {add=[295]} 0 0
[junit4:junit4]   2> 6576 T2762 C201 UPDATE [collection1] webapp=/solr path=/update params={wt=javabin&version=2} {add=[296]} 0 5
[junit4:junit4]   2> 6578 T2761 C201 UPDATE [collection1] webapp=/solr path=/update params={wt=javabin&version=2} {add=[297]} 0 0
[junit4:junit4]   2> 6582 T2764 C201 UPDATE [collection1] webapp=/solr path=/update params={wt=javabin&version=2} {add=[298]} 0 0
[junit4:junit4]   2> 6588 T2763 C201 UPDATE [collection1] webapp=/solr path=/update params={wt=javabin&version=2} {add=[299]} 0 0
[junit4:junit4]   2> 6592 T2765 C201 UPDATE [collection1] webapp=/solr path=/update params={wt=javabin&version=2} {add=[300]} 0 0
[junit4:junit4]   2> 6595 T2766 C201 UPDATE [collection1] webapp=/solr path=/update params={wt=javabin&version=2} {add=[301]} 0 0
[junit4:junit4]   2> 6599 T2762 C201 UPDATE [collection1] webapp=/solr path=/update params={wt=javabin&version=2} {add=[302]} 0 0
[junit4:junit4]   2> 6602 T2761 C201 UPDATE [collection1] webapp=/solr path=/update params={wt=javabin&version=2} {add=[303]} 0 0
[junit4:junit4]   2> 6607 T2764 C201 UPDATE [collection1] webapp=/solr path=/update params={wt=javabin&version=2} {add=[304]} 0 0
[junit4:junit4]   2> 6610 T2763 C201 UPDATE [collection1] webapp=/solr path=/update params={wt=javabin&version=2} {add=[305]} 0 0
[junit4:junit4]   2> 6614 T2765 C201 UPDATE [collection1] webapp=/solr path=/update params={wt=javabin&version=2} {add=[306]} 0 0
[junit4:junit4]   2> 6618 T2766 C201 UPDATE [collection1] webapp=/solr path=/update params={wt=javabin&version=2} {add=[307]} 0 0
[junit4:junit4]   2> 6622 T2762 C201 UPDATE [collection1] webapp=/solr path=/update params={wt=javabin&version=2} {add=[308]} 0 0
[junit4:junit4]   2> 6625 T2761 C201 UPDATE [collection1] webapp=/solr path=/update params={wt=javabin&version=2} {add=[309]} 0 0
[junit4:junit4]   2> 6629 T2764 C201 UPDATE [collection1] webapp=/solr path=/update params={wt=javabin&version=2} {add=[310]} 0 0
[junit4:junit4]   2> 6632 T2763 C201 UPDATE [collection1] webapp=/solr path=/update params={wt=javabin&version=2} {add=[311]} 0 0
[junit4:junit4]   2> 6637 T2765 C201 UPDATE [collection1] webapp=/solr path=/update params={wt=javabin&version=2} {add=[312]} 0 0
[junit4:junit4]   2> 6640 T2766 C201 UPDATE [collection1] webapp=/solr path=/update params={wt=javabin&version=2} {add=[313]} 0 0
[junit4:junit4]   2> 6643 T2762 C201 UPDATE [collection1] webapp=/solr path=/update params={wt=javabin&version=2} {add=[314]} 0 0
[junit4:junit4]   2> 6648 T2761 C201 UPDATE [collection1] webapp=/solr path=/update params={wt=javabin&version=2} {add=[315]} 0 0
[junit4:junit4]   2> 6652 T2764 C201 UPDATE [collection1] webapp=/solr path=/update params={wt=javabin&version=2} {add=[316]} 0 0
[junit4:junit4]   2> 6657 T2763 C201 UPDATE [collection1] webapp=/solr path=/update params={wt=javabin&version=2} {add=[317]} 0 0
[junit4:junit4]   2> 6661 T2765 C201 UPDATE [collection1] webapp=/solr path=/update params={wt=javabin&version=2} {add=[318]} 0 0
[junit4:junit4]   2> 6664 T2766 C201 UPDATE [collection1] webapp=/solr path=/update params={wt=javabin&version=2} {add=[319]} 0 0
[junit4:junit4]   2> 6669 T2762 C201 UPDATE [collection1] webapp=/solr path=/update params={wt=javabin&version=2} {add=[320]} 0 0
[junit4:junit4]   2> 6672 T2761 C201 UPDATE [collection1] webapp=/solr path=/update params={wt=javabin&version=2} {add=[321]} 0 0
[junit4:junit4]   2> 6677 T2764 C201 UPDATE [collection1] webapp=/solr path=/update params={wt=javabin&version=2} {add=[322]} 0 0
[junit4:junit4]   2> 6680 T2763 C201 UPDATE [collection1] webapp=/solr path=/update params={wt=javabin&version=2} {add=[323]} 0 0
[junit4:junit4]   2> 6684 T2765 C201 UPDATE [collection1] webapp=/solr path=/update params={wt=javabin&version=2} {add=[324]} 0 0
[junit4:junit4]   2> 6687 T2766 C201 UPDATE [collection1] webapp=/solr path=/update params={wt=javabin&version=2} {add=[325]} 0 0
[junit4:junit4]   2> 6691 T2762 C201 UPDATE [collection1] webapp=/solr path=/update params={wt=javabin&version=2} {add=[326]} 0 0
[junit4:junit4]   2> 6694 T2761 C201 UPDATE [collection1] webapp=/solr path=/update params={wt=javabin&version=2} {add=[327]} 0 0
[junit4:junit4]   2> 6698 T2764 C201 UPDATE [collection1] webapp=/solr path=/update params={wt=javabin&version=2} {add=[328]} 0 0
[junit4:junit4]   2> 6702 T2763 C201 REQ [collection1] webapp=/solr path=/replication params={command=indexversion&wt=javabin&qt=/replication&version=2} status=0 QTime=0 
[junit4:junit4]   2> 6702 T2765 C201 UPDATE [collection1] webapp=/solr path=/update params={wt=javabin&version=2} {add=[329]} 0 0
[junit4:junit4]   2> 6706 T2766 C201 UPDATE [collection1] webapp=/solr path=/update params={wt=javabin&version=2} {add=[330]} 0 0
[junit4:junit4]   2> 6710 T2762 C201 UPDATE [collection1] webapp=/solr path=/update params={wt=javabin&version=2} {add=[331]} 0 0
[junit4:junit4]   2> 6714 T2761 C201 UPDATE [collection1] webapp=/solr path=/update params={wt=javabin&version=2} {add=[332]} 0 0
[junit4:junit4]   2> 6718 T2764 C201 UPDATE [collection1] webapp=/solr path=/update params={wt=javabin&version=2} {add=[333]} 0 0
[junit4:junit4]   2> 6722 T2763 C201 UPDATE [collection1] webapp=/solr path=/update params={wt=javabin&version=2} {add=[334]} 0 0
[junit4:junit4]   2> 6726 T2765 C201 UPDATE [collection1] webapp=/solr path=/update params={wt=javabin&version=2} {add=[335]} 0 0
[junit4:junit4]   2> 6731 T2766 C201 UPDATE [collection1] webapp=/solr path=/update params={wt=javabin&version=2} {add=[336]} 0 0
[junit4:junit4]   2> 6735 T2762 C201 UPDATE [collection1] webapp=/solr path=/update params={wt=javabin&version=2} {add=[337]} 0 0
[junit4:junit4]   2> 6738 T2761 C201 UPDATE [collection1] webapp=/solr path=/update params={wt=javabin&version=2} {add=[338]} 0 0
[junit4:junit4]   2> 6743 T2764 C201 UPDATE [collection1] webapp=/solr path=/update params={wt=javabin&version=2} {add=[339]} 0 0
[junit4:junit4]   2> 6747 T2763 C201 UPDATE [collection1] webapp=/solr path=/update params={wt=javabin&version=2} {add=[340]} 0 0
[junit4:junit4]   2> 6752 T2765 C201 UPDATE [collection1] webapp=/solr path=/update params={wt=javabin&version=2} {add=[341]} 0 0
[junit4:junit4]   2> 6755 T2766 C201 UPDATE [collection1] webapp=/solr path=/update params={wt=javabin&version=2} {add=[342]} 0 0
[junit4:junit4]   2> 6760 T2762 C201 UPDATE [collection1] webapp=/solr path=/update params={wt=javabin&version=2} {add=[343]} 0 0
[junit4:junit4]   2> 6764 T2761 C201 UPDATE [collection1] webapp=/solr path=/update params={wt=javabin&version=2} {add=[344]} 0 1
[junit4:junit4]   2> 6768 T2764 C201 UPDATE [collection1] webapp=/solr path=/update params={wt=javabin&version=2} {add=[345]} 0 0
[junit4:junit4]   2> 6771 T2763 C201 UPDATE [collection1] webapp=/solr path=/update params={wt=javabin&version=2} {add=[346]} 0 0
[junit4:junit4]   2> 6776 T2765 C201 UPDATE [collection1] webapp=/solr path=/update params={wt=javabin&version=2} {add=[347]} 0 0
[junit4:junit4]   2> 6781 T2766 C201 UPDATE [collection1] webapp=/solr path=/update params={wt=javabin&version=2} {add=[348]} 0 0
[junit4:junit4]   2> 6785 T2761 C201 UPDATE [collection1] webapp=/solr path=/update params={wt=javabin&version=2} {add=[349]} 0 0
[junit4:junit4]   2> 6791 T2762 C201 UPDATE [collection1] webapp=/solr path=/update params={wt=javabin&version=2} {add=[350]} 0 0
[junit4:junit4]   2> 6798 T2764 C201 UPDATE [collection1] webapp=/solr path=/update params={wt=javabin&version=2} {add=[351]} 0 0
[junit4:junit4]   2> 6801 T2763 C201 UPDATE [collection1] webapp=/solr path=/update params={wt=javabin&version=2} {add=[352]} 0 0
[junit4:junit4]   2> 6805 T2765 C201 UPDATE [collection1] webapp=/solr path=/update params={wt=javabin&version=2} {add=[353]} 0 0
[junit4:junit4]   2> 6809 T2766 C201 UPDATE [collection1] webapp=/solr path=/update params={wt=javabin&version=2} {add=[354]} 0 0
[junit4:junit4]   2> 6813 T2761 C201 UPDATE [collection1] webapp=/solr path=/update params={wt=javabin&version=2} {add=[355]} 0 0
[junit4:junit4]   2> 6817 T2762 C201 UPDATE [collection1] webapp=/solr path=/update params={wt=javabin&version=2} {add=[356]} 0 0
[junit4:junit4]   2> 6823 T2764 C201 UPDATE [collection1] webapp=/solr path=/update params={wt=javabin&version=2} {add=[357]} 0 0
[junit4:junit4]   2> 6827 T2763 C201 UPDATE [collection1] webapp=/solr path=/update params={wt=javabin&version=2} {add=[358]} 0 0
[junit4:junit4]   2> 6831 T2765 C201 UPDATE [collection1] webapp=/solr path=/update params={wt=javabin&version=2} {add=[359]} 0 0
[junit4:junit4]   2> 6834 T2761 C201 UPDATE [collection1] webapp=/solr path=/update params={wt=javabin&version=2} {add=[360]} 0 0
[junit4:junit4]   2> 6839 T2762 C201 UPDATE [collection1] webapp=/solr path=/update params={wt=javabin&version=2} {add=[361]} 0 0
[junit4:junit4]   2> 6843 T2764 C201 UPDATE [collection1] webapp=/solr path=/update params={wt=javabin&version=2} {add=[362]} 0 0
[junit4:junit4]   2> 6847 T2763 C201 UPDATE [collection1] webapp=/solr path=/update params={wt=javabin&version=2} {add=[363]} 0 0
[junit4:junit4]   2> 6851 T2765 C201 UPDATE [collection1] webapp=/solr path=/update params={wt=javabin&version=2} {add=[364]} 0 0
[junit4:junit4]   2> 6854 T2766 C201 UPDATE [collection1] webapp=/solr path=/update params={wt=javabin&version=2} {add=[365]} 0 0
[junit4:junit4]   2> 6859 T2761 C201 UPDATE [collection1] webapp=/solr path=/update params={wt=javabin&version=2} {add=[366]} 0 0
[junit4:junit4]   2> 6862 T2762 C201 UPDATE [collection1] webapp=/solr path=/update params={wt=javabin&version=2} {add=[367]} 0 0
[junit4:junit4]   2> 6867 T2764 C201 UPDATE [collection1] webapp=/solr path=/update params={wt=javabin&version=2} {add=[368]} 0 0
[junit4:junit4]   2> 6870 T2763 C201 UPDATE [collection1] webapp=/solr path=/update params={wt=javabin&version=2} {add=[369]} 0 0
[junit4:junit4]   2> 6875 T2765 C201 UPDATE [collection1] webapp=/solr path=/update params={wt=javabin&version=2} {add=[370]} 0 0
[junit4:junit4]   2> 6879 T2766 C201 UPDATE [collection1] webapp=/solr path=/update params={wt=javabin&version=2} {add=[371]} 0 0
[junit4:junit4]   2> 6882 T2761 C201 UPDATE [collection1] webapp=/solr path=/update params={wt=javabin&version=2} {add=[372]} 0 0
[junit4:junit4]   2> 6885 T2762 C201 UPDATE [collection1] webapp=/solr path=/update params={wt=javabin&version=2} {add=[373]} 0 0
[junit4:junit4]   2> 6889 T2764 C201 UPDATE [collection1] webapp=/solr path=/update params={wt=javabin&version=2} {add=[374]} 0 0
[junit4:junit4]   2> 6893 T2763 C201 UPDATE [collection1] webapp=/solr path=/update params={wt=javabin&version=2} {add=[375]} 0 1
[junit4:junit4]   2> 6897 T2765 C201 UPDATE [collection1] webapp=/solr path=/update params={wt=javabin&version=2} {add=[376]} 0 0
[junit4:junit4]   2> 6902 T2766 C201 UPDATE [collection1] webapp=/solr path=/update params={wt=javabin&version=2} {add=[377]} 0 0
[junit4:junit4]   2> 6906 T2761 C201 UPDATE [collection1] webapp=/solr path=/update params={wt=javabin&version=2} {add=[378]} 0 0
[junit4:junit4]   2> 6911 T2762 C201 UPDATE [collection1] webapp=/solr path=/update params={wt=javabin&version=2} {add=[379]} 0 0
[junit4:junit4]   2> 6914 T2764 C201 UPDATE [collection1] webapp=/solr path=/update params={wt=javabin&version=2} {add=[380]} 0 0
[junit4:junit4]   2> 6918 T2763 C201 UPDATE [collection1] webapp=/solr path=/update params={wt=javabin&version=2} {add=[381]} 0 0
[junit4:junit4]   2> 6922 T2765 C201 UPDATE [collection1] webapp=/solr path=/update params={wt=javabin&version=2} {add=[382]} 0 0
[junit4:junit4]   2> 6926 T2766 C201 UPDATE [collection1] webapp=/solr path=/update params={wt=javabin&version=2} {add=[383]} 0 0
[junit4:junit4]   2> 6929 T2761 C201 UPDATE [collection1] webapp=/solr path=/update params={wt=javabin&version=2} {add=[384]} 0 0
[junit4:junit4]   2> 6933 T2762 C201 UPDATE [collection1] webapp=/solr path=/update params={wt=javabin&version=2} {add=[385]} 0 0
[junit4:junit4]   2> 6936 T2764 C201 UPDATE [collection1] webapp=/solr path=/update params={wt=javabin&version=2} {add=[386]} 0 0
[junit4:junit4]   2> 6941 T2763 C201 UPDATE [collection1] webapp=/solr path=/update params={wt=javabin&version=2} {add=[387]} 0 0
[junit4:junit4]   2> 6945 T2765 C201 UPDATE [collection1] webapp=/solr path=/update params={wt=javabin&version=2} {add=[388]} 0 0
[junit4:junit4]   2> 6950 T2766 C201 UPDATE [collection1] webapp=/solr path=/update params={wt=javabin&version=2} {add=[389]} 0 0
[junit4:junit4]   2> 6956 T2761 C201 UPDATE [collection1] webapp=/solr path=/update params={wt=javabin&version=2} {add=[390]} 0 1
[junit4:junit4]   2> 6959 T2762 C201 UPDATE [collection1] webapp=/solr path=/update params={wt=javabin&version=2} {add=[391]} 0 0
[junit4:junit4]   2> 6964 T2764 C201 UPDATE [collection1] webapp=/solr path=/update params={wt=javabin&version=2} {add=[392]} 0 0
[junit4:junit4]   2> 6967 T2763 C201 UPDATE [collection1] webapp=/solr path=/update params={wt=javabin&version=2} {add=[393]} 0 0
[junit4:junit4]   2> 6971 T2765 C201 UPDATE [collection1] webapp=/solr path=/update params={wt=javabin&version=2} {add=[394]} 0 0
[junit4:junit4]   2> 6974 T2766 C201 UPDATE [collection1] webapp=/solr path=/update params={wt=javabin&version=2} {add=[395]} 0 0
[junit4:junit4]   2> 6978 T2761 C201 UPDATE [collection1] webapp=/solr path=/update params={wt=javabin&version=2} {add=[396]} 0 0
[junit4:junit4]   2> 6982 T2762 C201 UPDATE [collection1] webapp=/solr path=/update params={wt=javabin&version=2} {add=[397]} 0 0
[junit4:junit4]   2> 6986 T2764 C201 UPDATE [collection1] webapp=/solr path=/update params={wt=javabin&version=2} {add=[398]} 0 0
[junit4:junit4]   2> 6990 T2763 C201 UPDATE [collection1] webapp=/solr path=/update params={wt=javabin&version=2} {add=[399]} 0 0
[junit4:junit4]   2> 6995 T2765 C201 UPDATE [collection1] webapp=/solr path=/update params={wt=javabin&version=2} {add=[400]} 0 0
[junit4:junit4]   2> 7001 T2766 C201 UPDATE [collection1] webapp=/solr path=/update params={wt=javabin&version=2} {add=[401]} 0 0
[junit4:junit4]   2> 7005 T2761 C201 UPDATE [collection1] webapp=/solr path=/update params={wt=javabin&version=2} {add=[402]} 0 0
[junit4:junit4]   2> 7009 T2762 C201 UPDATE [collection1] webapp=/solr path=/update params={wt=javabin&version=2} {add=[403]} 0 0
[junit4:junit4]   2> 7012 T2764 C201 UPDATE [collection1] webapp=/solr path=/update params={wt=javabin&version=2} {add=[404]} 0 0
[junit4:junit4]   2> 7016 T2763 C201 UPDATE [collection1] webapp=/solr path=/update params={wt=javabin&version=2} {add=[405]} 0 0
[junit4:junit4]   2> 7020 T2765 C201 UPDATE [collection1] webapp=/solr path=/update params={wt=javabin&version=2} {add=[406]} 0 0
[junit4:junit4]   2> 7024 T2766 C201 UPDATE [collection1] webapp=/solr path=/update params={wt=javabin&version=2} {add=[407]} 0 0
[junit4:junit4]   2> 7027 T2761 C201 UPDATE [collection1] webapp=/solr path=/update params={wt=javabin&version=2} {add=[408]} 0 0
[junit4:junit4]   2> 7031 T2762 C201 UPDATE [collection1] webapp=/solr path=/update params={wt=javabin&version=2} {add=[409]} 0 0
[junit4:junit4]   2> 7034 T2764 C201 UPDATE [collection1] webapp=/solr path=/update params={wt=javabin&version=2} {add=[410]} 0 0
[junit4:junit4]   2> 7039 T2763 C201 UPDATE [collection1] webapp=/solr path=/update params={wt=javabin&version=2} {add=[411]} 0 0
[junit4:junit4]   2> 7042 T2765 C201 UPDATE [collection1] webapp=/solr path=/update params={wt=javabin&version=2} {add=[412]} 0 0
[junit4:junit4]   2> 7046 T2766 C201 UPDATE [collection1] webapp=/solr path=/update params={wt=javabin&version=2} {add=[413]} 0 0
[junit4:junit4]   2> 7050 T2761 C201 UPDATE [collection1] webapp=/solr path=/update params={wt=javabin&version=2} {add=[414]} 0 0
[junit4:junit4]   2> 7055 T2762 C201 UPDATE [collection1] webapp=/solr path=/update params={wt=javabin&version=2} {add=[415]} 0 1
[junit4:junit4]   2> 7059 T2764 C201 UPDATE [collection1] webapp=/solr path=/update params={wt=javabin&version=2} {add=[416]} 0 0
[junit4:junit4]   2> 7062 T2763 C201 UPDATE [collection1] webapp=/solr path=/update params={wt=javabin&version=2} {add=[417]} 0 0
[junit4:junit4]   2> 7066 T2765 C201 UPDATE [collection1] webapp=/solr path=/update params={wt=javabin&version=2} {add=[418]} 0 0
[junit4:junit4]   2> 7070 T2766 C201 UPDATE [collection1] webapp=/solr path=/update params={wt=javabin&version=2} {add=[419]} 0 0
[junit4:junit4]   2> 7074 T2761 C201 UPDATE [collection1] webapp=/solr path=/update params={wt=javabin&version=2} {add=[420]} 0 0
[junit4:junit4]   2> 7078 T2762 C201 UPDATE [collection1] webapp=/solr path=/update params={wt=javabin&version=2} {add=[421]} 0 0
[junit4:junit4]   2> 7081 T2764 C201 UPDATE [collection1] webapp=/solr path=/update params={wt=javabin&version=2} {add=[422]} 0 0
[junit4:junit4]   2> 7085 T2763 C201 UPDATE [collection1] webapp=/solr path=/update params={wt=javabin&version=2} {add=[423]} 0 0
[junit4:junit4]   2> 7089 T2765 C201 UPDATE [collection1] webapp=/solr path=/update params={wt=javabin&version=2} {add=[424]} 0 0
[junit4:junit4]   2> 7094 T2766 C201 UPDATE [collection1] webapp=/solr path=/update params={wt=javabin&version=2} {add=[425]} 0 0
[junit4:junit4]   2> 7098 T2761 C201 UPDATE [collection1] webapp=/solr path=/update params={wt=javabin&version=2} {add=[426]} 0 0
[junit4:junit4]   2> 7102 T2762 C201 UPDATE [collection1] webapp=/solr path=/update params={wt=javabin&version=2} {add=[427]} 0 0
[junit4:junit4]   2> 7105 T2764 C201 UPDATE [collection1] webapp=/solr path=/update params={wt=javabin&version=2} {add=[428]} 0 0
[junit4:junit4]   2> 7109 T2763 C201 UPDATE [collection1] webapp=/solr path=/update params={wt=javabin&version=2} {add=[429]} 0 0
[junit4:junit4]   2> 7113 T2765 C201 UPDATE [collection1] webapp=/solr path=/update params={wt=javabin&version=2} {add=[430]} 0 0
[junit4:junit4]   2> 7118 T2766 C201 UPDATE [collection1] webapp=/solr path=/update params={wt=javabin&version=2} {add=[431]} 0 0
[junit4:junit4]   2> 7122 T2761 C201 UPDATE [collection1] webapp=/solr path=/update params={wt=javabin&version=2} {add=[432]} 0 0
[junit4:junit4]   2> 7127 T2762 C201 UPDATE [collection1] webapp=/solr path=/update params={wt=javabin&version=2} {add=[433]} 0 0
[junit4:junit4]   2> 7131 T2764 C201 UPDATE [collection1] webapp=/solr path=/update params={wt=javabin&version=2} {add=[434]} 0 0
[junit4:junit4]   2> 7136 T2763 C201 UPDATE [collection1] webapp=/solr path=/update params={wt=javabin&version=2} {add=[435]} 0 0
[junit4:junit4]   2> 7140 T2765 C201 UPDATE [collection1] webapp=/solr path=/update params={wt=javabin&version=2} {add=[436]} 0 0
[junit4:junit4]   2> 7143 T2766 C201 UPDATE [collection1] webapp=/solr path=/update params={wt=javabin&version=2} {add=[437]} 0 0
[junit4:junit4]   2> 7147 T2761 C201 UPDATE [collection1] webapp=/solr path=/update params={wt=javabin&version=2} {add=[438]} 0 0
[junit4:junit4]   2> 7151 T2762 C201 UPDATE [collection1] webapp=/solr path=/update params={wt=javabin&version=2} {add=[439]} 0 0
[junit4:junit4]   2> 7156 T2764 C201 UPDATE [collection1] webapp=/solr path=/update params={wt=javabin&version=2} {add=[440]} 0 0
[junit4:junit4]   2> 7161 T2763 C201 UPDATE [collection1] webapp=/solr path=/update params={wt=javabin&version=2} {add=[441]} 0 1
[junit4:junit4]   2> 7165 T2765 C201 UPDATE [collection1] webapp=/solr path=/update params={wt=javabin&version=2} {add=[442]} 0 0
[junit4:junit4]   2> 7169 T2766 C201 UPDATE [collection1] webapp=/solr path=/update params={wt=javabin&version=2} {add=[443]} 0 0
[junit4:junit4]   2> 7173 T2761 C201 UPDATE [collection1] webapp=/solr path=/update params={wt=javabin&version=2} {add=[444]} 0 0
[junit4:junit4]   2> 7178 T2762 C201 UPDATE [collection1] webapp=/solr path=/update params={wt=javabin&version=2} {add=[445]} 0 0
[junit4:junit4]   2> 7182 T2764 C201 UPDATE [collection1] webapp=/solr path=/update params={wt=javabin&version=2} {add=[446]} 0 0
[junit4:junit4]   2> 7187 T2763 C201 UPDATE [collection1] webapp=/solr path=/update params={wt=javabin&version=2} {add=[447]} 0 0
[junit4:junit4]   2> 7190 T2765 C201 UPDATE [collection1] webapp=/solr path=/update params={wt=javabin&version=2} {add=[448]} 0 0
[junit4:junit4]   2> 7194 T2766 C201 UPDATE [collection1] webapp=/solr path=/update params={wt=javabin&version=2} {add=[449]} 0 0
[junit4:junit4]   2> 7198 T2761 C201 UPDATE [collection1] webapp=/solr path=/update params={wt=javabin&version=2} {add=[450]} 0 0
[junit4:junit4]   2> 7202 T2762 C201 UPDATE [collection1] webapp=/solr path=/update params={wt=javabin&version=2} {add=[451]} 0 0
[junit4:junit4]   2> 7207 T2764 C201 UPDATE [collection1] webapp=/solr path=/update params={wt=javabin&version=2} {add=[452]} 0 0
[junit4:junit4]   2> 7211 T2763 C201 UPDATE [collection1] webapp=/solr path=/update params={wt=javabin&version=2} {add=[453]} 0 0
[junit4:junit4]   2> 7216 T2765 C201 UPDATE [collection1] webapp=/solr path=/update params={wt=javabin&version=2} {add=[454]} 0 0
[junit4:junit4]   2> 7220 T2766 C201 UPDATE [collection1] webapp=/solr path=/update params={wt=javabin&version=2} {add=[455]} 0 0
[junit4:junit4]   2> 7223 T2761 C201 UPDATE [collection1] webapp=/solr path=/update params={wt=javabin&version=2} {add=[456]} 0 0
[junit4:junit4]   2> 7227 T2762 C201 UPDATE [collection1] webapp=/solr path=/update params={wt=javabin&version=2} {add=[457]} 0 0
[junit4:junit4]   2> 7231 T2764 C201 UPDATE [collection1] webapp=/solr path=/update params={wt=javabin&version=2} {add=[458]} 0 0
[junit4:junit4]   2> 7236 T2765 C201 UPDATE [collection1] webapp=/solr path=/update params={wt=javabin&version=2} {add=[459]} 0 0
[junit4:junit4]   2> 7240 T2766 C201 UPDATE [collection1] webapp=/solr path=/update params={wt=javabin&version=2} {add=[460]} 0 0
[junit4:junit4]   2> 7244 T2761 C201 UPDATE [collection1] webapp=/solr path=/update params={wt=javabin&version=2} {add=[461]} 0 0
[junit4:junit4]   2> 7249 T2762 C201 UPDATE [collection1] webapp=/solr path=/update params={wt=javabin&version=2} {add=[462]} 0 0
[junit4:junit4]   2> 7252 T2764 C201 UPDATE [collection1] webapp=/solr path=/update params={wt=javabin&version=2} {add=[463]} 0 0
[junit4:junit4]   2> 7256 T2763 C201 UPDATE [collection1] webapp=/solr path=/update params={wt=javabin&version=2} {add=[464]} 0 0
[junit4:junit4]   2> 7260 T2765 C201 UPDATE [collection1] webapp=/solr path=/update params={wt=javabin&version=2} {add=[465]} 0 0
[junit4:junit4]   2> 7264 T2766 C201 UPDATE [collection1] webapp=/solr path=/update params={wt=javabin&version=2} {add=[466]} 0 0
[junit4:junit4]   2> 7268 T2761 C201 UPDATE [collection1] webapp=/solr path=/update params={wt=javabin&version=2} {add=[467]} 0 0
[junit4:junit4]   2> 7271 T2762 C201 UPDATE [collection1] webapp=/solr path=/update params={wt=javabin&version=2} {add=[468]} 0 0
[junit4:junit4]   2> 7277 T2764 C201 UPDATE [collection1] webapp=/solr path=/update params={wt=javabin&version=2} {add=[469]} 0 0
[junit4:junit4]   2> 7280 T2763 C201 UPDATE [collection1] webapp=/solr path=/update params={wt=javabin&version=2} {add=[470]} 0 0
[junit4:junit4]   2> 7285 T2765 C201 UPDATE [collection1] webapp=/solr path=/update params={wt=javabin&version=2} {add=[471]} 0 0
[junit4:junit4]   2> 7289 T2766 C201 UPDATE [collection1] webapp=/solr path=/update params={wt=javabin&version=2} {add=[472]} 0 0
[junit4:junit4]   2> 7294 T2761 C201 UPDATE [collection1] webapp=/solr path=/update params={wt=javabin&version=2} {add=[473]} 0 0
[junit4:junit4]   2> 7299 T2762 C201 UPDATE [collection1] webapp=/solr path=/update params={wt=javabin&version=2} {add=[474]} 0 0
[junit4:junit4]   2> 7303 T2764 C201 UPDATE [collection1] webapp=/solr path=/update params={wt=javabin&version=2} {add=[475]} 0 0
[junit4:junit4]   2> 7307 T2763 C201 UPDATE [collection1] webapp=/solr path=/update params={wt=javabin&version=2} {add=[476]} 0 0
[junit4:junit4]   2> 7312 T2765 C201 UPDATE [collection1] webapp=/solr path=/update params={wt=javabin&version=2} {add=[477]} 0 0
[junit4:junit4]   2> 7316 T2766 C201 UPDATE [collection1] webapp=/solr path=/update params={wt=javabin&version=2} {add=[478]} 0 0
[junit4:junit4]   2> 7320 T2761 C201 UPDATE [collection1] webapp=/solr path=/update params={wt=javabin&version=2} {add=[479]} 0 0
[junit4:junit4]   2> 7323 T2762 C201 UPDATE [collection1] webapp=/solr path=/update params={wt=javabin&version=2} {add=[480]} 0 0
[junit4:junit4]   2> 7327 T2764 C201 UPDATE [collection1] webapp=/solr path=/update params={wt=javabin&version=2} {add=[481]} 0 0
[junit4:junit4]   2> 7331 T2763 C201 UPDATE [collection1] webapp=/solr path=/update params={wt=javabin&version=2} {add=[482]} 0 0
[junit4:junit4]   2> 7335 T2765 C201 UPDATE [collection1] webapp=/solr path=/update params={wt=javabin&version=2} {add=[483]} 0 0
[junit4:junit4]   2> 7340 T2766 C201 UPDATE [collection1] webapp=/solr path=/update params={wt=javabin&version=2} {add=[484]} 0 0
[junit4:junit4]   2> 7344 T2761 C201 UPDATE [collection1] webapp=/solr path=/update params={wt=javabin&version=2} {add=[485]} 0 0
[junit4:junit4]   2> 7348 T2762 C201 UPDATE [collection1] webapp=/solr path=/update params={wt=javabin&version=2} {add=[486]} 0 0
[junit4:junit4]   2> 7351 T2764 C201 UPDATE [collection1] webapp=/solr path=/update params={wt=javabin&version=2} {add=[487]} 0 0
[junit4:junit4]   2> 7356 T2763 C201 UPDATE [collection1] webapp=/solr path=/update params={wt=javabin&version=2} {add=[488]} 0 0
[junit4:junit4]   2> 7360 T2765 C201 UPDATE [collection1] webapp=/solr path=/update params={wt=javabin&version=2} {add=[489]} 0 0
[junit4:junit4]   2> 7364 T2766 C201 UPDATE [collection1] webapp=/solr path=/update params={wt=javabin&version=2} {add=[490]} 0 0
[junit4:junit4]   2> 7369 T2761 C201 UPDATE [collection1] webapp=/solr path=/update params={wt=javabin&version=2} {add=[491]} 0 0
[junit4:junit4]   2> 7373 T2762 C201 UPDATE [collection1] webapp=/solr path=/update params={wt=javabin&version=2} {add=[492]} 0 0
[junit4:junit4]   2> 7377 T2764 C201 UPDATE [collection1] webapp=/solr path=/update params={wt=javabin&version=2} {add=[493]} 0 0
[junit4:junit4]   2> 7382 T2763 C201 UPDATE [collection1] webapp=/solr path=/update params={wt=javabin&version=2} {add=[494]} 0 0
[junit4:junit4]   2> 7386 T2765 C201 UPDATE [collection1] webapp=/solr path=/update params={wt=javabin&version=2} {add=[495]} 0 0
[junit4:junit4]   2> 7389 T2766 C201 UPDATE [collection1] webapp=/solr path=/update params={wt=javabin&version=2} {add=[496]} 0 0
[junit4:junit4]   2> 7393 T2761 C201 UPDATE [collection1] webapp=/solr path=/update params={wt=javabin&version=2} {add=[497]} 0 0
[junit4:junit4]   2> 7397 T2762 C201 UPDATE [collection1] webapp=/solr path=/update params={wt=javabin&version=2} {add=[498]} 0 0
[junit4:junit4]   2> 7401 T2764 C201 REQ [collection1] webapp=/solr path=/replication params={command=disableReplication} status=0 QTime=0 
[junit4:junit4]   2> 7405 T2763 C201 oasu.DirectUpdateHandler2.commit start commit{flags=0,_version_=0,optimize=false,openSearcher=true,waitSearcher=true,expungeDeletes=false,softCommit=false}
[junit4:junit4]   2> 7425 T2763 C201 oasc.SolrDeletionPolicy.onCommit SolrDeletionPolicy.onCommit: commits:num=2
[junit4:junit4]   2> 		commit{dir=MockDirWrapper(org.apache.lucene.store.NIOFSDirectory@C:\Users\JenkinsSlave\workspace\Lucene-Solr-trunk-Windows\solr\build\solr-core\test\J0\index3169331699tmp lockFactory=org.apache.lucene.store.SingleInstanceLockFactory@c6a676),segFN=segments_1,generation=1,filenames=[segments_1]
[junit4:junit4]   2> 		commit{dir=MockDirWrapper(org.apache.lucene.store.NIOFSDirectory@C:\Users\JenkinsSlave\workspace\Lucene-Solr-trunk-Windows\solr\build\solr-core\test\J0\index3169331699tmp lockFactory=org.apache.lucene.store.SingleInstanceLockFactory@c6a676),segFN=segments_2,generation=2,filenames=[_0_1.len, _0_0.len, segments_2, _0.inf, _0.si, _0.pst, _0.fld]
[junit4:junit4]   2> 7426 T2763 C201 oasc.SolrDeletionPolicy.updateCommits newest commit = 2[_0_1.len, _0_0.len, segments_2, _0.inf, _0.si, _0.pst, _0.fld]
[junit4:junit4]   2> 7427 T2763 C201 oasc.CachingDirectoryFactory.close Releasing directory:C:\Users\JenkinsSlave\workspace\Lucene-Solr-trunk-Windows\solr\build\solr-core\test\J0\.\org.apache.solr.handler.TestReplicationHandler$SolrInstance-1351332128579\master\collection1\data
[junit4:junit4]   2> 7440 T2763 C201 oass.SolrIndexSearcher.<init> Opening Searcher@176db45 main
[junit4:junit4]   2> 7440 T2763 C201 oasu.DirectUpdateHandler2.commit end_commit_flush
[junit4:junit4]   2> 7440 T2767 oasc.SolrCore.registerSearcher [collection1] Registered new searcher Searcher@176db45 main{StandardDirectoryReader(segments_2:3 _0(5.0):C499)}
[junit4:junit4]   2> 7441 T2767 oasc.CachingDirectoryFactory.close Releasing directory:C:\Users\JenkinsSlave\workspace\Lucene-Solr-trunk-Windows\solr\build\solr-core\test\J0\.\org.apache.solr.handler.TestReplicationHandler$SolrInstance-1351332128579\master\collection1\data\index
[junit4:junit4]   2> 7441 T2763 C201 UPDATE [collection1] webapp=/solr path=/update params={waitSearcher=true&wt=javabin&commit=true&softCommit=false&version=2} {commit=} 0 36
[junit4:junit4]   2> 7445 T2765 C201 REQ [collection1] webapp=/solr path=/select params={wt=javabin&q=*:*&version=2} hits=499 status=0 QTime=0 
[junit4:junit4]   2> 7581 T2771 C202 oasc.CachingDirectoryFactory.close Releasing director

[...truncated too long message...]

IgnoreAfterMaxFailures$1.evaluate(TestRuleIgnoreAfterMaxFailures.java:70)
[junit4:junit4]    > 	at org.apache.lucene.util.TestRuleMarkFailure$1.evaluate(TestRuleMarkFailure.java:48)
[junit4:junit4]    > 	at com.carrotsearch.randomizedtesting.rules.StatementAdapter.evaluate(StatementAdapter.java:36)
[junit4:junit4]    > 	at com.carrotsearch.randomizedtesting.ThreadLeakControl$StatementRunner.run(ThreadLeakControl.java:358)
[junit4:junit4]    > 	at com.carrotsearch.randomizedtesting.ThreadLeakControl.forkTimeoutingTask(ThreadLeakControl.java:782)
[junit4:junit4]    > 	at com.carrotsearch.randomizedtesting.ThreadLeakControl$3.evaluate(ThreadLeakControl.java:442)
[junit4:junit4]    > 	at com.carrotsearch.randomizedtesting.RandomizedRunner.runSingleTest(RandomizedRunner.java:746)
[junit4:junit4]    > 	at com.carrotsearch.randomizedtesting.RandomizedRunner$3.evaluate(RandomizedRunner.java:648)
[junit4:junit4]    > 	at com.carrotsearch.randomizedtesting.RandomizedRunner$4.evaluate(RandomizedRunner.java:682)
[junit4:junit4]    > 	at com.carrotsearch.randomizedtesting.RandomizedRunner$5.evaluate(RandomizedRunner.java:693)
[junit4:junit4]    > 	at com.carrotsearch.randomizedtesting.rules.StatementAdapter.evaluate(StatementAdapter.java:36)
[junit4:junit4]    > 	at com.carrotsearch.randomizedtesting.rules.SystemPropertiesRestoreRule$1.evaluate(SystemPropertiesRestoreRule.java:53)
[junit4:junit4]    > 	at org.apache.lucene.util.AbstractBeforeAfterRule$1.evaluate(AbstractBeforeAfterRule.java:45)
[junit4:junit4]    > 	at org.apache.lucene.util.TestRuleStoreClassName$1.evaluate(TestRuleStoreClassName.java:42)
[junit4:junit4]    > 	at com.carrotsearch.randomizedtesting.rules.SystemPropertiesInvariantRule$1.evaluate(SystemPropertiesInvariantRule.java:55)
[junit4:junit4]    > 	at com.carrotsearch.randomizedtesting.rules.NoShadowingOrOverridesOnMethodsRule$1.evaluate(NoShadowingOrOverridesOnMethodsRule.java:39)
[junit4:junit4]    > 	at com.carrotsearch.randomizedtesting.rules.NoShadowingOrOverridesOnMethodsRule$1.evaluate(NoShadowingOrOverridesOnMethodsRule.java:39)
[junit4:junit4]    > 	at com.carrotsearch.randomizedtesting.rules.StatementAdapter.evaluate(StatementAdapter.java:36)
[junit4:junit4]    > 	at org.apache.lucene.util.TestRuleAssertionsRequired$1.evaluate(TestRuleAssertionsRequired.java:43)
[junit4:junit4]    > 	at org.apache.lucene.util.TestRuleMarkFailure$1.evaluate(TestRuleMarkFailure.java:48)
[junit4:junit4]    > 	at org.apache.lucene.util.TestRuleIgnoreAfterMaxFailures$1.evaluate(TestRuleIgnoreAfterMaxFailures.java:70)
[junit4:junit4]    > 	at org.apache.lucene.util.TestRuleIgnoreTestSuites$1.evaluate(TestRuleIgnoreTestSuites.java:55)
[junit4:junit4]    > 	at com.carrotsearch.randomizedtesting.rules.StatementAdapter.evaluate(StatementAdapter.java:36)
[junit4:junit4]    > 	at com.carrotsearch.randomizedtesting.ThreadLeakControl$StatementRunner.run(ThreadLeakControl.java:358)
[junit4:junit4]    > 	at java.lang.Thread.run(Thread.java:722)
[junit4:junit4]   2> 43252 T3666 oas.SolrTestCaseJ4.deleteCore ###deleteCore
[junit4:junit4]   2> NOTE: test params are: codec=Lucene41: {range_facet_l=MockVariableIntBlock(baseBlockSize=88), text=PostingsFormat(name=Direct), _version_=MockVariableIntBlock(baseBlockSize=88), rnd_b=Pulsing41(freqCutoff=20 minBlockSize=84 maxBlockSize=179), intDefault=MockVariableIntBlock(baseBlockSize=88), timestamp=MockVariableIntBlock(baseBlockSize=88), id=Pulsing41(freqCutoff=20 minBlockSize=84 maxBlockSize=179), a_t=MockVariableIntBlock(baseBlockSize=88), range_facet_sl=PostingsFormat(name=Direct), range_facet_si=PostingsFormat(name=MockRandom), other_tl1=MockVariableIntBlock(baseBlockSize=88), multiDefault=PostingsFormat(name=MockRandom), a_si=PostingsFormat(name=MockRandom)}, sim=RandomSimilarityProvider(queryNorm=false,coord=crazy): {}, locale=es_NI, timezone=America/Indiana/Tell_City
[junit4:junit4]   2> NOTE: Windows 7 6.1 x86/Oracle Corporation 1.7.0_07 (32-bit)/cpus=2,threads=1,free=115334712,total=263192576
[junit4:junit4]   2> NOTE: All tests run in this JVM: [ResponseLogComponentTest, PluginInfoTest, PeerSyncTest, TestCollationField, TestStressLucene, TestSolrIndexConfig, TestJmxIntegration, TestBadConfig, SolrCoreCheckLockOnStartupTest, CopyFieldTest, DirectSolrSpellCheckerTest, TestJoin, DateFieldTest, TestLRUCache, DOMUtilTest, CoreAdminHandlerTest, NumericFieldsTest, TermVectorComponentTest, SuggesterWFSTTest, AnalysisAfterCoreReloadTest, TestSearchPerf, TestBinaryResponseWriter, ZkNodePropsTest, TestDistributedGrouping, IndexBasedSpellCheckerTest, TestConfig, SolrRequestParserTest, ResourceLoaderTest, TestPerFieldSimilarity, BadIndexSchemaTest, PathHierarchyTokenizerFactoryTest, OutputWriterTest, SortByFunctionTest, UpdateRequestProcessorFactoryTest, TestJmxMonitoredMap, TestFunctionQuery, ShowFileRequestHandlerTest, TestLMDirichletSimilarityFactory, TestGroupingSearch, RecoveryZkTest, TestCharFilters, ClusterStateTest, RAMDirectoryFactoryTest, TestAnalyzedSuggestions, TestFastLRUCache, TestLFUCache, DirectUpdateHandlerTest, TestPHPSerializedResponseWriter, TestSuggestSpellingConverter, BasicFunctionalityTest, DistanceFunctionTest, TestRemoteStreaming, TestStressReorder, TestSolr4Spatial, DateMathParserTest, ReturnFieldsTest, TestReload, ConvertedLegacyTest, StatelessScriptUpdateProcessorFactoryTest, TestRandomFaceting, TestSolrCoreProperties, DistributedTermsComponentTest, DistributedSpellCheckComponentTest, IndexReaderFactoryTest, TestOmitPositions, PingRequestHandlerTest, TermVectorComponentDistributedTest, BasicDistributedZk2Test, TestReversedWildcardFilterFactory, TestDocumentBuilder, FileBasedSpellCheckerTest, NoCacheHeaderTest, ScriptEngineTest, UniqFieldsUpdateProcessorFactoryTest, IndexSchemaTest, SoftAutoCommitTest, XsltUpdateRequestHandlerTest, TestPropInjectDefaults, SuggesterTest, BasicDistributedZkTest, MultiTermTest, DirectSolrConnectionTest, MinimalSchemaTest, TestRangeQuery, RequestHandlersTest, DebugComponentTest, UpdateParamsTest, TestSystemIdResolver, TestIndexSearcher, TestDFRSimilarityFactory, TestElisionMultitermQuery, TestMultiCoreConfBootstrap, SolrCmdDistributorTest, StatsComponentTest, WordBreakSolrSpellCheckerTest, ZkSolrClientTest, OpenExchangeRatesOrgProviderTest, TestQuerySenderNoQuery, AutoCommitTest, TestFoldingMultitermQuery, TermsComponentTest, PolyFieldTest, TestDistributedSearch, TestArbitraryIndexDir, SpellCheckCollatorTest, DisMaxRequestHandlerTest, TestDocSet, TestFaceting, BinaryUpdateRequestHandlerTest, OverseerTest, SpellCheckComponentTest, FullSolrCloudDistribCmdsTest, TestReplicationHandler, LeaderElectionIntegrationTest, LeaderElectionTest, TestRealTimeGet, ZkControllerTest, TestExtendedDismaxParser, BasicZkTest, TestHashPartitioner, TestRecovery, SolrCoreTest, SimpleFacetsTest, TestCoreContainer, LukeRequestHandlerTest, TestSort, TestFiltering, QueryElevationComponentTest, SignatureUpdateProcessorFactoryTest, SampleTest, HighlighterTest, TestTrie, CacheHeaderTest, QueryEqualityTest, TestWordDelimiterFilterFactory, TestCSVLoader, SpatialFilterTest, TestCSVResponseWriter, MoreLikeThisHandlerTest, DocumentBuilderTest, MBeansHandlerTest, DistributedQueryElevationComponentTest, CurrencyFieldTest, TestPseudoReturnFields, QueryParsingTest, SolrInfoMBeanTest, StandardRequestHandlerTest, TestQueryTypes, XmlUpdateRequestHandlerTest, FieldAnalysisRequestHandlerTest, JsonLoaderTest, TestSurroundQueryParser, DocumentAnalysisRequestHandlerTest, DirectUpdateHandlerOptimizeTest, IndexSchemaRuntimeFieldTest, TestSolrQueryParser, SolrPluginUtilsTest, TestValueSourceCache, FastVectorHighlighterTest, JSONWriterTest, SearchHandlerTest, RequiredFieldsTest, SuggesterFSTTest, TestQueryUtils, LoggingHandlerTest, SuggesterTSTTest, CSVRequestHandlerTest, NotRequiredUniqueKeyTest, TestSolrDeletionPolicy1, TestLuceneMatchVersion, TestPropInject, TestWriterPerf, TestIndexingPerformance, PrimitiveFieldTypeTest, AlternateDirectoryTest, FieldMutatingUpdateProcessorTest, BadComponentTest, TestUpdate, TestBinaryField, HighlighterConfigTest, TestSolrDeletionPolicy2, SOLR749Test, DefaultValueUpdateProcessorTest, TestMergePolicyConfig, TestXIncludeConfig, TestQuerySenderListener, SolrIndexConfigTest, TestNumberUtils, EchoParamsTest, SpellPossibilityIteratorTest, TestBM25SimilarityFactory, TestPhraseSuggestions, TestPluginEnable, LegacyHTMLStripCharFilterTest, TestLMJelinekMercerSimilarityFactory, TestIBSimilarityFactory, TestCodecSupport, TestDefaultSimilarityFactory, TimeZoneUtilsTest, URLClassifyProcessorTest, PrimUtilsTest, FileUtilsTest, TestSolrXMLSerializer, SpellingQueryConverterTest, UUIDFieldTest, SystemInfoHandlerTest, TestUtils, PreAnalyzedFieldTest, CircularListTest, ClusterStateUpdateTest, SyncSliceTest]
[junit4:junit4] Completed in 43.28s, 1 test, 1 failure <<< FAILURES!

[...truncated 39 lines...]
BUILD FAILED
C:\Users\JenkinsSlave\workspace\Lucene-Solr-trunk-Windows\build.xml:335: The following error occurred while executing this line:
C:\Users\JenkinsSlave\workspace\Lucene-Solr-trunk-Windows\build.xml:39: The following error occurred while executing this line:
C:\Users\JenkinsSlave\workspace\Lucene-Solr-trunk-Windows\solr\build.xml:178: The following error occurred while executing this line:
C:\Users\JenkinsSlave\workspace\Lucene-Solr-trunk-Windows\lucene\module-build.xml:61: The following error occurred while executing this line:
C:\Users\JenkinsSlave\workspace\Lucene-Solr-trunk-Windows\lucene\common-build.xml:1159: The following error occurred while executing this line:
C:\Users\JenkinsSlave\workspace\Lucene-Solr-trunk-Windows\lucene\common-build.xml:827: There were test failures: 232 suites, 961 tests, 2 suite-level errors, 1 failure, 12 ignored (7 assumptions)

Total time: 42 minutes 41 seconds
Build step 'Invoke Ant' marked build as failure
Archiving artifacts
Recording test results
Description set: Java: 32bit/jdk1.7.0_07 -client -XX:+UseG1GC
Email was triggered for: Failure
Sending email for trigger: Failure



Mime
View raw message