lucene-dev mailing list archives

Site index · List index
Message view « Date » · « Thread »
Top « Date » · « Thread »
From Policeman Jenkins Server <jenk...@sd-datasolutions.de>
Subject [JENKINS] Lucene-Solr-trunk-Windows (64bit/jdk1.7.0_07) - Build # 1318 - Still Failing!
Date Fri, 26 Oct 2012 22:53:45 GMT
Build: http://jenkins.sd-datasolutions.de/job/Lucene-Solr-trunk-Windows/1318/
Java: 64bit/jdk1.7.0_07 -XX:+UseSerialGC

4 tests failed.
FAILED:  org.apache.solr.cloud.BasicDistributedZk2Test.testDistribSearch

Error Message:
Shard still reported as live in zk - 0 jetty

Stack Trace:
java.lang.AssertionError: Shard still reported as live in zk - 0 jetty
	at __randomizedtesting.SeedInfo.seed([3D2BA9D3178A6ACE:BCCD27CB60D50AF2]:0)
	at org.junit.Assert.fail(Assert.java:93)
	at org.apache.solr.cloud.AbstractFullDistribZkTestBase.waitToSeeNotLive(AbstractFullDistribZkTestBase.java:1231)
	at org.apache.solr.cloud.BasicDistributedZk2Test.brindDownShardIndexSomeDocsAndRecover(BasicDistributedZk2Test.java:217)
	at org.apache.solr.cloud.BasicDistributedZk2Test.doTest(BasicDistributedZk2Test.java:92)
	at org.apache.solr.BaseDistributedSearchTestCase.testDistribSearch(BaseDistributedSearchTestCase.java:695)
	at sun.reflect.NativeMethodAccessorImpl.invoke0(Native Method)
	at sun.reflect.NativeMethodAccessorImpl.invoke(NativeMethodAccessorImpl.java:57)
	at sun.reflect.DelegatingMethodAccessorImpl.invoke(DelegatingMethodAccessorImpl.java:43)
	at java.lang.reflect.Method.invoke(Method.java:601)
	at com.carrotsearch.randomizedtesting.RandomizedRunner.invoke(RandomizedRunner.java:1559)
	at com.carrotsearch.randomizedtesting.RandomizedRunner.access$600(RandomizedRunner.java:79)
	at com.carrotsearch.randomizedtesting.RandomizedRunner$6.evaluate(RandomizedRunner.java:737)
	at com.carrotsearch.randomizedtesting.RandomizedRunner$7.evaluate(RandomizedRunner.java:773)
	at com.carrotsearch.randomizedtesting.RandomizedRunner$8.evaluate(RandomizedRunner.java:787)
	at com.carrotsearch.randomizedtesting.rules.SystemPropertiesRestoreRule$1.evaluate(SystemPropertiesRestoreRule.java:53)
	at org.apache.lucene.util.TestRuleSetupTeardownChained$1.evaluate(TestRuleSetupTeardownChained.java:50)
	at org.apache.lucene.util.TestRuleFieldCacheSanity$1.evaluate(TestRuleFieldCacheSanity.java:51)
	at org.apache.lucene.util.AbstractBeforeAfterRule$1.evaluate(AbstractBeforeAfterRule.java:45)
	at com.carrotsearch.randomizedtesting.rules.SystemPropertiesInvariantRule$1.evaluate(SystemPropertiesInvariantRule.java:55)
	at org.apache.lucene.util.TestRuleThreadAndTestName$1.evaluate(TestRuleThreadAndTestName.java:48)
	at org.apache.lucene.util.TestRuleIgnoreAfterMaxFailures$1.evaluate(TestRuleIgnoreAfterMaxFailures.java:70)
	at org.apache.lucene.util.TestRuleMarkFailure$1.evaluate(TestRuleMarkFailure.java:48)
	at com.carrotsearch.randomizedtesting.rules.StatementAdapter.evaluate(StatementAdapter.java:36)
	at com.carrotsearch.randomizedtesting.ThreadLeakControl$StatementRunner.run(ThreadLeakControl.java:358)
	at com.carrotsearch.randomizedtesting.ThreadLeakControl.forkTimeoutingTask(ThreadLeakControl.java:782)
	at com.carrotsearch.randomizedtesting.ThreadLeakControl$3.evaluate(ThreadLeakControl.java:442)
	at com.carrotsearch.randomizedtesting.RandomizedRunner.runSingleTest(RandomizedRunner.java:746)
	at com.carrotsearch.randomizedtesting.RandomizedRunner$3.evaluate(RandomizedRunner.java:648)
	at com.carrotsearch.randomizedtesting.RandomizedRunner$4.evaluate(RandomizedRunner.java:682)
	at com.carrotsearch.randomizedtesting.RandomizedRunner$5.evaluate(RandomizedRunner.java:693)
	at com.carrotsearch.randomizedtesting.rules.StatementAdapter.evaluate(StatementAdapter.java:36)
	at com.carrotsearch.randomizedtesting.rules.SystemPropertiesRestoreRule$1.evaluate(SystemPropertiesRestoreRule.java:53)
	at org.apache.lucene.util.AbstractBeforeAfterRule$1.evaluate(AbstractBeforeAfterRule.java:45)
	at org.apache.lucene.util.TestRuleStoreClassName$1.evaluate(TestRuleStoreClassName.java:42)
	at com.carrotsearch.randomizedtesting.rules.SystemPropertiesInvariantRule$1.evaluate(SystemPropertiesInvariantRule.java:55)
	at com.carrotsearch.randomizedtesting.rules.NoShadowingOrOverridesOnMethodsRule$1.evaluate(NoShadowingOrOverridesOnMethodsRule.java:39)
	at com.carrotsearch.randomizedtesting.rules.NoShadowingOrOverridesOnMethodsRule$1.evaluate(NoShadowingOrOverridesOnMethodsRule.java:39)
	at com.carrotsearch.randomizedtesting.rules.StatementAdapter.evaluate(StatementAdapter.java:36)
	at org.apache.lucene.util.TestRuleAssertionsRequired$1.evaluate(TestRuleAssertionsRequired.java:43)
	at org.apache.lucene.util.TestRuleMarkFailure$1.evaluate(TestRuleMarkFailure.java:48)
	at org.apache.lucene.util.TestRuleIgnoreAfterMaxFailures$1.evaluate(TestRuleIgnoreAfterMaxFailures.java:70)
	at org.apache.lucene.util.TestRuleIgnoreTestSuites$1.evaluate(TestRuleIgnoreTestSuites.java:55)
	at com.carrotsearch.randomizedtesting.rules.StatementAdapter.evaluate(StatementAdapter.java:36)
	at com.carrotsearch.randomizedtesting.ThreadLeakControl$StatementRunner.run(ThreadLeakControl.java:358)
	at java.lang.Thread.run(Thread.java:722)


FAILED:  org.apache.solr.cloud.SyncSliceTest.testDistribSearch

Error Message:
Shard still reported as live in zk - 0 jetty

Stack Trace:
java.lang.AssertionError: Shard still reported as live in zk - 0 jetty
	at __randomizedtesting.SeedInfo.seed([3D2BA9D3178A6ACE:BCCD27CB60D50AF2]:0)
	at org.junit.Assert.fail(Assert.java:93)
	at org.apache.solr.cloud.AbstractFullDistribZkTestBase.waitToSeeNotLive(AbstractFullDistribZkTestBase.java:1231)
	at org.apache.solr.cloud.AbstractFullDistribZkTestBase.waitToSeeNotLive(AbstractFullDistribZkTestBase.java:1216)
	at org.apache.solr.cloud.SyncSliceTest.waitToSeeDownInClusterState(SyncSliceTest.java:259)
	at org.apache.solr.cloud.SyncSliceTest.doTest(SyncSliceTest.java:163)
	at org.apache.solr.BaseDistributedSearchTestCase.testDistribSearch(BaseDistributedSearchTestCase.java:695)
	at sun.reflect.NativeMethodAccessorImpl.invoke0(Native Method)
	at sun.reflect.NativeMethodAccessorImpl.invoke(NativeMethodAccessorImpl.java:57)
	at sun.reflect.DelegatingMethodAccessorImpl.invoke(DelegatingMethodAccessorImpl.java:43)
	at java.lang.reflect.Method.invoke(Method.java:601)
	at com.carrotsearch.randomizedtesting.RandomizedRunner.invoke(RandomizedRunner.java:1559)
	at com.carrotsearch.randomizedtesting.RandomizedRunner.access$600(RandomizedRunner.java:79)
	at com.carrotsearch.randomizedtesting.RandomizedRunner$6.evaluate(RandomizedRunner.java:737)
	at com.carrotsearch.randomizedtesting.RandomizedRunner$7.evaluate(RandomizedRunner.java:773)
	at com.carrotsearch.randomizedtesting.RandomizedRunner$8.evaluate(RandomizedRunner.java:787)
	at com.carrotsearch.randomizedtesting.rules.SystemPropertiesRestoreRule$1.evaluate(SystemPropertiesRestoreRule.java:53)
	at org.apache.lucene.util.TestRuleSetupTeardownChained$1.evaluate(TestRuleSetupTeardownChained.java:50)
	at org.apache.lucene.util.TestRuleFieldCacheSanity$1.evaluate(TestRuleFieldCacheSanity.java:51)
	at org.apache.lucene.util.AbstractBeforeAfterRule$1.evaluate(AbstractBeforeAfterRule.java:45)
	at com.carrotsearch.randomizedtesting.rules.SystemPropertiesInvariantRule$1.evaluate(SystemPropertiesInvariantRule.java:55)
	at org.apache.lucene.util.TestRuleThreadAndTestName$1.evaluate(TestRuleThreadAndTestName.java:48)
	at org.apache.lucene.util.TestRuleIgnoreAfterMaxFailures$1.evaluate(TestRuleIgnoreAfterMaxFailures.java:70)
	at org.apache.lucene.util.TestRuleMarkFailure$1.evaluate(TestRuleMarkFailure.java:48)
	at com.carrotsearch.randomizedtesting.rules.StatementAdapter.evaluate(StatementAdapter.java:36)
	at com.carrotsearch.randomizedtesting.ThreadLeakControl$StatementRunner.run(ThreadLeakControl.java:358)
	at com.carrotsearch.randomizedtesting.ThreadLeakControl.forkTimeoutingTask(ThreadLeakControl.java:782)
	at com.carrotsearch.randomizedtesting.ThreadLeakControl$3.evaluate(ThreadLeakControl.java:442)
	at com.carrotsearch.randomizedtesting.RandomizedRunner.runSingleTest(RandomizedRunner.java:746)
	at com.carrotsearch.randomizedtesting.RandomizedRunner$3.evaluate(RandomizedRunner.java:648)
	at com.carrotsearch.randomizedtesting.RandomizedRunner$4.evaluate(RandomizedRunner.java:682)
	at com.carrotsearch.randomizedtesting.RandomizedRunner$5.evaluate(RandomizedRunner.java:693)
	at com.carrotsearch.randomizedtesting.rules.StatementAdapter.evaluate(StatementAdapter.java:36)
	at com.carrotsearch.randomizedtesting.rules.SystemPropertiesRestoreRule$1.evaluate(SystemPropertiesRestoreRule.java:53)
	at org.apache.lucene.util.AbstractBeforeAfterRule$1.evaluate(AbstractBeforeAfterRule.java:45)
	at org.apache.lucene.util.TestRuleStoreClassName$1.evaluate(TestRuleStoreClassName.java:42)
	at com.carrotsearch.randomizedtesting.rules.SystemPropertiesInvariantRule$1.evaluate(SystemPropertiesInvariantRule.java:55)
	at com.carrotsearch.randomizedtesting.rules.NoShadowingOrOverridesOnMethodsRule$1.evaluate(NoShadowingOrOverridesOnMethodsRule.java:39)
	at com.carrotsearch.randomizedtesting.rules.NoShadowingOrOverridesOnMethodsRule$1.evaluate(NoShadowingOrOverridesOnMethodsRule.java:39)
	at com.carrotsearch.randomizedtesting.rules.StatementAdapter.evaluate(StatementAdapter.java:36)
	at org.apache.lucene.util.TestRuleAssertionsRequired$1.evaluate(TestRuleAssertionsRequired.java:43)
	at org.apache.lucene.util.TestRuleMarkFailure$1.evaluate(TestRuleMarkFailure.java:48)
	at org.apache.lucene.util.TestRuleIgnoreAfterMaxFailures$1.evaluate(TestRuleIgnoreAfterMaxFailures.java:70)
	at org.apache.lucene.util.TestRuleIgnoreTestSuites$1.evaluate(TestRuleIgnoreTestSuites.java:55)
	at com.carrotsearch.randomizedtesting.rules.StatementAdapter.evaluate(StatementAdapter.java:36)
	at com.carrotsearch.randomizedtesting.ThreadLeakControl$StatementRunner.run(ThreadLeakControl.java:358)
	at java.lang.Thread.run(Thread.java:722)


FAILED:  junit.framework.TestSuite.org.apache.solr.handler.TestReplicationHandler

Error Message:
Resource in scope SUITE failed to close. Resource was registered from thread Thread[id=2156, name=TEST-TestReplicationHandler.test-seed#[3D2BA9D3178A6ACE], state=RUNNABLE, group=TGRP-TestReplicationHandler], registration stack trace below.

Stack Trace:
com.carrotsearch.randomizedtesting.ResourceDisposalError: Resource in scope SUITE failed to close. Resource was registered from thread Thread[id=2156, name=TEST-TestReplicationHandler.test-seed#[3D2BA9D3178A6ACE], state=RUNNABLE, group=TGRP-TestReplicationHandler], registration stack trace below.
	at java.lang.Thread.getStackTrace(Thread.java:1567)
	at com.carrotsearch.randomizedtesting.RandomizedContext.closeAtEnd(RandomizedContext.java:150)
	at org.apache.lucene.util.LuceneTestCase.closeAfterSuite(LuceneTestCase.java:514)
	at org.apache.lucene.util.LuceneTestCase.wrapDirectory(LuceneTestCase.java:958)
	at org.apache.lucene.util.LuceneTestCase.newDirectory(LuceneTestCase.java:872)
	at org.apache.lucene.util.LuceneTestCase.newDirectory(LuceneTestCase.java:864)
	at org.apache.solr.core.MockDirectoryFactory.create(MockDirectoryFactory.java:33)
	at org.apache.solr.core.CachingDirectoryFactory.get(CachingDirectoryFactory.java:221)
	at org.apache.solr.update.SolrIndexWriter.create(SolrIndexWriter.java:60)
	at org.apache.solr.core.SolrCore.initIndex(SolrCore.java:502)
	at org.apache.solr.core.SolrCore.<init>(SolrCore.java:705)
	at org.apache.solr.core.SolrCore.<init>(SolrCore.java:618)
	at org.apache.solr.core.CoreContainer.create(CoreContainer.java:842)
	at org.apache.solr.core.CoreContainer.load(CoreContainer.java:529)
	at org.apache.solr.core.CoreContainer$Initializer.initialize(CoreContainer.java:306)
	at org.apache.solr.servlet.SolrDispatchFilter.init(SolrDispatchFilter.java:107)
	at org.eclipse.jetty.servlet.FilterHolder.doStart(FilterHolder.java:114)
	at org.eclipse.jetty.util.component.AbstractLifeCycle.start(AbstractLifeCycle.java:59)
	at org.eclipse.jetty.servlet.ServletHandler.initialize(ServletHandler.java:754)
	at org.eclipse.jetty.servlet.ServletHandler.updateMappings(ServletHandler.java:1227)
	at org.eclipse.jetty.servlet.ServletHandler.setFilterMappings(ServletHandler.java:1263)
	at org.eclipse.jetty.servlet.ServletHandler.addFilterWithMapping(ServletHandler.java:965)
	at org.eclipse.jetty.servlet.ServletHandler.addFilterWithMapping(ServletHandler.java:923)
	at org.eclipse.jetty.servlet.ServletContextHandler.addFilter(ServletContextHandler.java:333)
	at org.apache.solr.client.solrj.embedded.JettySolrRunner$1.lifeCycleStarted(JettySolrRunner.java:173)
	at org.eclipse.jetty.util.component.AbstractLifeCycle.setStarted(AbstractLifeCycle.java:169)
	at org.eclipse.jetty.util.component.AbstractLifeCycle.start(AbstractLifeCycle.java:60)
	at org.apache.solr.client.solrj.embedded.JettySolrRunner.start(JettySolrRunner.java:225)
	at org.apache.solr.client.solrj.embedded.JettySolrRunner.start(JettySolrRunner.java:205)
	at org.apache.solr.handler.TestReplicationHandler.createJetty(TestReplicationHandler.java:131)
	at org.apache.solr.handler.TestReplicationHandler.doTestIndexAndConfigReplication(TestReplicationHandler.java:410)
	at org.apache.solr.handler.TestReplicationHandler.test(TestReplicationHandler.java:254)
	at sun.reflect.NativeMethodAccessorImpl.invoke0(Native Method)
	at sun.reflect.NativeMethodAccessorImpl.invoke(NativeMethodAccessorImpl.java:57)
	at sun.reflect.DelegatingMethodAccessorImpl.invoke(DelegatingMethodAccessorImpl.java:43)
	at java.lang.reflect.Method.invoke(Method.java:601)
	at com.carrotsearch.randomizedtesting.RandomizedRunner.invoke(RandomizedRunner.java:1559)
	at com.carrotsearch.randomizedtesting.RandomizedRunner.access$600(RandomizedRunner.java:79)
	at com.carrotsearch.randomizedtesting.RandomizedRunner$6.evaluate(RandomizedRunner.java:737)
	at com.carrotsearch.randomizedtesting.RandomizedRunner$7.evaluate(RandomizedRunner.java:773)
	at com.carrotsearch.randomizedtesting.RandomizedRunner$8.evaluate(RandomizedRunner.java:787)
	at com.carrotsearch.randomizedtesting.rules.SystemPropertiesRestoreRule$1.evaluate(SystemPropertiesRestoreRule.java:53)
	at org.apache.lucene.util.TestRuleSetupTeardownChained$1.evaluate(TestRuleSetupTeardownChained.java:50)
	at org.apache.lucene.util.TestRuleFieldCacheSanity$1.evaluate(TestRuleFieldCacheSanity.java:51)
	at org.apache.lucene.util.AbstractBeforeAfterRule$1.evaluate(AbstractBeforeAfterRule.java:45)
	at com.carrotsearch.randomizedtesting.rules.SystemPropertiesInvariantRule$1.evaluate(SystemPropertiesInvariantRule.java:55)
	at org.apache.lucene.util.TestRuleThreadAndTestName$1.evaluate(TestRuleThreadAndTestName.java:48)
	at org.apache.lucene.util.TestRuleIgnoreAfterMaxFailures$1.evaluate(TestRuleIgnoreAfterMaxFailures.java:70)
	at org.apache.lucene.util.TestRuleMarkFailure$1.evaluate(TestRuleMarkFailure.java:48)
	at com.carrotsearch.randomizedtesting.rules.StatementAdapter.evaluate(StatementAdapter.java:36)
	at com.carrotsearch.randomizedtesting.ThreadLeakControl$StatementRunner.run(ThreadLeakControl.java:358)
	at com.carrotsearch.randomizedtesting.ThreadLeakControl.forkTimeoutingTask(ThreadLeakControl.java:782)
	at com.carrotsearch.randomizedtesting.ThreadLeakControl$3.evaluate(ThreadLeakControl.java:442)
	at com.carrotsearch.randomizedtesting.RandomizedRunner.runSingleTest(RandomizedRunner.java:746)
	at com.carrotsearch.randomizedtesting.RandomizedRunner$3.evaluate(RandomizedRunner.java:648)
	at com.carrotsearch.randomizedtesting.RandomizedRunner$4.evaluate(RandomizedRunner.java:682)
	at com.carrotsearch.randomizedtesting.RandomizedRunner$5.evaluate(RandomizedRunner.java:693)
	at com.carrotsearch.randomizedtesting.rules.StatementAdapter.evaluate(StatementAdapter.java:36)
	at com.carrotsearch.randomizedtesting.rules.SystemPropertiesRestoreRule$1.evaluate(SystemPropertiesRestoreRule.java:53)
	at org.apache.lucene.util.AbstractBeforeAfterRule$1.evaluate(AbstractBeforeAfterRule.java:45)
	at org.apache.lucene.util.TestRuleStoreClassName$1.evaluate(TestRuleStoreClassName.java:42)
	at com.carrotsearch.randomizedtesting.rules.SystemPropertiesInvariantRule$1.evaluate(SystemPropertiesInvariantRule.java:55)
	at com.carrotsearch.randomizedtesting.rules.NoShadowingOrOverridesOnMethodsRule$1.evaluate(NoShadowingOrOverridesOnMethodsRule.java:39)
	at com.carrotsearch.randomizedtesting.rules.NoShadowingOrOverridesOnMethodsRule$1.evaluate(NoShadowingOrOverridesOnMethodsRule.java:39)
	at com.carrotsearch.randomizedtesting.rules.StatementAdapter.evaluate(StatementAdapter.java:36)
	at org.apache.lucene.util.TestRuleAssertionsRequired$1.evaluate(TestRuleAssertionsRequired.java:43)
	at org.apache.lucene.util.TestRuleMarkFailure$1.evaluate(TestRuleMarkFailure.java:48)
	at org.apache.lucene.util.TestRuleIgnoreAfterMaxFailures$1.evaluate(TestRuleIgnoreAfterMaxFailures.java:70)
	at org.apache.lucene.util.TestRuleIgnoreTestSuites$1.evaluate(TestRuleIgnoreTestSuites.java:55)
	at com.carrotsearch.randomizedtesting.rules.StatementAdapter.evaluate(StatementAdapter.java:36)
	at com.carrotsearch.randomizedtesting.ThreadLeakControl$StatementRunner.run(ThreadLeakControl.java:358)
	at java.lang.Thread.run(Thread.java:722)
Caused by: java.lang.AssertionError: Directory not closed: MockDirWrapper(org.apache.lucene.store.RAMDirectory@53990949 lockFactory=org.apache.lucene.store.SingleInstanceLockFactory@3d31533c)
	at org.junit.Assert.fail(Assert.java:93)
	at org.apache.lucene.util.CloseableDirectory.close(CloseableDirectory.java:47)
	at com.carrotsearch.randomizedtesting.RandomizedRunner$2$1.apply(RandomizedRunner.java:602)
	at com.carrotsearch.randomizedtesting.RandomizedRunner$2$1.apply(RandomizedRunner.java:599)
	at com.carrotsearch.randomizedtesting.RandomizedContext.closeResources(RandomizedContext.java:167)
	at com.carrotsearch.randomizedtesting.RandomizedRunner$2.afterAlways(RandomizedRunner.java:615)
	at com.carrotsearch.randomizedtesting.rules.StatementAdapter.evaluate(StatementAdapter.java:43)
	... 2 more


FAILED:  junit.framework.TestSuite.org.apache.solr.handler.TestReplicationHandler

Error Message:
Resource in scope SUITE failed to close. Resource was registered from thread Thread[id=2280, name=Thread-757, state=RUNNABLE, group=TGRP-TestReplicationHandler], registration stack trace below.

Stack Trace:
com.carrotsearch.randomizedtesting.ResourceDisposalError: Resource in scope SUITE failed to close. Resource was registered from thread Thread[id=2280, name=Thread-757, state=RUNNABLE, group=TGRP-TestReplicationHandler], registration stack trace below.
	at java.lang.Thread.getStackTrace(Thread.java:1567)
	at com.carrotsearch.randomizedtesting.RandomizedContext.closeAtEnd(RandomizedContext.java:150)
	at org.apache.lucene.util.LuceneTestCase.closeAfterSuite(LuceneTestCase.java:514)
	at org.apache.lucene.util.LuceneTestCase.wrapDirectory(LuceneTestCase.java:958)
	at org.apache.lucene.util.LuceneTestCase.newDirectory(LuceneTestCase.java:872)
	at org.apache.lucene.util.LuceneTestCase.newDirectory(LuceneTestCase.java:864)
	at org.apache.solr.core.MockDirectoryFactory.create(MockDirectoryFactory.java:33)
	at org.apache.solr.core.CachingDirectoryFactory.get(CachingDirectoryFactory.java:221)
	at org.apache.solr.core.CachingDirectoryFactory.get(CachingDirectoryFactory.java:181)
	at org.apache.solr.handler.SnapPuller.fetchLatestIndex(SnapPuller.java:373)
	at org.apache.solr.handler.ReplicationHandler.doFetch(ReplicationHandler.java:273)
	at org.apache.solr.handler.ReplicationHandler$1.run(ReplicationHandler.java:181)
Caused by: java.lang.AssertionError: Directory not closed: MockDirWrapper(org.apache.lucene.store.RAMDirectory@57bfb97f lockFactory=org.apache.lucene.store.SimpleFSLockFactory@17393ab1)
	at org.junit.Assert.fail(Assert.java:93)
	at org.apache.lucene.util.CloseableDirectory.close(CloseableDirectory.java:47)
	at com.carrotsearch.randomizedtesting.RandomizedRunner$2$1.apply(RandomizedRunner.java:602)
	at com.carrotsearch.randomizedtesting.RandomizedRunner$2$1.apply(RandomizedRunner.java:599)
	at com.carrotsearch.randomizedtesting.RandomizedContext.closeResources(RandomizedContext.java:167)
	at com.carrotsearch.randomizedtesting.RandomizedRunner$2.afterAlways(RandomizedRunner.java:615)
	at com.carrotsearch.randomizedtesting.rules.StatementAdapter.evaluate(StatementAdapter.java:43)
	at com.carrotsearch.randomizedtesting.ThreadLeakControl$StatementRunner.run(ThreadLeakControl.java:358)
	at java.lang.Thread.run(Thread.java:722)




Build Log:
[...truncated 8732 lines...]
[junit4:junit4] Suite: org.apache.solr.handler.TestReplicationHandler
[junit4:junit4]   2> 0 T2156 oas.SolrTestCaseJ4.setUp ###Starting test
[junit4:junit4]   2> 0 T2156 oas.SolrTestCaseJ4.setUp ###Starting test
[junit4:junit4]   2> 16 T2156 oejs.Server.doStart jetty-8.1.2.v20120308
[junit4:junit4]   2> 31 T2156 oejs.AbstractConnector.doStart Started SelectChannelConnector@0.0.0.0:51689
[junit4:junit4]   2> 31 T2156 oasc.SolrResourceLoader.locateSolrHome JNDI not configured for solr (NoInitialContextEx)
[junit4:junit4]   2> 31 T2156 oasc.SolrResourceLoader.locateSolrHome using system property solr.solr.home: .\org.apache.solr.handler.TestReplicationHandler$SolrInstance-1351291567691\master
[junit4:junit4]   2> 31 T2156 oasc.SolrResourceLoader.<init> new SolrResourceLoader for deduced Solr Home: '.\org.apache.solr.handler.TestReplicationHandler$SolrInstance-1351291567691\master\'
[junit4:junit4]   2> 78 T2156 oass.SolrDispatchFilter.init SolrDispatchFilter.init()
[junit4:junit4]   2> 78 T2156 oasc.SolrResourceLoader.locateSolrHome JNDI not configured for solr (NoInitialContextEx)
[junit4:junit4]   2> 78 T2156 oasc.SolrResourceLoader.locateSolrHome using system property solr.solr.home: .\org.apache.solr.handler.TestReplicationHandler$SolrInstance-1351291567691\master
[junit4:junit4]   2> 78 T2156 oasc.CoreContainer$Initializer.initialize looking for solr.xml: C:\Users\JenkinsSlave\workspace\Lucene-Solr-trunk-Windows\solr\build\solr-core\test\J0\.\org.apache.solr.handler.TestReplicationHandler$SolrInstance-1351291567691\master\solr.xml
[junit4:junit4]   2> 78 T2156 oasc.CoreContainer.<init> New CoreContainer 275911384
[junit4:junit4]   2> 78 T2156 oasc.CoreContainer$Initializer.initialize no solr.xml file found - using default
[junit4:junit4]   2> 78 T2156 oasc.CoreContainer.load Loading CoreContainer using Solr Home: '.\org.apache.solr.handler.TestReplicationHandler$SolrInstance-1351291567691\master\'
[junit4:junit4]   2> 78 T2156 oasc.SolrResourceLoader.<init> new SolrResourceLoader for directory: '.\org.apache.solr.handler.TestReplicationHandler$SolrInstance-1351291567691\master\'
[junit4:junit4]   2> 109 T2156 oasc.CoreContainer.load Registering Log Listener
[junit4:junit4]   2> 141 T2156 oasc.CoreContainer.create Creating SolrCore 'collection1' using instanceDir: .\org.apache.solr.handler.TestReplicationHandler$SolrInstance-1351291567691\master\collection1
[junit4:junit4]   2> 141 T2156 oasc.SolrResourceLoader.<init> new SolrResourceLoader for directory: '.\org.apache.solr.handler.TestReplicationHandler$SolrInstance-1351291567691\master\collection1\'
[junit4:junit4]   2> 172 T2156 oasc.SolrConfig.<init> Using Lucene MatchVersion: LUCENE_50
[junit4:junit4]   2> 234 T2156 oasc.SolrConfig.<init> Loaded SolrConfig: solrconfig.xml
[junit4:junit4]   2> 234 T2156 oass.IndexSchema.readSchema Reading Solr Schema
[junit4:junit4]   2> 234 T2156 oass.IndexSchema.readSchema Schema name=test
[junit4:junit4]   2> 266 T2156 oass.IndexSchema.readSchema unique key field: id
[junit4:junit4]   2> 266 T2156 oasc.SolrCore.<init> [collection1] Opening new SolrCore at .\org.apache.solr.handler.TestReplicationHandler$SolrInstance-1351291567691\master\collection1\, dataDir=.\org.apache.solr.handler.TestReplicationHandler$SolrInstance-1351291567691\master\collection1\data\
[junit4:junit4]   2> 266 T2156 oasc.SolrCore.<init> JMX monitoring not detected for core: collection1
[junit4:junit4]   2> 266 T2156 oasc.SolrCore.initDirectoryFactory org.apache.solr.core.MockDirectoryFactory
[junit4:junit4]   2> 266 T2156 oasc.CachingDirectoryFactory.injectLockFactory WARNING No lockType configured for MockDirWrapper(org.apache.lucene.store.RAMDirectory@17f881c lockFactory=org.apache.lucene.store.SingleInstanceLockFactory@5bc0e708) assuming 'simple'
[junit4:junit4]   2> 266 T2156 oasc.CachingDirectoryFactory.get return new directory for C:\Users\JenkinsSlave\workspace\Lucene-Solr-trunk-Windows\solr\build\solr-core\test\J0\.\org.apache.solr.handler.TestReplicationHandler$SolrInstance-1351291567691\master\collection1\data forceNew:false
[junit4:junit4]   2> 266 T2156 oasc.CachingDirectoryFactory.close Releasing directory:C:\Users\JenkinsSlave\workspace\Lucene-Solr-trunk-Windows\solr\build\solr-core\test\J0\.\org.apache.solr.handler.TestReplicationHandler$SolrInstance-1351291567691\master\collection1\data
[junit4:junit4]   2> 266 T2156 oasc.SolrCore.getNewIndexDir New index directory detected: old=null new=.\org.apache.solr.handler.TestReplicationHandler$SolrInstance-1351291567691\master\collection1\data\index/
[junit4:junit4]   2> 266 T2156 oasc.SolrCore.initIndex WARNING [collection1] Solr index directory '.\org.apache.solr.handler.TestReplicationHandler$SolrInstance-1351291567691\master\collection1\data\index' doesn't exist. Creating new index...
[junit4:junit4]   2> 266 T2156 oasc.CachingDirectoryFactory.get return new directory for C:\Users\JenkinsSlave\workspace\Lucene-Solr-trunk-Windows\solr\build\solr-core\test\J0\.\org.apache.solr.handler.TestReplicationHandler$SolrInstance-1351291567691\master\collection1\data\index forceNew:false
[junit4:junit4]   2> 266 T2156 oasc.SolrDeletionPolicy.onCommit SolrDeletionPolicy.onCommit: commits:num=1
[junit4:junit4]   2> 		commit{dir=MockDirWrapper(org.apache.lucene.store.RAMDirectory@4dc98cbf lockFactory=org.apache.lucene.store.SingleInstanceLockFactory@6862830),segFN=segments_1,generation=1,filenames=[segments_1]
[junit4:junit4]   2> 266 T2156 oasc.SolrDeletionPolicy.updateCommits newest commit = 1[segments_1]
[junit4:junit4]   2> 266 T2156 oasc.CachingDirectoryFactory.close Releasing directory:C:\Users\JenkinsSlave\workspace\Lucene-Solr-trunk-Windows\solr\build\solr-core\test\J0\.\org.apache.solr.handler.TestReplicationHandler$SolrInstance-1351291567691\master\collection1\data\index
[junit4:junit4]   2> 266 T2156 oasc.RequestHandlers.initHandlersFromConfig created standard: solr.StandardRequestHandler
[junit4:junit4]   2> 266 T2156 oasc.RequestHandlers.initHandlersFromConfig created /replication: solr.ReplicationHandler
[junit4:junit4]   2> 266 T2156 oasc.RequestHandlers.initHandlersFromConfig created defaults: solr.StandardRequestHandler
[junit4:junit4]   2> 266 T2156 oasc.RequestHandlers.initHandlersFromConfig adding lazy requestHandler: solr.StandardRequestHandler
[junit4:junit4]   2> 266 T2156 oasc.RequestHandlers.initHandlersFromConfig created lazy: solr.StandardRequestHandler
[junit4:junit4]   2> 266 T2156 oasc.RequestHandlers.initHandlersFromConfig created /update: solr.UpdateRequestHandler
[junit4:junit4]   2> 281 T2156 oashl.XMLLoader.init xsltCacheLifetimeSeconds=60
[junit4:junit4]   2> 281 T2156 oasc.CachingDirectoryFactory.close Releasing directory:C:\Users\JenkinsSlave\workspace\Lucene-Solr-trunk-Windows\solr\build\solr-core\test\J0\.\org.apache.solr.handler.TestReplicationHandler$SolrInstance-1351291567691\master\collection1\data
[junit4:junit4]   2> 281 T2156 oass.SolrIndexSearcher.<init> Opening Searcher@54e13911 main
[junit4:junit4]   2> 281 T2156 oasu.CommitTracker.<init> Hard AutoCommit: disabled
[junit4:junit4]   2> 281 T2156 oasu.CommitTracker.<init> Soft AutoCommit: disabled
[junit4:junit4]   2> 281 T2156 oashc.HttpShardHandlerFactory.getParameter Setting socketTimeout to: 0
[junit4:junit4]   2> 281 T2156 oashc.HttpShardHandlerFactory.getParameter Setting urlScheme to: http://
[junit4:junit4]   2> 281 T2156 oashc.HttpShardHandlerFactory.getParameter Setting connTimeout to: 0
[junit4:junit4]   2> 281 T2156 oashc.HttpShardHandlerFactory.getParameter Setting maxConnectionsPerHost to: 20
[junit4:junit4]   2> 281 T2156 oashc.HttpShardHandlerFactory.getParameter Setting corePoolSize to: 0
[junit4:junit4]   2> 281 T2156 oashc.HttpShardHandlerFactory.getParameter Setting maximumPoolSize to: 2147483647
[junit4:junit4]   2> 281 T2156 oashc.HttpShardHandlerFactory.getParameter Setting maxThreadIdleTime to: 5
[junit4:junit4]   2> 281 T2156 oashc.HttpShardHandlerFactory.getParameter Setting sizeOfQueue to: -1
[junit4:junit4]   2> 281 T2156 oashc.HttpShardHandlerFactory.getParameter Setting fairnessPolicy to: false
[junit4:junit4]   2> 281 T2156 oascsi.HttpClientUtil.createClient Creating new http client, config:maxConnectionsPerHost=20&maxConnections=10000&socketTimeout=0&connTimeout=0&retry=false
[junit4:junit4]   2> 297 T2156 oash.ReplicationHandler.inform Replication enabled for following config files: schema.xml,xslt/dummy.xsl
[junit4:junit4]   2> 297 T2156 oash.ReplicationHandler.inform Commits will be reserved for  10000
[junit4:junit4]   2> 297 T2166 oasc.SolrCore.registerSearcher [collection1] Registered new searcher Searcher@54e13911 main{StandardDirectoryReader(segments_1:1)}
[junit4:junit4]   2> 297 T2156 oasc.CoreContainer.register registering core: collection1
[junit4:junit4]   2> 297 T2156 oass.SolrDispatchFilter.init user.dir=C:\Users\JenkinsSlave\workspace\Lucene-Solr-trunk-Windows\solr\build\solr-core\test\J0
[junit4:junit4]   2> 297 T2156 oass.SolrDispatchFilter.init SolrDispatchFilter.init() done
[junit4:junit4]   2> 297 T2156 oascsi.HttpClientUtil.createClient Creating new http client, config:maxConnections=128&maxConnectionsPerHost=32&followRedirects=false
[junit4:junit4]   2> 313 T2156 oejs.Server.doStart jetty-8.1.2.v20120308
[junit4:junit4]   2> 313 T2156 oejs.AbstractConnector.doStart Started SelectChannelConnector@0.0.0.0:51692
[junit4:junit4]   2> 313 T2156 oasc.SolrResourceLoader.locateSolrHome JNDI not configured for solr (NoInitialContextEx)
[junit4:junit4]   2> 313 T2156 oasc.SolrResourceLoader.locateSolrHome using system property solr.solr.home: .\org.apache.solr.handler.TestReplicationHandler$SolrInstance-1351291567988\slave
[junit4:junit4]   2> 313 T2156 oasc.SolrResourceLoader.<init> new SolrResourceLoader for deduced Solr Home: '.\org.apache.solr.handler.TestReplicationHandler$SolrInstance-1351291567988\slave\'
[junit4:junit4]   2> 328 T2156 oass.SolrDispatchFilter.init SolrDispatchFilter.init()
[junit4:junit4]   2> 328 T2156 oasc.SolrResourceLoader.locateSolrHome JNDI not configured for solr (NoInitialContextEx)
[junit4:junit4]   2> 328 T2156 oasc.SolrResourceLoader.locateSolrHome using system property solr.solr.home: .\org.apache.solr.handler.TestReplicationHandler$SolrInstance-1351291567988\slave
[junit4:junit4]   2> 328 T2156 oasc.CoreContainer$Initializer.initialize looking for solr.xml: C:\Users\JenkinsSlave\workspace\Lucene-Solr-trunk-Windows\solr\build\solr-core\test\J0\.\org.apache.solr.handler.TestReplicationHandler$SolrInstance-1351291567988\slave\solr.xml
[junit4:junit4]   2> 328 T2156 oasc.CoreContainer.<init> New CoreContainer 621811655
[junit4:junit4]   2> 328 T2156 oasc.CoreContainer$Initializer.initialize no solr.xml file found - using default
[junit4:junit4]   2> 328 T2156 oasc.CoreContainer.load Loading CoreContainer using Solr Home: '.\org.apache.solr.handler.TestReplicationHandler$SolrInstance-1351291567988\slave\'
[junit4:junit4]   2> 328 T2156 oasc.SolrResourceLoader.<init> new SolrResourceLoader for directory: '.\org.apache.solr.handler.TestReplicationHandler$SolrInstance-1351291567988\slave\'
[junit4:junit4]   2> 344 T2156 oasc.CoreContainer.load Registering Log Listener
[junit4:junit4]   2> 359 T2156 oasc.CoreContainer.create Creating SolrCore 'collection1' using instanceDir: .\org.apache.solr.handler.TestReplicationHandler$SolrInstance-1351291567988\slave\collection1
[junit4:junit4]   2> 375 T2156 oasc.SolrResourceLoader.<init> new SolrResourceLoader for directory: '.\org.apache.solr.handler.TestReplicationHandler$SolrInstance-1351291567988\slave\collection1\'
[junit4:junit4]   2> 406 T2156 oasc.SolrConfig.<init> Using Lucene MatchVersion: LUCENE_50
[junit4:junit4]   2> 453 T2156 oasc.SolrConfig.<init> Loaded SolrConfig: solrconfig.xml
[junit4:junit4]   2> 453 T2156 oass.IndexSchema.readSchema Reading Solr Schema
[junit4:junit4]   2> 469 T2156 oass.IndexSchema.readSchema Schema name=test
[junit4:junit4]   2> 484 T2156 oass.IndexSchema.readSchema unique key field: id
[junit4:junit4]   2> 484 T2156 oasc.SolrCore.<init> [collection1] Opening new SolrCore at .\org.apache.solr.handler.TestReplicationHandler$SolrInstance-1351291567988\slave\collection1\, dataDir=.\org.apache.solr.handler.TestReplicationHandler$SolrInstance-1351291567988\slave\collection1\data\
[junit4:junit4]   2> 484 T2156 oasc.SolrCore.<init> JMX monitoring not detected for core: collection1
[junit4:junit4]   2> 484 T2156 oasc.SolrCore.initDirectoryFactory org.apache.solr.core.MockDirectoryFactory
[junit4:junit4]   2> 484 T2156 oasc.CachingDirectoryFactory.injectLockFactory WARNING No lockType configured for MockDirWrapper(org.apache.lucene.store.RAMDirectory@3f4e49c6 lockFactory=org.apache.lucene.store.SingleInstanceLockFactory@2ccd86a2) assuming 'simple'
[junit4:junit4]   2> 484 T2156 oasc.CachingDirectoryFactory.get return new directory for C:\Users\JenkinsSlave\workspace\Lucene-Solr-trunk-Windows\solr\build\solr-core\test\J0\.\org.apache.solr.handler.TestReplicationHandler$SolrInstance-1351291567988\slave\collection1\data forceNew:false
[junit4:junit4]   2> 484 T2156 oasc.CachingDirectoryFactory.close Releasing directory:C:\Users\JenkinsSlave\workspace\Lucene-Solr-trunk-Windows\solr\build\solr-core\test\J0\.\org.apache.solr.handler.TestReplicationHandler$SolrInstance-1351291567988\slave\collection1\data
[junit4:junit4]   2> 484 T2156 oasc.SolrCore.getNewIndexDir New index directory detected: old=null new=.\org.apache.solr.handler.TestReplicationHandler$SolrInstance-1351291567988\slave\collection1\data\index/
[junit4:junit4]   2> 484 T2156 oasc.SolrCore.initIndex WARNING [collection1] Solr index directory '.\org.apache.solr.handler.TestReplicationHandler$SolrInstance-1351291567988\slave\collection1\data\index' doesn't exist. Creating new index...
[junit4:junit4]   2> 484 T2156 oasc.CachingDirectoryFactory.get return new directory for C:\Users\JenkinsSlave\workspace\Lucene-Solr-trunk-Windows\solr\build\solr-core\test\J0\.\org.apache.solr.handler.TestReplicationHandler$SolrInstance-1351291567988\slave\collection1\data\index forceNew:false
[junit4:junit4]   2> 484 T2156 oasc.SolrDeletionPolicy.onCommit SolrDeletionPolicy.onCommit: commits:num=1
[junit4:junit4]   2> 		commit{dir=MockDirWrapper(org.apache.lucene.store.RAMDirectory@305466a2 lockFactory=org.apache.lucene.store.SingleInstanceLockFactory@107cc2b3),segFN=segments_1,generation=1,filenames=[segments_1]
[junit4:junit4]   2> 484 T2156 oasc.SolrDeletionPolicy.updateCommits newest commit = 1[segments_1]
[junit4:junit4]   2> 484 T2156 oasc.CachingDirectoryFactory.close Releasing directory:C:\Users\JenkinsSlave\workspace\Lucene-Solr-trunk-Windows\solr\build\solr-core\test\J0\.\org.apache.solr.handler.TestReplicationHandler$SolrInstance-1351291567988\slave\collection1\data\index
[junit4:junit4]   2> 484 T2156 oasc.RequestHandlers.initHandlersFromConfig created standard: solr.StandardRequestHandler
[junit4:junit4]   2> 484 T2156 oasc.RequestHandlers.initHandlersFromConfig created defaults: solr.StandardRequestHandler
[junit4:junit4]   2> 484 T2156 oasc.RequestHandlers.initHandlersFromConfig adding lazy requestHandler: solr.StandardRequestHandler
[junit4:junit4]   2> 484 T2156 oasc.RequestHandlers.initHandlersFromConfig created lazy: solr.StandardRequestHandler
[junit4:junit4]   2> 484 T2156 oasc.RequestHandlers.initHandlersFromConfig created /update: solr.UpdateRequestHandler
[junit4:junit4]   2> 484 T2156 oasc.RequestHandlers.initHandlersFromConfig created /replication: solr.ReplicationHandler
[junit4:junit4]   2> 484 T2156 oashl.XMLLoader.init xsltCacheLifetimeSeconds=60
[junit4:junit4]   2> 484 T2156 oasc.CachingDirectoryFactory.close Releasing directory:C:\Users\JenkinsSlave\workspace\Lucene-Solr-trunk-Windows\solr\build\solr-core\test\J0\.\org.apache.solr.handler.TestReplicationHandler$SolrInstance-1351291567988\slave\collection1\data
[junit4:junit4]   2> 500 T2156 oass.SolrIndexSearcher.<init> Opening Searcher@2ed81bdb main
[junit4:junit4]   2> 500 T2156 oasu.CommitTracker.<init> Hard AutoCommit: disabled
[junit4:junit4]   2> 500 T2156 oasu.CommitTracker.<init> Soft AutoCommit: disabled
[junit4:junit4]   2> 500 T2156 oashc.HttpShardHandlerFactory.getParameter Setting socketTimeout to: 0
[junit4:junit4]   2> 500 T2156 oashc.HttpShardHandlerFactory.getParameter Setting urlScheme to: http://
[junit4:junit4]   2> 500 T2156 oashc.HttpShardHandlerFactory.getParameter Setting connTimeout to: 0
[junit4:junit4]   2> 500 T2156 oashc.HttpShardHandlerFactory.getParameter Setting maxConnectionsPerHost to: 20
[junit4:junit4]   2> 500 T2156 oashc.HttpShardHandlerFactory.getParameter Setting corePoolSize to: 0
[junit4:junit4]   2> 500 T2156 oashc.HttpShardHandlerFactory.getParameter Setting maximumPoolSize to: 2147483647
[junit4:junit4]   2> 500 T2156 oashc.HttpShardHandlerFactory.getParameter Setting maxThreadIdleTime to: 5
[junit4:junit4]   2> 500 T2156 oashc.HttpShardHandlerFactory.getParameter Setting sizeOfQueue to: -1
[junit4:junit4]   2> 500 T2156 oashc.HttpShardHandlerFactory.getParameter Setting fairnessPolicy to: false
[junit4:junit4]   2> 500 T2156 oascsi.HttpClientUtil.createClient Creating new http client, config:maxConnectionsPerHost=20&maxConnections=10000&socketTimeout=0&connTimeout=0&retry=false
[junit4:junit4]   2> 500 T2156 oash.SnapPuller.startExecutorService Poll Scheduled at an interval of 1000ms
[junit4:junit4]   2> 500 T2176 oasc.SolrCore.registerSearcher [collection1] Registered new searcher Searcher@2ed81bdb main{StandardDirectoryReader(segments_1:1)}
[junit4:junit4]   2> 500 T2156 oasc.CoreContainer.register registering core: collection1
[junit4:junit4]   2> 500 T2156 oass.SolrDispatchFilter.init user.dir=C:\Users\JenkinsSlave\workspace\Lucene-Solr-trunk-Windows\solr\build\solr-core\test\J0
[junit4:junit4]   2> 500 T2156 oass.SolrDispatchFilter.init SolrDispatchFilter.init() done
[junit4:junit4]   2> 500 T2156 oascsi.HttpClientUtil.createClient Creating new http client, config:maxConnections=128&maxConnectionsPerHost=32&followRedirects=false
[junit4:junit4]   2> 531 T2156 oasc.CoreContainer.shutdown Shutting down CoreContainer instance=621811655
[junit4:junit4]   2> 531 T2156 oasc.SolrCore.close [collection1]  CLOSING SolrCore org.apache.solr.core.SolrCore@40b17983
[junit4:junit4]   2> 531 T2156 oasu.DirectUpdateHandler2.close closing DirectUpdateHandler2{commits=0,autocommits=0,soft autocommits=0,optimizes=0,rollbacks=0,expungeDeletes=0,docsPending=0,adds=0,deletesById=0,deletesByQuery=0,errors=0,cumulative_adds=0,cumulative_deletesById=0,cumulative_deletesByQuery=0,cumulative_errors=0}
[junit4:junit4]   2> 531 T2156 oasc.SolrCore.decrefSolrCoreState Closing SolrCoreState
[junit4:junit4]   2> 531 T2156 oasu.DefaultSolrCoreState.closeIndexWriter SolrCoreState ref count has reached 0 - closing IndexWriter
[junit4:junit4]   2> 531 T2156 oasu.DefaultSolrCoreState.closeIndexWriter closing IndexWriter with IndexWriterCloser
[junit4:junit4]   2> 531 T2156 oasc.SolrCore.closeSearcher [collection1] Closing main searcher on request.
[junit4:junit4]   2> 531 T2156 oasc.CachingDirectoryFactory.close Releasing directory:C:\Users\JenkinsSlave\workspace\Lucene-Solr-trunk-Windows\solr\build\solr-core\test\J0\.\org.apache.solr.handler.TestReplicationHandler$SolrInstance-1351291567988\slave\collection1\data\index
[junit4:junit4]   2> 531 T2156 oejsh.ContextHandler.doStop stopped o.e.j.s.ServletContextHandler{/solr,null}
[junit4:junit4]   2> 601 T2156 oasc.CoreContainer.shutdown Shutting down CoreContainer instance=275911384
[junit4:junit4]   2> 601 T2156 oasc.SolrCore.close [collection1]  CLOSING SolrCore org.apache.solr.core.SolrCore@689f2dd6
[junit4:junit4]   2> 601 T2156 oasu.DirectUpdateHandler2.close closing DirectUpdateHandler2{commits=0,autocommits=0,soft autocommits=0,optimizes=0,rollbacks=0,expungeDeletes=0,docsPending=0,adds=0,deletesById=0,deletesByQuery=0,errors=0,cumulative_adds=0,cumulative_deletesById=0,cumulative_deletesByQuery=0,cumulative_errors=0}
[junit4:junit4]   2> 601 T2156 oasc.SolrCore.decrefSolrCoreState Closing SolrCoreState
[junit4:junit4]   2> 601 T2156 oasu.DefaultSolrCoreState.closeIndexWriter SolrCoreState ref count has reached 0 - closing IndexWriter
[junit4:junit4]   2> 601 T2156 oasu.DefaultSolrCoreState.closeIndexWriter closing IndexWriter with IndexWriterCloser
[junit4:junit4]   2> 601 T2156 oasc.SolrCore.closeSearcher [collection1] Closing main searcher on request.
[junit4:junit4]   2> 601 T2156 oasc.CachingDirectoryFactory.close Releasing directory:C:\Users\JenkinsSlave\workspace\Lucene-Solr-trunk-Windows\solr\build\solr-core\test\J0\.\org.apache.solr.handler.TestReplicationHandler$SolrInstance-1351291567691\master\collection1\data\index
[junit4:junit4]   2> 601 T2156 oejsh.ContextHandler.doStop stopped o.e.j.s.ServletContextHandler{/solr,null}
[junit4:junit4]   2> 653 T2156 oejs.Server.doStart jetty-8.1.2.v20120308
[junit4:junit4]   2> 654 T2156 oejs.AbstractConnector.doStart Started SelectChannelConnector@0.0.0.0:51695
[junit4:junit4]   2> 654 T2156 oasc.SolrResourceLoader.locateSolrHome JNDI not configured for solr (NoInitialContextEx)
[junit4:junit4]   2> 654 T2156 oasc.SolrResourceLoader.locateSolrHome using system property solr.solr.home: .\org.apache.solr.handler.TestReplicationHandler$SolrInstance-1351291567691\master
[junit4:junit4]   2> 654 T2156 oasc.SolrResourceLoader.<init> new SolrResourceLoader for deduced Solr Home: '.\org.apache.solr.handler.TestReplicationHandler$SolrInstance-1351291567691\master\'
[junit4:junit4]   2> 670 T2156 oass.SolrDispatchFilter.init SolrDispatchFilter.init()
[junit4:junit4]   2> 670 T2156 oasc.SolrResourceLoader.locateSolrHome JNDI not configured for solr (NoInitialContextEx)
[junit4:junit4]   2> 670 T2156 oasc.SolrResourceLoader.locateSolrHome using system property solr.solr.home: .\org.apache.solr.handler.TestReplicationHandler$SolrInstance-1351291567691\master
[junit4:junit4]   2> 670 T2156 oasc.CoreContainer$Initializer.initialize looking for solr.xml: C:\Users\JenkinsSlave\workspace\Lucene-Solr-trunk-Windows\solr\build\solr-core\test\J0\.\org.apache.solr.handler.TestReplicationHandler$SolrInstance-1351291567691\master\solr.xml
[junit4:junit4]   2> 670 T2156 oasc.CoreContainer.<init> New CoreContainer 1533563812
[junit4:junit4]   2> 670 T2156 oasc.CoreContainer$Initializer.initialize no solr.xml file found - using default
[junit4:junit4]   2> 670 T2156 oasc.CoreContainer.load Loading CoreContainer using Solr Home: '.\org.apache.solr.handler.TestReplicationHandler$SolrInstance-1351291567691\master\'
[junit4:junit4]   2> 670 T2156 oasc.SolrResourceLoader.<init> new SolrResourceLoader for directory: '.\org.apache.solr.handler.TestReplicationHandler$SolrInstance-1351291567691\master\'
[junit4:junit4]   2> 686 T2156 oasc.CoreContainer.load Registering Log Listener
[junit4:junit4]   2> 701 T2156 oasc.CoreContainer.create Creating SolrCore 'collection1' using instanceDir: .\org.apache.solr.handler.TestReplicationHandler$SolrInstance-1351291567691\master\collection1
[junit4:junit4]   2> 701 T2156 oasc.SolrResourceLoader.<init> new SolrResourceLoader for directory: '.\org.apache.solr.handler.TestReplicationHandler$SolrInstance-1351291567691\master\collection1\'
[junit4:junit4]   2> 748 T2156 oasc.SolrConfig.<init> Using Lucene MatchVersion: LUCENE_50
[junit4:junit4]   2> 795 T2156 oasc.SolrConfig.<init> Loaded SolrConfig: solrconfig.xml
[junit4:junit4]   2> 795 T2156 oass.IndexSchema.readSchema Reading Solr Schema
[junit4:junit4]   2> 795 T2156 oass.IndexSchema.readSchema Schema name=test
[junit4:junit4]   2> 826 T2156 oass.IndexSchema.readSchema unique key field: id
[junit4:junit4]   2> 826 T2156 oasc.SolrCore.<init> [collection1] Opening new SolrCore at .\org.apache.solr.handler.TestReplicationHandler$SolrInstance-1351291567691\master\collection1\, dataDir=.\org.apache.solr.handler.TestReplicationHandler$SolrInstance-1351291567691\master\collection1\data\
[junit4:junit4]   2> 826 T2156 oasc.SolrCore.<init> JMX monitoring not detected for core: collection1
[junit4:junit4]   2> 826 T2156 oasc.SolrCore.initDirectoryFactory org.apache.solr.core.MockDirectoryFactory
[junit4:junit4]   2> 826 T2156 oasc.CachingDirectoryFactory.injectLockFactory WARNING No lockType configured for MockDirWrapper(org.apache.lucene.store.RAMDirectory@1e96b26b lockFactory=org.apache.lucene.store.SingleInstanceLockFactory@379b9e7d) assuming 'simple'
[junit4:junit4]   2> 826 T2156 oasc.CachingDirectoryFactory.get return new directory for C:\Users\JenkinsSlave\workspace\Lucene-Solr-trunk-Windows\solr\build\solr-core\test\J0\.\org.apache.solr.handler.TestReplicationHandler$SolrInstance-1351291567691\master\collection1\data forceNew:false
[junit4:junit4]   2> 826 T2156 oasc.CachingDirectoryFactory.close Releasing directory:C:\Users\JenkinsSlave\workspace\Lucene-Solr-trunk-Windows\solr\build\solr-core\test\J0\.\org.apache.solr.handler.TestReplicationHandler$SolrInstance-1351291567691\master\collection1\data
[junit4:junit4]   2> 826 T2156 oasc.SolrCore.getNewIndexDir New index directory detected: old=null new=.\org.apache.solr.handler.TestReplicationHandler$SolrInstance-1351291567691\master\collection1\data\index/
[junit4:junit4]   2> 842 T2156 oasc.SolrCore.initIndex WARNING [collection1] Solr index directory '.\org.apache.solr.handler.TestReplicationHandler$SolrInstance-1351291567691\master\collection1\data\index' doesn't exist. Creating new index...
[junit4:junit4]   2> 842 T2156 oasc.CachingDirectoryFactory.get return new directory for C:\Users\JenkinsSlave\workspace\Lucene-Solr-trunk-Windows\solr\build\solr-core\test\J0\.\org.apache.solr.handler.TestReplicationHandler$SolrInstance-1351291567691\master\collection1\data\index forceNew:false
[junit4:junit4]   2> 842 T2156 oasc.SolrDeletionPolicy.onCommit SolrDeletionPolicy.onCommit: commits:num=1
[junit4:junit4]   2> 		commit{dir=MockDirWrapper(org.apache.lucene.store.SimpleFSDirectory@C:\Users\JenkinsSlave\workspace\Lucene-Solr-trunk-Windows\solr\build\solr-core\test\J0\index4507745085tmp lockFactory=org.apache.lucene.store.SingleInstanceLockFactory@64d807a9),segFN=segments_1,generation=1,filenames=[segments_1]
[junit4:junit4]   2> 842 T2156 oasc.SolrDeletionPolicy.updateCommits newest commit = 1[segments_1]
[junit4:junit4]   2> 842 T2156 oasc.CachingDirectoryFactory.close Releasing directory:C:\Users\JenkinsSlave\workspace\Lucene-Solr-trunk-Windows\solr\build\solr-core\test\J0\.\org.apache.solr.handler.TestReplicationHandler$SolrInstance-1351291567691\master\collection1\data\index
[junit4:junit4]   2> 842 T2156 oasc.RequestHandlers.initHandlersFromConfig created standard: solr.StandardRequestHandler
[junit4:junit4]   2> 842 T2156 oasc.RequestHandlers.initHandlersFromConfig created /replication: solr.ReplicationHandler
[junit4:junit4]   2> 842 T2156 oasc.RequestHandlers.initHandlersFromConfig created defaults: solr.StandardRequestHandler
[junit4:junit4]   2> 842 T2156 oasc.RequestHandlers.initHandlersFromConfig adding lazy requestHandler: solr.StandardRequestHandler
[junit4:junit4]   2> 842 T2156 oasc.RequestHandlers.initHandlersFromConfig created lazy: solr.StandardRequestHandler
[junit4:junit4]   2> 842 T2156 oasc.RequestHandlers.initHandlersFromConfig created /update: solr.UpdateRequestHandler
[junit4:junit4]   2> 858 T2156 oashl.XMLLoader.init xsltCacheLifetimeSeconds=60
[junit4:junit4]   2> 858 T2156 oasc.CachingDirectoryFactory.close Releasing directory:C:\Users\JenkinsSlave\workspace\Lucene-Solr-trunk-Windows\solr\build\solr-core\test\J0\.\org.apache.solr.handler.TestReplicationHandler$SolrInstance-1351291567691\master\collection1\data
[junit4:junit4]   2> 858 T2156 oass.SolrIndexSearcher.<init> Opening Searcher@744f306a main
[junit4:junit4]   2> 858 T2156 oasu.CommitTracker.<init> Hard AutoCommit: disabled
[junit4:junit4]   2> 858 T2156 oasu.CommitTracker.<init> Soft AutoCommit: disabled
[junit4:junit4]   2> 858 T2156 oashc.HttpShardHandlerFactory.getParameter Setting socketTimeout to: 0
[junit4:junit4]   2> 858 T2156 oashc.HttpShardHandlerFactory.getParameter Setting urlScheme to: http://
[junit4:junit4]   2> 858 T2156 oashc.HttpShardHandlerFactory.getParameter Setting connTimeout to: 0
[junit4:junit4]   2> 858 T2156 oashc.HttpShardHandlerFactory.getParameter Setting maxConnectionsPerHost to: 20
[junit4:junit4]   2> 858 T2156 oashc.HttpShardHandlerFactory.getParameter Setting corePoolSize to: 0
[junit4:junit4]   2> 858 T2156 oashc.HttpShardHandlerFactory.getParameter Setting maximumPoolSize to: 2147483647
[junit4:junit4]   2> 858 T2156 oashc.HttpShardHandlerFactory.getParameter Setting maxThreadIdleTime to: 5
[junit4:junit4]   2> 858 T2156 oashc.HttpShardHandlerFactory.getParameter Setting sizeOfQueue to: -1
[junit4:junit4]   2> 858 T2156 oashc.HttpShardHandlerFactory.getParameter Setting fairnessPolicy to: false
[junit4:junit4]   2> 858 T2156 oascsi.HttpClientUtil.createClient Creating new http client, config:maxConnectionsPerHost=20&maxConnections=10000&socketTimeout=0&connTimeout=0&retry=false
[junit4:junit4]   2> 873 T2156 oash.ReplicationHandler.inform Replication enabled for following config files: schema.xml
[junit4:junit4]   2> 873 T2156 oash.ReplicationHandler.inform Commits will be reserved for  10000
[junit4:junit4]   2> 873 T2156 oasc.CoreContainer.register registering core: collection1
[junit4:junit4]   2> 873 T2187 oasc.SolrCore.registerSearcher [collection1] Registered new searcher Searcher@744f306a main{StandardDirectoryReader(segments_1:1)}
[junit4:junit4]   2> 873 T2156 oass.SolrDispatchFilter.init user.dir=C:\Users\JenkinsSlave\workspace\Lucene-Solr-trunk-Windows\solr\build\solr-core\test\J0
[junit4:junit4]   2> 873 T2156 oass.SolrDispatchFilter.init SolrDispatchFilter.init() done
[junit4:junit4]   2> 873 T2156 oascsi.HttpClientUtil.createClient Creating new http client, config:maxConnections=128&maxConnectionsPerHost=32&followRedirects=false
[junit4:junit4]   2> ASYNC  NEW_CORE C173 name=collection1 org.apache.solr.core.SolrCore@5a3d4f8d
[junit4:junit4]   2> 889 T2181 C173 oasu.DirectUpdateHandler2.deleteAll [collection1] REMOVING ALL DOCUMENTS FROM INDEX
[junit4:junit4]   2> 889 T2181 C173 oasc.CachingDirectoryFactory.close Releasing directory:C:\Users\JenkinsSlave\workspace\Lucene-Solr-trunk-Windows\solr\build\solr-core\test\J0\.\org.apache.solr.handler.TestReplicationHandler$SolrInstance-1351291567691\master\collection1\data
[junit4:junit4]   2> 889 T2181 C173 oasc.SolrDeletionPolicy.onInit SolrDeletionPolicy.onInit: commits:num=1
[junit4:junit4]   2> 		commit{dir=MockDirWrapper(org.apache.lucene.store.SimpleFSDirectory@C:\Users\JenkinsSlave\workspace\Lucene-Solr-trunk-Windows\solr\build\solr-core\test\J0\index4507745085tmp lockFactory=org.apache.lucene.store.SingleInstanceLockFactory@64d807a9),segFN=segments_1,generation=1,filenames=[segments_1]
[junit4:junit4]   2> 889 T2181 C173 oasc.SolrDeletionPolicy.updateCommits newest commit = 1[segments_1]
[junit4:junit4]   2> 889 T2181 C173 UPDATE [collection1] webapp=/solr path=/update params={wt=javabin&version=2} {deleteByQuery=*:*} 0 0
[junit4:junit4]   2> 904 T2182 C173 UPDATE [collection1] webapp=/solr path=/update params={wt=javabin&version=2} {add=[0]} 0 0
[junit4:junit4]   2> 920 T2183 C173 UPDATE [collection1] webapp=/solr path=/update params={wt=javabin&version=2} {add=[1]} 0 0
[junit4:junit4]   2> 936 T2184 C173 UPDATE [collection1] webapp=/solr path=/update params={wt=javabin&version=2} {add=[2]} 0 0
[junit4:junit4]   2> 951 T2185 C173 UPDATE [collection1] webapp=/solr path=/update params={wt=javabin&version=2} {add=[3]} 0 0
[junit4:junit4]   2> 967 T2186 C173 UPDATE [collection1] webapp=/solr path=/update params={wt=javabin&version=2} {add=[4]} 0 0
[junit4:junit4]   2> 983 T2181 C173 UPDATE [collection1] webapp=/solr path=/update params={wt=javabin&version=2} {add=[5]} 0 0
[junit4:junit4]   2> 998 T2182 C173 UPDATE [collection1] webapp=/solr path=/update params={wt=javabin&version=2} {add=[6]} 0 0
[junit4:junit4]   2> 1014 T2183 C173 UPDATE [collection1] webapp=/solr path=/update params={wt=javabin&version=2} {add=[7]} 0 0
[junit4:junit4]   2> 1029 T2184 C173 UPDATE [collection1] webapp=/solr path=/update params={wt=javabin&version=2} {add=[8]} 0 0
[junit4:junit4]   2> 1045 T2185 C173 UPDATE [collection1] webapp=/solr path=/update params={wt=javabin&version=2} {add=[9]} 0 0
[junit4:junit4]   2> 1061 T2186 C173 oasu.DirectUpdateHandler2.commit start commit{flags=0,_version_=0,optimize=false,openSearcher=true,waitSearcher=true,expungeDeletes=false,softCommit=false}
[junit4:junit4]   2> 1061 T2186 C173 oasc.SolrDeletionPolicy.onCommit SolrDeletionPolicy.onCommit: commits:num=2
[junit4:junit4]   2> 		commit{dir=MockDirWrapper(org.apache.lucene.store.SimpleFSDirectory@C:\Users\JenkinsSlave\workspace\Lucene-Solr-trunk-Windows\solr\build\solr-core\test\J0\index4507745085tmp lockFactory=org.apache.lucene.store.SingleInstanceLockFactory@64d807a9),segFN=segments_1,generation=1,filenames=[segments_1]
[junit4:junit4]   2> 		commit{dir=MockDirWrapper(org.apache.lucene.store.SimpleFSDirectory@C:\Users\JenkinsSlave\workspace\Lucene-Solr-trunk-Windows\solr\build\solr-core\test\J0\index4507745085tmp lockFactory=org.apache.lucene.store.SingleInstanceLockFactory@64d807a9),segFN=segments_2,generation=2,filenames=[_0_Lucene40_0.tim, _0.fnm, _0_Lucene40_0.frq, _0_nrm.cfe, segments_2, _0.fdx, _0_nrm.cfs, _0.si, _0.fdt, _0_Lucene40_0.tip]
[junit4:junit4]   2> 1061 T2186 C173 oasc.SolrDeletionPolicy.updateCommits newest commit = 2[_0_Lucene40_0.tim, _0.fnm, _0_Lucene40_0.frq, _0_nrm.cfe, segments_2, _0.fdx, _0_nrm.cfs, _0.si, _0.fdt, _0_Lucene40_0.tip]
[junit4:junit4]   2> 1061 T2186 C173 oasc.CachingDirectoryFactory.close Releasing directory:C:\Users\JenkinsSlave\workspace\Lucene-Solr-trunk-Windows\solr\build\solr-core\test\J0\.\org.apache.solr.handler.TestReplicationHandler$SolrInstance-1351291567691\master\collection1\data
[junit4:junit4]   2> 1076 T2186 C173 oass.SolrIndexSearcher.<init> Opening Searcher@7dbe4086 main
[junit4:junit4]   2> 1076 T2186 C173 oasu.DirectUpdateHandler2.commit end_commit_flush
[junit4:junit4]   2> 1076 T2187 oasc.SolrCore.registerSearcher [collection1] Registered new searcher Searcher@7dbe4086 main{StandardDirectoryReader(segments_2:4 _0(5.0):C10)}
[junit4:junit4]   2> 1076 T2187 oasc.CachingDirectoryFactory.close Releasing directory:C:\Users\JenkinsSlave\workspace\Lucene-Solr-trunk-Windows\solr\build\solr-core\test\J0\.\org.apache.solr.handler.TestReplicationHandler$SolrInstance-1351291567691\master\collection1\data\index
[junit4:junit4]   2> 1076 T2186 C173 UPDATE [collection1] webapp=/solr path=/update params={waitSearcher=true&wt=javabin&commit=true&softCommit=false&version=2} {commit=} 0 15
[junit4:junit4]   2> 1092 T2182 C173 REQ [collection1] webapp=/solr path=/select params={wt=javabin&q=*:*&version=2} hits=10 status=0 QTime=0 
[junit4:junit4]   2> 1201 T2156 oejs.Server.doStart jetty-8.1.2.v20120308
[junit4:junit4]   2> 1201 T2156 oejs.AbstractConnector.doStart Started SelectChannelConnector@0.0.0.0:51699
[junit4:junit4]   2> 1201 T2156 oasc.SolrResourceLoader.locateSolrHome JNDI not configured for solr (NoInitialContextEx)
[junit4:junit4]   2> 1201 T2156 oasc.SolrResourceLoader.locateSolrHome using system property solr.solr.home: .\org.apache.solr.handler.TestReplicationHandler$SolrInstance-1351291567988\slave
[junit4:junit4]   2> 1201 T2156 oasc.SolrResourceLoader.<init> new SolrResourceLoader for deduced Solr Home: '.\org.apache.solr.handler.TestReplicationHandler$SolrInstance-1351291567988\slave\'
[junit4:junit4]   2> 1233 T2156 oass.SolrDispatchFilter.init SolrDispatchFilter.init()
[junit4:junit4]   2> 1233 T2156 oasc.SolrResourceLoader.locateSolrHome JNDI not configured for solr (NoInitialContextEx)
[junit4:junit4]   2> 1233 T2156 oasc.SolrResourceLoader.locateSolrHome using system property solr.solr.home: .\org.apache.solr.handler.TestReplicationHandler$SolrInstance-1351291567988\slave
[junit4:junit4]   2> 1233 T2156 oasc.CoreContainer$Initializer.initialize looking for solr.xml: C:\Users\JenkinsSlave\workspace\Lucene-Solr-trunk-Windows\solr\build\solr-core\test\J0\.\org.apache.solr.handler.TestReplicationHandler$SolrInstance-1351291567988\slave\solr.xml
[junit4:junit4]   2> 1233 T2156 oasc.CoreContainer.<init> New CoreContainer 747658561
[junit4:junit4]   2> 1233 T2156 oasc.CoreContainer$Initializer.initialize no solr.xml file found - using default
[junit4:junit4]   2> 1233 T2156 oasc.CoreContainer.load Loading CoreContainer using Solr Home: '.\org.apache.solr.handler.TestReplicationHandler$SolrInstance-1351291567988\slave\'
[junit4:junit4]   2> 1233 T2156 oasc.SolrResourceLoader.<init> new SolrResourceLoader for directory: '.\org.apache.solr.handler.TestReplicationHandler$SolrInstance-1351291567988\slave\'
[junit4:junit4]   2> 1264 T2156 oasc.CoreContainer.load Registering Log Listener
[junit4:junit4]   2> 1279 T2156 oasc.CoreContainer.create Creating SolrCore 'collection1' using instanceDir: .\org.apache.solr.handler.TestReplicationHandler$SolrInstance-1351291567988\slave\collection1
[junit4:junit4]   2> 1279 T2156 oasc.SolrResourceLoader.<init> new SolrResourceLoader for directory: '.\org.apache.solr.handler.TestReplicationHandler$SolrInstance-1351291567988\slave\collection1\'
[junit4:junit4]   2> 1311 T2156 oasc.SolrConfig.<init> Using Lucene MatchVersion: LUCENE_50
[junit4:junit4]   2> 1358 T2156 oasc.SolrConfig.<init> Loaded SolrConfig: solrconfig.xml
[junit4:junit4]   2> 1358 T2156 oass.IndexSchema.readSchema Reading Solr Schema
[junit4:junit4]   2> 1358 T2156 oass.IndexSchema.readSchema Schema name=test
[junit4:junit4]   2> 1373 T2156 oass.IndexSchema.readSchema unique key field: id
[junit4:junit4]   2> 1389 T2156 oasc.SolrCore.<init> [collection1] Opening new SolrCore at .\org.apache.solr.handler.TestReplicationHandler$SolrInstance-1351291567988\slave\collection1\, dataDir=.\org.apache.solr.handler.TestReplicationHandler$SolrInstance-1351291567988\slave\collection1\data\
[junit4:junit4]   2> 1389 T2156 oasc.SolrCore.<init> JMX monitoring not detected for core: collection1
[junit4:junit4]   2> 1389 T2156 oasc.SolrCore.initDirectoryFactory org.apache.solr.core.MockDirectoryFactory
[junit4:junit4]   2> 1389 T2156 oasc.CachingDirectoryFactory.injectLockFactory WARNING No lockType configured for MockDirWrapper(org.apache.lucene.store.RAMDirectory@462d51e3 lockFactory=org.apache.lucene.store.SingleInstanceLockFactory@495b3213) assuming 'simple'
[junit4:junit4]   2> 1389 T2156 oasc.CachingDirectoryFactory.get return new directory for C:\Users\JenkinsSlave\workspace\Lucene-Solr-trunk-Windows\solr\build\solr-core\test\J0\.\org.apache.solr.handler.TestReplicationHandler$SolrInstance-1351291567988\slave\collection1\data forceNew:false
[junit4:junit4]   2> 1389 T2156 oasc.CachingDirectoryFactory.close Releasing directory:C:\Users\JenkinsSlave\workspace\Lucene-Solr-trunk-Windows\solr\build\solr-core\test\J0\.\org.apache.solr.handler.TestReplicationHandler$SolrInstance-1351291567988\slave\collection1\data
[junit4:junit4]   2> 1389 T2156 oasc.SolrCore.getNewIndexDir New index directory detected: old=null new=.\org.apache.solr.handler.TestReplicationHandler$SolrInstance-1351291567988\slave\collection1\data\index/
[junit4:junit4]   2> 1389 T2156 oasc.SolrCore.initIndex WARNING [collection1] Solr index directory '.\org.apache.solr.handler.TestReplicationHandler$SolrInstance-1351291567988\slave\collection1\data\index' doesn't exist. Creating new index...
[junit4:junit4]   2> 1389 T2156 oasc.CachingDirectoryFactory.get return new directory for C:\Users\JenkinsSlave\workspace\Lucene-Solr-trunk-Windows\solr\build\solr-core\test\J0\.\org.apache.solr.handler.TestReplicationHandler$SolrInstance-1351291567988\slave\collection1\data\index forceNew:false
[junit4:junit4]   2> 1389 T2156 oasc.SolrDeletionPolicy.onCommit SolrDeletionPolicy.onCommit: commits:num=1
[junit4:junit4]   2> 		commit{dir=MockDirWrapper(org.apache.lucene.store.RAMDirectory@16f4df1a lockFactory=org.apache.lucene.store.SingleInstanceLockFactory@39d2f354),segFN=segments_1,generation=1,filenames=[segments_1]
[junit4:junit4]   2> 1389 T2156 oasc.SolrDeletionPolicy.updateCommits newest commit = 1[segments_1]
[junit4:junit4]   2> 1389 T2156 oasc.CachingDirectoryFactory.close Releasing directory:C:\Users\JenkinsSlave\workspace\Lucene-Solr-trunk-Windows\solr\build\solr-core\test\J0\.\org.apache.solr.handler.TestReplicationHandler$SolrInstance-1351291567988\slave\collection1\data\index
[junit4:junit4]   2> 1389 T2156 oasc.RequestHandlers.initHandlersFromConfig created standard: solr.StandardRequestHandler
[junit4:junit4]   2> 1389 T2156 oasc.RequestHandlers.initHandlersFromConfig created defaults: solr.StandardRequestHandler
[junit4:junit4]   2> 1389 T2156 oasc.RequestHandlers.initHandlersFromConfig adding lazy requestHandler: solr.StandardRequestHandler
[junit4:junit4]   2> 1389 T2156 oasc.RequestHandlers.initHandlersFromConfig created lazy: solr.StandardRequestHandler
[junit4:junit4]   2> 1389 T2156 oasc.RequestHandlers.initHandlersFromConfig created /update: solr.UpdateRequestHandler
[junit4:junit4]   2> 1389 T2156 oasc.RequestHandlers.initHandlersFromConfig created /replication: solr.ReplicationHandler
[junit4:junit4]   2> 1404 T2156 oashl.XMLLoader.init xsltCacheLifetimeSeconds=60
[junit4:junit4]   2> 1404 T2156 oasc.CachingDirectoryFactory.close Releasing directory:C:\Users\JenkinsSlave\workspace\Lucene-Solr-trunk-Windows\solr\build\solr-core\test\J0\.\org.apache.solr.handler.TestReplicationHandler$SolrInstance-1351291567988\slave\collection1\data
[junit4:junit4]   2> 1404 T2156 oass.SolrIndexSearcher.<init> Opening Searcher@39108e45 main
[junit4:junit4]   2> 1404 T2156 oasu.CommitTracker.<init> Hard AutoCommit: disabled
[junit4:junit4]   2> 1404 T2156 oasu.CommitTracker.<init> Soft AutoCommit: disabled
[junit4:junit4]   2> 1404 T2156 oashc.HttpShardHandlerFactory.getParameter Setting socketTimeout to: 0
[junit4:junit4]   2> 1404 T2156 oashc.HttpShardHandlerFactory.getParameter Setting urlScheme to: http://
[junit4:junit4]   2> 1404 T2156 oashc.HttpShardHandlerFactory.getParameter Setting connTimeout to: 0
[junit4:junit4]   2> 1404 T2156 oashc.HttpShardHandlerFactory.getParameter Setting maxConnectionsPerHost to: 20
[junit4:junit4]   2> 1404 T2156 oashc.HttpShardHandlerFactory.getParameter Setting corePoolSize to: 0
[junit4:junit4]   2> 1404 T2156 oashc.HttpShardHandlerFactory.getParameter Setting maximumPoolSize to: 2147483647
[junit4:junit4]   2> 1404 T2156 oashc.HttpShardHandlerFactory.getParameter Setting maxThreadIdleTime to: 5
[junit4:junit4]   2> 1404 T2156 oashc.HttpShardHandlerFactory.getParameter Setting sizeOfQueue to: -1
[junit4:junit4]   2> 1404 T2156 oashc.HttpShardHandlerFactory.getParameter Setting fairnessPolicy to: false
[junit4:junit4]   2> 1404 T2156 oascsi.HttpClientUtil.createClient Creating new http client, config:maxConnectionsPerHost=20&maxConnections=10000&socketTimeout=0&connTimeout=0&retry=false
[junit4:junit4]   2> 1420 T2156 oash.SnapPuller.startExecutorService Poll Scheduled at an interval of 1000ms
[junit4:junit4]   2> 1420 T2197 oasc.SolrCore.registerSearcher [collection1] Registered new searcher Searcher@39108e45 main{StandardDirectoryReader(segments_1:1)}
[junit4:junit4]   2> 1420 T2156 oasc.CoreContainer.register registering core: collection1
[junit4:junit4]   2> 1420 T2156 oass.SolrDispatchFilter.init user.dir=C:\Users\JenkinsSlave\workspace\Lucene-Solr-trunk-Windows\solr\build\solr-core\test\J0
[junit4:junit4]   2> 1420 T2156 oass.SolrDispatchFilter.init SolrDispatchFilter.init() done
[junit4:junit4]   2> 1420 T2156 oascsi.HttpClientUtil.createClient Creating new http client, config:maxConnections=128&maxConnectionsPerHost=32&followRedirects=false
[junit4:junit4]   2> ASYNC  NEW_CORE C174 name=collection1 org.apache.solr.core.SolrCore@24e75534
[junit4:junit4]   2> 1436 T2191 C174 REQ [collection1] webapp=/solr path=/select params={wt=javabin&q=*:*&version=2} hits=0 status=0 QTime=0 
[junit4:junit4]   2> 1561 T2192 C174 REQ [collection1] webapp=/solr path=/select params={wt=javabin&q=*:*&version=2} hits=0 status=0 QTime=0 
[junit4:junit4]   2> 1686 T2193 C174 REQ [collection1] webapp=/solr path=/select params={wt=javabin&q=*:*&version=2} hits=0 status=0 QTime=0 
[junit4:junit4]   2> 1811 T2195 C174 REQ [collection1] webapp=/solr path=/select params={wt=javabin&q=*:*&version=2} hits=0 status=0 QTime=0 
[junit4:junit4]   2> 1936 T2196 C174 REQ [collection1] webapp=/solr path=/select params={wt=javabin&q=*:*&version=2} hits=0 status=0 QTime=0 
[junit4:junit4]   2> 2061 T2191 C174 REQ [collection1] webapp=/solr path=/select params={wt=javabin&q=*:*&version=2} hits=0 status=0 QTime=0 
[junit4:junit4]   2> 2186 T2192 C174 REQ [collection1] webapp=/solr path=/select params={wt=javabin&q=*:*&version=2} hits=0 status=0 QTime=0 
[junit4:junit4]   2> 2311 T2193 C174 REQ [collection1] webapp=/solr path=/select params={wt=javabin&q=*:*&version=2} hits=0 status=0 QTime=0 
[junit4:junit4]   2> 2326 T2181 C173 REQ [collection1] webapp=/solr path=/replication params={command=indexversion&wt=javabin&qt=/replication&version=2} status=0 QTime=0 
[junit4:junit4]   2> 2326 T2198 oash.SnapPuller.fetchLatestIndex Master's generation: 2
[junit4:junit4]   2> 2326 T2198 oash.SnapPuller.fetchLatestIndex Slave's generation: 1
[junit4:junit4]   2> 2326 T2198 oash.SnapPuller.fetchLatestIndex Starting replication process
[junit4:junit4]   2> 2342 T2186 C173 oasc.CachingDirectoryFactory.close Releasing directory:C:\Users\JenkinsSlave\workspace\Lucene-Solr-trunk-Windows\solr\build\solr-core\test\J0\.\org.apache.solr.handler.TestReplicationHandler$SolrInstance-1351291567691\master\collection1\data
[junit4:junit4]   2> 2342 T2186 C173 oasc.CachingDirectoryFactory.close Releasing directory:C:\Users\JenkinsSlave\workspace\Lucene-Solr-trunk-Windows\solr\build\solr-core\test\J0\.\org.apache.solr.handler.TestReplicationHandler$SolrInstance-1351291567691\master\collection1\data\index
[junit4:junit4]   2> 2342 T2186 C173 REQ [collection1] webapp=/solr path=/replication params={command=filelist&generation=2&wt=javabin&qt=/replication&version=2} status=0 QTime=0 
[junit4:junit4]   2> 2342 T2198 oash.SnapPuller.fetchLatestIndex Number of files in latest index in master: 10
[junit4:junit4]   2> 2342 T2198 oasc.CachingDirectoryFactory.injectLockFactory WARNING No lockType configured for MockDirWrapper(org.apache.lucene.store.RAMDirectory@f7796a6 lockFactory=org.apache.lucene.store.SingleInstanceLockFactory@74437438) assuming 'simple'
[junit4:junit4]   2> 2342 T2198 oasc.CachingDirectoryFactory.get return new directory for C:\Users\JenkinsSlave\workspace\Lucene-Solr-trunk-Windows\solr\build\solr-core\test\J0\.\org.apache.solr.handler.TestReplicationHandler$SolrInstance-1351291567988\slave\collection1\data\index.20121026194610033 forceNew:false
[junit4:junit4]   2> 2342 T2198 oasc.CachingDirectoryFactory.close Releasing directory:C:\Users\JenkinsSlave\workspace\Lucene-Solr-trunk-Windows\solr\build\solr-core\test\J0\.\org.apache.solr.handler.TestReplicationHandler$SolrInstance-1351291567988\slave\collection1\data
[junit4:junit4]   2> 2342 T2198 oash.SnapPuller.fetchLatestIndex Starting download to MockDirWrapper(org.apache.lucene.store.RAMDirectory@f7796a6 lockFactory=org.apache.lucene.store.SimpleFSLockFactory@78834429) fullCopy=false
[junit4:junit4]   2> 2358 T2182 C173 REQ [collection1] webapp=/solr path=/replication params={file=_0_Lucene40_0.tim&command=filecontent&checksum=true&compression=true&generation=2&qt=/replication&wt=filestream} status=0 QTime=0 
[junit4:junit4]   2> 2373 T2183 C173 REQ [collection1] webapp=/solr path=/replication params={file=_0.fnm&command=filecontent&checksum=true&compression=true&generation=2&qt=/replication&wt=filestream} status=0 QTime=0 
[junit4:junit4]   2> 2389 T2184 C173 REQ [collection1] webapp=/solr path=/replication params={file=_0_Lucene40_0.frq&command=filecontent&checksum=true&compression=true&generation=2&qt=/replication&wt=filestream} status=0 QTime=0 
[junit4:junit4]   2> 2404 T2185 C173 REQ [collection1] webapp=/solr path=/replication params={file=_0_nrm.cfe&command=filecontent&checksum=true&compression=true&generation=2&qt=/replication&wt=filestream} status=0 QTime=0 
[junit4:junit4]   2> 2420 T2181 C173 REQ [collection1] webapp=/solr path=/replication params={file=segments_2&command=filecontent&checksum=true&compression=true&generation=2&qt=/replication&wt=filestream} status=0 QTime=0 
[junit4:junit4]   2> 2436 T2186 C173 REQ [collection1] webapp=/solr path=/replication params={file=_0.fdx&command=filecontent&checksum=true&compression=true&generation=2&qt=/replication&wt=filestream} status=0 QTime=0 
[junit4:junit4]   2> 2436 T2195 C174 REQ [collection1] webapp=/solr path=/select params={wt=javabin&q=*:*&version=2} hits=0 status=0 QTime=0 
[junit4:junit4]   2> 2451 T2182 C173 REQ [collection1] webapp=/solr path=/replication params={file=_0_nrm.cfs&command=filecontent&checksum=true&compression=true&generation=2&qt=/replication&wt=filestream} status=0 QTime=0 
[junit4:junit4]   2> 2467 T2183 C173 REQ [collection1] webapp=/solr path=/replication params={file=_0.si&command=filecontent&checksum=true&compression=true&generation=2&qt=/replication&wt=filestream} status=0 QTime=0 
[junit4:junit4]   2> 2483 T2184 C173 REQ [collection1] webapp=/solr path=/replication params={file=_0.fdt&command=filecontent&checksum=true&compression=true&generation=2&qt=/replication&wt=filestream} status=0 QTime=0 
[junit4:junit4]   2> 2498 T2185 C173 REQ [collection1] webapp=/solr path=/replication params={file=_0_Lucene40_0.tip&command=filecontent&checksum=true&compression=true&generation=2&qt=/replication&wt=filestream} status=0 QTime=0 
[junit4:junit4]   2> 2498 T2198 oasc.CachingDirectoryFactory.close Releasing directory:C:\Users\JenkinsSlave\workspace\Lucene-Solr-trunk-Windows\solr\build\solr-core\test\J0\.\org.apache.solr.handler.TestReplicationHandler$SolrInstance-1351291567988\slave\collection1\data\index
[junit4:junit4]   2> 2498 T2198 oash.SnapPuller.fetchLatestIndex Total time taken for download : 0 secs
[junit4:junit4]   2> 2498 T2198 oasu.DefaultSolrCoreState.newIndexWriter Creating new IndexWriter...
[junit4:junit4]   2> 2498 T2198 oasu.DefaultSolrCoreState.newIndexWriter Waiting until IndexWriter is unused... core=collection1
[junit4:junit4]   2> 2498 T2198 oasc.CachingDirectoryFactory.close Releasing directory:C:\Users\JenkinsSlave\workspace\Lucene-Solr-trunk-Windows\solr\build\solr-core\test\J0\.\org.apache.solr.handler.TestReplicationHandler$SolrInstance-1351291567988\slave\collection1\data
[junit4:junit4]   2> 2498 T2198 oasc.SolrDeletionPolicy.onInit SolrDeletionPolicy.onInit: commits:num=2
[junit4:junit4]   2> 		commit{dir=MockDirWrapper(org.apache.lucene.store.RAMDirectory@16f4df1a lockFactory=org.apache.lucene.store.SingleInstanceLockFactory@39d2f354),segFN=segments_1,generation=1,filenames=[segments_1]
[junit4:junit4]   2> 		commit{dir=MockDirWrapper(org.apache.lucene.store.RAMDirectory@16f4df1a lockFactory=org.apache.lucene.store.SingleInstanceLockFactory@39d2f354),segFN=segments_2,generation=2,filenames=[_0_Lucene40_0.tim, _0.fnm, _0_Lucene40_0.frq, _0_nrm.cfe, segments_2, _0.fdx, _0_nrm.cfs, _0.si, _0.fdt, _0_Lucene40_0.tip]
[junit4:junit4]   2> 2498 T2198 oasc.SolrDeletionPolicy.updateCommits newest commit = 2[_0_Lucene40_0.tim, _0.fnm, _0_Lucene40_0.frq, _0_nrm.cfe, segments_2, _0.fdx, _0_nrm.cfs, _0.si, _0.fdt, _0_Lucene40_0.tip]
[junit4:junit4]   2> 2498 T2198 oasu.DefaultSolrCoreState.newIndexWriter New IndexWriter is ready to be used.
[junit4:junit4]   2> 2498 T2198 oasc.CachingDirectoryFactory.close Releasing directory:C:\Users\JenkinsSlave\workspace\Lucene-Solr-trunk-Windows\solr\build\solr-core\test\J0\.\org.apache.solr.handler.TestReplicationHandler$SolrInstance-1351291567988\slave\collection1\data
[junit4:junit4]   2> 2498 T2198 oass.SolrIndexSearcher.<init> Opening Searcher@59226a2f main
[junit4:junit4]   2> 2498 T2197 oasc.SolrCore.registerSearcher [collection1] Registered new searcher Searcher@59226a2f main{StandardDirectoryReader(segments_2:4:nrt _0(5.0):C10)}
[junit4:junit4]   2> 2498 T2197 oasc.CachingDirectoryFactory.close Releasing directory:C:\Users\JenkinsSlave\workspace\Lucene-Solr-trunk-Windows\solr\build\solr-core\test\J0\.\org.apache.solr.handler.TestReplicationHandler$SolrInstance-1351291567988\slave\collection1\data\index
[junit4:junit4]   2> 2498 T2198 oasu.DirectUpdateHandler2.commit start commit{flags=0,_version_=0,optimize=false,openSearcher=false,waitSearcher=false,expungeDeletes=false,softCommit=false}
[junit4:junit4]   2> 2498 T2198 oasc.CachingDirectoryFactory.close Releasing directory:C:\Users\JenkinsSlave\workspace\Lucene-Solr-trunk-Windows\solr\build\solr-core\test\J0\.\org.apache.solr.handler.TestReplicationHandler$SolrInstance-1351291567988\slave\collection1\data
[junit4:junit4]   2> 2498 T2198 oasu.DirectUpdateHandler2.commit end_commit_flush
[junit4:junit4]   2> 2498 T2198 oash.SnapPuller.fetchLatestIndex removing temporary index download directory files MockDirWrapper(org.apache.lucene.store.RAMDirectory@f7796a6 lockFactory=org.apache.lucene.store.SimpleFSLockFactory@78834429)
[junit4:junit4]   2> 2498 T2198 oasc.CachingDirectoryFactory.close Releasing directory:C:\Users\JenkinsSlave\workspace\Lucene-Solr-trunk-Windows\solr\build\solr-core\test\J0\.\org.apache.solr.handler.TestReplicationHandler$SolrInstance-1351291567988\slave\collection1\data\index.20121026194610033
[junit4:junit4]   2> 2498 T2198 oasc.CachingDirectoryFactory.close Releasing directory:C:\Users\JenkinsSlave\workspace\Lucene-Solr-trunk-Windows\solr\build\solr-core\test\J0\.\org.apache.solr.handler.TestReplicationHandler$SolrInstance-1351291567988\slave\collection1\data\index
[junit4:junit4]   2> 2561 T2196 C174 REQ [collection1] webapp=/solr path=/select params={wt=javabin&q=*:*&version=2} hits=10 status=0 QTime=0 
[junit4:junit4]   2> 2686 T2181 C173 REQ [collection1] webapp=/solr path=/replication params={command=indexversion&qt=/replication&wt=javabin&version=2} status=0 QTime=0 
[junit4:junit4]   2> 2701 T2186 C173 REQ [collection1] webapp=/solr path=/replication params={command=commits&qt=/replication&wt=javabin&version=2} status=0 QTime=0 
[junit4:junit4]   2> 2717 T2182 oasc.CoreContainer.reload Reloading SolrCore 'collection1' using instanceDir: C:\Users\JenkinsSlave\workspace\Lucene-Solr-trunk-Windows\solr\build\solr-core\test\J0\.\org.apache.solr.handler.TestReplicationHandler$SolrInstance-1351291567691\master\collection1
[junit4:junit4]   2> 2717 T2182 oasc.SolrResourceLoader.<init> new SolrResourceLoader for directory: 'C:\Users\JenkinsSlave\workspace\Lucene-Solr-trunk-Windows\solr\build\solr-core\test\J0\.\org.apache.solr.handler.TestReplicationHandler$SolrInstance-1351291567691\master\collection1\'
[junit4:junit4]   2> 2764 T2182 oasc.SolrConfig.<init> Using Lucene MatchVersion: LUCENE_50
[junit4:junit4]   2> 2858 T2182 oasc.SolrConfig.<init> Loaded SolrConfig: solrconfig.xml
[junit4:junit4]   2> 2858 T2182 oass.IndexSchema.readSchema Reading Solr Schema
[junit4:junit4]   2> 2858 T2182 oass.IndexSchema.readSchema Schema name=test
[junit4:junit4]   2> 2889 T2182 oass.IndexSchema.readSchema unique key field: id
[junit4:junit4]   2> 2889 T2182 oasc.SolrCore.<init> [collection1] Opening new SolrCore at C:\Users\JenkinsSlave\workspace\Lucene-Solr-trunk-Windows\solr\build\solr-core\test\J0\.\org.apache.solr.handler.TestReplicationHandler$SolrInstance-1351291567691\master\collection1\, dataDir=.\org.apache.solr.handler.TestReplicationHandler$SolrInstance-1351291567691\master\collection1\data\
[junit4:junit4]   2> 2889 T2182 oasc.SolrCore.<init> JMX monitoring not detected for core: collection1
[junit4:junit4]   2> 2889 T2182 oasc.CachingDirectoryFactory.close Releasing directory:C:\Users\JenkinsSlave\workspace\Lucene-Solr-trunk-Windows\solr\build\solr-core\test\J0\.\org.apache.solr.handler.TestReplicationHandler$SolrInstance-1351291567691\master\collection1\data
[junit4:junit4]   2> 2889 T2182 oasc.SolrCore.getNewIndexDir New index directory detected: old=null new=.\org.apache.solr.handler.TestReplicationHandler$SolrInstance-1351291567691\master\collection1\data\index/
[junit4:junit4]   2> 2889 T2182 oasc.RequestHandlers.initHandlersFromConfig created standard: solr.StandardRequestHandler
[junit4:junit4]   2> 2889 T2182 oasc.RequestHandlers.initHandlersFromConfig created /replication: solr.ReplicationHandler
[junit4:junit4]   2> 2889 T2182 oasc.RequestHandlers.initHandlersFromConfig created defaults: solr.StandardRequestHandler
[junit4:junit4]   2> 2889 T2182 oasc.RequestHandlers.initHandlersFromConfig adding lazy requestHandler: solr.StandardRequestHandler
[junit4:junit4]   2> 2889 T2182 oasc.RequestHandlers.initHandlersFromConfig created lazy: solr.StandardRequestHandler
[junit4:junit4]   2> 2889 T2182 oasc.RequestHandlers.initHandlersFromConfig created /update: solr.UpdateRequestHandler
[junit4:junit4]   2> 2889 T2182 oashl.XMLLoader.init xsltCacheLifetimeSeconds=60
[junit4:junit4]   2> 2904 T2182 oasc.CachingDirectoryFactory.close Releasing directory:C:\Users\JenkinsSlave\workspace\Lucene-Solr-trunk-Windows\solr\build\solr-core\test\J0\.\org.apache.solr.handler.TestReplicationHandler$SolrInstance-1351291567691\master\collection1\data
[junit4:junit4]   2> 2904 T2182 oass.SolrIndexSearcher.<init> Opening Searcher@6f0d8249 main
[junit4:junit4]   2> 2904 T2182 oasu.CommitTracker.<init> Hard AutoCommit: disabled
[junit4:junit4]   2> 2904 T2182 oasu.CommitTracker.<init> Soft AutoCommit: disabled
[junit4:junit4]   2> 2904 T2182 oash.ReplicationHandler.inform Replication enabled for following config files: schema.xml
[junit4:junit4]   2> 2904 T2182 oash.ReplicationHandler.inform Commits will be reserved for  10000
[junit4:junit4]   2> 2904 T2200 oasc.SolrCore.registerSearcher [collection1] Registered new searcher Searcher@6f0d8249 main{StandardDirectoryReader(segments_2:4:nrt _0(5.0):C10)}
[junit4:junit4]   2> 2904 T2182 oasc.CoreContainer.register replacing core: collection1
[junit4:junit4]   2> 2904 T2182 oasc.SolrCore.close [collection1]  CLOSING SolrCore org.apache.solr.core.SolrCore@5a3d4f8d
[junit4:junit4]   2> 2904 T2182 oasu.DirectUpdateHandler2.close closing DirectUpdateHandler2{commits=1,autocommits=0,soft autocommits=0,optimizes=0,rollbacks=0,expungeDeletes=0,docsPending=0,adds=0,deletesById=0,deletesByQuery=0,errors=0,cumulative_adds=10,cumulative_deletesById=0,cumulative_deletesByQuery=1,cumulative_errors=0}
[junit4:junit4]   2> 2904 T2182 oasc.SolrCore.closeSearcher [collection1] Closing main searcher on request.
[junit4:junit4]   2> 2904 T2182 oasc.CachingDirectoryFactory.close Releasing directory:C:\Users\JenkinsSlave\workspace\Lucene-Solr-trunk-Windows\solr\build\solr-core\test\J0\.\org.apache.solr.handler.TestReplicationHandler$SolrInstance-1351291567691\master\collection1\data\index
[junit4:junit4]   2> ASYNC  NEW_CORE C175 name=collection1 org.apache.solr.core.SolrCore@7850e028
[junit4:junit4]   2> 2936 T2184 C175 REQ [collection1] webapp=/solr path=/replication params={command=indexversion&qt=/replication&wt=javabin&version=2} status=0 QTime=0 
[junit4:junit4]   2> 2951 T2185 C175 REQ [collection1] webapp=/solr path=/replication params={command=commits&qt=/replication&wt=javabin&version=2} status=0 QTime=0 
[junit4:junit4]   2> 2967 T2181 C175 UPDATE [collection1] webapp=/solr path=/update params={wt=javabin&version=2} {add=[110]} 0 0
[junit4:junit4]   2> 2983 T2186 C175 UPDATE [collection1] webapp=/solr path=/update params={wt=javabin&version=2} {add=[120]} 0 0
[junit4:junit4]   2> 2998 T2183 C175 oasu.DirectUpdateHandler2.commit start commit{flags=0,_version_=0,optimize=false,openSearcher=true,waitSearcher=true,expungeDeletes=false,softCommit=false}
[junit4:junit4]   2> 2998 T2183 C175 oasc.SolrDeletionPolicy.onCommit SolrDeletionPolicy.onCommit: commits:num=2
[junit4:junit4]   2> 		commit{dir=MockDirWrapper(org.apache.lucene.store.SimpleFSDirectory@C:\Users\JenkinsSlave\workspace\Lucene-Solr-trunk-Windows\solr\build\solr-core\test\J0\index4507745085tmp lockFactory=org.apache.lucene.store.SingleInstanceLockFactory@64d807a9),segFN=segments_2,generation=2,filenames=[_0_Lucene40_0.tim, _0.fnm, _0_Lucene40_0.frq, _0_nrm.cfe, segments_2, _0.fdx, _0_nrm.cfs, _0.si, _0.fdt, _0_Lucene40_0.tip]
[junit4:junit4]   2> 		commit{dir=MockDirWrapper(org.apache.lucene.store.SimpleFSDirectory@C:\Users\JenkinsSlave\workspace\Lucene-Solr-trunk-Windows\solr\build\solr-core\test\J0\index4507745085tmp lockFactory=org.apache.lucene.store.SingleInstanceLockFactory@64d807a9),segFN=segments_3,generation=3,filenames=[_1_Lucene40_0.tim, _1_nrm.cfs, _0_Lucene40_0.tim, _0.fnm, _1_Lucene40_0.frq, _0_nrm.cfs, _1.fnm, _1_Lucene40_0.tip, _1_nrm.cfe, _0_Lucene40_0.tip, _1.fdx, _0_Lucene40_0.frq, _1.fdt, _1.si, _0_nrm.cfe, _0.fdx, _0.si, segments_3, _0.fdt]
[junit4:junit4]   2> 2998 T2183 C175 oasc.SolrDeletionPolicy.updateCommits newest commit = 3[_1_Lucene40_0.tim, _1_nrm.cfs, _0_Lucene40_0.tim, _0.fnm, _1_Lucene40_0.frq, _0_nrm.cfs, _1.fnm, _1_Lucene40_0.tip, _1_nrm.cfe, _0_Lucene40_0.tip, _1.fdx, _0_Lucene40_0.frq, _1.fdt, _1.si, _0_nrm.cfe, _0.fdx, _0.si, segments_3, _0.fdt]
[junit4:junit4]   2> 2998 T2183 C175 oasc.CachingDirectoryFactory.close Releasing directory:C:\Users\JenkinsSlave\workspace\Lucene-Solr-trunk-Windows\solr\build\solr-core\test\J0\.\org.apache.solr.handler.TestReplicationHandler$SolrInstance-1351291567691\master\collection1\data
[junit4:junit4]   2> 3014 T2183 C175 oass.SolrIndexSearcher.<init> Opening Searcher@6a7e785b main
[junit4:junit4]   2> 3014 T2183 C175 oasu.DirectUpdateHandler2.commit end_commit_flush
[junit4:junit4]   2> 3014 T2200 oasc.SolrCore.registerSearcher [collection1] Registered new searcher Searcher@6a7e785b main{StandardDirectoryReader(segments_3:6:nrt _0(5.0):C10 _1(5.0):C2)}
[junit4:junit4]   2> 3014 T2200 oasc.CachingDirectoryFactory.close Releasing directory:C:\Users\JenkinsSlave\workspace\Lucene-Solr-trunk-Windows\solr\build\solr-core\test\J0\.\org.apache.solr.handler.TestReplicationHandler$SolrInstance-1351291567691\master\collection1\data\index
[junit4:junit4]   2> 3014 T2183 C175 UPDATE [collection1] webapp=/solr path=/update params={waitSearcher=true&wt=javabin&commit=true&softCommit=false&version=2} {commit=} 0 16
[junit4:junit4]   2> 3029 T2182 C175 REQ [collection1] webapp=/solr path=/select params={wt=javabin&q=*:*&version=2} hits=12 status=0 QTime=0 
[junit4:junit4]   2> 3154 T2194 C174 REQ [collection1] webapp=/solr path=/select params={wt=javabin&q=*:*&version=2} hits=10 status=0 QTime=0 
[junit4:junit4]   2> 3279 T2192 C174 REQ [collection1] webapp=/solr path=/select params={wt=javabin&q=*:*&version=2} hits=10 status=0 QTime=0 
[junit4:junit4]   2> 3342 T2184 C175 REQ [collection1] webapp=/solr path=/replication params={command=indexversion&wt=javabin&qt=/replication&version=2} status=0 QTime=0 
[junit4:junit4]   2> 3342 T2198 oash.SnapPuller.fetchLatestIndex Master's generation: 3
[junit4:junit4]   2> 3342 T2198 oash.SnapPuller.fetchLatestIndex Slave's generation: 2
[junit4:junit4]   2> 3342 T2198 oash.SnapPuller.fetchLatestIndex Starting replication process
[junit4:junit4]   2> 3358 T2181 C175 oasc.CachingDirectoryFactory.close Releasing directory:C:\Users\JenkinsSlave\workspace\Lucene-Solr-trunk-Windows\solr\build\solr-core\test\J0\.\org.apache.solr.handler.TestReplicationHandler$SolrInstance-1351291567691\master\collection1\data
[junit4:junit4]   2> 3358 T2181 C175 oasc.CachingDirectoryFactory.close Releasing directory:C:\Users\JenkinsSlave\workspace\Lucene-Solr-trunk-Windows\solr\build\solr-core\test\J0\.\org.apache.solr.handler.TestReplicationHandler$SolrInstance-1351291567691\master\collection1\data\index
[junit4:junit4]   2> 3358 T2181 C175 REQ [collection1] webapp=/solr path=/replication params={command=filelist&generation=3&wt=javabin&qt=/replication&version=2} status=0 QTime=0 
[junit4:junit4]   2> 3358 T2198 oash.SnapPuller.fetchLatestIndex Number of files in latest index in master: 19
[junit4:junit4]   2> 3358 T2198 oasc.CachingDirectoryFactory.injectLockFactory WARNING No lockType configured for MockDirWrapper(org.apache.lucene.store.RAMDirectory@3795d406 lockFactory=org.apache.lucene.store.SingleInstanceLockFactory@4d92f26c) assuming 'simple'
[junit4:junit4]   2> 3358 T2198 oasc.CachingDirectoryFactory.get return new directory for C:\Users\JenkinsSlave\workspace\Lucene-Solr-trunk-Windows\solr\build\solr-core\test\J0\.\org.apache.solr.handler.TestReplicationHandler$SolrInstance-1351291567988\slave\collection1\data\index.20121026194611049 forceNew:false
[junit4:junit4]   2> 3358 T2198 oasc.CachingDirectoryFactory.close Releasing directory:C:\Users\JenkinsSlave\workspace\Lucene-Solr-trunk-Windows\solr\build\solr-core\test\J0\.\org.apache.solr.handler.TestReplicationHandler$SolrInstance-1351291567988\slave\collection1\data
[junit4:junit4]   2> 3358 T2198 oash.SnapPuller.fetchLatestIndex Starting download to MockDirWrapper(org.apache.lucene.store.RAMDirectory@3795d406 lockFactory=org.apache.lucene.store.SimpleFSLockFactory@6a69b83d) fullCopy=false
[junit4:junit4]   2> 3373 T2186 C175 REQ [collection1] webapp=/solr path=/replication params={file=_1_Lucene40_0.tim&command=filecontent&checksum=true&compression=true&generation=3&qt=/replication&wt=filestream} status=0 QTime=0 
[junit4:junit4]   2> 3389 T2183 C175 REQ [collection1] webapp=/solr path=/replication params={file=_1_nrm.cfs&command=filecontent&checksum=true&compression=true&generation=3&qt=/replication&wt=filestream} status=0 QTime=0 
[junit4:junit4]   2> 3389 T2198 oash.SnapPuller.downloadIndexFiles Skipping download for _0_Lucene40_0.tim
[junit4:junit4]   2> 3389 T2198 oash.SnapPuller.downloadIndexFiles Skipping download for _0.fnm
[junit4:junit4]   2> 3404 T2182 C175 REQ [collection1] webapp=/solr path=/replication params={file=_1_Lucene40_0.frq&command=filecontent&checksum=true&compression=true&generation=3&qt=/replication&wt=filestream} status=0 QTime=0 
[junit4:junit4]   2> 3404 T2198 oash.SnapPuller.downloadIndexFiles Skipping download for _0_nrm.cfs
[junit4:junit4]   2> 3404 T2193 C174 REQ [collection1] webapp=/solr path=/select params={wt=javabin&q=*:*&version=2} hits=10 status=0 QTime=0 
[junit4:junit4]   2> 3420 T2185 C175 REQ [collection1] webapp=/solr path=/replication params={file=_1.fnm&command=filecontent&checksum=true&compression=true&generation=3&qt=/replication&wt=filestream} status=0 QTime=0 
[junit4:junit4]   2> 3420 T2198 oash.SnapPuller.downloadIndexFiles Skipping download for _0_Lucene40_0.tip
[junit4:junit4]   2> 3436 T2184 C175 REQ [collection1] webapp=/solr path=/replication params={file=_1_nrm.cfe&command=filecontent&checksum=true&compression=true&generation=3&qt=/replication&wt=filestream} status=0 QTime=0 
[junit4:junit4]   2> 3451 T2181 C175 REQ [collection1] webapp=/solr path=/replication params={file=_1_Lucene40_0.tip&command=filecontent&checksum=true&compression=true&generation=3&qt=/replication&wt=filestream} status=0 QTime=0 
[junit4:junit4]   2> 3467 T2186 C175 REQ [collection1] webapp=/solr path=/replication params={file=_1.fdx&command=filecontent&checksum=true&compression=true&generation=3&qt=/replication&wt=filestream} status=0 QTime=0 
[junit4:junit4]   2> 3467 T2198 oash.SnapPuller.downloadIndexFiles Skipping download for _0_Lucene40_0.frq
[junit4:junit4]   2> 3483 T2183 C175 REQ [collection1] webapp=/solr path=/replication params={file=_1.fdt&command=filecontent&checksum=true&compression=true&generation=3&qt=/replication&wt=filestream} status=0 QTime=0 
[junit4:junit4]   2> 3498 T2182 C175 REQ [collection1] webapp=/solr path=/replication params={file=_1.si&command=filecontent&checksum=true&compression=true&generation=3&qt=/replication&wt=filestream} status=0 QTime=0 
[junit4:junit4]   2> 3498 T2198 oash.SnapPuller.downloadIndexFiles Skipping download for _0_nrm.cfe
[junit4:junit4]   2> 3498 T2198 oash.SnapPuller.downloadIndexFiles Skipping download for _0.fdx
[junit4:junit4]   2> 3498 T2198 oash.SnapPuller.downloadIndexFiles Skipping download for _0.si
[junit4:junit4]   2> 3498 T2198 oash.SnapPuller.downloadIndexFiles Skipping download for _0.fdt
[junit4:junit4]   2> 3514 T2185 C175 REQ [collection1] webapp=/solr path=/replication params={file=segments_3&command=filecontent&checksum=true&compression=true&generation=3&qt=/replication&wt=filestream} status=0 QTime=0 
[junit4:junit4]   2> 3514 T2198 oasc.CachingDirectoryFactory.close Releasing directory:C:\Users\JenkinsSlave\workspace\Lucene-Solr-trunk-Windows\solr\build\solr-core\test\J0\.\org.apache.solr.handler.TestReplicationHandler$SolrInstance-1351291567988\slave\collection1\data\index
[junit4:junit4]   2> 3514 T2198 oash.SnapPuller.fetchLatestIndex Total time taken for download : 0 secs
[junit4:junit4]   2> 3514 T2198 oasu.DefaultSolrCoreState.newIndexWriter Creating new IndexWriter...
[junit4:junit4]   2> 3514 T2198 oasu.DefaultSolrCoreState.newIndexWriter Waiting until IndexWriter is unused... core=collection1
[junit4:junit4]   2> 3514 T2198 oasu.DefaultSolrCoreState.newIndexWriter Closing old IndexWriter... core=collection1
[junit4:junit4]   2> 3514 T2198 oasc.CachingDirectoryFactory.close Releasing directory:C:\Users\JenkinsSlave\workspace\Lucene-Solr-trunk-Windows\solr\build\solr-core\test\J0\.\org.apache.solr.handler.TestReplicationHandler$SolrInstance-1351291567988\slave\collection1\data\index
[junit4:junit4]   2> 3514 T2198 oasc.CachingDirectoryFactory.close Releasing directory:C:\Users\JenkinsSlave\workspace\Lucene-Solr-trunk-Windows\solr\build\solr-core\test\J0\.\org.apache.solr.handler.TestReplicationHandler$SolrInstance-1351291567988\slave\collection1\data
[junit4:junit4]   2> 3514 T2198 oasc.SolrDeletionPolicy.onInit SolrDeletionPolicy.onInit: commits:num=2
[junit4:junit4]   2> 		commit{dir=MockDirWrapper(org.apache.lucene.store.RAMDirectory@16f4df1a lockFactory=org.apache.lucene.store.SingleInstanceLockFactory@39d2f354),segFN=segments_2,generation=2,filenames=[_0_Lucene40_0.tim, _0.fnm, _0_Lucene40_0.frq, _0_nrm.cfe, segments_2, _0.fdx, _0_nrm.cfs, _0.si, _0.fdt, _0_Lucene40_0.tip]
[junit4:junit4]   2> 		commit{dir=MockDirWrapper(org.apache.lucene.store.RAMDirectory@16f4df1a lockFactory=org.apache.lucene.store.SingleInstanceLockFactory@39d2f354),segFN=segments_3,generation=3,filenames=[_1_Lucene40_0.tim, _1_nrm.cfs, _0_Lucene40_0.tim, _0.fnm, _1_Lucene40_0.frq, _0_nrm.cfs, _1.fnm, _1_nrm.cfe, _1_Lucene40_0.tip, _0_Lucene40_0.tip, _1.fdx, _0_Lucene40_0.frq, _1.fdt, _1.si, _0_nrm.cfe, _0.fdx, _0.si, segments_3, _0.fdt]
[junit4:junit4]   2> 3514 T2198 oasc.SolrDeletionPolicy.updateCommits newest commit = 3[_1_Lucene40_0.tim, _1_nrm.cfs, _0_Lucene40_0.tim, _0.fnm, _1_Lucene40_0.frq, _0_nrm.cfs, _1.fnm, _1_nrm.cfe, _1_Lucene40_0.tip, _0_Lucene40_0.tip, _1.fdx, _0_Lucene40_0.frq, _1.fdt, _1.si, _0_nrm.cfe, _0.fdx, _0.si, segments_3, _0.fdt]
[junit4:junit4]   2> 3514 T2198 oasu.DefaultSolrCoreState.newIndexWriter New IndexWriter is ready to be used.
[junit4:junit4]   2> 3514 T2198 oasc.CachingDirectoryFactory.close Releasing directory:C:\Users\JenkinsSlave\workspace\Lucene-Solr-trunk-Windows\solr\build\solr-core\test\J0\.\org.apache.solr.handler.TestReplicationHandler$SolrInstance-1351291567988\slave\collection1\data
[junit4:junit4]   2> 3514 T2198 oass.SolrIndexSearcher.<init> Opening Searcher@49c04713 main
[junit4:junit4]   2> 3514 T2197 oasc.SolrCore.registerSearcher [collection1] Registered new searcher Searcher@49c04713 main{StandardDirectoryReader(segments_3:6:nrt _0(5.0):C10 _1(5.0):C2)}
[junit4:junit4]   2> 3514 T2197 oasc.CachingDirectoryFactory.close Releasing directory:C:\Users\JenkinsSlave\workspace\Lucene-Solr-trunk-Windows\solr\build\solr-core\test\J0\.\org.apache.solr.handler.TestReplicationHandler$SolrInstance-1351291567988\slave\collection1\data\index
[junit4:junit4]   2> 3514 T2198 oasu.DirectUpdateHandler2.commit start commit{flags=0,_version_=0,optimize=false,openSearcher=false,waitSearcher=false,expungeDeletes=false,softCommit=false}
[junit4:junit4]   2> 3514 T2198 oasc.CachingDirectoryFactory.close Releasing directory:C:\Users\JenkinsSlave\workspace\Lucene-Solr-trunk-Windows\solr\build\solr-core\test\J0\.\org.apache.solr.handler.TestReplicationHandler$SolrInstance-1351291567988\slave\collection1\data
[junit4:junit4]   2> 3514 T2198 oasu.DirectUpdateHandler2.commit end_commit_flush
[junit4:junit4]   2> 3514 T2198 oash.SnapPuller.fetchLatestIndex removing temporary index download directory files MockDirWrapper(org.apache.lucene.store.RAMDirectory@3795d406 lockFactory=org.apache.lucene.store.SimpleFSLockFactory@6a69b83d)
[junit4:junit4]   2> 3514 T2198 oasc.CachingDirectoryFactory.close Releasing directory:C:\Users\JenkinsSlave\workspace\Lucene-Solr-trunk-Windows\solr\build\solr-core\test\J0\.\org.apache.solr.handler.TestReplicationHandler$SolrInstance-1351291567988\slave\collection1\data\index.20121026194611049
[junit4:junit4]   2> 3514 T2198 oasc.CachingDirectoryFactory.close Releasing directory:C:\Users\JenkinsSlave\workspace\Lucene-Solr-trunk-Windows\solr\build\solr-core\test\J0\.\org.apache.solr.handler.TestReplicationHandler$SolrInstance-1351291567988\slave\collection1\data\index
[junit4:junit4]   2> 3529 T2196 C174 REQ [collection1] webapp=/solr path=/select params={wt=javabin&q=*:*&version=2} hits=12 status=0 QTime=0 
[junit4:junit4]   2> 3654 T2156 oasc.CoreContainer.shutdown Shutting down CoreContainer instance=1533563812
[junit4:junit4]   2> 3654 T2156 oasc.SolrCore.close [collection1]  CLOSING SolrCore org.apache.solr.core.SolrCore@7850e028
[junit4:junit4]   2> 3654 T2156 oasu.DirectUpdateHandler2.close closing DirectUpdateHandler2{commits=1,autocommits=0,soft autocommits=0,optimizes=0,rollbacks=0,expungeDeletes=0,docsPending=0,adds=0,deletesById=0,deletesByQuery=0,errors=0,cumulative_adds=2,cumulative_deletesById=0,cumulative_deletesByQuery=0,cumulative_errors=0}
[junit4:junit4]   2> 3654 T2156 oasc.SolrCore.decrefSolrCoreState Closing SolrCoreState
[junit4:junit4]   2> 3654 T2156 oasu.DefaultSolrCoreState.closeIndexWriter SolrCoreState ref count has reached 0 - closing IndexWriter
[junit4:junit4]   2> 3654 T2156 oasu.DefaultSolrCoreState.closeIndexWriter closing IndexWriter with IndexWriterCloser
[junit4:junit4]   2> 3654 T2156 C175 oasc.CachingDirectoryFactory.close Releasing directory:C:\Users\JenkinsSlave\workspace\Lucene-Solr-trunk-Windows\solr\build\solr-core\test\J0\.\org.apache.solr.handler.TestReplicationHandler$SolrInstance-1351291567691\master\collection1\data\index
[junit4:junit4]   2> 3654 T2156 oasc.SolrCore.closeSearcher [collection1] Closing main searcher on request.
[junit4:junit4]   2> 3654 T2156 oasc.CachingDirectoryFactory.close Releasing directory:C:\Users\JenkinsSlave\workspace\Lucene-Solr-trunk-Windows\solr\build\solr-core\test\J0\.\org.apache.solr.handler.TestReplicationHandler$SolrInstance-1351291567691\master\collection1\data\index
[junit4:junit4]   2> 3654 T2156 oejsh.ContextHandler.doStop stopped o.e.j.s.ServletContextHandler{/solr,null}
[junit4:junit4]   2> 3707 T2156 oejs.Server.doStart jetty-8.1.2.v20120308
[junit4:junit4]   2> 3708 T2156 oejs.AbstractConnector.doStart Started SelectChannelConnector@0.0.0.0:51704
[junit4:junit4]   2> 3724 T2156 oasc.SolrResourceLoader.locateSolrHome JNDI not configured for solr (NoInitialContextEx)
[junit4:junit4]   2> 3724 T2156 oasc.SolrResourceLoader.locateSolrHome using system property solr.solr.home: .\org.apache.solr.handler.TestReplicationHandler$SolrInstance-1351291567691\master
[junit4:junit4]   2> 3724 T2156 oasc.SolrResourceLoader.<init> new SolrResourceLoader for deduced Solr Home: '.\org.apache.solr.handler.TestReplicationHandler$SolrInstance-1351291567691\master\'
[junit4:junit4]   2> 3771 T2156 oass.SolrDispatchFilter.init SolrDispatchFilter.init()
[junit4:junit4]   2> 3771 T2156 oasc.SolrResourceLoader.locateSolrHome JNDI not configured for solr (NoInitialContextEx)
[junit4:junit4]   2> 3771 T2156 oasc.SolrResourceLoader.locateSolrHome using system property solr.solr.home: .\org.apache.solr.handler.TestReplicationHandler$SolrInstance-1351291567691\master
[junit4:junit4]   2> 3771 T2156 oasc.CoreContainer$Initializer.initialize looking for solr.xml: C:\Users\JenkinsSlave\workspace\Lucene-Solr-trunk-Windows\solr\build\solr-core\test\J0\.\org.apache.solr.handler.TestReplicationHandler$SolrInstance-1351291567691\master\solr.xml
[junit4:junit4]   2> 3771 T2156 oasc.CoreContainer.<init> New CoreContainer 500399958
[junit4:junit4]   2> 3771 T2156 oasc.CoreContainer$Initializer.initialize no solr.xml file found - using default
[junit4:junit4]   2> 3771 T2156 oasc.CoreContainer.load Loading CoreContainer using Solr Home: '.\org.apache.solr.handler.TestReplicationHandler$SolrInstance-1351291567691\master\'
[junit4:junit4]   2> 3771 T2156 oasc.SolrResourceLoader.<init> new SolrResourceLoader for directory: '.\org.apache.solr.handler.TestReplicationHandler$SolrInstance-1351291567691\master\'
[junit4:junit4]   2> 3802 T2156 oasc.CoreContainer.load Registering Log Listener
[junit4:junit4]   2> 3833 T2156 oasc.CoreContainer.create Creating SolrCore 'collection1' using instanceDir: .\org.apache.solr.handler.TestReplicationHandler$SolrInstance-1351291567691\master\collection1
[junit4:junit4]   2> 3833 T2156 oasc.SolrResourceLoader.<init> new SolrResourceLoader for directory: '.\org.apache.solr.handler.TestReplicationHandler$SolrInstance-1351291567691\master\collection1\'
[junit4:junit4]   2> 3896 T2156 oasc.SolrConfig.<init> Using Lucene MatchVersion: LUCENE_50
[junit4:junit4]   2> 3942 T2156 oasc.SolrConfig.<init> Loaded SolrConfig: solrconfig.xml
[junit4:junit4]   2> 3942 T2156 oass.IndexSchema.readSchema Reading Solr Schema
[junit4:junit4]   2> 3942 T2156 oass.IndexSchema.readSchema Schema name=test
[junit4:junit4]   2> 3958 T2156 oass.IndexSchema.readSchema unique key field: id
[junit4:junit4]   2> 3958 T2156 oasc.SolrCore.<init> [collection1] Opening new SolrCore at .\org.apache.solr.handler.TestReplicationHandler$SolrInstance-1351291567691\master\collection1\, dataDir=.\org.apache.solr.handler.TestReplicationHandler$SolrInstance-1351291567691\master\collection1\data\
[junit4:junit4]   2> 3974 T2156 oasc.SolrCore.<init> JMX monitoring not detected for core: collection1
[junit4:junit4]   2> 3974 T2156 oasc.SolrCore.initDirectoryFactory org.apache.solr.core.MockDirectoryFactory
[junit4:junit4]   2> 3974 T2156 oasc.CachingDirectoryFactory.injectLockFactory WARNING No lockType configured for MockDirWrapper(NRTCachingDirectory(org.apache.lucene.store.SimpleFSDirectory@C:\Users\JenkinsSlave\workspace\Lucene-Solr-trunk-Windows\solr\build\solr-core\test\J0\index4507745086tmp lockFactory=org.apache.lucene.store.NativeFSLockFactory@c1c03f0; maxCacheMB=0.90625 maxMergeSizeMB=0.8349609375)) assuming 'simple'
[junit4:junit4]   2> 3974 T2156 oasc.CachingDirectoryFactory.get return new directory for C:\Users\JenkinsSlave\workspace\Lucene-Solr-trunk-Windows\solr\build\solr-core\test\J0\.\org.apache.solr.handler.TestReplicationHandler$SolrInstance-1351291567691\master\collection1\data forceNew:false
[junit4:junit4]   2> 3974 T2156 oasc.CachingDirectoryFactory.close Releasing directory:C:\Users\JenkinsSlave\workspace\Lucene-Solr-trunk-Windows\solr\build\solr-core\test\J0\.\org.apache.solr.handler.TestReplicationHandler$SolrInstance-1351291567691\master\collection1\data
[junit4:junit4]   2> 3974 T2156 oasc.SolrCore.getNewIndexDir New index directory detected: old=null new=.\org.apache.solr.handler.TestReplicationHandler$SolrInstance-1351291567691\master\collection1\data\index/
[junit4:junit4]   2> 3974 T2156 oasc.SolrCore.initIndex WARNING [collection1] Solr index directory '.\org.apache.solr.handler.TestReplicationHandler$SolrInstance-1351291567691\master\collection1\data\index' doesn't exist. Creating new index...
[junit4:junit4]   2> 3974 T2156 oasc.CachingDirectoryFactory.get return new directory for C:\Users\JenkinsSlave\workspace\Lucene-Solr-trunk-Windows\solr\build\solr-core\test\J0\.\org.apache.solr.handler.TestReplicationHandler$SolrInstance-1351291567691\master\collection1\data\index forceNew:false
[junit4:junit4]   2> 3974 T2156 oasc.SolrDeletionPolicy.onCommit SolrDeletionPolicy.onCommit: commits:num=1
[junit4:junit4]   2> 		commit{dir=BaseDirectoryWrapper(org.apache.lucene.store.RAMDirectory@701af9cb lockFactory=org.apache.lucene.store.SingleInstanceLockFactory@7b05b7ec),segFN=segments_1,generation=1,filenames=[segments_1]
[junit4:junit4]   2> 3974 T2156 oasc.SolrDeletionPolicy.updateCommits newest commit = 1[segments_1]
[junit4:junit4]   2> 3974 T2156 oasc.CachingDirectoryFactory.close Releasing directory:C:\Users\JenkinsSlave\workspace\Lucene-Solr-trunk-Windows\solr\build\solr-core\test\J0\.\org.apache.solr.handler.TestReplicationHandler$SolrInstance-1351291567691\master\collection1\data\index
[junit4:junit4]   2> 3974 T2156 oasc.RequestHandlers.initHandlersFromConfig created standard: solr.StandardRequestHandler
[junit4:junit4]   2> 3974 T2156 oasc.RequestHandlers.initHandlersFromConfig created /replication: solr.ReplicationHandler
[junit4:junit4]   2> 3974 T2156 oasc.RequestHandlers.initHandlersFromConfig created defaults: solr.StandardRequestHandler
[junit4:junit4]   2> 3974 T2156 oasc.RequestHandlers.initHandlersFromConfig adding lazy requestHandler: solr.StandardRequestHandler
[junit4:junit4]   2> 3974 T2156 oasc.RequestHandlers.initHandlersFromConfig created lazy: solr.StandardRequestHandler
[junit4:junit4]   2> 3974 T2156 oasc.RequestHandlers.initHandlersFromConfig created /update: solr.UpdateRequestHandler
[junit4:junit4]   2> 3989 T2156 oashl.XMLLoader.init xsltCacheLifetimeSeconds=60
[junit4:junit4]   2> 3989 T2156 oasc.CachingDirectoryFactory.close Releasing directory:C:\Users\JenkinsSlave\workspace\Lucene-Solr-trunk-Windows\solr\build\solr-core\test\J0\.\org.apache.solr.handler.TestReplicationHandler$SolrInstance-1351291567691\master\collection1\data
[junit4:junit4]   2> 3989 T2156 oass.SolrIndexSearcher.<init> Opening Searcher@1d055d5b main
[junit4:junit4]   2> 3989 T2156 oasu.CommitTracker.<init> Hard AutoCommit: disabled
[junit4:junit4]   2> 3989 T2156 oasu.CommitTracker.<init> Soft AutoCommit: disabled
[junit4:junit4]   2> 3989 T2156 oashc.HttpShardHandlerFactory.getParameter Setting socketTimeout to: 0
[junit4:junit4]   2> 3989 T2156 oashc.HttpShardHandlerFactory.getParameter Setting urlScheme to: http://
[junit4:junit4]   2> 3989 T2156 oashc.HttpShardHandlerFactory.getParameter Setting connTimeout to: 0
[junit4:junit4]   2> 3989 T2156 oashc.HttpShardHandlerFactory.getParameter Setting maxConnectionsPerHost to: 20
[junit4:junit4]   2> 3989 T2156 oashc.HttpShardHandlerFactory.getParameter Setting corePoolSize to: 0
[junit4:junit4]   2> 3989 T2156 oashc.HttpShardHandlerFactory.getParameter Setting maximumPoolSize to: 2147483647
[junit4:junit4]   2> 3989 T2156 oashc.HttpShardHandlerFactory.getParameter Setting maxThreadIdleTime to: 5
[junit4:junit4]   2> 3989 T2156 oashc.HttpShardHandlerFactory.getParameter Setting sizeOfQueue to: -1
[junit4:junit4]   2> 3989 T2156 oashc.HttpShardHandlerFactory.getParameter Setting fairnessPolicy to: false
[junit4:junit4]   2> 4005 T2156 oascsi.HttpClientUtil.createClient Creating new http client, config:maxConnectionsPerHost=20&maxConnections=10000&socketTimeout=0&connTimeout=0&retry=false
[junit4:junit4]   2> 4005 T2156 oash.ReplicationHandler.inform Replication enabled for following config files: schema.xml,xslt/dummy.xsl
[junit4:junit4]   2> 4005 T2156 oash.ReplicationHandler.inform Commits will be reserved for  10000
[junit4:junit4]   2> 4005 T2156 oasc.CoreContainer.register registering core: collection1
[junit4:junit4]   2> 4005 T2211 oasc.SolrCore.registerSearcher [collection1] Registered new searcher Searcher@1d055d5b main{StandardDirectoryReader(segments_1:1)}
[junit4:junit4]   2> 4005 T2156 oass.SolrDispatchFilter.init user.dir=C:\Users\JenkinsSlave\workspace\Lucene-Solr-trunk-Windows\solr\build\solr-core\test\J0
[junit4:junit4]   2> 4005 T2156 oass.SolrDispatchFilter.init SolrDispatchFilter.init() done
[junit4:junit4]   2> 4005 T2156 oascsi.HttpClientUtil.createClient Creating new http client, config:maxConnections=128&maxConnectionsPerHost=32&followRedirects=false
[junit4:junit4]   2> 4036 T2156 oasc.CoreContainer.shutdown Shutting down CoreContainer instance=747658561
[junit4:junit4]   2> 4036 T2156 oasc.SolrCore.close [collection1]  CLOSING SolrCore org.apache.solr.core.SolrCore@24e75534
[junit4:junit4]   2> 4036 T2156 oasu.DirectUpdateHandler2.close closing DirectUpdateHandler2{commits=2,autocommits=0,soft autocommits=0,optimizes=0,rollbacks=0,expungeDeletes=0,docsPending=0,adds=0,deletesById=0,deletesByQuery=0,errors=0,cumulative_adds=0,cumulative_deletesById=0,cumulative_deletesByQuery=0,cumulative_errors=0}
[junit4:junit4]   2> 4036 T2156 oasc.SolrCore.decrefSolrCoreState Closing SolrCoreState
[junit4:junit4]   2> 4036 T2156 oasu.DefaultSolrCoreState.closeIndexWriter SolrCoreState ref count has reached 0 - closing IndexWriter
[junit4:junit4]   2> 4036 T2156 oasu.DefaultSolrCoreState.closeIndexWriter closing IndexWriter with IndexWriterCloser
[junit4:junit4]   2> 4036 T2156 C174 oasc.CachingDirectoryFactory.close Releasing directory:C:\Users\JenkinsSlave\workspace\Lucene-Solr-trunk-Windows\solr\build\solr-core\test\J0\.\org.apache.solr.handler.TestReplicationHandler$SolrInstance-1351291567988\slave\collection1\data\index
[junit4:junit4]   2> 4036 T2156 oasc.SolrCore.closeSearcher [collection1] Closing main searcher on request.
[junit4:junit4]   2> 4036 T2156 oasc.CachingDirectoryFactory.close Releasing directory:C:\Users\JenkinsSlave\workspace\Lucene-Solr-trunk-Windows\solr\build\solr-core\test\J0\.\org.apache.solr.handler.TestReplicationHandler$SolrInstance-1351291567988\slave\collection1\data\index
[junit4:junit4]   2> 4036 T2156 oejsh.ContextHandler.doStop stopped o.e.j.s.ServletContextHandler{/solr,null}
[junit4:junit4]   2> 4089 T2156 oejs.Server.doStart jetty-8.1.2.v20120308
[junit4:junit4]   2> 4090 T2156 oejs.AbstractConnector.doStart Started SelectChannelConnector@0.0.0.0:51707
[junit4:junit4]   2> 4090 T2156 oasc.SolrResourceLoader.locateSolrHome JNDI not configured for solr (NoInitialContextEx)
[junit4:junit4]   2> 4090 T2156 oasc.SolrResourceLoader.locateSolrHome using system property solr.solr.home: .\org.apache.solr.handler.TestReplicationHandler$SolrInstance-1351291567988\slave
[junit4:junit4]   2> 4090 T2156 oasc.SolrResourceLoader.<init> new SolrResourceLoader for deduced Solr Home: '.\org.apache.solr.handler.TestReplicationHandler$SolrInstance-1351291567988\slave\'
[junit4:junit4]   2> 4121 T2156 oass.SolrDispatchFilter.init SolrDispatchFilter.init()
[junit4:junit4]   2> 4121 T2156 oasc.SolrResourceLoader.locateSolrHome JNDI not configured for solr (NoInitialContextEx)
[junit4:junit4]   2> 4121 T2156 oasc.SolrResourceLoader.locateSolrHome using system property solr.solr.home: .\org.apache.solr.handler.TestReplicationHandler$SolrInstance-1351291567988\slave
[junit4:junit4]   2> 4121 T2156 oasc.CoreContainer$Initializer.initialize looking for solr.xml: C:\Users\JenkinsSlave\workspace\Lucene-Solr-trunk-Windows\solr\build\solr-core\test\J0\.\org.apache.solr.handler.TestReplicationHandler$SolrInstance-1351291567988\slave\solr.xml
[junit4:junit4]   2> 4121 T2156 oasc.CoreContainer.<init> New CoreContainer 476291711
[junit4:junit4]   2> 4121 T2156 oasc.CoreContainer$Initializer.initialize no solr.xml file found - using default
[junit4:junit4]   2> 4121 T2156 oasc.CoreContainer.load Loading CoreContainer using Solr Home: '.\org.apache.solr.handler.TestReplicationHandler$SolrInstance-1351291567988\slave\'
[junit4:junit4]   2> 4121 T2156 oasc.SolrResourceLoader.<init> new SolrResourceLoader for directory: '.\org.apache.solr.handler.TestReplicationHandler$SolrInstance-1351291567988\slave\'
[junit4:junit4]   2> 4152 T2156 oasc.CoreContainer.load Registering Log Listener
[junit4:junit4]   2> 4168 T2156 oasc.CoreContainer.create Creating SolrCore 'collection1' using instanceDir: .\org.apache.solr.handler.TestReplicationHandler$SolrInstance-1351291567988\slave\collection1
[junit4:junit4]   2> 4168 T2156 oasc.SolrResourceLoader.<init> new SolrResourceLoader for directory: '.\org.apache.solr.handler.TestReplicationHandler$SolrInstance-1351291567988\slave\collection1\'
[junit4:junit4]   2> 4215 T2156 oasc.SolrConfig.<init> Using Lucene MatchVersion: LUCENE_50
[junit4:junit4]   2> 4262 T2156 oasc.SolrConfig.<init> Loaded SolrConfig: solrconfig.xml
[junit4:junit4]   2> 4262 T2156 oass.IndexSchema.readSchema Reading Solr Schema
[junit4:junit4]   2> 4277 T2156 oass.IndexSchema.readSchema Schema name=test
[junit4:junit4]   2> 4293 T2156 oass.IndexSchema.readSchema unique key field: id
[junit4:junit4]   2> 4293 T2156 oasc.SolrCore.<init> [collection1] Opening new SolrCore at .\org.apache.solr.handler.TestReplicationHandler$SolrInstance-1351291567988\slave\collection1\, dataDir=.\org.apache.solr.handler.TestReplicationHandler$SolrInstance-1351291567988\slave\collection1\data\
[junit4:junit4]   2> 4293 T2156 oasc.SolrCore.<init> JMX monitoring not detected for core: collection1
[junit4:junit4]   2> 4293 T2156 oasc.SolrCore.initDirectoryFactory org.apache.solr.core.MockDirectoryFactory
[junit4:junit4]   2> 4293 T2156 oasc.CachingDirectoryFactory.injectLockFactory WARNING No lockType configured for MockDirWrapper(org.apache.lucene.store.RAMDirectory@38a858ee lockFactory=org.apache.lucene.store.SingleInstanceLockFactory@34668e51) assuming 'simple'
[junit4:junit4]   2> 4293 T2156 oasc.CachingDirectoryFactory.get return new directory for C:\Users\JenkinsSlave\workspace\Lucene-Solr-trunk-Windows\solr\build\solr-core\test\J0\.\org.apache.solr.handler.TestReplicationHandler$SolrInstance-1351291567988\slave\collection1\data forceNew:false
[junit4:junit4]   2> 4293 T2156 oasc.CachingDirectoryFactory.close Releasing directory:C:\Users\JenkinsSlave\workspace\Lucene-Solr-trunk-Windows\solr\build\solr-core\test\J0\.\org.apache.solr.handler.TestReplicationHandler$SolrInstance-1351291567988\slave\collection1\data
[junit4:junit4]   2> 4293 T2156 oasc.SolrCore.getNewIndexDir New index directory detected: old=null new=.\org.apache.solr.handler.TestReplicationHandler$SolrInstance-1351291567988\slave\collection1\data\index/
[junit4:junit4]   2> 4293 T2156 oasc.SolrCore.initIndex WARNING [collection1] Solr index directory '.\org.apache.solr.handler.TestReplicationHandler$SolrInstance-1351291567988\slave\collection1\data\index' doesn't exist. Creating new index...
[junit4:junit4]   2> 4293 T2156 oasc.CachingDirectoryFactory.get return new directory for C:\Users\JenkinsSlave\workspace\Lucene-Solr-trunk-Windows\solr\build\solr-core\test\J0\.\org.apache.solr.handler.TestReplicationHandler$SolrInstance-1351291567988\slave\collection1\data\index forceNew:false
[junit4:junit4]   2> 4293 T2156 oasc.SolrDeletionPolicy.onCommit SolrDeletionPolicy.onCommit: commits:num=1
[junit4:junit4]   2> 		commit{dir=MockDirWrapper(org.apache.lucene.store.MMapDirectory@C:\Users\JenkinsSlave\workspace\Lucene-Solr-trunk-Windows\solr\build\solr-core\test\J0\index4507745087tmp lockFactory=org.apache.lucene.store.SingleInstanceLockFactory@78ccbbc6),segFN=segments_1,generation=1,filenames=[segments_1]
[junit4:junit4]   2> 4309 T2156 oasc.SolrDeletionPolicy.updateCommits newest commit = 1[segments_1]
[junit4:junit4]   2> 4309 T2156 oasc.CachingDirectoryFactory.close Releasing directory:C:\Users\JenkinsSlave\workspace\Lucene-Solr-trunk-Windows\solr\build\solr-core\test\J0\.\org.apache.solr.handler.TestReplicationHandler$SolrInstance-1351291567988\slave\collection1\data\index
[junit4:junit4]   2> 4309 T2156 oasc.RequestHandlers.initHandlersFromConfig created standard: solr.StandardRequestHandler
[junit4:junit4]   2> 4309 T2156 oasc.RequestHandlers.initHandlersFromConfig created defaults: solr.StandardRequestHandler
[junit4:junit4]   2> 4309 T2156 oasc.RequestHandlers.initHandlersFromConfig adding lazy requestHandler: solr.StandardRequestHandler
[junit4:junit4]   2> 4309 T2156 oasc.RequestHandlers.initHandlersFromConfig created lazy: solr.StandardRequestHandler
[junit4:junit4]   2> 4309 T2156 oasc.RequestHandlers.initHandlersFromConfig created /update: solr.UpdateRequestHandler
[junit4:junit4]   2> 4309 T2156 oasc.RequestHandlers.initHandlersFromConfig created /replication: solr.ReplicationHandler
[junit4:junit4]   2> 4324 T2156 oashl.XMLLoader.init xsltCacheLifetimeSeconds=60
[junit4:junit4]   2> 4324 T2156 oasc.CachingDirectoryFactory.close Releasing directory:C:\Users\JenkinsSlave\workspace\Lucene-Solr-trunk-Windows\solr\build\solr-core\test\J0\.\org.apache.solr.handler.TestReplicationHandler$SolrInstance-1351291567988\slave\collection1\data
[junit4:junit4]   2> 4324 T2156 oass.SolrIndexSearcher.<init> Opening Searcher@6caa7443 main
[junit4:junit4]   2> 4324 T2156 oasu.CommitTracker.<init> Hard AutoCommit: disabled
[junit4:junit4]   2> 4324 T2156 oasu.CommitTracker.<init> Soft AutoCommit: disabled
[junit4:junit4]   2> 4324 T2156 oashc.HttpShardHandlerFactory.getParameter Setting socketTimeout to: 0
[junit4:junit4]   2> 4324 T2156 oashc.HttpShardHandlerFactory.getParameter Setting urlScheme to: http://
[junit4:junit4]   2> 4324 T2156 oashc.HttpShardHandlerFactory.getParameter Setting connTimeout to: 0
[junit4:junit4]   2> 4324 T2156 oashc.HttpShardHandlerFactory.getParameter Setting maxConnectionsPerHost to: 20
[junit4:junit4]   2> 4324 T2156 oashc.HttpShardHandlerFactory.getParameter Setting corePoolSize to: 0
[junit4:junit4]   2> 4324 T2156 oashc.HttpShardHandlerFactory.getParameter Setting maximumPoolSize to: 2147483647
[junit4:junit4]   2> 4324 T2156 oashc.HttpShardHandlerFactory.getParameter Setting maxThreadIdleTime to: 5
[junit4:junit4]   2> 4324 T2156 oashc.HttpShardHandlerFactory.getParameter Setting sizeOfQueue to: -1
[junit4:junit4]   2> 4324 T2156 oashc.HttpShardHandlerFactory.getParameter Setting fairnessPolicy to: false
[junit4:junit4]   2> 4324 T2156 oascsi.HttpClientUtil.createClient Creating new http client, config:maxConnectionsPerHost=20&maxConnections=10000&socketTimeout=0&connTimeout=0&retry=false
[junit4:junit4]   2> 4340 T2156 oash.SnapPuller.startExecutorService Poll Scheduled at an interval of 1000ms
[junit4:junit4]   2> 4340 T2156 oasc.CoreContainer.register registering core: collection1
[junit4:junit4]   2> 4340 T2221 oasc.SolrCore.registerSearcher [collection1] Registered new searcher Searcher@6caa7443 main{StandardDirectoryReader(segments_1:1)}
[junit4:junit4]   2> 4340 T2156 oass.SolrDispatchFilter.init user.dir=C:\Users\JenkinsSlave\workspace\Lucene-Solr-trunk-Windows\solr\build\solr-core\test\J0
[junit4:junit4]   2> 4340 T2156 oass.SolrDispatchFilter.init SolrDispatchFilter.init() done
[junit4:junit4]   2> 4340 T2156 oascsi.HttpClientUtil.createClient Creating new http client, config:maxConnections=128&maxConnectionsPerHost=32&followRedirects=false
[junit4:junit4]   2> ASYNC  NEW_CORE C176 name=collection1 org.apache.solr.core.SolrCore@57a2e170
[junit4:junit4]   2> 4356 T2206 C176 oasc.CachingDirectoryFactory.close Releasing directory:C:\Users\JenkinsSlave\workspace\Lucene-Solr-trunk-Windows\solr\build\solr-core\test\J0\.\org.apache.solr.handler.TestReplicationHandler$SolrInstance-1351291567691\master\collection1\data\index
[junit4:junit4]   2> 4356 T2206 C176 REQ [collection1] webapp=/solr path=/replication params={command=details&qt=/replication&wt=javabin&version=2} status=0 QTime=0 
[junit4:junit4]   2> ASYNC  NEW_CORE C177 name=collection1 org.apache.solr.core.SolrCore@34ab3f21
[junit4:junit4]   2> 4356 T2215 C177 oasc.CachingDirectoryFactory.close Releasing directory:C:\Users\JenkinsSlave\workspace\Lucene-Solr-trunk-Windows\solr\build\solr-core\test\J0\.\org.apache.solr.handler.TestReplicationHandler$SolrInstance-1351291567988\slave\collection1\data\index
[junit4:junit4]   2> 4371 T2207 C176 oasc.CachingDirectoryFactory.close Releasing directory:C:\Users\JenkinsSlave\workspace\Lucene-Solr-trunk-Windows\solr\build\solr-core\test\J0\.\org.apache.solr.handler.TestReplicationHandler$SolrInstance-1351291567691\master\collection1\data\index
[junit4:junit4]   2> 4371 T2207 C176 REQ [collection1] webapp=/solr path=/replication params={command=details&slave=false&qt=/replication&wt=javabin&version=2} status=0 QTime=0 
[junit4:junit4]   2> 4371 T2215 C177 REQ [collection1] webapp=/solr path=/replication params={command=details&qt=/replication&wt=javabin&version=2} status=0 QTime=15 
[junit4:junit4]   2> 4387 T2156 oejs.Server.doStart jetty-8.1.2.v20120308
[junit4:junit4]   2> 4387 T2156 oejs.AbstractConnector.doStart Started SelectChannelConnector@0.0.0.0:51713
[junit4:junit4]   2> 4402 T2156 oasc.SolrResourceLoader.locateSolrHome JNDI not configured for solr (NoInitialContextEx)
[junit4:junit4]   2> 4402 T2156 oasc.SolrResourceLoader.locateSolrHome using system property solr.solr.home: .\org.apache.solr.handler.TestReplicationHandler$SolrInstance-1351291572062\repeater
[junit4:junit4]   2> 4402 T2156 oasc.SolrResourceLoader.<init> new SolrResourceLoader for deduced Solr Home: '.\org.apache.solr.handler.TestReplicationHandler$SolrInstance-1351291572062\repeater\'
[junit4:junit4]   2> 4434 T2156 oass.SolrDispatchFilter.init SolrDispatchFilter.init()
[junit4:junit4]   2> 4434 T2156 oasc.SolrResourceLoader.locateSolrHome JNDI not configured for solr (NoInitialContextEx)
[junit4:junit4]   2> 4434 T2156 oasc.SolrResourceLoader.locateSolrHome using system property solr.solr.home: .\org.apache.solr.handler.TestReplicationHandler$SolrInstance-1351291572062\repeater
[junit4:junit4]   2> 4434 T2156 oasc.CoreContainer$Initializer.initialize looking for solr.xml: C:\Users\JenkinsSlave\workspace\Lucene-Solr-trunk-Windows\solr\build\solr-core\test\J0\.\org.apache.solr.handler.TestReplicationHandler$SolrInstance-1351291572062\repeater\solr.xml
[junit4:junit4]   2> 4434 T2156 oasc.CoreContainer.<init> New CoreContainer 109257712
[junit4:junit4]   2> 4434 T2156 oasc.CoreContainer$Initializer.initialize no solr.xml file found - using default
[junit4:junit4]   2> 4434 T2156 oasc.CoreContainer.load Loading CoreContainer using Solr Home: '.\org.apache.solr.handler.TestReplicationHandler$SolrInstance-1351291572062\repeater\'
[junit4:junit4]   2> 4434 T2156 oasc.SolrResourceLoader.<init> new SolrResourceLoader for directory: '.\org.apache.solr.handler.TestReplicationHandler$SolrInstance-1351291572062\repeater\'
[junit4:junit4]   2> 4481 T2156 oasc.CoreContainer.load Registering Log Listener
[junit4:junit4]   2> 4496 T2156 oasc.CoreContainer.create Creating SolrCore 'collection1' using instanceDir: .\org.apache.solr.handler.TestReplicationHandler$SolrInstance-1351291572062\repeater\collection1
[junit4:junit4]   2> 4512 T2156 oasc.SolrResourceLoader.<init> new SolrResourceLoader for directory: '.\org.apache.solr.handler.TestReplicationHandler$SolrInstance-1351291572062\repeater\collection1\'
[junit4:junit4]   2> 4574 T2156 oasc.SolrConfig.<init> Using Lucene MatchVersion: LUCENE_50
[junit4:junit4]   2> 4637 T2156 oasc.SolrConfig.<init> Loaded SolrConfig: solrconfig.xml
[junit4:junit4]   2> 4637 T2156 oass.IndexSchema.readSchema Reading Solr Schema
[junit4:junit4]   2> 4652 T2156 oass.IndexSchema.readSchema Schema name=test
[junit4:junit4]   2> 4684 T2156 oass.IndexSchema.readSchema unique key field: id
[junit4:junit4]   2> 4684 T2156 oasc.SolrCore.<init> [collection1] Opening new SolrCore at .\org.apache.solr.handler.TestReplicationHandler$SolrInstance-1351291572062\repeater\collection1\, dataDir=.\org.apache.solr.handler.TestReplicationHandler$SolrInstance-1351291572062\repeater\collection1\data\
[junit4:junit4]   2> 4684 T2156 oasc.SolrCore.<init> JMX monitoring not detected for core: collection1
[junit4:junit4]   2> 4684 T2156 oasc.SolrCore.initDirectoryFactory org.apache.solr.core.MockDirectoryFactory
[junit4:junit4]   2> 4684 T2156 oasc.CachingDirectoryFactory.injectLockFactory WARNING No lockType configured for MockDirWrapper(org.apache.lucene.store.RAMDirectory@7415efcd lockFactory=org.apache.lucene.store.SingleInstanceLockFactory@4c32b745) assuming 'simple'
[junit4:junit4]   2> 4684 T2156 oasc.CachingDirectoryFactory.get return new directory for C:\Users\JenkinsSlave\workspace\Lucene-Solr-trunk-Windows\solr\build\solr-core\test\J0\.\org.apache.solr.handler.TestReplicationHandler$SolrInstance-1351291572062\repeater\collection1\data forceNew:false
[junit4:junit4]   2> 4684 T2156 oasc.CachingDirectoryFactory.close Releasing directory:C:\Users\JenkinsSlave\workspace\Lucene-Solr-trunk-Windows\solr\build\solr-core\test\J0\.\org.apache.solr.handler.TestReplicationHandler$SolrInstance-1351291572062\repeater\collection1\data
[junit4:junit4]   2> 4684 T2156 oasc.SolrCore.getNewIndexDir New index directory detected: old=null new=.\org.apache.solr.handler.TestReplicationHandler$SolrInstance-1351291572062\repeater\collection1\data\index/
[junit4:junit4]   2> 4684 T2156 oasc.SolrCore.initIndex WARNING [collection1] Solr index directory '.\org.apache.solr.handler.TestReplicationHandler$SolrInstance-1351291572062\repeater\collection1\data\index' doesn't exist. Creating new index...
[junit4:junit4]   2> 4684 T2156 oasc.CachingDirectoryFactory.get return new directory for C:\Users\JenkinsSlave\workspace\Lucene-Solr-trunk-Windows\solr\build\solr-core\test\J0\.\org.apache.solr.handler.TestReplicationHandler$SolrInstance-1351291572062\repeater\collection1\data\index forceNew:false
[junit4:junit4]   2> 4684 T2156 oasc.SolrDeletionPolicy.onCommit SolrDeletionPolicy.onCommit: commits:num=1
[junit4:junit4]   2> 		commit{dir=MockDirWrapper(org.apache.lucene.store.RAMDirectory@46061658 lockFactory=org.apache.lucene.store.SingleInstanceLockFactory@390ee0f),segFN=segments_1,generation=1,filenames=[segments_1]
[junit4:junit4]   2> 4684 T2156 oasc.SolrDeletionPolicy.updateCommits newest commit = 1[segments_1]
[junit4:junit4]   2> 4684 T2156 oasc.CachingDirectoryFactory.close Releasing directory:C:\Users\JenkinsSlave\workspace\Lucene-Solr-trunk-Windows\solr\build\solr-core\test\J0\.\org.apache.solr.handler.TestReplicationHandler$SolrInstance-1351291572062\repeater\collection1\data\index
[junit4:junit4]   2> 4684 T2156 oasc.RequestHandlers.initHandlersFromConfig created standard: solr.StandardRequestHandler
[junit4:junit4]   2> 4684 T2156 oasc.RequestHandlers.initHandlersFromConfig created defaults: solr.StandardRequestHandler
[junit4:junit4]   2> 4684 T2156 oasc.RequestHandlers.initHandlersFromConfig adding lazy requestHandler: solr.StandardRequestHandler
[junit4:junit4]   2> 4684 T2156 oasc.RequestHandlers.initHandlersFromConfig created lazy: solr.StandardRequestHandler
[junit4:junit4]   2> 4684 T2156 oasc.RequestHandlers.initHandlersFromConfig created /update: solr.UpdateRequestHandler
[junit4:junit4]   2> 4684 T2156 oasc.RequestHandlers.initHandlersFromConfig created /replication: solr.ReplicationHandler
[junit4:junit4]   2> 4699 T2156 oashl.XMLLoader.init xsltCacheLifetimeSeconds=60
[junit4:junit4]   2> 4699 T2156 oasc.CachingDirectoryFactory.close Releasing directory:C:\Users\JenkinsSlave\workspace\Lucene-Solr-trunk-Windows\solr\build\solr-core\test\J0\.\org.apache.solr.handler.TestReplicationHandler$SolrInstance-1351291572062\repeater\collection1\data
[junit4:junit4]   2> 4699 T2156 oass.SolrIndexSearcher.<init> Opening Searcher@520370b5 main
[junit4:junit4]   2> 4699 T2156 oasu.CommitTracker.<init> Hard AutoCommit: disabled
[junit4:junit4]   2> 4699 T2156 oasu.CommitTracker.<init> Soft AutoCommit: disabled
[junit4:junit4]   2> 4699 T2156 oashc.HttpShardHandlerFactory.getParameter Setting socketTimeout to: 0
[junit4:junit4]   2> 4699 T2156 oashc.HttpShardHandlerFactory.getParameter Setting urlScheme to: http://
[junit4:junit4]   2> 4699 T2156 oashc.HttpShardHandlerFactory.getParameter Setting connTimeout to: 0
[junit4:junit4]   2> 4699 T2156 oashc.HttpShardHandlerFactory.getParameter Setting maxConnectionsPerHost to: 20
[junit4:junit4]   2> 4699 T2156 oashc.HttpShardHandlerFactory.getParameter Setting corePoolSize to: 0
[junit4:junit4]   2> 4699 T2156 oashc.HttpShardHandlerFactory.getParameter Setting maximumPoolSize to: 2147483647
[junit4:junit4]   2> 4699 T2156 oashc.HttpShardHandlerFactory.getParameter Setting maxThreadIdleTime to: 5
[junit4:junit4]   2> 4699 T2156 oashc.HttpShardHandlerFactory.getParameter Setting sizeOfQueue to: -1
[junit4:junit4]   2> 4699 T2156 oashc.HttpShardHandlerFactory.getParameter Setting fairnessPolicy to: false
[junit4:junit4]   2> 4699 T2156 oascsi.HttpClientUtil.createClient Creating new http client, config:maxConnectionsPerHost=20&maxConnections=10000&socketTimeout=0&connTimeout=0&retry=false
[junit4:junit4]   2> 4715 T2156 oash.SnapPuller.<init> WARNING 'masterUrl' must be specified without the /replication suffix
[junit4:junit4]   2> 4715 T2156 oash.SnapPuller.startExecutorService Poll Scheduled at an interval of 1000ms
[junit4:junit4]   2> 4715 T2156 oash.ReplicationHandler.inform Replication enabled for following config files: schema.xml
[junit4:junit4]   2> 4715 T2156 oash.ReplicationHandler.inform Commits will be reserved for  10000
[junit4:junit4]   2> 4715 T2232 oasc.SolrCore.registerSearcher [collection1] Registered new searcher Searcher@520370b5 main{StandardDirectoryReader(segments_1:1)}
[junit4:junit4]   2> 4715 T2156 oasc.CoreContainer.register registering core: collection1
[junit4:junit4]   2> 4715 T2156 oass.SolrDispatchFilter.init user.dir=C:\Users\JenkinsSlave\workspace\Lucene-Solr-trunk-Windows\solr\build\solr-core\test\J0
[junit4:junit4]   2> 4715 T2156 oass.SolrDispatchFilter.init SolrDispatchFilter.init() done
[junit4:junit4]   2> 4715 T2156 oascsi.HttpClientUtil.createClient Creating new http client, config:maxConnections=128&maxConnectionsPerHost=32&followRedirects=false
[junit4:junit4]   2> ASYNC  NEW_CORE C178 name=collection1 org.apache.solr.core.SolrCore@75d43833
[junit4:junit4]   2> 4731 T2226 C178 oasc.CachingDirectoryFactory.close Releasing directory:C:\Users\JenkinsSlave\workspace\Lucene-Solr-trunk-Windows\solr\build\solr-core\test\J0\.\org.apache.solr.handler.TestReplicationHandler$SolrInstance-1351291572062\repeater\collection1\data\index
[junit4:junit4]   2> 4746 T2208 C176 oasc.CachingDirectoryFactory.close Releasing directory:C:\Users\JenkinsSlave\workspace\Lucene-Solr-trunk-Windows\solr\build\solr-core\test\J0\.\org.apache.solr.handler.TestReplicationHandler$SolrInstance-1351291567691\master\collection1\data\index
[junit4:junit4]   2> 4746 T2208 C176 REQ [collection1] webapp=/solr path=/replication params={command=details&slave=false&qt=/replication&wt=javabin&version=2} status=0 QTime=0 
[junit4:junit4]   2> 4746 T2226 C178 REQ [collection1] webapp=/solr path=/replication params={command=details&qt=/replication&wt=javabin&version=2} status=0 QTime=31 
[junit4:junit4]   2> 4762 T2156 oasc.CoreContainer.shutdown Shutting down CoreContainer instance=109257712
[junit4:junit4]   2> 4762 T2156 oasc.SolrCore.close [collection1]  CLOSING SolrCore org.apache.solr.core.SolrCore@75d43833
[junit4:junit4]   2> 4762 T2156 oasu.DirectUpdateHandler2.close closing DirectUpdateHandler2{commits=0,autocommits=0,soft autocommits=0,optimizes=0,rollbacks=0,expungeDeletes=0,docsPending=0,adds=0,deletesById=0,deletesByQuery=0,errors=0,cumulative_adds=0,cumulative_deletesById=0,cumulative_deletesByQuery=0,cumulative_errors=0}
[junit4:junit4]   2> 4762 T2156 oasc.SolrCore.decrefSolrCoreState Closing SolrCoreState
[junit4:junit4]   2> 4762 T2156 oasu.DefaultSolrCoreState.closeIndexWriter SolrCoreState ref count has reached 0 - closing IndexWriter
[junit4:junit4]   2> 4762 T2156 oasu.DefaultSolrCoreState.closeIndexWriter closing IndexWriter with IndexWriterCloser
[junit4:junit4]   2> 4762 T2156 oasc.SolrCore.closeSearcher [collection1] Closing main searcher on request.
[junit4:junit4]   2> 4762 T2156 oasc.CachingDirectoryFactory.close Releasing directory:C:\Users\JenkinsSlave\workspace\Lucene-Solr-trunk-Windows\solr\build\solr-core\test\J0\.\org.apache.solr.handler.TestReplicationHandler$SolrInstance-1351291572062\repeater\collection1\data\index
[junit4:junit4]   2> 4762 T2156 oejsh.ContextHandler.doStop stopped o.e.j.s.ServletContextHandler{/solr,null}
[junit4:junit4]   2> 4830 T2210 C176 REQ [collection1] webapp=/solr path=/select params={wt=javabin&q=*:*&version=2} hits=0 status=0 QTime=0 
[junit4:junit4]   2> 4846 T2205 C176 oasc.CachingDirectoryFactory.close Releasing directory:C:\Users\JenkinsSlave\workspace\Lucene-Solr-trunk-Windows\solr\build\solr-core\test\J0\.\org.apache.solr.handler.TestReplicationHandler$SolrInstance-1351291567691\master\collection1\data
[junit4:junit4]   2> 4846 T2205 C176 oasc.SolrDeletionPolicy.onInit SolrDeletionPolicy.onInit: commits:num=1
[junit4:junit4]   2> 		commit{dir=BaseDirectoryWrapper(org.apache.lucene.store.RAMDirectory@701af9cb lockFactory=org.apache.lucene.store.SingleInstanceLockFactory@7b05b7ec),segFN=segments_1,generation=1,filenames=[segments_1]
[junit4:junit4]   2> 4846 T2205 C176 oasc.SolrDeletionPolicy.updateCommits newest commit = 1[segments_1]
[junit4:junit4]   2> 4846 T2205 C176 UPDATE [collection1] webapp=/solr path=/update params={wt=javabin&version=2} {add=[0]} 0 0
[junit4:junit4]   2> 4861 T2206 C176 UPDATE [collection1] webapp=/solr path=/update params={wt=javabin&version=2} {add=[1]} 0 0
[junit4:junit4]   2> 4877 T2207 C176 UPDATE [collection1] webapp=/solr path=/update params={wt=javabin&version=2} {add=[2]} 0 0
[junit4:junit4]   2> 4893 T2209 C176 UPDATE [collection1] webapp=/solr path=/update params={wt=javabin&version=2} {add=[3]} 0 0
[junit4:junit4]   2> 4908 T2208 C176 UPDATE [collection1] webapp=/solr path=/update params={wt=javabin&version=2} {add=[4]} 0 0
[junit4:junit4]   2> 4924 T2210 C176 UPDATE [collection1] webapp=/solr path=/update params={wt=javabin&version=2} {add=[5]} 0 0
[junit4:junit4]   2> 4940 T2205 C176 UPDATE [collection1] webapp=/solr path=/update params={wt=javabin&version=2} {add=[6]} 0 0
[junit4:junit4]   2> 4955 T2206 C176 UPDATE [collection1] webapp=/solr path=/update params={wt=javabin&version=2} {add=[7]} 0 0
[junit4:junit4]   2> 4971 T2207 C176 UPDATE [collection1] webapp=/solr path=/update params={wt=javabin&version=2} {add=[8]} 0 0
[junit4:junit4]   2> 4986 T2209 C176 UPDATE [collection1] webapp=/solr path=/update params={wt=javabin&version=2} {add=[9]} 0 0
[junit4:junit4]   2> 5002 T2208 C176 UPDATE [collection1] webapp=/solr path=/update params={wt=javabin&version=2} {add=[10]} 0 0
[junit4:junit4]   2> 5018 T2210 C176 UPDATE [collection1] webapp=/solr path=/update params={wt=javabin&version=2} {add=[11]} 0 0
[junit4:junit4]   2> 5033 T2205 C176 UPDATE [collection1] webapp=/solr path=/update params={wt=javabin&version=2} {add=[12]} 0 0
[junit4:junit4]   2> 5049 T2206 C176 UPDATE [collection1] webapp=/solr path=/update params={wt=javabin&version=2} {add=[13]} 0 0
[junit4:junit4]   2> 5065 T2207 C176 UPDATE [collection1] webapp=/solr path=/update params={wt=javabin&version=2} {add=[14]} 0 0
[junit4:junit4]   2> 5080 T2209 C176 UPDATE [collection1] webapp=/solr path=/update params={wt=javabin&version=2} {add=[15]} 0 0
[junit4:junit4]   2> 5096 T2208 C176 UPDATE [collection1] webapp=/solr path=/update params={wt=javabin&version=2} {add=[16]} 0 0
[junit4:junit4]   2> 5111 T2210 C176 UPDATE [collection1] webapp=/solr path=/update params={wt=javabin&version=2} {add=[17]} 0 0
[junit4:junit4]   2> 5127 T2205 C176 UPDATE [collection1] webapp=/solr path=/update params={wt=javabin&version=2} {add=[18]} 0 0
[junit4:junit4]   2> 5143 T2206 C176 UPDATE [collection1] webapp=/solr path=/update params={wt=javabin&version=2} {add=[19]} 0 0
[junit4:junit4]   2> 5158 T2207 C176 UPDATE [collection1] webapp=/solr path=/update params={wt=javabin&version=2} {add=[20]} 0 0
[junit4:junit4]   2> 5174 T2208 C176 UPDATE [collection1] webapp=/solr path=/update params={wt=javabin&version=2} {add=[21]} 0 0
[junit4:junit4]   2> 5190 T2210 C176 UPDATE [collection1] webapp=/solr path=/update params={wt=javabin&version=2} {add=[22]} 0 0
[junit4:junit4]   2> 5205 T2205 C176 UPDATE [collection1] webapp=/solr path=/update params={wt=javabin&version=2} {add=[23]} 0 0
[junit4:junit4]   2> 5221 T2206 C176 UPDATE [collection1] webapp=/solr path=/update params={wt=javabin&version=2} {add=[24]} 0 0
[junit4:junit4]   2> 5236 T2207 C176 UPDATE [collection1] webapp=/solr path=/update params={wt=javabin&version=2} {add=[25]} 0 0
[junit4:junit4]   2> 5252 T2209 C176 UPDATE [collection1] webapp=/solr path=/update params={wt=javabin&version=2} {add=[26]} 0 0
[junit4:junit4]   2> 5268 T2208 C176 UPDATE [collection1] webapp=/solr path=/update params={wt=javabin&version=2} {add=[27]} 0 0
[junit4:junit4]   2> 5283 T2210 C176 UPDATE [collection1] webapp=/solr path=/update params={wt=javabin&version=2} {add=[28]} 0 0
[junit4:junit4]   2> 5299 T2205 C176 UPDATE [collection1] webapp=/solr path=/update params={wt=javabin&version=2} {add=[29]} 0 0
[junit4:junit4]   2> 5315 T2206 C176 UPDATE [collection1] webapp=/solr path=/update params={wt=javabin&version=2} {add=[30]} 0 0
[junit4:junit4]   2> 5330 T2207 C176 UPDATE [collection1] webapp=/solr path=/update params={wt=javabin&version=2} {add=[31]} 0 0
[junit4:junit4]   2> 5346 T2209 C176 REQ [collection1] webapp=/solr path=/replication params={command=indexversion&wt=javabin&qt=/replication&version=2} status=0 QTime=0 
[junit4:junit4]   2> 5346 T2208 C176 UPDATE [collection1] webapp=/solr path=/update params={wt=javabin&version=2} {add=[32]} 0 0
[junit4:junit4]   2> 5361 T2210 C176 UPDATE [collection1] webapp=/solr path=/update params={wt=javabin&version=2} {add=[33]} 0 0
[junit4:junit4]   2> 5377 T2205 C176 UPDATE [collection1] webapp=/solr path=/update params={wt=javabin&version=2} {add=[34]} 0 0
[junit4:junit4]   2> 5393 T2206 C176 UPDATE [collection1] webapp=/solr path=/update params={wt=javabin&version=2} {add=[35]} 0 0
[junit4:junit4]   2> 5408 T2207 C176 UPDATE [collection1] webapp=/solr path=/update params={wt=javabin&version=2} {add=[36]} 0 0
[junit4:junit4]   2> 5424 T2209 C176 UPDATE [collection1] webapp=/solr path=/update params={wt=javabin&version=2} {add=[37]} 0 0
[junit4:junit4]   2> 5440 T2208 C176 UPDATE [collection1] webapp=/solr path=/update params={wt=javabin&version=2} {add=[38]} 0 0
[junit4:junit4]   2> 5455 T2210 C176 UPDATE [collection1] webapp=/solr path=/update params={wt=javabin&version=2} {add=[39]} 0 0
[junit4:junit4]   2> 5471 T2205 C176 UPDATE [collection1] webapp=/solr path=/update params={wt=javabin&version=2} {add=[40]} 0 0
[junit4:junit4]   2> 5486 T2206 C176 UPDATE [collection1] webapp=/solr path=/update params={wt=javabin&version=2} {add=[41]} 0 0
[junit4:junit4]   2> 5502 T2207 C176 UPDATE [collection1] webapp=/solr path=/update params={wt=javabin&version=2} {add=[42]} 0 0
[junit4:junit4]   2> 5518 T2209 C176 UPDATE [collection1] webapp=/solr path=/update params={wt=javabin&version=2} {add=[43]} 0 0
[junit4:junit4]   2> 5533 T2208 C176 UPDATE [collection1] webapp=/solr path=/update params={wt=javabin&version=2} {add=[44]} 0 0
[junit4:junit4]   2> 5549 T2210 C176 UPDATE [collection1] webapp=/solr path=/update params={wt=javabin&version=2} {add=[45]} 0 0
[junit4:junit4]   2> 5565 T2205 C176 UPDATE [collection1] webapp=/solr path=/update params={wt=javabin&version=2} {add=[46]} 0 0
[junit4:junit4]   2> 5580 T2207 C176 UPDATE [collection1] webapp=/solr path=/update params={wt=javabin&version=2} {add=[47]} 0 0
[junit4:junit4]   2> 5596 T2209 C176 UPDATE [collection1] webapp=/solr path=/update params={wt=javabin&version=2} {add=[48]} 0 0
[junit4:junit4]   2> 5611 T2208 C176 UPDATE [collection1] webapp=/solr path=/update params={wt=javabin&version=2} {add=[49]} 0 0
[junit4:junit4]   2> 5627 T2210 C176 UPDATE [collection1] webapp=/solr path=/update params={wt=javabin&version=2} {add=[50]} 0 0
[junit4:junit4]   2> 5643 T2206 C176 UPDATE [collection1] webapp=/solr path=/update params={wt=javabin&version=2} {add=[51]} 0 0
[junit4:junit4]   2> 5658 T2205 C176 UPDATE [collection1] webapp=/solr path=/update params={wt=javabin&version=2} {add=[52]} 0 0
[junit4:junit4]   2> 5674 T2207 C176 UPDATE [collection1] webapp=/solr path=/update params={wt=javabin&version=2} {add=[53]} 0 0
[junit4:junit4]   2> 5690 T2209 C176 UPDATE [collection1] webapp=/solr path=/update params={wt=javabin&version=2} {add=[54]} 0 0
[junit4:junit4]   2> 5705 T2208 C176 UPDATE [collection1] webapp=/solr path=/update params={wt=javabin&version=2} {add=[55]} 0 0
[junit4:junit4]   2> 5721 T2210 C176 UPDATE [collection1] webapp=/solr path=/update params={wt=javabin&version=2} {add=[56]} 0 0
[junit4:junit4]   2> 5736 T2206 C176 UPDATE [collection1] webapp=/solr path=/update params={wt=javabin&version=2} {add=[57]} 0 0
[junit4:junit4]   2> 5752 T2205 C176 UPDATE [collection1] webapp=/solr path=/update params={wt=javabin&version=2} {add=[58]} 0 0
[junit4:junit4]   2> 5768 T2207 C176 UPDATE [collection1] webapp=/solr path=/update params={wt=javabin&version=2} {add=[59]} 0 0
[junit4:junit4]   2> 5783 T2209 C176 UPDATE [collection1] webapp=/solr path=/update params={wt=javabin&version=2} {add=[60]} 0 0
[junit4:junit4]   2> 5799 T2208 C176 UPDATE [collection1] webapp=/solr path=/update params={wt=javabin&version=2} {add=[61]} 0 0
[junit4:junit4]   2> 5815 T2210 C176 UPDATE [collection1] webapp=/solr path=/update params={wt=javabin&version=2} {add=[62]} 0 0
[junit4:junit4]   2> 5830 T2206 C176 UPDATE [collection1] webapp=/solr path=/update params={wt=javabin&version=2} {add=[63]} 0 0
[junit4:junit4]   2> 5846 T2205 C176 UPDATE [collection1] webapp=/solr path=/update params={wt=javabin&version=2} {add=[64]} 0 0
[junit4:junit4]   2> 5861 T2207 C176 UPDATE [collection1] webapp=/solr path=/update params={wt=javabin&version=2} {add=[65]} 0 0
[junit4:junit4]   2> 5877 T2209 C176 UPDATE [collection1] webapp=/solr path=/update params={wt=javabin&version=2} {add=[66]} 0 0
[junit4:junit4]   2> 5893 T2208 C176 UPDATE [collection1] webapp=/solr path=/update params={wt=javabin&version=2} {add=[67]} 0 0
[junit4:junit4]   2> 5908 T2210 C176 UPDATE [collection1] webapp=/solr path=/update params={wt=javabin&version=2} {add=[68]} 0 0
[junit4:junit4]   2> 5924 T2206 C176 UPDATE [collection1] webapp=/solr path=/update params={wt=javabin&version=2} {add=[69]} 0 0
[junit4:junit4]   2> 5940 T2205 C176 UPDATE [collection1] webapp=/solr path=/update params={wt=javabin&version=2} {add=[70]} 0 0
[junit4:junit4]   2> 5955 T2207 C176 UPDATE [collection1] webapp=/solr path=/update params={wt=javabin&version=2} {add=[71]} 0 0
[junit4:junit4]   2> 5971 T2209 C176 UPDATE [collection1] webapp=/solr path=/update params={wt=javabin&version=2} {add=[72]} 0 0
[junit4:junit4]   2> 5986 T2210 C176 UPDATE [collection1] webapp=/solr path=/update params={wt=javabin&version=2} {add=[73]} 0 0
[junit4:junit4]   2> 6002 T2206 C176 UPDATE [collection1] webapp=/solr path=/update params={wt=javabin&version=2} {add=[74]} 0 0
[junit4:junit4]   2> 6018 T2205 C176 UPDATE [collection1] webapp=/solr path=/update params={wt=javabin&version=2} {add=[75]} 0 0
[junit4:junit4]   2> 6033 T2207 C176 UPDATE [collection1] webapp=/solr path=/update params={wt=javabin&version=2} {add=[76]} 0 0
[junit4:junit4]   2> 6049 T2208 C176 UPDATE [collection1] webapp=/solr path=/update params={wt=javabin&version=2} {add=[77]} 0 0
[junit4:junit4]   2> 6065 T2209 C176 UPDATE [collection1] webapp=/solr path=/update params={wt=javabin&version=2} {add=[78]} 0 0
[junit4:junit4]   2> 6080 T2210 C176 UPDATE [collection1] webapp=/solr path=/update params={wt=javabin&version=2} {add=[79]} 0 0
[junit4:junit4]   2> 6096 T2206 C176 UPDATE [collection1] webapp=/solr path=/update params={wt=javabin&version=2} {add=[80]} 0 0
[junit4:junit4]   2> 6111 T2205 C176 UPDATE [collection1] webapp=/solr path=/update params={wt=javabin&version=2} {add=[81]} 0 0
[junit4:junit4]   2> 6127 T2207 C176 UPDATE [collection1] webapp=/solr path=/update params={wt=javabin&version=2} {add=[82]} 0 0
[junit4:junit4]   2> 6143 T2208 C176 UPDATE [collection1] webapp=/solr path=/update params={wt=javabin&version=2} {add=[83]} 0 0
[junit4:junit4]   2> 6158 T2209 C176 UPDATE [collection1] webapp=/solr path=/update params={wt=javabin&version=2} {add=[84]} 0 0
[junit4:junit4]   2> 6174 T2210 C176 UPDATE [collection1] webapp=/solr path=/update params={wt=javabin&version=2} {add=[85]} 0 0
[junit4:junit4]   2> 6190 T2206 C176 UPDATE [collection1] webapp=/solr path=/update params={wt=javabin&version=2} {add=[86]} 0 0
[junit4:junit4]   2> 6205 T2205 C176 UPDATE [collection1] webapp=/solr path=/update params={wt=javabin&version=2} {add=[87]} 0 0
[junit4:junit4]   2> 6221 T2207 C176 UPDATE [collection1] webapp=/solr path=/update params={wt=javabin&version=2} {add=[88]} 0 0
[junit4:junit4]   2> 6236 T2208 C176 UPDATE [collection1] webapp=/solr path=/update params={wt=javabin&version=2} {add=[89]} 0 0
[junit4:junit4]   2> 6252 T2209 C176 UPDATE [collection1] webapp=/solr path=/update params={wt=javabin&version=2} {add=[90]} 0 0
[junit4:junit4]   2> 6268 T2210 C176 UPDATE [collection1] webapp=/solr path=/update params={wt=javabin&version=2} {add=[91]} 0 0
[junit4:junit4]   2> 6283 T2206 C176 UPDATE [collection1] webapp=/solr path=/update params={wt=javabin&version=2} {add=[92]} 0 0
[junit4:junit4]   2> 6299 T2205 C176 UPDATE [collection1] webapp=/solr path=/update params={wt=javabin&version=2} {add=[93]} 0 0
[junit4:junit4]   2> 6315 T2207 C176 UPDATE [collection1] webapp=/solr path=/update params={wt=javabin&version=2} {add=[94]} 0 0
[junit4:junit4]   2> 6330 T2208 C176 UPDATE [collection1] webapp=/solr path=/update params={wt=javabin&version=2} {add=[95]} 0 0
[junit4:junit4]   2> 6346 T2209 C176 REQ [collection1] webapp=/solr path=/replication params={command=indexversion&wt=javabin&qt=/replication&version=2} status=0 QTime=0 
[junit4:junit4]   2> 6346 T2210 C176 UPDATE [collection1] webapp=/solr path=/update params={wt=javabin&version=2} {add=[96]} 0 0
[junit4:junit4]   2> 6361 T2206 C176 UPDATE [collection1] webapp=/solr path=/update params={wt=javabin&version=2} {add=[97]} 0 0
[junit4:junit4]   2> 6377 T2205 C176 UPDATE [collection1] webapp=/solr path=/update params={wt=javabin&version=2} {add=[98]} 0 0
[junit4:junit4]   2> 6393 T2208 C176 UPDATE [collection1] webapp=/solr path=/update params={wt=javabin&version=2} {add=[99]} 0 0
[junit4:junit4]   2> 6408 T2210 C176 UPDATE [collection1] webapp=/solr path=/update params={wt=javabin&version=2} {add=[100]} 0 0
[junit4:junit4]   2> 6424 T2209 C176 UPDATE [collection1] webapp=/solr path=/update params={wt=javabin&version=2} {add=[101]} 0 0
[junit4:junit4]   2> 6440 T2206 C176 UPDATE [collection1] webapp=/solr path=/update params={wt=javabin&version=2} {add=[102]} 0 0
[junit4:junit4]   2> 6455 T2207 C176 UPDATE [collection1] webapp=/solr path=/update params={wt=javabin&version=2} {add=[103]} 0 0
[junit4:junit4]   2> 6471 T2205 C176 UPDATE [collection1] webapp=/solr path=/update params={wt=javabin&version=2} {add=[104]} 0 0
[junit4:junit4]   2> 6486 T2208 C176 UPDATE [collection1] webapp=/solr path=/update params={wt=javabin&version=2} {add=[105]} 0 0
[junit4:junit4]   2> 6502 T2210 C176 UPDATE [collection1] webapp=/solr path=/update params={wt=javabin&version=2} {add=[106]} 0 0
[junit4:junit4]   2> 6518 T2209 C176 UPDATE [collection1] webapp=/solr path=/update params={wt=javabin&version=2} {add=[107]} 0 0
[junit4:junit4]   2> 6533 T2206 C176 UPDATE [collection1] webapp=/solr path=/update params={wt=javabin&version=2} {add=[108]} 0 0
[junit4:junit4]   2> 6549 T2207 C176 UPDATE [collection1] webapp=/solr path=/update params={wt=javabin&version=2} {add=[109]} 0 0
[junit4:junit4]   2> 6565 T2205 C176 UPDATE [collection1] webapp=/solr path=/update params={wt=javabin&version=2} {add=[110]} 0 0
[junit4:junit4]   2> 6580 T2208 C176 UPDATE [collection1] webapp=/solr path=/update params={wt=javabin&version=2} {add=[111]} 0 0
[junit4:junit4]   2> 6596 T2210 C176 UPDATE [collection1] webapp=/solr path=/update params={wt=javabin&version=2} {add=[112]} 0 0
[junit4:junit4]   2> 6611 T2209 C176 UPDATE [collection1] webapp=/solr path=/update params={wt=javabin&version=2} {add=[113]} 0 0
[junit4:junit4]   2> 6627 T2206 C176 UPDATE [collection1] webapp=/solr path=/update params={wt=javabin&version=2} {add=[114]} 0 0
[junit4:junit4]   2> 6643 T2207 C176 UPDATE [collection1] webapp=/solr path=/update params={wt=javabin&version=2} {add=[115]} 0 0
[junit4:junit4]   2> 6658 T2205 C176 UPDATE [collection1] webapp=/solr path=/update params={wt=javabin&version=2} {add=[116]} 0 0
[junit4:junit4]   2> 6674 T2208 C176 UPDATE [collection1] webapp=/solr path=/update params={wt=javabin&version=2} {add=[117]} 0 0
[junit4:junit4]   2> 6690 T2210 C176 UPDATE [collection1] webapp=/solr path=/update params={wt=javabin&version=2} {add=[118]} 0 0
[junit4:junit4]   2> 6705 T2209 C176 UPDATE [collection1] webapp=/solr path=/update params={wt=javabin&version=2} {add=[119]} 0 0
[junit4:junit4]   2> 6721 T2206 C176 UPDATE [collection1] webapp=/solr path=/update params={wt=javabin&version=2} {add=[120]} 0 0
[junit4:junit4]   2> 6736 T2207 C176 UPDATE [collection1] webapp=/solr path=/update params={wt=javabin&version=2} {add=[121]} 0 0
[junit4:junit4]   2> 6752 T2205 C176 UPDATE [collection1] webapp=/solr path=/update params={wt=javabin&version=2} {add=[122]} 0 0
[junit4:junit4]   2> 6768 T2208 C176 UPDATE [collection1] webapp=/solr path=/update params={wt=javabin&version=2} {add=[123]} 0 0
[junit4:junit4]   2> 6783 T2210 C176 UPDATE [collection1] webapp=/solr path=/update params={wt=javabin&version=2} {add=[124]} 0 0
[junit4:junit4]   2> 6799 T2206 C176 UPDATE [collection1] webapp=/solr path=/update params={wt=javabin&version=2} {add=[125]} 0 0
[junit4:junit4]   2> 6815 T2207 C176 UPDATE [collection1] webapp=/solr path=/update params={wt=javabin&version=2} {add=[126]} 0 0
[junit4:junit4]   2> 6830 T2205 C176 UPDATE [collection1] webapp=/solr path=/update params={wt=javabin&version=2} {add=[127]} 0 0
[junit4:junit4]   2> 6846 T2208 C176 UPDATE [collection1] webapp=/solr path=/update params={wt=javabin&version=2} {add=[128]} 0 0
[junit4:junit4]   2> 6861 T2209 C176 UPDATE [collection1] webapp=/solr path=/update params={wt=javabin&version=2} {add=[129]} 0 0
[junit4:junit4]   2> 6877 T2210 C176 UPDATE [collection1] webapp=/solr path=/update params={wt=javabin&version=2} {add=[130]} 0 0
[junit4:junit4]   2> 6893 T2206 C176 UPDATE [collection1] webapp=/solr path=/update params={wt=javabin&version=2} {add=[131]} 0 0
[junit4:junit4]   2> 6908 T2207 C176 UPDATE [collection1] webapp=/solr path=/update params={wt=javabin&version=2} {add=[132]} 0 0
[junit4:junit4]   2> 6924 T2205 C176 UPDATE [collection1] webapp=/solr path=/update params={wt=javabin&version=2} {add=[133]} 0 0
[junit4:junit4]   2> 6940 T2208 C176 UPDATE [collection1] webapp=/solr path=/update params={wt=javabin&version=2} {add=[134]} 0 0
[junit4:junit4]   2> 6955 T2209 C176 UPDATE [collection1] webapp=/solr path=/update params={wt=javabin&version=2} {add=[135]} 0 0
[junit4:junit4]   2> 6971 T2210 C176 UPDATE [collection1] webapp=/solr path=/update params={wt=javabin&version=2} {add=[136]} 0 0
[junit4:junit4]   2> 6986 T2206 C176 UPDATE [collection1] webapp=/solr path=/update params={wt=javabin&version=2} {add=[137]} 0 0
[junit4:junit4]   2> 7002 T2207 C176 UPDATE [collection1] webapp=/solr path=/update params={wt=javabin&version=2} {add=[138]} 0 0
[junit4:junit4]   2> 7018 T2205 C176 UPDATE [collection1] webapp=/solr path=/update params={wt=javabin&version=2} {add=[139]} 0 0
[junit4:junit4]   2> 7033 T2208 C176 UPDATE [collection1] webapp=/solr path=/update params={wt=javabin&version=2} {add=[140]} 0 0
[junit4:junit4]   2> 7049 T2209 C176 UPDATE [collection1] webapp=/solr path=/update params={wt=javabin&version=2} {add=[141]} 0 0
[junit4:junit4]   2> 7065 T2210 C176 UPDATE [collection1] webapp=/solr path=/update params={wt=javabin&version=2} {add=[142]} 0 0
[junit4:junit4]   2> 7080 T2206 C176 UPDATE [collection1] webapp=/solr path=/update params={wt=javabin&version=2} {add=[143]} 0 0
[junit4:junit4]   2> 7096 T2207 C176 UPDATE [collection1] webapp=/solr path=/update params={wt=javabin&version=2} {add=[144]} 0 0
[junit4:junit4]   2> 7111 T2205 C176 UPDATE [collection1] webapp=/solr path=/update params={wt=javabin&version=2} {add=[145]} 0 0
[junit4:junit4]   2> 7127 T2208 C176 UPDATE [collection1] webapp=/solr path=/update params={wt=javabin&version=2} {add=[146]} 0 0
[junit4:junit4]   2> 7143 T2209 C176 UPDATE [collection1] webapp=/solr path=/update params={wt=javabin&version=2} {add=[147]} 0 0
[junit4:junit4]   2> 7158 T2210 C176 UPDATE [collection1] webapp=/solr path=/update params={wt=javabin&version=2} {add=[148]} 0 0
[junit4:junit4]   2> 7174 T2206 C176 UPDATE [collection1] webapp=/solr path=/update params={wt=javabin&version=2} {add=[149]} 0 0
[junit4:junit4]   2> 7190 T2207 C176 UPDATE [collection1] webapp=/solr path=/update params={wt=javabin&version=2} {add=[150]} 0 0
[junit4:junit4]   2> 7205 T2208 C176 UPDATE [collection1] webapp=/solr path=/update params={wt=javabin&version=2} {add=[151]} 0 0
[junit4:junit4]   2> 7221 T2209 C176 UPDATE [collection1] webapp=/solr path=/update params={wt=javabin&version=2} {add=[152]} 0 0
[junit4:junit4]   2> 7236 T2210 C176 UPDATE [collection1] webapp=/solr path=/update params={wt=javabin&version=2} {add=[153]} 0 0
[junit4:junit4]   2> 7252 T2206 C176 UPDATE [collection1] webapp=/solr path=/update params={wt=javabin&version=2} {add=[154]} 0 0
[junit4:junit4]   2> 7268 T2205 C176 UPDATE [collection1] webapp=/solr path=/update params={wt=javabin&version=2} {add=[155]} 0 0
[junit4:junit4]   2> 7283 T2207 C176 UPDATE [collection1] webapp=/solr path=/update params={wt=javabin&version=2} {add=[156]} 0 0
[junit4:junit4]   2> 7299 T2208 C176 UPDATE [collection1] webapp=/solr path=/update params={wt=javabin&version=2} {add=[157]} 0 0
[junit4:junit4]   2> 7315 T2209 C176 UPDATE [collection1] webapp=/solr path=/update params={wt=javabin&version=2} {add=[158]} 0 0
[junit4:junit4]   2> 7330 T2210 C176 UPDATE [collection1] webapp=/solr path=/update params={wt=javabin&version=2} {add=[159]} 0 0
[junit4:junit4]   2> 7346 T2206 C176 REQ [collection1] webapp=/solr path=/replication params={command=indexversion&wt=javabin&qt=/replication&version=2} status=0 QTime=0 
[junit4:junit4]   2> 7346 T2205 C176 UPDATE [collection1] webapp=/solr path=/update params={wt=javabin&version=2} {add=[160]} 0 0
[junit4:junit4]   2> 7361 T2207 C176 UPDATE [collection1] webapp=/solr path=/update params={wt=javabin&version=2} {add=[161]} 0 0
[junit4:junit4]   2> 7377 T2208 C176 UPDATE [collection1] webapp=/solr path=/update params={wt=javabin&version=2} {add=[162]} 0 0
[junit4:junit4]   2> 7393 T2209 C176 UPDATE [collection1] webapp=/solr path=/update params={wt=javabin&version=2} {add=[163]} 0 0
[junit4:junit4]   2> 7408 T2210 C176 UPDATE [collection1] webapp=/solr path=/update params={wt=javabin&version=2} {add=[164]} 0 0
[junit4:junit4]   2> 7424 T2205 C176 UPDATE [collection1] webapp=/solr path=/update params={wt=javabin&version=2} {add=[165]} 0 0
[junit4:junit4]   2> 7440 T2206 C176 UPDATE [collection1] webapp=/solr path=/update params={wt=javabin&version=2} {add=[166]} 0 0
[junit4:junit4]   2> 7455 T2207 C176 UPDATE [collection1] webapp=/solr path=/update params={wt=javabin&version=2} {add=[167]} 0 0
[junit4:junit4]   2> 7471 T2208 C176 UPDATE [collection1] webapp=/solr path=/update params={wt=javabin&version=2} {add=[168]} 0 0
[junit4:junit4]   2> 7486 T2209 C176 UPDATE [collection1] webapp=/solr path=/update params={wt=javabin&version=2} {add=[169]} 0 0
[junit4:junit4]   2> 7502 T2210 C176 UPDATE [collection1] webapp=/solr path=/update params={wt=javabin&version=2} {add=[170]} 0 0
[junit4:junit4]   2> 7518 T2205 C176 UPDATE [collection1] webapp=/solr path=/update params={wt=javabin&version=2} {add=[171]} 0 0
[junit4:junit4]   2> 7533 T2206 C176 UPDATE [collection1] webapp=/solr path=/update params={wt=javabin&version=2} {add=[172]} 0 0
[junit4:junit4]   2> 7549 T2207 C176 UPDATE [collection1] webapp=/solr path=/update params={wt=javabin&version=2} {add=[173]} 0 0
[junit4:junit4]   2> 7565 T2208 C176 UPDATE [collection1] webapp=/solr path=/update params={wt=javabin&version=2} {add=[174]} 0 0
[junit4:junit4]   2> 7580 T2209 C176 UPDATE [collection1] webapp=/solr path=/update params={wt=javabin&version=2} {add=[175]} 0 0
[junit4:junit4]   2> 7596 T2210 C176 UPDATE [collection1] webapp=/solr path=/update params={wt=javabin&version=2} {add=[176]} 0 0
[junit4:junit4]   2> 7611 T2206 C176 UPDATE [collection1] webapp=/solr path=/update params={wt=javabin&version=2} {add=[177]} 0 0
[junit4:junit4]   2> 7627 T2207 C176 UPDATE [collection1] webapp=/solr path=/update params={wt=javabin&version=2} {add=[178]} 0 0
[junit4:junit4]   2> 7643 T2208 C176 UPDATE [collection1] webapp=/solr path=/update params={wt=javabin&version=2} {add=[179]} 0 0
[junit4:junit4]   2> 7658 T2209 C176 UPDATE [collection1] webapp=/solr path=/update params={wt=javabin&version=2} {add=[180]} 0 0
[junit4:junit4]   2> 7674 T2205 C176 UPDATE [collection1] webapp=/solr path=/update params={wt=javabin&version=2} {add=[181]} 0 0
[junit4:junit4]   2> 7690 T2210 C176 UPDATE [collection1] webapp=/solr path=/update params={wt=javabin&version=2} {add=[182]} 0 0
[junit4:junit4]   2> 7705 T2206 C176 UPDATE [collection1] webapp=/solr path=/update params={wt=javabin&version=2} {add=[183]} 0 0
[junit4:junit4]   2> 7721 T2207 C176 UPDATE [collection1] webapp=/solr path=/update params={wt=javabin&version=2} {add=[184]} 0 0
[junit4:junit4]   2> 7736 T2208 C176 UPDATE [collection1] webapp=/solr path=/update params={wt=javabin&version=2} {add=[185]} 0 0
[junit4:junit4]   2> 7752 T2209 C176 UPDATE [collection1] webapp=/solr path=/update params={wt=javabin&version=2} {add=[186]} 0 0
[junit4:junit4]   2> 7768 T2205 C176 UPDATE [collection1] webapp=/solr path=/update params={wt=javabin&version=2} {add=[187]} 0 0
[junit4:junit4]   2> 7783 T2210 C176 UPDATE [collection1] webapp=/solr path=/update params={wt=javabin&version=2} {add=[188]} 0 0
[junit4:junit4]   2> 7799 T2206 C176 UPDATE [collection1] webapp=/solr path=/update params={wt=javabin&version=2} {add=[189]} 0 0
[junit4:junit4]   2> 7815 T2207 C176 UPDATE [collection1] webapp=/solr path=/update params={wt=javabin&version=2} {add=[190]} 0 0
[junit4:junit4]   2> 7830 T2208 C176 UPDATE [collection1] webapp=/solr path=/update params={wt=javabin&version=2} {add=[191]} 0 0
[junit4:junit4]   2> 7846 T2209 C176 UPDATE [collection1] webapp=/solr path=/update params={wt=javabin&version=2} {add=[192]} 0 0
[junit4:junit4]   2> 7861 T2205 C176 UPDATE [collection1] webapp=/solr path=/update params={wt=javabin&version=2} {add=[193]} 0 0
[junit4:junit4]   2> 7877 T2210 C176 UPDATE [collection1] webapp=/solr path=/update params={wt=javabin&version=2} {add=[194]} 0 0
[junit4:junit4]   2> 7893 T2206 C176 UPDATE [collection1] webapp=/solr path=/update params={wt=javabin&version=2} {add=[195]} 0 0
[junit4:junit4]   2> 7908 T2207 C176 UPDATE [collection1] webapp=/solr path=/update params={wt=javabin&version=2} {add=[196]} 0 0
[junit4:junit4]   2> 7924 T2208 C176 UPDATE [collection1] webapp=/solr path=/update params={wt=javabin&version=2} {add=[197]} 0 0
[junit4:junit4]   2> 7940 T2209 C176 UPDATE [collection1] webapp=/solr path=/update params={wt=javabin&version=2} {add=[198]} 0 0
[junit4:junit4]   2> 7955 T2205 C176 UPDATE [collection1] webapp=/solr path=/update params={wt=javabin&version=2} {add=[199]} 0 0
[junit4:junit4]   2> 7971 T2210 C176 UPDATE [collection1] webapp=/solr path=/update params={wt=javabin&version=2} {add=[200]} 0 0
[junit4:junit4]   2> 7986 T2206 C176 UPDATE [collection1] webapp=/solr path=/update params={wt=javabin&version=2} {add=[201]} 0 0
[junit4:junit4]   2> 8002 T2207 C176 UPDATE [collection1] webapp=/solr path=/update params={wt=javabin&version=2} {add=[202]} 0 0
[junit4:junit4]   2> 8018 T2209 C176 UPDATE [collection1] webapp=/solr path=/update params={wt=javabin&version=2} {add=[203]} 0 0
[junit4:junit4]   2> 8033 T2205 C176 UPDATE [collection1] webapp=/solr path=/update params={wt=javabin&version=2} {add=[204]} 0 0
[junit4:junit4]   2> 8049 T2210 C176 UPDATE [collection1] webapp=/solr path=/update params={wt=javabin&version=2} {add=[205]} 0 0
[junit4:junit4]   2> 8065 T2206 C176 UPDATE [collection1] webapp=/solr path=/update params={wt=javabin&version=2} {add=[206]} 0 0
[junit4:junit4]   2> 8080 T2208 C176 UPDATE [collection1] webapp=/solr path=/update params={wt=javabin&version=2} {add=[207]} 0 0
[junit4:junit4]   2> 8096 T2207 C176 UPDATE [collection1] webapp=/solr path=/update params={wt=javabin&version=2} {add=[208]} 0 0
[junit4:junit4]   2> 8111 T2209 C176 UPDATE [collection1] webapp=/solr path=/update params={wt=javabin&version=2} {add=[209]} 0 0
[junit4:junit4]   2> 8127 T2205 C176 UPDATE [collection1] webapp=/solr path=/update params={wt=javabin&version=2} {add=[210]} 0 0
[junit4:junit4]   2> 8143 T2210 C176 UPDATE [collection1] webapp=/solr path=/update params={wt=javabin&version=2} {add=[211]} 0 0
[junit4:junit4]   2> 8158 T2206 C176 UPDATE [collection1] webapp=/solr path=/update params={wt=javabin&version=2} {add=[212]} 0 0
[junit4:junit4]   2> 8174 T2208 C176 UPDATE [collection1] webapp=/solr path=/update params={wt=javabin&version=2} {add=[213]} 0 0
[junit4:junit4]   2> 8190 T2207 C176 UPDATE [collection1] webapp=/solr path=/update params={wt=javabin&version=2} {add=[214]} 0 0
[junit4:junit4]   2> 8205 T2209 C176 UPDATE [collection1] webapp=/solr path=/update params={wt=javabin&version=2} {add=[215]} 0 0
[junit4:junit4]   2> 8221 T2205 C176 UPDATE [collection1] webapp=/solr path=/update params={wt=javabin&version=2} {add=[216]} 0 0
[junit4:junit4]   2> 8236 T2210 C176 UPDATE [collection1] webapp=/solr path=/update params={wt=javabin&version=2} {add=[217]} 0 0
[junit4:junit4]   2> 8252 T2206 C176 UPDATE [collection1] webapp=/solr path=/update params={wt=javabin&version=2} {add=[218]} 0 0
[junit4:junit4]   2> 8268 T2208 C176 UPDATE [collection1] webapp=/solr path=/update params={wt=javabin&version=2} {add=[219]} 0 0
[junit4:junit4]   2> 8283 T2207 C176 UPDATE [collection1] webapp=/solr path=/update params={wt=javabin&version=2} {add=[220]} 0 0
[junit4:junit4]   2> 8299 T2209 C176 UPDATE [collection1] webapp=/solr path=/update params={wt=javabin&version=2} {add=[221]} 0 0
[junit4:junit4]   2> 8315 T2205 C176 UPDATE [collection1] webapp=/solr path=/update params={wt=javabin&version=2} {add=[222]} 0 0
[junit4:junit4]   2> 8330 T2210 C176 UPDATE [collection1] webapp=/solr path=/update params={wt=javabin&version=2} {add=[223]} 0 0
[junit4:junit4]   2> 8346 T2206 C176 REQ [collection1] webapp=/solr path=/replication params={command=indexversion&wt=javabin&qt=/replication&version=2} status=0 QTime=0 
[junit4:junit4]   2> 8346 T2208 C176 UPDATE [collection1] webapp=/solr path=/update params={wt=javabin&version=2} {add=[224]} 0 0
[junit4:junit4]   2> 8361 T2207 C176 UPDATE [collection1] webapp=/solr path=/update params={wt=javabin&version=2} {add=[225]} 0 0
[junit4:junit4]   2> 8377 T2209 C176 UPDATE [collection1] webapp=/solr path=/update params={wt=javabin&version=2} {add=[226]} 0 0
[junit4:junit4]   2> 8393 T2205 C176 UPDATE [collection1] webapp=/solr path=/update params={wt=javabin&version=2} {add=[227]} 0 0
[junit4:junit4]   2> 8408 T2210 C176 UPDATE [collection1] webapp=/solr path=/update params={wt=javabin&version=2} {add=[228]} 0 0
[junit4:junit4]   2> 8424 T2208 C176 UPDATE [collection1] webapp=/solr path=/update params={wt=javabin&version=2} {add=[229]} 0 0
[junit4:junit4]   2> 8440 T2207 C176 UPDATE [collection1] webapp=/solr path=/update params={wt=javabin&version=2} {add=[230]} 0 0
[junit4:junit4]   2> 8455 T2209 C176 UPDATE [collection1] webapp=/solr path=/update params={wt=javabin&version=2} {add=[231]} 0 0
[junit4:junit4]   2> 8471 T2205 C176 UPDATE [collection1] webapp=/solr path=/update params={wt=javabin&version=2} {add=[232]} 0 0
[junit4:junit4]   2> 8486 T2206 C176 UPDATE [collection1] webapp=/solr path=/update params={wt=javabin&version=2} {add=[233]} 0 0
[junit4:junit4]   2> 8502 T2210 C176 UPDATE [collection1] webapp=/solr path=/update params={wt=javabin&version=2} {add=[234]} 0 0
[junit4:junit4]   2> 8518 T2208 C176 UPDATE [collection1] webapp=/solr path=/update params={wt=javabin&version=2} {add=[235]} 0 0
[junit4:junit4]   2> 8533 T2207 C176 UPDATE [collection1] webapp=/solr path=/update params={wt=javabin&version=2} {add=[236]} 0 0
[junit4:junit4]   2> 8549 T2209 C176 UPDATE [collection1] webapp=/solr path=/update params={wt=javabin&version=2} {add=[237]} 0 0
[junit4:junit4]   2> 8565 T2205 C176 UPDATE [collection1] webapp=/solr path=/update params={wt=javabin&version=2} {add=[238]} 0 0
[junit4:junit4]   2> 8580 T2206 C176 UPDATE [collection1] webapp=/solr path=/update params={wt=javabin&version=2} {add=[239]} 0 0
[junit4:junit4]   2> 8596 T2210 C176 UPDATE [collection1] webapp=/solr path=/update params={wt=javabin&version=2} {add=[240]} 0 0
[junit4:junit4]   2> 8611 T2208 C176 UPDATE [collection1] webapp=/solr path=/update params={wt=javabin&version=2} {add=[241]} 0 0
[junit4:junit4]   2> 8627 T2207 C176 UPDATE [collection1] webapp=/solr path=/update params={wt=javabin&version=2} {add=[242]} 0 0
[junit4:junit4]   2> 8643 T2209 C176 UPDATE [collection1] webapp=/solr path=/update params={wt=javabin&version=2} {add=[243]} 0 0
[junit4:junit4]   2> 8658 T2205 C176 UPDATE [collection1] webapp=/solr path=/update params={wt=javabin&version=2} {add=[244]} 0 0
[junit4:junit4]   2> 8674 T2206 C176 UPDATE [collection1] webapp=/solr path=/update params={wt=javabin&version=2} {add=[245]} 0 0
[junit4:junit4]   2> 8690 T2210 C176 UPDATE [collection1] webapp=/solr path=/update params={wt=javabin&version=2} {add=[246]} 0 0
[junit4:junit4]   2> 8705 T2208 C176 UPDATE [collection1] webapp=/solr path=/update params={wt=javabin&version=2} {add=[247]} 0 0
[junit4:junit4]   2> 8721 T2207 C176 UPDATE [collection1] webapp=/solr path=/update params={wt=javabin&version=2} {add=[248]} 0 0
[junit4:junit4]   2> 8736 T2209 C176 UPDATE [collection1] webapp=/solr path=/update params={wt=javabin&version=2} {add=[249]} 0 0
[junit4:junit4]   2> 8752 T2205 C176 UPDATE [collection1] webapp=/solr path=/update params={wt=javabin&version=2} {add=[250]} 0 0
[junit4:junit4]   2> 8768 T2206 C176 UPDATE [collection1] webapp=/solr path=/update params={wt=javabin&version=2} {add=[251]} 0 0
[junit4:junit4]   2> 8783 T2210 C176 UPDATE [collection1] webapp=/solr path=/update params={wt=javabin&version=2} {add=[252]} 0 0
[junit4:junit4]   2> 8799 T2208 C176 UPDATE [collection1] webapp=/solr path=/update params={wt=javabin&version=2} {add=[253]} 0 0
[junit4:junit4]   2> 8815 T2207 C176 UPDATE [collection1] webapp=/solr path=/update params={wt=javabin&version=2} {add=[254]} 0 0
[junit4:junit4]   2> 8830 T2205 C176 UPDATE [collection1] webapp=/solr path=/update params={wt=javabin&version=2} {add=[255]} 0 0
[junit4:junit4]   2> 8846 T2206 C176 UPDATE [collection1] webapp=/solr path=/update params={wt=javabin&version=2} {add=[256]} 0 0
[junit4:junit4]   2> 8861 T2210 C176 UPDATE [collection1] webapp=/solr path=/update params={wt=javabin&version=2} {add=[257]} 0 0
[junit4:junit4]   2> 8877 T2208 C176 UPDATE [collection1] webapp=/solr path=/update params={wt=javabin&version=2} {add=[258]} 0 0
[junit4:junit4]   2> 8893 T2209 C176 UPDATE [collection1] webapp=/solr path=/update params={wt=javabin&version=2} {add=[259]} 0 0
[junit4:junit4]   2> 8908 T2207 C176 UPDATE [collection1] webapp=/solr path=/update params={wt=javabin&version=2} {add=[260]} 0 0
[junit4:junit4]   2> 8924 T2205 C176 UPDATE [collection1] webapp=/solr path=/update params={wt=javabin&version=2} {add=[261]} 0 0
[junit4:junit4]   2> 8940 T2206 C176 UPDATE [collection1] webapp=/solr path=/update params={wt=javabin&version=2} {add=[262]} 0 0
[junit4:junit4]   2> 8955 T2210 C176 UPDATE [collection1] webapp=/solr path=/update params={wt=javabin&version=2} {add=[263]} 0 0
[junit4:junit4]   2> 8971 T2208 C176 UPDATE [collection1] webapp=/solr path=/update params={wt=javabin&version=2} {add=[264]} 0 0
[junit4:junit4]   2> 8986 T2209 C176 UPDATE [collection1] webapp=/solr path=/update params={wt=javabin&version=2} {add=[265]} 0 0
[junit4:junit4]   2> 9002 T2207 C176 UPDATE [collection1] webapp=/solr path=/update params={wt=javabin&version=2} {add=[266]} 0 0
[junit4:junit4]   2> 9018 T2205 C176 UPDATE [collection1] webapp=/solr path=/update params={wt=javabin&version=2} {add=[267]} 0 0
[junit4:junit4]   2> 9033 T2206 C176 UPDATE [collection1] webapp=/solr path=/update params={wt=javabin&version=2} {add=[268]} 0 0
[junit4:junit4]   2> 9049 T2210 C176 UPDATE [collection1] webapp=/solr path=/update params={wt=javabin&version=2} {add=[269]} 0 0
[junit4:junit4]   2> 9065 T2208 C176 UPDATE [collection1] webapp=/solr path=/update params={wt=javabin&version=2} {add=[270]} 0 0
[junit4:junit4]   2> 9080 T2209 C176 UPDATE [collection1] webapp=/solr path=/update params={wt=javabin&version=2} {add=[271]} 0 0
[junit4:junit4]   2> 9096 T2207 C176 UPDATE [collection1] webapp=/solr path=/update params={wt=javabin&version=2} {add=[272]} 0 0
[junit4:junit4]   2> 9111 T2205 C176 UPDATE [collection1] webapp=/solr path=/update params={wt=javabin&version=2} {add=[273]} 0 0
[junit4:junit4]   2> 9127 T2206 C176 UPDATE [collection1] webapp=/solr path=/update params={wt=javabin&version=2} {add=[274]} 0 0
[junit4:junit4]   2> 9143 T2210 C176 UPDATE [collection1] webapp=/solr path=/update params={wt=javabin&version=2} {add=[275]} 0 0
[junit4:junit4]   2> 9158 T2208 C176 UPDATE [collection1] webapp=/solr path=/update params={wt=javabin&version=2} {add=[276]} 0 0
[junit4:junit4]   2> 9174 T2209 C176 UPDATE [collection1] webapp=/solr path=/update params={wt=javabin&version=2} {add=[277]} 0 0
[junit4:junit4]   2> 9190 T2207 C176 UPDATE [collection1] webapp=/solr path=/update params={wt=javabin&version=2} {add=[278]} 0 0
[junit4:junit4]   2> 9205 T2205 C176 UPDATE [collection1] webapp=/solr path=/update params={wt=javabin&version=2} {add=[279]} 0 0
[junit4:junit4]   2> 9221 T2206 C176 UPDATE [collection1] webapp=/solr path=/update params={wt=javabin&version=2} {add=[280]} 0 0
[junit4:junit4]   2> 9236 T2208 C176 UPDATE [collection1] webapp=/solr path=/update params={wt=javabin&version=2} {add=[281]} 0 0
[junit4:junit4]   2> 9252 T2209 C176 UPDATE [collection1] webapp=/solr path=/update params={wt=javabin&version=2} {add=[282]} 0 0
[junit4:junit4]   2> 9268 T2207 C176 UPDATE [collection1] webapp=/solr path=/update params={wt=javabin&version=2} {add=[283]} 0 0
[junit4:junit4]   2> 9283 T2205 C176 UPDATE [collection1] webapp=/solr path=/update params={wt=javabin&version=2} {add=[284]} 0 0
[junit4:junit4]   2> 9299 T2210 C176 UPDATE [collection1] webapp=/solr path=/update params={wt=javabin&version=2} {add=[285]} 0 0
[junit4:junit4]   2> 9315 T2206 C176 UPDATE [collection1] webapp=/solr path=/update params={wt=javabin&version=2} {add=[286]} 0 0
[junit4:junit4]   2> 9330 T2208 C176 UPDATE [collection1] webapp=/solr path=/update params={wt=javabin&version=2} {add=[287]} 0 0
[junit4:junit4]   2> 9346 T2209 C176 REQ [collection1] webapp=/solr path=/replication params={command=indexversion&wt=javabin&qt=/replication&version=2} status=0 QTime=0 
[junit4:junit4]   2> 9346 T2207 C176 UPDATE [collection1] webapp=/solr path=/update params={wt=javabin&version=2} {add=[288]} 0 0
[junit4:junit4]   2> 9361 T2205 C176 UPDATE [collection1] webapp=/solr path=/update params={wt=javabin&version=2} {add=[289]} 0 0
[junit4:junit4]   2> 9377 T2210 C176 UPDATE [collection1] webapp=/solr path=/update params={wt=javabin&version=2} {add=[290]} 0 0
[junit4:junit4]   2> 9393 T2206 C176 UPDATE [collection1] webapp=/solr path=/update params={wt=javabin&version=2} {add=[291]} 0 0
[junit4:junit4]   2> 9408 T2208 C176 UPDATE [collection1] webapp=/solr path=/update params={wt=javabin&version=2} {add=[292]} 0 0
[junit4:junit4]   2> 9424 T2207 C176 UPDATE [collection1] webapp=/solr path=/update params={wt=javabin&version=2} {add=[293]} 0 0
[junit4:junit4]   2> 9440 T2209 C176 UPDATE [collection1] webapp=/solr path=/update params={wt=javabin&version=2} {add=[294]} 0 0
[junit4:junit4]   2> 9455 T2205 C176 UPDATE [collection1] webapp=/solr path=/update params={wt=javabin&version=2} {add=[295]} 0 0
[junit4:junit4]   2> 9471 T2210 C176 UPDATE [collection1] webapp=/solr path=/update params={wt=javabin&version=2} {add=[296]} 0 0
[junit4:junit4]   2> 9486 T2206 C176 UPDATE [collection1] webapp=/solr path=/update params={wt=javabin&version=2} {add=[297]} 0 0
[junit4:junit4]   2> 9502 T2208 C176 UPDATE [collection1] webapp=/solr path=/update params={wt=javabin&version=2} {add=[298]} 0 0
[junit4:junit4]   2> 9518 T2207 C176 UPDATE [collection1] webapp=/solr path=/update params={wt=javabin&version=2} {add=[299]} 0 0
[junit4:junit4]   2> 9533 T2209 C176 UPDATE [collection1] webapp=/solr path=/update params={wt=javabin&version=2} {add=[300]} 0 0
[junit4:junit4]   2> 9549 T2205 C176 UPDATE [collection1] webapp=/solr path=/update params={wt=javabin&version=2} {add=[301]} 0 0
[junit4:junit4]   2> 9565 T2210 C176 UPDATE [collection1] webapp=/solr path=/update params={wt=javabin&version=2} {add=[302]} 0 0
[junit4:junit4]   2> 9580 T2206 C176 UPDATE [collection1] webapp=/solr path=/update params={wt=javabin&version=2} {add=[303]} 0 0
[junit4:junit4]   2> 9596 T2208 C176 UPDATE [collection1] webapp=/solr path=/update params={wt=javabin&version=2} {add=[304]} 0 0
[junit4:junit4]   2> 9611 T2207 C176 UPDATE [collection1] webapp=/solr path=/update params={wt=javabin&version=2} {add=[305]} 0 0
[junit4:junit4]   2> 9627 T2209 C176 UPDATE [collection1] webapp=/solr path=/update params={wt=javabin&version=2} {add=[306]} 0 0
[junit4:junit4]   2> 9643 T2210 C176 UPDATE [collection1] webapp=/solr path=/update params={wt=javabin&version=2} {add=[307]} 0 0
[junit4:junit4]   2> 9658 T2206 C176 UPDATE [collection1] webapp=/solr path=/update params={wt=javabin&version=2} {add=[308]} 0 0
[junit4:junit4]   2> 9674 T2208 C176 UPDATE [collection1] webapp=/solr path=/update params={wt=javabin&version=2} {add=[309]} 0 0
[junit4:junit4]   2> 9690 T2207 C176 UPDATE [collection1] webapp=/solr path=/update params={wt=javabin&version=2} {add=[310]} 0 0
[junit4:junit4]   2> 9705 T2205 C176 UPDATE [collection1] webapp=/solr path=/update params={wt=javabin&version=2} {add=[311]} 0 0
[junit4:junit4]   2> 9721 T2209 C176 UPDATE [collection1] webapp=/solr path=/update params={wt=javabin&version=2} {add=[312]} 0 0
[junit4:junit4]   2> 9736 T2210 C176 UPDATE [collection1] webapp=/solr path=/update params={wt=javabin&version=2} {add=[313]} 0 0
[junit4:junit4]   2> 9752 T2206 C176 UPDATE [collection1] webapp=/solr path=/update params={wt=javabin&version=2} {add=[314]} 0 0
[junit4:junit4]   2> 9768 T2208 C176 UPDATE [collection1] webapp=/solr path=/update params={wt=javabin&version=2} {add=[315]} 0 0
[junit4:junit4]   2> 9783 T2207 C176 UPDATE [collection1] webapp=/solr path=/update params={wt=javabin&version=2} {add=[316]} 0 0
[junit4:junit4]   2> 9799 T2205 C176 UPDATE [collection1] webapp=/solr path=/update params={wt=javabin&version=2} {add=[317]} 0 0
[junit4:junit4]   2> 9815 T2209 C176 UPDATE [collection1] webapp=/solr path=/update params={wt=javabin&version=2} {add=[318]} 0 0
[junit4:junit4]   2> 9830 T2210 C176 UPDATE [collection1] webapp=/solr path=/update params={wt=javabin&version=2} {add=[319]} 0 0
[junit4:junit4]   2> 9846 T2206 C176 UPDATE [collection1] webapp=/solr path=/update params={wt=javabin&version=2} {add=[320]} 0 0
[junit4:junit4]   2> 9861 T2208 C176 UPDATE [collection1] webapp=/solr path=/update params={wt=javabin&version=2} {add=[321]} 0 0
[junit4:junit4]   2> 9877 T2207 C176 UPDATE [collection1] webapp=/solr path=/update params={wt=javabin&version=2} {add=[322]} 0 0
[junit4:junit4]   2> 9893 T2205 C176 UPDATE [collection1] webapp=/solr path=/update params={wt=javabin&version=2} {add=[323]} 0 0
[junit4:junit4]   2> 9908 T2209 C176 UPDATE [collection1] webapp=/solr path=/update params={wt=javabin&version=2} {add=[324]} 0 0
[junit4:junit4]   2> 9924 T2210 C176 UPDATE [collection1] webapp=/solr path=/update params={wt=javabin&version=2} {add=[325]} 0 0
[junit4:junit4]   2> 9940 T2206 C176 UPDATE [collection1] webapp=/solr path=/update params={wt=javabin&version=2} {add=[326]} 0 0
[junit4:junit4]   2> 9955 T2208 C176 UPDATE [collection1] webapp=/solr path=/update params={wt=javabin&version=2} {add=[327]} 0 0
[junit4:junit4]   2> 9971 T2207 C176 UPDATE [collection1] webapp=/solr path=/update params={wt=javabin&version=2} {add=[328]} 0 0
[junit4:junit4]   2> 9986 T2205 C176 UPDATE [collection1] webapp=/solr path=/update params={wt=javabin&version=2} {add=[329]} 0 0
[junit4:junit4]   2> 10002 T2209 C176 UPDATE [collection1] webapp=/solr path=/update params={wt=javabin&version=2} {add=[330]} 0 0
[junit4:junit4]   2> 10018 T2210 C176 UPDATE [collection1] webapp=/solr path=/update params={wt=javabin&version=2} {add=[331]} 0 0
[junit4:junit4]   2> 10033 T2206 C176 UPDATE [collection1] webapp=/solr path=/update params={wt=javabin&version=2} {add=[332]} 0 0
[junit4:junit4]   2> 10049 T2207 C176 UPDATE [collection1] webapp=/solr path=/update params={wt=javabin&version=2} {add=[333]} 0 0
[junit4:junit4]   2> 10065 T2205 C176 UPDATE [collection1] webapp=/solr path=/update params={wt=javabin&version=2} {add=[334]} 0 0
[junit4:junit4]   2> 10080 T2209 C176 UPDATE [collection1] webapp=/solr path=/update params={wt=javabin&version=2} {add=[335]} 0 0
[junit4:junit4]   2> 10096 T2210 C176 UPDATE [collection1] webapp=/solr path=/update params={wt=javabin&version=2} {add=[336]} 0 0
[junit4:junit4]   2> 10111 T2208 C176 UPDATE [collection1] webapp=/solr path=/update params={wt=javabin&version=2} {add=[337]} 0 0
[junit4:junit4]   2> 10127 T2206 C176 UPDATE [collection1] webapp=/solr path=/update params={wt=javabin&version=2} {add=[338]} 0 0
[junit4:junit4]   2> 10143 T2207 C176 UPDATE [collection1] webapp=/solr path=/update params={wt=javabin&version=2} {add=[339]} 0 0
[junit4:junit4]   2> 10158 T2205 C176 UPDATE [collection1] webapp=/solr path=/update params={wt=javabin&version=2} {add=[340]} 0 0
[junit4:junit4]   2> 10174 T2209 C176 UPDATE [collection1] webapp=/solr path=/update params={wt=javabin&version=2} {add=[341]} 0 0
[junit4:junit4]   2> 10190 T2210 C176 UPDATE [collection1] webapp=/solr path=/update params={wt=javabin&version=2} {add=[342]} 0 0
[junit4:junit4]   2> 10205 T2208 C176 UPDATE [collection1] webapp=/solr path=/update params={wt=javabin&version=2} {add=[343]} 0 0
[junit4:junit4]   2> 10221 T2206 C176 UPDATE [collection1] webapp=/solr path=/update params={wt=javabin&version=2} {add=[344]} 0 0
[junit4:junit4]   2> 10236 T2207 C176 UPDATE [collection1] webapp=/solr path=/update params={wt=javabin&version=2} {add=[345]} 0 0
[junit4:junit4]   2> 10252 T2205 C176 UPDATE [collection1] webapp=/solr path=/update params={wt=javabin&version=2} {add=[346]} 0 0
[junit4:junit4]   2> 10268 T2209 C176 UPDATE [collection1] webapp=/solr path=/update params={wt=javabin&version=2} {add=[347]} 0 0
[junit4:junit4]   2> 10283 T2210 C176 UPDATE [collection1] webapp=/solr path=/update params={wt=javabin&version=2} {add=[348]} 0 0
[junit4:junit4]   2> 10299 T2208 C176 UPDATE [collection1] webapp=/solr path=/update params={wt=javabin&version=2} {add=[349]} 0 0
[junit4:junit4]   2> 10315 T2206 C176 UPDATE [collection1] webapp=/solr path=/update params={wt=javabin&version=2} {add=[350]} 0 0
[junit4:junit4]   2> 10330 T2207 C176 UPDATE [collection1] webapp=/solr path=/update params={wt=javabin&version=2} {add=[351]} 0 0
[junit4:junit4]   2> 10346 T2205 C176 REQ [collection1] webapp=/solr path=/replication params={command=indexversion&wt=javabin&qt=/replication&version=2} status=0 QTime=0 
[junit4:junit4]   2> 10346 T2209 C176 UPDATE [collection1] webapp=/solr path=/update params={wt=javabin&version=2} {add=[352]} 0 0
[junit4:junit4]   2> 10361 T2210 C176 UPDATE [collection1] webapp=/solr path=/update params={wt=javabin&version=2} {add=[353]} 0 0
[junit4:junit4]   2> 10377 T2208 C176 UPDATE [collection1] webapp=/solr path=/update params={wt=javabin&version=2} {add=[354]} 0 0
[junit4:junit4]   2> 10393 T2206 C176 UPDATE [collection1] webapp=/solr path=/update params={wt=javabin&version=2} {add=[355]} 0 0
[junit4:junit4]   2> 10408 T2207 C176 UPDATE [collection1] webapp=/solr path=/update params={wt=javabin&version=2} {add=[356]} 0 0
[junit4:junit4]   2> 10424 T2209 C176 UPDATE [collection1] webapp=/solr path=/update params={wt=javabin&version=2} {add=[357]} 0 0
[junit4:junit4]   2> 10440 T2205 C176 UPDATE [collection1] webapp=/solr path=/update params={wt=javabin&version=2} {add=[358]} 0 0
[junit4:junit4]   2> 10455 T2208 C176 UPDATE [collection1] webapp=/solr path=/update params={wt=javabin&version=2} {add=[359]} 0 0
[junit4:junit4]   2> 10471 T2206 C176 UPDATE [collection1] webapp=/solr path=/update params={wt=javabin&version=2} {add=[360]} 0 0
[junit4:junit4]   2> 10486 T2207 C176 UPDATE [collection1] webapp=/solr path=/update params={wt=javabin&version=2} {add=[361]} 0 0
[junit4:junit4]   2> 10502 T2209 C176 UPDATE [collection1] webapp=/solr path=/update params={wt=javabin&version=2} {add=[362]} 0 0
[junit4:junit4]   2> 10518 T2210 C176 UPDATE [collection1] webapp=/solr path=/update params={wt=javabin&version=2} {add=[363]} 0 0
[junit4:junit4]   2> 10533 T2205 C176 UPDATE [collection1] webapp=/solr path=/update params={wt=javabin&version=2} {add=[364]} 0 0
[junit4:junit4]   2> 10549 T2208 C176 UPDATE [collection1] webapp=/solr path=/update params={wt=javabin&version=2} {add=[365]} 0 0
[junit4:junit4]   2> 10565 T2206 C176 UPDATE [collection1] webapp=/solr path=/update params={wt=javabin&version=2} {add=[366]} 0 0
[junit4:junit4]   2> 10580 T2207 C176 UPDATE [collection1] webapp=/solr path=/update params={wt=javabin&version=2} {add=[367]} 0 0
[junit4:junit4]   2> 10596 T2209 C176 UPDATE [collection1] webapp=/solr path=/update params={wt=javabin&version=2} {add=[368]} 0 0
[junit4:junit4]   2> 10611 T2210 C176 UPDATE [collection1] webapp=/solr path=/update params={wt=javabin&version=2} {add=[369]} 0 0
[junit4:junit4]   2> 10627 T2205 C176 UPDATE [collection1] webapp=/solr path=/update params={wt=javabin&version=2} {add=[370]} 0 0
[junit4:junit4]   2> 10643 T2208 C176 UPDATE [collection1] webapp=/solr path=/update params={wt=javabin&version=2} {add=[371]} 0 0
[junit4:junit4]   2> 10658 T2206 C176 UPDATE [collection1] webapp=/solr path=/update params={wt=javabin&version=2} {add=[372]} 0 0
[junit4:junit4]   2> 10674 T2207 C176 UPDATE [collection1] webapp=/solr path=/update params={wt=javabin&version=2} {add=[373]} 0 0
[junit4:junit4]   2> 10690 T2209 C176 UPDATE [collection1] webapp=/solr path=/update params={wt=javabin&version=2} {add=[374]} 0 0
[junit4:junit4]   2> 10705 T2210 C176 UPDATE [collection1] webapp=/solr path=/update params={wt=javabin&version=2} {add=[375]} 0 0
[junit4:junit4]   2> 10721 T2205 C176 UPDATE [collection1] webapp=/solr path=/update params={wt=javabin&version=2} {add=[376]} 0 0
[junit4:junit4]   2> 10736 T2208 C176 UPDATE [collection1] webapp=/solr path=/update params={wt=javabin&version=2} {add=[377]} 0 0
[junit4:junit4]   2> 10752 T2206 C176 UPDATE [collection1] webapp=/solr path=/update params={wt=javabin&version=2} {add=[378]} 0 0
[junit4:junit4]   2> 10768 T2207 C176 UPDATE [collection1] webapp=/solr path=/update params={wt=javabin&version=2} {add=[379]} 0 0
[junit4:junit4]   2> 10783 T2209 C176 UPDATE [collection1] webapp=/solr path=/update params={wt=javabin&version=2} {add=[380]} 0 0
[junit4:junit4]   2> 10799 T2210 C176 UPDATE [collection1] webapp=/solr path=/update params={wt=javabin&version=2} {add=[381]} 0 0
[junit4:junit4]   2> 10815 T2205 C176 UPDATE [collection1] webapp=/solr path=/update params={wt=javabin&version=2} {add=[382]} 0 0
[junit4:junit4]   2> 10830 T2208 C176 UPDATE [collection1] webapp=/solr path=/update params={wt=javabin&version=2} {add=[383]} 0 0
[junit4:junit4]   2> 10846 T2206 C176 UPDATE [collection1] webapp=/solr path=/update params={wt=javabin&version=2} {add=[384]} 0 0
[junit4:junit4]   2> 10861 T2209 C176 UPDATE [collection1] webapp=/solr path=/update params={wt=javabin&version=2} {add=[385]} 0 0
[junit4:junit4]   2> 10877 T2210 C176 UPDATE [collection1] webapp=/solr path=/update params={wt=javabin&version=2} {add=[386]} 0 0
[junit4:junit4]   2> 10893 T2205 C176 UPDATE [collection1] webapp=/solr path=/update params={wt=javabin&version=2} {add=[387]} 0 0
[junit4:junit4]   2> 10908 T2208 C176 UPDATE [collection1] webapp=/solr path=/update params={wt=javabin&version=2} {add=[388]} 0 0
[junit4:junit4]   2> 10924 T2207 C176 UPDATE [collection1] webapp=/solr path=/update params={wt=javabin&version=2} {add=[389]} 0 0
[junit4:junit4]   2> 10940 T2206 C176 UPDATE [collection1] webapp=/solr path=/update params={wt=javabin&version=2} {add=[390]} 0 0
[junit4:junit4]   2> 10955 T2209 C176 UPDATE [collection1] webapp=/solr path=/update params={wt=javabin&version=2} {add=[391]} 0 0
[junit4:junit4]   2> 10971 T2210 C176 UPDATE [collection1] webapp=/solr path=/update params={wt=javabin&version=2} {add=[392]} 0 0
[junit4:junit4]   2> 10986 T2205 C176 UPDATE [collection1] webapp=/solr path=/update params={wt=javabin&version=2} {add=[393]} 0 0
[junit4:junit4]   2> 11002 T2208 C176 UPDATE [collection1] webapp=/solr path=/update params={wt=javabin&version=2} {add=[394]} 0 0
[junit4:junit4]   2> 11018 T2207 C176 UPDATE [collection1] webapp=/solr path=/update params={wt=javabin&version=2} {add=[395]} 0 0
[junit4:junit4]   2> 11033 T2206 C176 UPDATE [collection1] webapp=/solr path=/update params={wt=javabin&version=2} {add=[396]} 0 0
[junit4:junit4]   2> 11049 T2209 C176 UPDATE [collection1] webapp=/solr path=/update params={wt=javabin&version=2} {add=[397]} 0 0
[junit4:junit4]   2> 11065 T2210 C176 UPDATE [collection1] webapp=/solr path=/update params={wt=javabin&version=2} {add=[398]} 0 0
[junit4:junit4]   2> 11080 T2205 C176 UPDATE [collection1] webapp=/solr path=/update params={wt=javabin&version=2} {add=[399]} 0 0
[junit4:junit4]   2> 11096 T2208 C176 UPDATE [collection1] webapp=/solr path=/update params={wt=javabin&version=2} {add=[400]} 0 0
[junit4:junit4]   2> 11111 T2207 C176 UPDATE [collection1] webapp=/solr path=/update params={wt=javabin&version=2} {add=[401]} 0 0
[junit4:junit4]   2> 11127 T2206 C176 UPDATE [collection1] webapp=/solr path=/update params={wt=javabin&version=2} {add=[402]} 0 0
[junit4:junit4]   2> 11143 T2209 C176 UPDATE [collection1] webapp=/solr path=/update params={wt=javabin&version=2} {add=[403]} 0 0
[junit4:junit4]   2> 11158 T2210 C176 UPDATE [collection1] webapp=/solr path=/update params={wt=javabin&version=2} {add=[404]} 0 0
[junit4:junit4]   2> 11174 T2205 C176 UPDATE [collection1] webapp=/solr path=/update params={wt=javabin&version=2} {add=[405]} 0 0
[junit4:junit4]   2> 11190 T2208 C176 UPDATE [collection1] webapp=/solr path=/update params={wt=javabin&version=2} {add=[406]} 0 0
[junit4:junit4]   2> 11205 T2207 C176 UPDATE [collection1] webapp=/solr path=/update params={wt=javabin&version=2} {add=[407]} 0 0
[junit4:junit4]   2> 11221 T2206 C176 UPDATE [collection1] webapp=/solr path=/update params={wt=javabin&version=2} {add=[408]} 0 0
[junit4:junit4]   2> 11236 T2209 C176 UPDATE [collection1] webapp=/solr path=/update params={wt=javabin&version=2} {add=[409]} 0 0
[junit4:junit4]   2> 11252 T2210 C176 UPDATE [collection1] webapp=/solr path=/update params={wt=javabin&version=2} {add=[410]} 0 0
[junit4:junit4]   2> 11268 T2208 C176 UPDATE [collection1] webapp=/solr path=/update params={wt=javabin&version=2} {add=[411]} 0 0
[junit4:junit4]   2> 11283 T2207 C176 UPDATE [collection1] webapp=/solr path=/update params={wt=javabin&version=2} {add=[412]} 0 0
[junit4:junit4]   2> 11299 T2206 C176 UPDATE [collection1] webapp=/solr path=/update params={wt=javabin&version=2} {add=[413]} 0 0
[junit4:junit4]   2> 11315 T2209 C176 UPDATE [collection1] webapp=/solr path=/update params={wt=javabin&version=2} {add=[414]} 0 0
[junit4:junit4]   2> 11330 T2205 C176 UPDATE [collection1] webapp=/solr path=/update params={wt=javabin&version=2} {add=[415]} 0 0
[junit4:junit4]   2> 11346 T2210 C176 REQ [collection1] webapp=/solr path=/replication params={command=indexversion&wt=javabin&qt=/replication&version=2} status=0 QTime=0 
[junit4:junit4]   2> 11346 T2208 C176 UPDATE [collection1] webapp=/solr path=/update params={wt=javabin&version=2} {add=[416]} 0 0
[junit4:junit4]   2> 11361 T2207 C176 UPDATE [collection1] webapp=/solr path=/update params={wt=javabin&version=2} {add=[417]} 0 0
[junit4:junit4]   2> 11377 T2206 C176 UPDATE [collection1] webapp=/solr path=/update params={wt=javabin&version=2} {add=[418]} 0 0
[junit4:junit4]   2> 11393 T2209 C176 UPDATE [collection1] webapp=/solr path=/update params={wt=javabin&version=2} {add=[419]} 0 0
[junit4:junit4]   2> 11408 T2205 C176 UPDATE [collection1] webapp=/solr path=/update params={wt=javabin&version=2} {add=[420]} 0 0
[junit4:junit4]   2> 11424 T2210 C176 UPDATE [collection1] webapp=/solr path=/update params={wt=javabin&version=2} {add=[421]} 0 0
[junit4:junit4]   2> 11440 T2208 C176 UPDATE [collection1] webapp=/solr path=/update params={wt=javabin&version=2} {add=[422]} 0 0
[junit4:junit4]   2> 11455 T2207 C176 UPDATE [collection1] webapp=/solr path=/update params={wt=javabin&version=2} {add=[423]} 0 0
[junit4:junit4]   2> 11471 T2206 C176 UPDATE [collection1] webapp=/solr path=/update params={wt=javabin&version=2} {add=[424]} 0 0
[junit4:junit4]   2> 11486 T2209 C176 UPDATE [collection1] webapp=/solr path=/update params={wt=javabin&version=2} {add=[425]} 0 0
[junit4:junit4]   2> 11502 T2205 C176 UPDATE [collection1] webapp=/solr path=/update params={wt=javabin&version=2} {add=[426]} 0 0
[junit4:junit4]   2> 11518 T2210 C176 UPDATE [collection1] webapp=/solr path=/update params={wt=javabin&version=2} {add=[427]} 0 0
[junit4:junit4]   2> 11533 T2208 C176 UPDATE [collection1] webapp=/solr path=/update params={wt=javabin&version=2} {add=[428]} 0 0
[junit4:junit4]   2> 11549 T2207 C176 UPDATE [collection1] webapp=/solr path=/update params={wt=javabin&version=2} {add=[429]} 0 0
[junit4:junit4]   2> 11565 T2206 C176 UPDATE [collection1] webapp=/solr path=/update params={wt=javabin&version=2} {add=[430]} 0 0
[junit4:junit4]   2> 11580 T2209 C176 UPDATE [collection1] webapp=/solr path=/update params={wt=javabin&version=2} {add=[431]} 0 0
[junit4:junit4]   2> 11596 T2205 C176 UPDATE [collection1] webapp=/solr path=/update params={wt=javabin&version=2} {add=[432]} 0 0
[junit4:junit4]   2> 11611 T2210 C176 UPDATE [collection1] webapp=/solr path=/update params={wt=javabin&version=2} {add=[433]} 0 0
[junit4:junit4]   2> 11627 T2208 C176 UPDATE [collection1] webapp=/solr path=/update params={wt=javabin&version=2} {add=[434]} 0 0
[junit4:junit4]   2> 11643 T2207 C176 UPDATE [collection1] webapp=/solr path=/update params={wt=javabin&version=2} {add=[435]} 0 0
[junit4:junit4]   2> 11658 T2206 C176 UPDATE [collection1] webapp=/solr path=/update params={wt=javabin&version=2} {add=[436]} 0 0
[junit4:junit4]   2> 11674 T2205 C176 UPDATE [collection1] webapp=/solr path=/update params={wt=javabin&version=2} {add=[437]} 0 0
[junit4:junit4]   2> 11690 T2210 C176 UPDATE [collection1] webapp=/solr path=/update params={wt=javabin&version=2} {add=[438]} 0 0
[junit4:junit4]   2> 11705 T2208 C176 UPDATE [collection1] webapp=/solr path=/update params={wt=javabin&version=2} {add=[439]} 0 0
[junit4:junit4]   2> 11721 T2207 C176 UPDATE [collection1] webapp=/solr path=/update params={wt=javabin&version=2} {add=[440]} 0 0
[junit4:junit4]   2> 11736 T2209 C176 UPDATE [collection1] webapp=/solr path=/update params={wt=javabin&version=2} {add=[441]} 0 0
[junit4:junit4]   2> 11752 T2206 C176 UPDATE [collection1] webapp=/solr path=/update params={wt=javabin&version=2} {add=[442]} 0 0
[junit4:junit4]   2> 11768 T2205 C176 UPDATE [collection1] webapp=/solr path=/update params={wt=javabin&version=2} {add=[443]} 0 0
[junit4:junit4]   2> 11783 T2210 C176 UPDATE [collection1] webapp=/solr path=/update params={wt=javabin&version=2} {add=[444]} 0 0
[junit4:junit4]   2> 11799 T2208 C176 UPDATE [collection1] webapp=/solr path=/update params={wt=javabin&version=2} {add=[445]} 0 0
[junit4:junit4]   2> 11815 T2207 C176 UPDATE [collection1] webapp=/solr path=/update params={wt=javabin&version=2} {add=[446]} 0 0
[junit4:junit4]   2> 11830 T2209 C176 UPDATE [collection1] webapp=/solr path=/update params={wt=javabin&version=2} {add=[447]} 0 0
[junit4:junit4]   2> 11846 T2206 C176 UPDATE [collection1] webapp=/solr path=/update params={wt=javabin&version=2} {add=[448]} 0 0
[junit4:junit4]   2> 11861 T2205 C176 UPDATE [collection1] webapp=/solr path=/update params={wt=javabin&version=2} {add=[449]} 0 0
[junit4:junit4]   2> 11877 T2210 C176 UPDATE [collecti

[...truncated too long message...]

reRule$1.evaluate(SystemPropertiesRestoreRule.java:53)
[junit4:junit4]    > 	at org.apache.lucene.util.TestRuleSetupTeardownChained$1.evaluate(TestRuleSetupTeardownChained.java:50)
[junit4:junit4]    > 	at org.apache.lucene.util.TestRuleFieldCacheSanity$1.evaluate(TestRuleFieldCacheSanity.java:51)
[junit4:junit4]    > 	at org.apache.lucene.util.AbstractBeforeAfterRule$1.evaluate(AbstractBeforeAfterRule.java:45)
[junit4:junit4]    > 	at com.carrotsearch.randomizedtesting.rules.SystemPropertiesInvariantRule$1.evaluate(SystemPropertiesInvariantRule.java:55)
[junit4:junit4]    > 	at org.apache.lucene.util.TestRuleThreadAndTestName$1.evaluate(TestRuleThreadAndTestName.java:48)
[junit4:junit4]    > 	at org.apache.lucene.util.TestRuleIgnoreAfterMaxFailures$1.evaluate(TestRuleIgnoreAfterMaxFailures.java:70)
[junit4:junit4]    > 	at org.apache.lucene.util.TestRuleMarkFailure$1.evaluate(TestRuleMarkFailure.java:48)
[junit4:junit4]    > 	at com.carrotsearch.randomizedtesting.rules.StatementAdapter.evaluate(StatementAdapter.java:36)
[junit4:junit4]    > 	at com.carrotsearch.randomizedtesting.ThreadLeakControl$StatementRunner.run(ThreadLeakControl.java:358)
[junit4:junit4]    > 	at com.carrotsearch.randomizedtesting.ThreadLeakControl.forkTimeoutingTask(ThreadLeakControl.java:782)
[junit4:junit4]    > 	at com.carrotsearch.randomizedtesting.ThreadLeakControl$3.evaluate(ThreadLeakControl.java:442)
[junit4:junit4]    > 	at com.carrotsearch.randomizedtesting.RandomizedRunner.runSingleTest(RandomizedRunner.java:746)
[junit4:junit4]    > 	at com.carrotsearch.randomizedtesting.RandomizedRunner$3.evaluate(RandomizedRunner.java:648)
[junit4:junit4]    > 	at com.carrotsearch.randomizedtesting.RandomizedRunner$4.evaluate(RandomizedRunner.java:682)
[junit4:junit4]    > 	at com.carrotsearch.randomizedtesting.RandomizedRunner$5.evaluate(RandomizedRunner.java:693)
[junit4:junit4]    > 	at com.carrotsearch.randomizedtesting.rules.StatementAdapter.evaluate(StatementAdapter.java:36)
[junit4:junit4]    > 	at com.carrotsearch.randomizedtesting.rules.SystemPropertiesRestoreRule$1.evaluate(SystemPropertiesRestoreRule.java:53)
[junit4:junit4]    > 	at org.apache.lucene.util.AbstractBeforeAfterRule$1.evaluate(AbstractBeforeAfterRule.java:45)
[junit4:junit4]    > 	at org.apache.lucene.util.TestRuleStoreClassName$1.evaluate(TestRuleStoreClassName.java:42)
[junit4:junit4]    > 	at com.carrotsearch.randomizedtesting.rules.SystemPropertiesInvariantRule$1.evaluate(SystemPropertiesInvariantRule.java:55)
[junit4:junit4]    > 	at com.carrotsearch.randomizedtesting.rules.NoShadowingOrOverridesOnMethodsRule$1.evaluate(NoShadowingOrOverridesOnMethodsRule.java:39)
[junit4:junit4]    > 	at com.carrotsearch.randomizedtesting.rules.NoShadowingOrOverridesOnMethodsRule$1.evaluate(NoShadowingOrOverridesOnMethodsRule.java:39)
[junit4:junit4]    > 	at com.carrotsearch.randomizedtesting.rules.StatementAdapter.evaluate(StatementAdapter.java:36)
[junit4:junit4]    > 	at org.apache.lucene.util.TestRuleAssertionsRequired$1.evaluate(TestRuleAssertionsRequired.java:43)
[junit4:junit4]    > 	at org.apache.lucene.util.TestRuleMarkFailure$1.evaluate(TestRuleMarkFailure.java:48)
[junit4:junit4]    > 	at org.apache.lucene.util.TestRuleIgnoreAfterMaxFailures$1.evaluate(TestRuleIgnoreAfterMaxFailures.java:70)
[junit4:junit4]    > 	at org.apache.lucene.util.TestRuleIgnoreTestSuites$1.evaluate(TestRuleIgnoreTestSuites.java:55)
[junit4:junit4]    > 	at com.carrotsearch.randomizedtesting.rules.StatementAdapter.evaluate(StatementAdapter.java:36)
[junit4:junit4]    > 	at com.carrotsearch.randomizedtesting.ThreadLeakControl$StatementRunner.run(ThreadLeakControl.java:358)
[junit4:junit4]    > 	at java.lang.Thread.run(Thread.java:722)
[junit4:junit4]   2> 29458 T3473 oas.SolrTestCaseJ4.deleteCore ###deleteCore
[junit4:junit4]   2> NOTE: test params are: codec=Lucene40, sim=DefaultSimilarity, locale=es_CL, timezone=Africa/Tripoli
[junit4:junit4]   2> NOTE: Windows 7 6.1 amd64/Oracle Corporation 1.7.0_07 (64-bit)/cpus=2,threads=2,free=137532968,total=233840640
[junit4:junit4]   2> NOTE: All tests run in this JVM: [BasicZkTest, CoreContainerCoreInitFailuresTest, SpatialFilterTest, XmlUpdateRequestHandlerTest, SuggesterWFSTTest, TestHashPartitioner, TestRecovery, SoftAutoCommitTest, HighlighterConfigTest, LeaderElectionIntegrationTest, TestStressReorder, RAMDirectoryFactoryTest, TestBM25SimilarityFactory, UpdateParamsTest, TestRangeQuery, JSONWriterTest, IndexSchemaRuntimeFieldTest, TestBinaryField, MinimalSchemaTest, DebugComponentTest, DistributedQueryElevationComponentTest, TestPhraseSuggestions, LoggingHandlerTest, WordBreakSolrSpellCheckerTest, TestLMJelinekMercerSimilarityFactory, OpenExchangeRatesOrgProviderTest, TestDocumentBuilder, IndexBasedSpellCheckerTest, PrimUtilsTest, TestCSVLoader, TestNumberUtils, SpellCheckComponentTest, TestSolrXMLSerializer, ZkSolrClientTest, DocumentAnalysisRequestHandlerTest, QueryParsingTest, SolrCoreTest, EchoParamsTest, DirectUpdateHandlerOptimizeTest, SearchHandlerTest, BadIndexSchemaTest, MBeansHandlerTest, DistributedTermsComponentTest, TestExtendedDismaxParser, SortByFunctionTest, ResponseLogComponentTest, TestCoreContainer, SolrRequestParserTest, RecoveryZkTest, PluginInfoTest, IndexSchemaTest, DateMathParserTest, TestReversedWildcardFilterFactory, MultiTermTest, TestMultiCoreConfBootstrap, XsltUpdateRequestHandlerTest, AutoCommitTest, PathHierarchyTokenizerFactoryTest, SolrCoreCheckLockOnStartupTest, PeerSyncTest, IndexReaderFactoryTest, SignatureUpdateProcessorFactoryTest, TestUpdate, TestFiltering, SolrPluginUtilsTest, TestSolrDeletionPolicy1, URLClassifyProcessorTest, DirectSolrConnectionTest, CopyFieldTest, ClusterStateTest, TestIndexSearcher, TestLuceneMatchVersion, SuggesterTSTTest, TestPropInjectDefaults, TestRemoteStreaming, TermVectorComponentTest, ClusterStateUpdateTest, LeaderElectionTest, PolyFieldTest, TestFunctionQuery, DirectUpdateHandlerTest, TestSolrJ, QueryElevationComponentTest, TestXIncludeConfig, TestFaceting, BasicFunctionalityTest, StatsComponentTest, TestDFRSimilarityFactory, TestAnalyzedSuggestions, TermVectorComponentDistributedTest, PrimitiveFieldTypeTest, BinaryUpdateRequestHandlerTest, ScriptEngineTest, TestPseudoReturnFields, FastVectorHighlighterTest, TestSolr4Spatial, SOLR749Test, CircularListTest, TestFastOutputStream, UniqFieldsUpdateProcessorFactoryTest, SampleTest, LukeRequestHandlerTest, TestQuerySenderNoQuery, SuggesterFSTTest, TestSystemIdResolver, TimeZoneUtilsTest, DefaultValueUpdateProcessorTest, TestIBSimilarityFactory, TestOmitPositions, HighlighterTest, SolrInfoMBeanTest, BasicDistributedZkTest, OverseerTest, FullSolrCloudDistribCmdsTest, TestReplicationHandler, DistributedSpellCheckComponentTest, TestRealTimeGet, ZkControllerTest, TestDistributedGrouping, TestRandomFaceting, TestDistributedSearch, SpellCheckCollatorTest, TestJoin, SimpleFacetsTest, TestSort, TestGroupingSearch, DirectSolrSpellCheckerTest, FileBasedSpellCheckerTest, ConvertedLegacyTest, TestBinaryResponseWriter, TestJmxIntegration, CoreAdminHandlerTest, TestTrie, CacheHeaderTest, QueryEqualityTest, TestWordDelimiterFilterFactory, TestCSVResponseWriter, MoreLikeThisHandlerTest, DocumentBuilderTest, CurrencyFieldTest, DisMaxRequestHandlerTest, TermsComponentTest, DistanceFunctionTest, StandardRequestHandlerTest, TestQueryTypes, TestPHPSerializedResponseWriter, FieldAnalysisRequestHandlerTest, PingRequestHandlerTest, JsonLoaderTest, TestSurroundQueryParser, TestSolrQueryParser, TestValueSourceCache, ReturnFieldsTest, RequestHandlersTest, RequiredFieldsTest, TestArbitraryIndexDir, TestQueryUtils, SolrCmdDistributorTest, SuggesterTest, CSVRequestHandlerTest, ShowFileRequestHandlerTest, TestSearchPerf, NotRequiredUniqueKeyTest, TestFoldingMultitermQuery, UpdateRequestProcessorFactoryTest, TestPropInject, TestWriterPerf, TestIndexingPerformance, NoCacheHeaderTest, AlternateDirectoryTest, FieldMutatingUpdateProcessorTest, BadComponentTest, TestSolrDeletionPolicy2, TestMergePolicyConfig, TestDocSet, TestLFUCache, TestQuerySenderListener, TestCollationField, SolrIndexConfigTest, NumericFieldsTest, OutputWriterTest, TestSolrCoreProperties, TestJmxMonitoredMap, TestConfig, SpellPossibilityIteratorTest, TestLMDirichletSimilarityFactory, TestPerFieldSimilarity, TestPluginEnable, LegacyHTMLStripCharFilterTest, TestCodecSupport, TestDefaultSimilarityFactory, TestFastLRUCache, ResourceLoaderTest, FileUtilsTest, DateFieldTest, SpellingQueryConverterTest, TestSuggestSpellingConverter, TestBadConfig, DOMUtilTest, TestLRUCache, UUIDFieldTest, SystemInfoHandlerTest, TestUtils, PreAnalyzedFieldTest, ZkNodePropsTest, AnalysisAfterCoreReloadTest, TestCharFilters, BasicDistributedZk2Test, SyncSliceTest]
[junit4:junit4] Completed in 29.49s, 1 test, 1 failure <<< FAILURES!

[...truncated 46 lines...]
BUILD FAILED
C:\Users\JenkinsSlave\workspace\Lucene-Solr-trunk-Windows\build.xml:335: The following error occurred while executing this line:
C:\Users\JenkinsSlave\workspace\Lucene-Solr-trunk-Windows\build.xml:39: The following error occurred while executing this line:
C:\Users\JenkinsSlave\workspace\Lucene-Solr-trunk-Windows\solr\build.xml:178: The following error occurred while executing this line:
C:\Users\JenkinsSlave\workspace\Lucene-Solr-trunk-Windows\lucene\module-build.xml:61: The following error occurred while executing this line:
C:\Users\JenkinsSlave\workspace\Lucene-Solr-trunk-Windows\lucene\common-build.xml:1159: The following error occurred while executing this line:
C:\Users\JenkinsSlave\workspace\Lucene-Solr-trunk-Windows\lucene\common-build.xml:827: There were test failures: 232 suites, 961 tests, 2 suite-level errors, 2 failures, 12 ignored (7 assumptions)

Total time: 40 minutes 47 seconds
Build step 'Invoke Ant' marked build as failure
Archiving artifacts
Recording test results
Description set: Java: 64bit/jdk1.7.0_07 -XX:+UseSerialGC
Email was triggered for: Failure
Sending email for trigger: Failure



Mime
View raw message