lucene-dev mailing list archives

Site index · List index
Message view « Date » · « Thread »
Top « Date » · « Thread »
From Charlie Cron <hudsonsevilt...@gmail.com>
Subject Build failed in Jenkins: slow-io-beasting #5153
Date Tue, 30 Oct 2012 21:08:08 GMT
See <http://sierranevada.servebeer.com:8080/job/slow-io-beasting/5153/>

------------------------------------------
[...truncated 15777 lines...]
[junit4:junit4]   2> 293482 T87 oasu.DirectUpdateHandler2.close closing DirectUpdateHandler2{commits=1,autocommits=0,soft
autocommits=0,optimizes=0,rollbacks=0,expungeDeletes=0,docsPending=0,adds=0,deletesById=0,deletesByQuery=0,errors=0,cumulative_adds=0,cumulative_deletesById=0,cumulative_deletesByQuery=0,cumulative_errors=0}
[junit4:junit4]   2> 293483 T87 oasc.SolrCore.decrefSolrCoreState Closing SolrCoreState
[junit4:junit4]   2> 293483 T87 oasu.DefaultSolrCoreState.closeIndexWriter SolrCoreState
ref count has reached 0 - closing IndexWriter
[junit4:junit4]   2> 293483 T87 oasu.DefaultSolrCoreState.closeIndexWriter closing IndexWriter
with IndexWriterCloser
[junit4:junit4]   2> 293485 T87 oasc.SolrCore.closeSearcher [collection1] Closing main
searcher on request.
[junit4:junit4]   2> 294321 T185 oaz.ClientCnxn$SendThread.startConnect Opening socket
connection to server 127.0.0.1/127.0.0.1:61743
[junit4:junit4]   2> 295414 T186 oaz.ClientCnxn$EventThread.run EventThread shut down
[junit4:junit4]   2> 295414 T87 oaz.ZooKeeper.close Session: 0x13ab37c33f10008 closed
[junit4:junit4]   2> 295424 T87 oejsh.ContextHandler.doStop stopped o.e.j.s.ServletContextHandler{/solr,null}
[junit4:junit4]   2> 295647 T87 oas.SolrTestCaseJ4.tearDown ###Ending testDistribSearch
[junit4:junit4]   1> / (2)
[junit4:junit4]   1> DATA:
[junit4:junit4]   1>     
[junit4:junit4]   1>  /solr (6)
[junit4:junit4]   1>   /solr/configs (1)
[junit4:junit4]   1>    /solr/configs/conf1 (2)
[junit4:junit4]   1>     /solr/configs/conf1/solrconfig.xml (0)
[junit4:junit4]   1>     DATA: ...supressed...
[junit4:junit4]   1>     /solr/configs/conf1/schema.xml (0)
[junit4:junit4]   1>     DATA: ...supressed...
[junit4:junit4]   1>   /solr/live_nodes (7)
[junit4:junit4]   1>    /solr/live_nodes/127.0.0.1:61773_solr (0)
[junit4:junit4]   1>    /solr/live_nodes/127.0.0.1:61779_solr (0)
[junit4:junit4]   1>    /solr/live_nodes/127.0.0.1:61796_solr (0)
[junit4:junit4]   1>    /solr/live_nodes/127.0.0.1:61761_solr (0)
[junit4:junit4]   1>    /solr/live_nodes/127.0.0.1:61804_solr (0)
[junit4:junit4]   1>    /solr/live_nodes/127.0.0.1:61788_solr (0)
[junit4:junit4]   1>    /solr/live_nodes/127.0.0.1:61767_solr (0)
[junit4:junit4]   1>   /solr/overseer (3)
[junit4:junit4]   1>   DATA:
[junit4:junit4]   1>       
[junit4:junit4]   1>    /solr/overseer/queue (0)
[junit4:junit4]   1>    DATA:
[junit4:junit4]   1>        
[junit4:junit4]   1>    /solr/overseer/queue-work (0)
[junit4:junit4]   1>    DATA:
[junit4:junit4]   1>        
[junit4:junit4]   1>    /solr/overseer/collection-queue-work (0)
[junit4:junit4]   1>    DATA:
[junit4:junit4]   1>        
[junit4:junit4]   1>   /solr/overseer_elect (2)
[junit4:junit4]   1>    /solr/overseer_elect/election (7)
[junit4:junit4]   1>     /solr/overseer_elect/election/88580488715894788-127.0.0.1:61773_solr-n_0000000002
(0)
[junit4:junit4]   1>     /solr/overseer_elect/election/88580488715894789-127.0.0.1:61779_solr-n_0000000003
(0)
[junit4:junit4]   1>     /solr/overseer_elect/election/88580488715894791-127.0.0.1:61796_solr-n_0000000005
(0)
[junit4:junit4]   1>     /solr/overseer_elect/election/88580488715894792-127.0.0.1:61804_solr-n_0000000006
(0)
[junit4:junit4]   1>     /solr/overseer_elect/election/88580488715894786-127.0.0.1:61761_solr-n_0000000000
(0)
[junit4:junit4]   1>     /solr/overseer_elect/election/88580488715894787-127.0.0.1:61767_solr-n_0000000001
(0)
[junit4:junit4]   1>     /solr/overseer_elect/election/88580488715894790-127.0.0.1:61788_solr-n_0000000004
(0)
[junit4:junit4]   1>    /solr/overseer_elect/leader (0)
[junit4:junit4]   1>    DATA:
[junit4:junit4]   1>        {"id":"88580488715894786-127.0.0.1:61761_solr-n_0000000000"}
[junit4:junit4]   1>   /solr/collections (2)
[junit4:junit4]   1>    /solr/collections/collection1 (3)
[junit4:junit4]   1>    DATA:
[junit4:junit4]   1>        {"configName":"conf1"}
[junit4:junit4]   1>     /solr/collections/collection1/shards (0)
[junit4:junit4]   1>     /solr/collections/collection1/leader_elect (2)
[junit4:junit4]   1>      /solr/collections/collection1/leader_elect/shard1 (1)
[junit4:junit4]   1>       /solr/collections/collection1/leader_elect/shard1/election (2)
[junit4:junit4]   1>        /solr/collections/collection1/leader_elect/shard1/election/88580488715894791-127.0.0.1:61796_solr_collection1-n_0000000001
(0)
[junit4:junit4]   1>        /solr/collections/collection1/leader_elect/shard1/election/88580488715894789-127.0.0.1:61779_solr_collection1-n_0000000000
(0)
[junit4:junit4]   1>      /solr/collections/collection1/leader_elect/shard2 (1)
[junit4:junit4]   1>       /solr/collections/collection1/leader_elect/shard2/election (3)
[junit4:junit4]   1>        /solr/collections/collection1/leader_elect/shard2/election/88580488715894792-127.0.0.1:61804_solr_collection1-n_0000000002
(0)
[junit4:junit4]   1>        /solr/collections/collection1/leader_elect/shard2/election/88580488715894790-127.0.0.1:61788_solr_collection1-n_0000000001
(0)
[junit4:junit4]   1>        /solr/collections/collection1/leader_elect/shard2/election/88580488715894788-127.0.0.1:61773_solr_collection1-n_0000000000
(0)
[junit4:junit4]   1>     /solr/collections/collection1/leaders (2)
[junit4:junit4]   1>      /solr/collections/collection1/leaders/shard1 (0)
[junit4:junit4]   1>      DATA:
[junit4:junit4]   1>          {
[junit4:junit4]   1>            "core":"collection1",
[junit4:junit4]   1>            "node_name":"127.0.0.1:61779_solr",
[junit4:junit4]   1>            "base_url":"http://127.0.0.1:61779/solr"}
[junit4:junit4]   1>      /solr/collections/collection1/leaders/shard2 (0)
[junit4:junit4]   1>      DATA:
[junit4:junit4]   1>          {
[junit4:junit4]   1>            "core":"collection1",
[junit4:junit4]   1>            "node_name":"127.0.0.1:61773_solr",
[junit4:junit4]   1>            "base_url":"http://127.0.0.1:61773/solr"}
[junit4:junit4]   1>    /solr/collections/control_collection (3)
[junit4:junit4]   1>    DATA:
[junit4:junit4]   1>        {"configName":"conf1"}
[junit4:junit4]   1>     /solr/collections/control_collection/shards (0)
[junit4:junit4]   1>     /solr/collections/control_collection/leader_elect (1)
[junit4:junit4]   1>      /solr/collections/control_collection/leader_elect/control_shard
(1)
[junit4:junit4]   1>       /solr/collections/control_collection/leader_elect/control_shard/election
(1)
[junit4:junit4]   1>        /solr/collections/control_collection/leader_elect/control_shard/election/88580488715894786-127.0.0.1:61761_solr_collection1-n_0000000000
(0)
[junit4:junit4]   1>     /solr/collections/control_collection/leaders (1)
[junit4:junit4]   1>      /solr/collections/control_collection/leaders/control_shard (0)
[junit4:junit4]   1>      DATA:
[junit4:junit4]   1>          {
[junit4:junit4]   1>            "core":"collection1",
[junit4:junit4]   1>            "node_name":"127.0.0.1:61761_solr",
[junit4:junit4]   1>            "base_url":"http://127.0.0.1:61761/solr"}
[junit4:junit4]   1>   /solr/clusterstate.json (0)
[junit4:junit4]   1>   DATA:
[junit4:junit4]   1>       {
[junit4:junit4]   1>         "collection1":{
[junit4:junit4]   1>           "shard1":{
[junit4:junit4]   1>             "range":"80000000-ffffffff",
[junit4:junit4]   1>             "replicas":{
[junit4:junit4]   1>               "127.0.0.1:61767_solr_collection1":{
[junit4:junit4]   1>                 "shard":null,
[junit4:junit4]   1>                 "roles":null,
[junit4:junit4]   1>                 "state":"down",
[junit4:junit4]   1>                 "core":"collection1",
[junit4:junit4]   1>                 "collection":"collection1",
[junit4:junit4]   1>                 "node_name":"127.0.0.1:61767_solr",
[junit4:junit4]   1>                 "base_url":"http://127.0.0.1:61767/solr"},
[junit4:junit4]   1>               "127.0.0.1:61779_solr_collection1":{
[junit4:junit4]   1>                 "shard":"shard1",
[junit4:junit4]   1>                 "roles":null,
[junit4:junit4]   1>                 "state":"active",
[junit4:junit4]   1>                 "core":"collection1",
[junit4:junit4]   1>                 "collection":"collection1",
[junit4:junit4]   1>                 "node_name":"127.0.0.1:61779_solr",
[junit4:junit4]   1>                 "base_url":"http://127.0.0.1:61779/solr",
[junit4:junit4]   1>                 "leader":"true"},
[junit4:junit4]   1>               "127.0.0.1:61796_solr_collection1":{
[junit4:junit4]   1>                 "shard":"shard1",
[junit4:junit4]   1>                 "roles":null,
[junit4:junit4]   1>                 "state":"active",
[junit4:junit4]   1>                 "core":"collection1",
[junit4:junit4]   1>                 "collection":"collection1",
[junit4:junit4]   1>                 "node_name":"127.0.0.1:61796_solr",
[junit4:junit4]   1>                 "base_url":"http://127.0.0.1:61796/solr"}}},
[junit4:junit4]   1>           "shard2":{
[junit4:junit4]   1>             "range":"0-7fffffff",
[junit4:junit4]   1>             "replicas":{
[junit4:junit4]   1>               "127.0.0.1:61773_solr_collection1":{
[junit4:junit4]   1>                 "shard":"shard2",
[junit4:junit4]   1>                 "roles":null,
[junit4:junit4]   1>                 "state":"active",
[junit4:junit4]   1>                 "core":"collection1",
[junit4:junit4]   1>                 "collection":"collection1",
[junit4:junit4]   1>                 "node_name":"127.0.0.1:61773_solr",
[junit4:junit4]   1>                 "base_url":"http://127.0.0.1:61773/solr",
[junit4:junit4]   1>                 "leader":"true"},
[junit4:junit4]   1>               "127.0.0.1:61788_solr_collection1":{
[junit4:junit4]   1>                 "shard":"shard2",
[junit4:junit4]   1>                 "roles":null,
[junit4:junit4]   1>                 "state":"active",
[junit4:junit4]   1>                 "core":"collection1",
[junit4:junit4]   1>                 "collection":"collection1",
[junit4:junit4]   1>                 "node_name":"127.0.0.1:61788_solr",
[junit4:junit4]   1>                 "base_url":"http://127.0.0.1:61788/solr"},
[junit4:junit4]   1>               "127.0.0.1:61804_solr_collection1":{
[junit4:junit4]   1>                 "shard":"shard2",
[junit4:junit4]   1>                 "roles":null,
[junit4:junit4]   1>                 "state":"active",
[junit4:junit4]   1>                 "core":"collection1",
[junit4:junit4]   1>                 "collection":"collection1",
[junit4:junit4]   1>                 "node_name":"127.0.0.1:61804_solr",
[junit4:junit4]   1>                 "base_url":"http://127.0.0.1:61804/solr"}}}},
[junit4:junit4]   1>         "control_collection":{"control_shard":{"replicas":{"127.0.0.1:61761_solr_collection1":{
[junit4:junit4]   1>                 "shard":"control_shard",
[junit4:junit4]   1>                 "roles":null,
[junit4:junit4]   1>                 "state":"active",
[junit4:junit4]   1>                 "core":"collection1",
[junit4:junit4]   1>                 "collection":"control_collection",
[junit4:junit4]   1>                 "node_name":"127.0.0.1:61761_solr",
[junit4:junit4]   1>                 "base_url":"http://127.0.0.1:61761/solr",
[junit4:junit4]   1>                 "leader":"true"}}}}}
[junit4:junit4]   1>  /zookeeper (1)
[junit4:junit4]   1>  DATA:
[junit4:junit4]   1>      
[junit4:junit4]   1> 
[junit4:junit4]   2> NOTE: reproduce with: ant test  -Dtestcase=CloudSolrServerTest -Dtests.method=testDistribSearch
-Dtests.seed=2AEE5ECB66742742 -Dtests.slow=true -Dtests.locale=iw_IL -Dtests.timezone=Libya
-Dtests.file.encoding=ISO-8859-1
[junit4:junit4] FAILURE  296s J5 | CloudSolrServerTest.testDistribSearch <<<
[junit4:junit4]    > Throwable #1: java.lang.AssertionError: There are still nodes recoverying
- waited for 30 seconds
[junit4:junit4]    > 	at __randomizedtesting.SeedInfo.seed([2AEE5ECB66742742:AB08D0D3112B477E]:0)
[junit4:junit4]    > 	at org.junit.Assert.fail(Assert.java:93)
[junit4:junit4]    > 	at org.apache.solr.cloud.AbstractDistribZkTestBase.waitForRecoveriesToFinish(AbstractDistribZkTestBase.java:165)
[junit4:junit4]    > 	at org.apache.solr.cloud.AbstractFullDistribZkTestBase.waitForRecoveriesToFinish(AbstractFullDistribZkTestBase.java:558)
[junit4:junit4]    > 	at org.apache.solr.cloud.AbstractFullDistribZkTestBase.waitForThingsToLevelOut(AbstractFullDistribZkTestBase.java:1133)
[junit4:junit4]    > 	at org.apache.solr.client.solrj.impl.CloudSolrServerTest.doTest(CloudSolrServerTest.java:95)
[junit4:junit4]    > 	at org.apache.solr.BaseDistributedSearchTestCase.testDistribSearch(BaseDistributedSearchTestCase.java:695)
[junit4:junit4]    > 	at sun.reflect.NativeMethodAccessorImpl.invoke0(Native Method)
[junit4:junit4]    > 	at sun.reflect.NativeMethodAccessorImpl.invoke(NativeMethodAccessorImpl.java:39)
[junit4:junit4]    > 	at sun.reflect.DelegatingMethodAccessorImpl.invoke(DelegatingMethodAccessorImpl.java:25)
[junit4:junit4]    > 	at java.lang.reflect.Method.invoke(Method.java:597)
[junit4:junit4]    > 	at com.carrotsearch.randomizedtesting.RandomizedRunner.invoke(RandomizedRunner.java:1559)
[junit4:junit4]    > 	at com.carrotsearch.randomizedtesting.RandomizedRunner.access$600(RandomizedRunner.java:79)
[junit4:junit4]    > 	at com.carrotsearch.randomizedtesting.RandomizedRunner$6.evaluate(RandomizedRunner.java:737)
[junit4:junit4]    > 	at com.carrotsearch.randomizedtesting.RandomizedRunner$7.evaluate(RandomizedRunner.java:773)
[junit4:junit4]    > 	at com.carrotsearch.randomizedtesting.RandomizedRunner$8.evaluate(RandomizedRunner.java:787)
[junit4:junit4]    > 	at com.carrotsearch.randomizedtesting.rules.SystemPropertiesRestoreRule$1.evaluate(SystemPropertiesRestoreRule.java:53)
[junit4:junit4]    > 	at org.apache.lucene.util.TestRuleSetupTeardownChained$1.evaluate(TestRuleSetupTeardownChained.java:50)
[junit4:junit4]    > 	at org.apache.lucene.util.TestRuleFieldCacheSanity$1.evaluate(TestRuleFieldCacheSanity.java:51)
[junit4:junit4]    > 	at org.apache.lucene.util.AbstractBeforeAfterRule$1.evaluate(AbstractBeforeAfterRule.java:45)
[junit4:junit4]    > 	at com.carrotsearch.randomizedtesting.rules.SystemPropertiesInvariantRule$1.evaluate(SystemPropertiesInvariantRule.java:55)
[junit4:junit4]    > 	at org.apache.lucene.util.TestRuleThreadAndTestName$1.evaluate(TestRuleThreadAndTestName.java:48)
[junit4:junit4]    > 	at org.apache.lucene.util.TestRuleIgnoreAfterMaxFailures$1.evaluate(TestRuleIgnoreAfterMaxFailures.java:70)
[junit4:junit4]    > 	at org.apache.lucene.util.TestRuleMarkFailure$1.evaluate(TestRuleMarkFailure.java:48)
[junit4:junit4]    > 	at com.carrotsearch.randomizedtesting.rules.StatementAdapter.evaluate(StatementAdapter.java:36)
[junit4:junit4]    > 	at com.carrotsearch.randomizedtesting.ThreadLeakControl$StatementRunner.run(ThreadLeakControl.java:358)
[junit4:junit4]    > 	at com.carrotsearch.randomizedtesting.ThreadLeakControl.forkTimeoutingTask(ThreadLeakControl.java:782)
[junit4:junit4]    > 	at com.carrotsearch.randomizedtesting.ThreadLeakControl$3.evaluate(ThreadLeakControl.java:442)
[junit4:junit4]    > 	at com.carrotsearch.randomizedtesting.RandomizedRunner.runSingleTest(RandomizedRunner.java:746)
[junit4:junit4]    > 	at com.carrotsearch.randomizedtesting.RandomizedRunner$3.evaluate(RandomizedRunner.java:648)
[junit4:junit4]    > 	at com.carrotsearch.randomizedtesting.RandomizedRunner$4.evaluate(RandomizedRunner.java:682)
[junit4:junit4]    > 	at com.carrotsearch.randomizedtesting.RandomizedRunner$5.evaluate(RandomizedRunner.java:693)
[junit4:junit4]    > 	at com.carrotsearch.randomizedtesting.rules.StatementAdapter.evaluate(StatementAdapter.java:36)
[junit4:junit4]    > 	at com.carrotsearch.randomizedtesting.rules.SystemPropertiesRestoreRule$1.evaluate(SystemPropertiesRestoreRule.java:53)
[junit4:junit4]    > 	at org.apache.lucene.util.AbstractBeforeAfterRule$1.evaluate(AbstractBeforeAfterRule.java:45)
[junit4:junit4]    > 	at org.apache.lucene.util.TestRuleStoreClassName$1.evaluate(TestRuleStoreClassName.java:42)
[junit4:junit4]    > 	at com.carrotsearch.randomizedtesting.rules.SystemPropertiesInvariantRule$1.evaluate(SystemPropertiesInvariantRule.java:55)
[junit4:junit4]    > 	at com.carrotsearch.randomizedtesting.rules.NoShadowingOrOverridesOnMethodsRule$1.evaluate(NoShadowingOrOverridesOnMethodsRule.java:39)
[junit4:junit4]    > 	at com.carrotsearch.randomizedtesting.rules.NoShadowingOrOverridesOnMethodsRule$1.evaluate(NoShadowingOrOverridesOnMethodsRule.java:39)
[junit4:junit4]    > 	at com.carrotsearch.randomizedtesting.rules.StatementAdapter.evaluate(StatementAdapter.java:36)
[junit4:junit4]    > 	at org.apache.lucene.util.TestRuleAssertionsRequired$1.evaluate(TestRuleAssertionsRequired.java:43)
[junit4:junit4]    > 	at org.apache.lucene.util.TestRuleMarkFailure$1.evaluate(TestRuleMarkFailure.java:48)
[junit4:junit4]    > 	at org.apache.lucene.util.TestRuleIgnoreAfterMaxFailures$1.evaluate(TestRuleIgnoreAfterMaxFailures.java:70)
[junit4:junit4]    > 	at org.apache.lucene.util.TestRuleIgnoreTestSuites$1.evaluate(TestRuleIgnoreTestSuites.java:55)
[junit4:junit4]    > 	at com.carrotsearch.randomizedtesting.rules.StatementAdapter.evaluate(StatementAdapter.java:36)
[junit4:junit4]    > 	at com.carrotsearch.randomizedtesting.ThreadLeakControl$StatementRunner.run(ThreadLeakControl.java:358)
[junit4:junit4]    > 	at java.lang.Thread.run(Thread.java:662)
[junit4:junit4]   2> 295696 T87 oas.SolrTestCaseJ4.deleteCore ###deleteCore
[junit4:junit4]   2> NOTE: test params are: codec=Lucene3x, sim=DefaultSimilarity, locale=iw_IL,
timezone=Libya
[junit4:junit4]   2> NOTE: Windows Vista 6.0 x86/Sun Microsystems Inc. 1.6.0_23 (32-bit)/cpus=4,threads=1,free=5195536,total=16515072
[junit4:junit4]   2> NOTE: All tests run in this JVM: [LargeVolumeEmbeddedTest, SolrDocumentTest,
SolrExceptionTest, MultiCoreExampleJettyTest, TestDocumentObjectBinder, JettyWebappTest, TermsResponseTest,
TestHash, SolrQueryTest, QueryResponseTest, SolrParamTest, FieldAnalysisResponseTest, FacetFieldTest,
NamedListTest, CloudSolrServerTest]
[junit4:junit4] Completed on J5 in 295.74s, 1 test, 1 failure <<< FAILURES!
[junit4:junit4] 
[junit4:junit4] 
[junit4:junit4] Tests with failures:
[junit4:junit4]   - org.apache.solr.client.solrj.impl.CloudSolrServerTest.testDistribSearch
[junit4:junit4] 
[junit4:junit4] 
[junit4:junit4] JVM J0:     4.95 ..    81.04 =    76.09s
[junit4:junit4] JVM J1:     4.95 ..    52.51 =    47.56s
[junit4:junit4] JVM J2:     4.95 ..    52.73 =    47.78s
[junit4:junit4] JVM J3:     4.95 ..    50.55 =    45.60s
[junit4:junit4] JVM J4:     4.95 ..    50.60 =    45.65s
[junit4:junit4] JVM J5:     4.46 ..   346.64 =   342.18s
[junit4:junit4] JVM J6:     5.20 ..    52.80 =    47.61s
[junit4:junit4] JVM J7:     4.95 ..    52.06 =    47.11s
[junit4:junit4] Execution time total: 5 minutes 46 seconds
[junit4:junit4] Tests summary: 43 suites, 239 tests, 1 failure

BUILD FAILED
<http://sierranevada.servebeer.com:8080/job/slow-io-beasting/ws/build.xml>:39: The following
error occurred while executing this line:
<http://sierranevada.servebeer.com:8080/job/slow-io-beasting/ws/solr/build.xml>:185:
The following error occurred while executing this line:
<http://sierranevada.servebeer.com:8080/job/slow-io-beasting/ws/lucene/module-build.xml>:61:
The following error occurred while executing this line:
<http://sierranevada.servebeer.com:8080/job/slow-io-beasting/ws/lucene/common-build.xml>:1159:
The following error occurred while executing this line:
<http://sierranevada.servebeer.com:8080/job/slow-io-beasting/ws/lucene/common-build.xml>:827:
There were test failures: 43 suites, 239 tests, 1 failure

Total time: 20 minutes 31 seconds
Build step 'Invoke Ant' marked build as failure

---------------------------------------------------------------------
To unsubscribe, e-mail: dev-unsubscribe@lucene.apache.org
For additional commands, e-mail: dev-help@lucene.apache.org


Mime
View raw message