lucene-dev mailing list archives

Site index · List index
Message view « Date » · « Thread »
Top « Date » · « Thread »
From Charlie Cron <hudsonsevilt...@gmail.com>
Subject Build failed in Jenkins: slow-io-beasting #4909
Date Sat, 27 Oct 2012 06:35:10 GMT
See <http://sierranevada.servebeer.com:8080/job/slow-io-beasting/4909/changes>

Changes:

[yonik] SOLR-3998: Atomic update on uniqueKey field itself causes duplicate document

------------------------------------------
[...truncated 18123 lines...]
[junit4:junit4]   2> 77051 T460 C35 UPDATE [collection1] webapp=/solr path=/update params={wt=javabin&version=2}
{add=[361]} 0 1
[junit4:junit4]   2> 77054 T457 C35 UPDATE [collection1] webapp=/solr path=/update params={wt=javabin&version=2}
{add=[362]} 0 1
[junit4:junit4]   2> 77056 T459 C35 UPDATE [collection1] webapp=/solr path=/update params={wt=javabin&version=2}
{add=[363]} 0 0
[junit4:junit4]   2> 77058 T451 C35 UPDATE [collection1] webapp=/solr path=/update params={wt=javabin&version=2}
{add=[364]} 0 0
[junit4:junit4]   2> 77059 T458 C35 UPDATE [collection1] webapp=/solr path=/update params={wt=javabin&version=2}
{add=[365]} 0 0
[junit4:junit4]   2> 77060 T455 C35 UPDATE [collection1] webapp=/solr path=/update params={wt=javabin&version=2}
{add=[366]} 0 0
[junit4:junit4]   2> 77062 T453 C35 UPDATE [collection1] webapp=/solr path=/update params={wt=javabin&version=2}
{add=[367]} 0 0
[junit4:junit4]   2> 77094 T460 C35 UPDATE [collection1] webapp=/solr path=/update params={wt=javabin&version=2}
{add=[368]} 0 0
[junit4:junit4]   2> 77110 T457 C35 UPDATE [collection1] webapp=/solr path=/update params={wt=javabin&version=2}
{add=[369]} 0 0
[junit4:junit4]   2> 77125 T459 C35 UPDATE [collection1] webapp=/solr path=/update params={wt=javabin&version=2}
{add=[370]} 0 0
[junit4:junit4]   2> 77141 T447 oash.SnapPuller.fetchLatestIndex SEVERE Master at: http://127.0.0.1:54179/solr
is not available. Index fetch failed. Exception: org.apache.solr.client.solrj.SolrServerException:
Server refused connection at: http://127.0.0.1:54179/solr
[junit4:junit4]   2> 77141 T451 C35 UPDATE [collection1] webapp=/solr path=/update params={wt=javabin&version=2}
{add=[371]} 0 0
[junit4:junit4]   2> 77156 T458 C35 UPDATE [collection1] webapp=/solr path=/update params={wt=javabin&version=2}
{add=[372]} 0 0
[junit4:junit4]   2> 77172 T455 C35 UPDATE [collection1] webapp=/solr path=/update params={wt=javabin&version=2}
{add=[373]} 0 0
[junit4:junit4]   2> 77188 T453 C35 UPDATE [collection1] webapp=/solr path=/update params={wt=javabin&version=2}
{add=[374]} 0 0
[junit4:junit4]   2> 77203 T460 C35 UPDATE [collection1] webapp=/solr path=/update params={wt=javabin&version=2}
{add=[375]} 0 0
[junit4:junit4]   2> 77219 T457 C35 UPDATE [collection1] webapp=/solr path=/update params={wt=javabin&version=2}
{add=[376]} 0 0
[junit4:junit4]   2> 77234 T459 C35 UPDATE [collection1] webapp=/solr path=/update params={wt=javabin&version=2}
{add=[377]} 0 0
[junit4:junit4]   2> 77250 T451 C35 UPDATE [collection1] webapp=/solr path=/update params={wt=javabin&version=2}
{add=[378]} 0 0
[junit4:junit4]   2> 77266 T458 C35 UPDATE [collection1] webapp=/solr path=/update params={wt=javabin&version=2}
{add=[379]} 0 0
[junit4:junit4]   2> 77281 T455 C35 UPDATE [collection1] webapp=/solr path=/update params={wt=javabin&version=2}
{add=[380]} 0 0
[junit4:junit4]   2> 77297 T453 C35 UPDATE [collection1] webapp=/solr path=/update params={wt=javabin&version=2}
{add=[381]} 0 0
[junit4:junit4]   2> 77312 T460 C35 UPDATE [collection1] webapp=/solr path=/update params={wt=javabin&version=2}
{add=[382]} 0 0
[junit4:junit4]   2> 77328 T459 C35 UPDATE [collection1] webapp=/solr path=/update params={wt=javabin&version=2}
{add=[383]} 0 0
[junit4:junit4]   2> 77344 T451 C35 UPDATE [collection1] webapp=/solr path=/update params={wt=javabin&version=2}
{add=[384]} 0 0
[junit4:junit4]   2> 77359 T458 C35 UPDATE [collection1] webapp=/solr path=/update params={wt=javabin&version=2}
{add=[385]} 0 0
[junit4:junit4]   2> 77375 T455 C35 UPDATE [collection1] webapp=/solr path=/update params={wt=javabin&version=2}
{add=[386]} 0 0
[junit4:junit4]   2> 77390 T453 C35 UPDATE [collection1] webapp=/solr path=/update params={wt=javabin&version=2}
{add=[387]} 0 0
[junit4:junit4]   2> 77406 T460 C35 UPDATE [collection1] webapp=/solr path=/update params={wt=javabin&version=2}
{add=[388]} 0 0
[junit4:junit4]   2> 77422 T457 C35 UPDATE [collection1] webapp=/solr path=/update params={wt=javabin&version=2}
{add=[389]} 0 0
[junit4:junit4]   2> 77437 T459 C35 UPDATE [collection1] webapp=/solr path=/update params={wt=javabin&version=2}
{add=[390]} 0 0
[junit4:junit4]   2> 77453 T451 C35 UPDATE [collection1] webapp=/solr path=/update params={wt=javabin&version=2}
{add=[391]} 0 0
[junit4:junit4]   2> 77468 T458 C35 UPDATE [collection1] webapp=/solr path=/update params={wt=javabin&version=2}
{add=[392]} 0 0
[junit4:junit4]   2> 77500 T455 C35 UPDATE [collection1] webapp=/solr path=/update params={wt=javabin&version=2}
{add=[393]} 0 0
[junit4:junit4]   2> 77515 T453 C35 UPDATE [collection1] webapp=/solr path=/update params={wt=javabin&version=2}
{add=[394]} 0 0
[junit4:junit4]   2> 77531 T460 C35 UPDATE [collection1] webapp=/solr path=/update params={wt=javabin&version=2}
{add=[395]} 0 0
[junit4:junit4]   2> 77546 T457 C35 UPDATE [collection1] webapp=/solr path=/update params={wt=javabin&version=2}
{add=[396]} 0 0
[junit4:junit4]   2> 77562 T459 C35 UPDATE [collection1] webapp=/solr path=/update params={wt=javabin&version=2}
{add=[397]} 0 0
[junit4:junit4]   2> 77578 T451 C35 UPDATE [collection1] webapp=/solr path=/update params={wt=javabin&version=2}
{add=[398]} 0 0
[junit4:junit4]   2> 77593 T458 C35 UPDATE [collection1] webapp=/solr path=/update params={wt=javabin&version=2}
{add=[399]} 0 0
[junit4:junit4]   2> 77609 T455 C35 UPDATE [collection1] webapp=/solr path=/update params={wt=javabin&version=2}
{add=[400]} 0 0
[junit4:junit4]   2> 77624 T453 C35 UPDATE [collection1] webapp=/solr path=/update params={wt=javabin&version=2}
{add=[401]} 0 0
[junit4:junit4]   2> 77640 T460 C35 UPDATE [collection1] webapp=/solr path=/update params={wt=javabin&version=2}
{add=[402]} 0 0
[junit4:junit4]   2> 77656 T457 C35 UPDATE [collection1] webapp=/solr path=/update params={wt=javabin&version=2}
{add=[403]} 0 0
[junit4:junit4]   2> 77671 T459 C35 UPDATE [collection1] webapp=/solr path=/update params={wt=javabin&version=2}
{add=[404]} 0 0
[junit4:junit4]   2> 77702 T451 C35 UPDATE [collection1] webapp=/solr path=/update params={wt=javabin&version=2}
{add=[405]} 0 0
[junit4:junit4]   2> 77718 T458 C35 UPDATE [collection1] webapp=/solr path=/update params={wt=javabin&version=2}
{add=[406]} 0 0
[junit4:junit4]   2> 77734 T453 C35 UPDATE [collection1] webapp=/solr path=/update params={wt=javabin&version=2}
{add=[407]} 0 0
[junit4:junit4]   2> 77749 T460 C35 UPDATE [collection1] webapp=/solr path=/update params={wt=javabin&version=2}
{add=[408]} 0 0
[junit4:junit4]   2> 77765 T457 C35 UPDATE [collection1] webapp=/solr path=/update params={wt=javabin&version=2}
{add=[409]} 0 0
[junit4:junit4]   2> 77780 T459 C35 UPDATE [collection1] webapp=/solr path=/update params={wt=javabin&version=2}
{add=[410]} 0 0
[junit4:junit4]   2> 77796 T451 C35 UPDATE [collection1] webapp=/solr path=/update params={wt=javabin&version=2}
{add=[411]} 0 0
[junit4:junit4]   2> 77812 T455 C35 UPDATE [collection1] webapp=/solr path=/update params={wt=javabin&version=2}
{add=[412]} 0 0
[junit4:junit4]   2> 77827 T458 C35 UPDATE [collection1] webapp=/solr path=/update params={wt=javabin&version=2}
{add=[413]} 0 0
[junit4:junit4]   2> 77843 T453 C35 UPDATE [collection1] webapp=/solr path=/update params={wt=javabin&version=2}
{add=[414]} 0 0
[junit4:junit4]   2> 77858 T460 C35 UPDATE [collection1] webapp=/solr path=/update params={wt=javabin&version=2}
{add=[415]} 0 0
[junit4:junit4]   2> 77874 T457 C35 UPDATE [collection1] webapp=/solr path=/update params={wt=javabin&version=2}
{add=[416]} 0 0
[junit4:junit4]   2> 77890 T459 C35 UPDATE [collection1] webapp=/solr path=/update params={wt=javabin&version=2}
{add=[417]} 0 0
[junit4:junit4]   2> 77905 T451 C35 UPDATE [collection1] webapp=/solr path=/update params={wt=javabin&version=2}
{add=[418]} 0 0
[junit4:junit4]   2> 77921 T455 C35 UPDATE [collection1] webapp=/solr path=/update params={wt=javabin&version=2}
{add=[419]} 0 0
[junit4:junit4]   2> 77936 T458 C35 UPDATE [collection1] webapp=/solr path=/update params={wt=javabin&version=2}
{add=[420]} 0 0
[junit4:junit4]   2> 77952 T453 C35 UPDATE [collection1] webapp=/solr path=/update params={wt=javabin&version=2}
{add=[421]} 0 0
[junit4:junit4]   2> 77968 T460 C35 UPDATE [collection1] webapp=/solr path=/update params={wt=javabin&version=2}
{add=[422]} 0 0
[junit4:junit4]   2> 77983 T457 C35 UPDATE [collection1] webapp=/solr path=/update params={wt=javabin&version=2}
{add=[423]} 0 0
[junit4:junit4]   2> 77999 T459 C35 UPDATE [collection1] webapp=/solr path=/update params={wt=javabin&version=2}
{add=[424]} 0 0
[junit4:junit4]   2> 78014 T451 C35 UPDATE [collection1] webapp=/solr path=/update params={wt=javabin&version=2}
{add=[425]} 0 0
[junit4:junit4]   2> 78030 T455 C35 UPDATE [collection1] webapp=/solr path=/update params={wt=javabin&version=2}
{add=[426]} 0 0
[junit4:junit4]   2> 78046 T458 C35 UPDATE [collection1] webapp=/solr path=/update params={wt=javabin&version=2}
{add=[427]} 0 0
[junit4:junit4]   2> 78061 T453 C35 UPDATE [collection1] webapp=/solr path=/update params={wt=javabin&version=2}
{add=[428]} 0 0
[junit4:junit4]   2> 78077 T460 C35 UPDATE [collection1] webapp=/solr path=/update params={wt=javabin&version=2}
{add=[429]} 0 0
[junit4:junit4]   2> 78092 T457 C35 UPDATE [collection1] webapp=/solr path=/update params={wt=javabin&version=2}
{add=[430]} 0 0
[junit4:junit4]   2> 78108 T459 C35 UPDATE [collection1] webapp=/solr path=/update params={wt=javabin&version=2}
{add=[431]} 0 0
[junit4:junit4]   2> 78124 T451 C35 UPDATE [collection1] webapp=/solr path=/update params={wt=javabin&version=2}
{add=[432]} 0 0
[junit4:junit4]   2> 78139 T458 C35 UPDATE [collection1] webapp=/solr path=/update params={wt=javabin&version=2}
{add=[433]} 0 0
[junit4:junit4]   2> 78155 T447 oash.SnapPuller.fetchLatestIndex SEVERE Master at: http://127.0.0.1:54179/solr
is not available. Index fetch failed. Exception: org.apache.solr.client.solrj.SolrServerException:
Server refused connection at: http://127.0.0.1:54179/solr
[junit4:junit4]   2> 78155 T453 C35 UPDATE [collection1] webapp=/solr path=/update params={wt=javabin&version=2}
{add=[434]} 0 0
[junit4:junit4]   2> 78170 T460 C35 UPDATE [collection1] webapp=/solr path=/update params={wt=javabin&version=2}
{add=[435]} 0 0
[junit4:junit4]   2> 78186 T457 C35 UPDATE [collection1] webapp=/solr path=/update params={wt=javabin&version=2}
{add=[436]} 0 0
[junit4:junit4]   2> 78202 T459 C35 UPDATE [collection1] webapp=/solr path=/update params={wt=javabin&version=2}
{add=[437]} 0 0
[junit4:junit4]   2> 78217 T455 C35 UPDATE [collection1] webapp=/solr path=/update params={wt=javabin&version=2}
{add=[438]} 0 0
[junit4:junit4]   2> 78233 T451 C35 UPDATE [collection1] webapp=/solr path=/update params={wt=javabin&version=2}
{add=[439]} 0 0
[junit4:junit4]   2> 78248 T458 C35 UPDATE [collection1] webapp=/solr path=/update params={wt=javabin&version=2}
{add=[440]} 0 0
[junit4:junit4]   2> 78264 T453 C35 UPDATE [collection1] webapp=/solr path=/update params={wt=javabin&version=2}
{add=[441]} 0 0
[junit4:junit4]   2> 78280 T460 C35 UPDATE [collection1] webapp=/solr path=/update params={wt=javabin&version=2}
{add=[442]} 0 0
[junit4:junit4]   2> 78295 T457 C35 UPDATE [collection1] webapp=/solr path=/update params={wt=javabin&version=2}
{add=[443]} 0 0
[junit4:junit4]   2> 78311 T459 C35 UPDATE [collection1] webapp=/solr path=/update params={wt=javabin&version=2}
{add=[444]} 0 0
[junit4:junit4]   2> 78326 T455 C35 UPDATE [collection1] webapp=/solr path=/update params={wt=javabin&version=2}
{add=[445]} 0 0
[junit4:junit4]   2> 78342 T451 C35 UPDATE [collection1] webapp=/solr path=/update params={wt=javabin&version=2}
{add=[446]} 0 0
[junit4:junit4]   2> 78358 T458 C35 UPDATE [collection1] webapp=/solr path=/update params={wt=javabin&version=2}
{add=[447]} 0 0
[junit4:junit4]   2> 78373 T453 C35 UPDATE [collection1] webapp=/solr path=/update params={wt=javabin&version=2}
{add=[448]} 0 0
[junit4:junit4]   2> 78389 T460 C35 UPDATE [collection1] webapp=/solr path=/update params={wt=javabin&version=2}
{add=[449]} 0 0
[junit4:junit4]   2> 78404 T457 C35 UPDATE [collection1] webapp=/solr path=/update params={wt=javabin&version=2}
{add=[450]} 0 0
[junit4:junit4]   2> 78420 T459 C35 UPDATE [collection1] webapp=/solr path=/update params={wt=javabin&version=2}
{add=[451]} 0 0
[junit4:junit4]   2> 78436 T455 C35 UPDATE [collection1] webapp=/solr path=/update params={wt=javabin&version=2}
{add=[452]} 0 0
[junit4:junit4]   2> 78451 T451 C35 UPDATE [collection1] webapp=/solr path=/update params={wt=javabin&version=2}
{add=[453]} 0 0
[junit4:junit4]   2> 78467 T458 C35 UPDATE [collection1] webapp=/solr path=/update params={wt=javabin&version=2}
{add=[454]} 0 0
[junit4:junit4]   2> 78482 T453 C35 UPDATE [collection1] webapp=/solr path=/update params={wt=javabin&version=2}
{add=[455]} 0 0
[junit4:junit4]   2> 78498 T460 C35 UPDATE [collection1] webapp=/solr path=/update params={wt=javabin&version=2}
{add=[456]} 0 0
[junit4:junit4]   2> 78514 T457 C35 UPDATE [collection1] webapp=/solr path=/update params={wt=javabin&version=2}
{add=[457]} 0 0
[junit4:junit4]   2> 78529 T459 C35 UPDATE [collection1] webapp=/solr path=/update params={wt=javabin&version=2}
{add=[458]} 0 0
[junit4:junit4]   2> 78545 T451 C35 UPDATE [collection1] webapp=/solr path=/update params={wt=javabin&version=2}
{add=[459]} 0 0
[junit4:junit4]   2> 78560 T458 C35 UPDATE [collection1] webapp=/solr path=/update params={wt=javabin&version=2}
{add=[460]} 0 0
[junit4:junit4]   2> 78576 T453 C35 UPDATE [collection1] webapp=/solr path=/update params={wt=javabin&version=2}
{add=[461]} 0 0
[junit4:junit4]   2> 78592 T460 C35 UPDATE [collection1] webapp=/solr path=/update params={wt=javabin&version=2}
{add=[462]} 0 0
[junit4:junit4]   2> 78607 T457 C35 UPDATE [collection1] webapp=/solr path=/update params={wt=javabin&version=2}
{add=[463]} 0 0
[junit4:junit4]   2> 78623 T459 C35 UPDATE [collection1] webapp=/solr path=/update params={wt=javabin&version=2}
{add=[464]} 0 0
[junit4:junit4]   2> 78638 T455 C35 UPDATE [collection1] webapp=/solr path=/update params={wt=javabin&version=2}
{add=[465]} 0 0
[junit4:junit4]   2> 78654 T451 C35 UPDATE [collection1] webapp=/solr path=/update params={wt=javabin&version=2}
{add=[466]} 0 0
[junit4:junit4]   2> 78670 T458 C35 UPDATE [collection1] webapp=/solr path=/update params={wt=javabin&version=2}
{add=[467]} 0 0
[junit4:junit4]   2> 78685 T453 C35 UPDATE [collection1] webapp=/solr path=/update params={wt=javabin&version=2}
{add=[468]} 0 0
[junit4:junit4]   2> 78701 T460 C35 UPDATE [collection1] webapp=/solr path=/update params={wt=javabin&version=2}
{add=[469]} 0 0
[junit4:junit4]   2> 78716 T457 C35 UPDATE [collection1] webapp=/solr path=/update params={wt=javabin&version=2}
{add=[470]} 0 0
[junit4:junit4]   2> 78732 T459 C35 UPDATE [collection1] webapp=/solr path=/update params={wt=javabin&version=2}
{add=[471]} 0 0
[junit4:junit4]   2> 78748 T455 C35 UPDATE [collection1] webapp=/solr path=/update params={wt=javabin&version=2}
{add=[472]} 0 0
[junit4:junit4]   2> 78763 T451 C35 UPDATE [collection1] webapp=/solr path=/update params={wt=javabin&version=2}
{add=[473]} 0 0
[junit4:junit4]   2> 78779 T458 C35 UPDATE [collection1] webapp=/solr path=/update params={wt=javabin&version=2}
{add=[474]} 0 0
[junit4:junit4]   2> 78794 T453 C35 UPDATE [collection1] webapp=/solr path=/update params={wt=javabin&version=2}
{add=[475]} 0 0
[junit4:junit4]   2> 78810 T460 C35 UPDATE [collection1] webapp=/solr path=/update params={wt=javabin&version=2}
{add=[476]} 0 0
[junit4:junit4]   2> 78826 T457 C35 UPDATE [collection1] webapp=/solr path=/update params={wt=javabin&version=2}
{add=[477]} 0 0
[junit4:junit4]   2> 78841 T459 C35 UPDATE [collection1] webapp=/solr path=/update params={wt=javabin&version=2}
{add=[478]} 0 0
[junit4:junit4]   2> 78857 T455 C35 UPDATE [collection1] webapp=/solr path=/update params={wt=javabin&version=2}
{add=[479]} 0 0
[junit4:junit4]   2> 78872 T451 C35 UPDATE [collection1] webapp=/solr path=/update params={wt=javabin&version=2}
{add=[480]} 0 0
[junit4:junit4]   2> 78888 T458 C35 UPDATE [collection1] webapp=/solr path=/update params={wt=javabin&version=2}
{add=[481]} 0 0
[junit4:junit4]   2> 78904 T453 C35 UPDATE [collection1] webapp=/solr path=/update params={wt=javabin&version=2}
{add=[482]} 0 0
[junit4:junit4]   2> 78919 T460 C35 UPDATE [collection1] webapp=/solr path=/update params={wt=javabin&version=2}
{add=[483]} 0 0
[junit4:junit4]   2> 78935 T457 C35 UPDATE [collection1] webapp=/solr path=/update params={wt=javabin&version=2}
{add=[484]} 0 0
[junit4:junit4]   2> 78950 T455 C35 UPDATE [collection1] webapp=/solr path=/update params={wt=javabin&version=2}
{add=[485]} 0 0
[junit4:junit4]   2> 78966 T451 C35 UPDATE [collection1] webapp=/solr path=/update params={wt=javabin&version=2}
{add=[486]} 0 0
[junit4:junit4]   2> 78982 T458 C35 UPDATE [collection1] webapp=/solr path=/update params={wt=javabin&version=2}
{add=[487]} 0 0
[junit4:junit4]   2> 78997 T453 C35 UPDATE [collection1] webapp=/solr path=/update params={wt=javabin&version=2}
{add=[488]} 0 0
[junit4:junit4]   2> 79013 T460 C35 UPDATE [collection1] webapp=/solr path=/update params={wt=javabin&version=2}
{add=[489]} 0 0
[junit4:junit4]   2> 79028 T459 C35 UPDATE [collection1] webapp=/solr path=/update params={wt=javabin&version=2}
{add=[490]} 0 0
[junit4:junit4]   2> 79060 T457 C35 UPDATE [collection1] webapp=/solr path=/update params={wt=javabin&version=2}
{add=[491]} 0 0
[junit4:junit4]   2> 79075 T455 C35 UPDATE [collection1] webapp=/solr path=/update params={wt=javabin&version=2}
{add=[492]} 0 0
[junit4:junit4]   2> 79091 T451 C35 oasu.DirectUpdateHandler2.commit start commit{flags=0,_version_=0,optimize=false,openSearcher=true,waitSearcher=true,expungeDeletes=false,softCommit=false}
[junit4:junit4]   2> 79169 T447 oash.SnapPuller.fetchLatestIndex SEVERE Master at: http://127.0.0.1:54179/solr
is not available. Index fetch failed. Exception: org.apache.solr.client.solrj.SolrServerException:
Server refused connection at: http://127.0.0.1:54179/solr
[junit4:junit4]   2> 79294 T451 C35 oasc.SolrDeletionPolicy.onCommit SolrDeletionPolicy.onCommit:
commits:num=2
[junit4:junit4]   2> 		commit{dir=NRTCachingDirectory(org.apache.lucene.store.SimpleFSDirectory@<http://sierranevada.servebeer.com:8080/job/slow-io-beasting/ws/solr/build/solr-core/test/J7/org.apache.solr.handler.TestReplicationHandler$SolrInstance-1351319424942/master/collection1/data/index>
lockFactory=org.apache.lucene.store.SingleInstanceLockFactory@ed053a; maxCacheMB=48.0 maxMergeSizeMB=4.0),segFN=segments_i,generation=18,filenames=[_a.inf,
_a_0.len, _a_1.len, _a.fld, _a_2.len, _a.pst, _a.si, segments_i]
[junit4:junit4]   2> 		commit{dir=NRTCachingDirectory(org.apache.lucene.store.SimpleFSDirectory@<http://sierranevada.servebeer.com:8080/job/slow-io-beasting/ws/solr/build/solr-core/test/J7/org.apache.solr.handler.TestReplicationHandler$SolrInstance-1351319424942/master/collection1/data/index>
lockFactory=org.apache.lucene.store.SingleInstanceLockFactory@ed053a; maxCacheMB=48.0 maxMergeSizeMB=4.0),segFN=segments_j,generation=19,filenames=[_b_1.len,
_b.si, _b.fld, _b.inf, _b_0.len, segments_j, _b.pst]
[junit4:junit4]   2> 79294 T451 C35 oasc.SolrDeletionPolicy.updateCommits newest commit
= 19
[junit4:junit4]   2> 79372 T451 C35 oass.SolrIndexSearcher.<init> Opening Searcher@1d7b662
main
[junit4:junit4]   2> 79372 T451 C35 oasu.DirectUpdateHandler2.commit end_commit_flush
[junit4:junit4]   2> 79372 T461 oasc.SolrCore.registerSearcher [collection1] Registered
new searcher Searcher@1d7b662 main{StandardDirectoryReader(segments_j:35 _b(4.1):C493)}
[junit4:junit4]   2> 79372 T451 C35 UPDATE [collection1] webapp=/solr path=/update params={waitSearcher=true&wt=javabin&commit=true&softCommit=false&version=2}
{commit=} 0 281
[junit4:junit4]   2> 79387 T453 C35 REQ [collection1] webapp=/solr path=/replication params={command=details}
status=0 QTime=0 
[junit4:junit4]   2> 79418 T460 C35 REQ [collection1] webapp=/solr path=/replication params={command=backup}
status=0 QTime=31 
[junit4:junit4]   2> 79621 T459 C35 REQ [collection1] webapp=/solr path=/replication params={command=details}
status=0 QTime=0 
[junit4:junit4]   2> 79824 T457 C35 REQ [collection1] webapp=/solr path=/replication params={command=details}
status=0 QTime=0 
[junit4:junit4]   2> 80183 T447 oash.SnapPuller.fetchLatestIndex SEVERE Master at: http://127.0.0.1:54179/solr
is not available. Index fetch failed. Exception: org.apache.solr.client.solrj.SolrServerException:
Server refused connection at: http://127.0.0.1:54179/solr
[junit4:junit4]   2> 80838 T460 C35 REQ [collection1] webapp=/solr path=/replication params={command=backup}
status=0 QTime=0 
[junit4:junit4]   2> 80838 T453 C35 REQ [collection1] webapp=/solr path=/replication params={command=details}
status=0 QTime=0 
[junit4:junit4]   2> 81056 T459 C35 REQ [collection1] webapp=/solr path=/replication params={command=details}
status=0 QTime=15 
[junit4:junit4]   2> 81181 T447 oash.SnapPuller.fetchLatestIndex SEVERE Master at: http://127.0.0.1:54179/solr
is not available. Index fetch failed. Exception: org.apache.solr.client.solrj.SolrServerException:
Server refused connection at: http://127.0.0.1:54179/solr
[junit4:junit4]   2> 81259 T457 C35 REQ [collection1] webapp=/solr path=/replication params={command=details}
status=0 QTime=0 
[junit4:junit4]   2> 81478 T234 oas.SolrTestCaseJ4.tearDown ###Ending test
[junit4:junit4]   1> replicate slave to master
[junit4:junit4]   2> 81493 T234 oasc.CoreContainer.shutdown Shutting down CoreContainer
instance=20254041
[junit4:junit4]   2> 81493 T234 oasc.SolrCore.close [collection1]  CLOSING SolrCore org.apache.solr.core.SolrCore@18e905
[junit4:junit4]   2> 81493 T234 oasu.DirectUpdateHandler2.close closing DirectUpdateHandler2{commits=1,autocommits=0,soft
autocommits=0,optimizes=0,rollbacks=0,expungeDeletes=0,docsPending=0,adds=0,deletesById=0,deletesByQuery=0,errors=0,cumulative_adds=493,cumulative_deletesById=0,cumulative_deletesByQuery=1,cumulative_errors=0}
[junit4:junit4]   2> 81493 T234 oasc.SolrCore.decrefSolrCoreState Closing SolrCoreState
[junit4:junit4]   2> 81493 T234 oasu.DefaultSolrCoreState.closeIndexWriter SolrCoreState
ref count has reached 0 - closing IndexWriter
[junit4:junit4]   2> 81493 T234 oasu.DefaultSolrCoreState.closeIndexWriter closing IndexWriter
with IndexWriterCloser
[junit4:junit4]   2> 81602 T234 oasc.SolrCore.closeSearcher [collection1] Closing main
searcher on request.
[junit4:junit4]   2> 81602 T234 oejsh.ContextHandler.doStop stopped o.e.j.s.ServletContextHandler{/solr,null}
[junit4:junit4]   2> 81700 T234 oasc.CoreContainer.shutdown Shutting down CoreContainer
instance=32738768
[junit4:junit4]   2> 81700 T234 oasc.SolrCore.close [collection1]  CLOSING SolrCore org.apache.solr.core.SolrCore@413be
[junit4:junit4]   2> 81700 T234 oasu.DirectUpdateHandler2.close closing DirectUpdateHandler2{commits=3,autocommits=0,soft
autocommits=0,optimizes=0,rollbacks=0,expungeDeletes=0,docsPending=0,adds=0,deletesById=0,deletesByQuery=0,errors=0,cumulative_adds=1,cumulative_deletesById=0,cumulative_deletesByQuery=0,cumulative_errors=0}
[junit4:junit4]   2> 81700 T234 oasc.SolrCore.decrefSolrCoreState Closing SolrCoreState
[junit4:junit4]   2> 81700 T234 oasu.DefaultSolrCoreState.closeIndexWriter SolrCoreState
ref count has reached 0 - closing IndexWriter
[junit4:junit4]   2> 81700 T234 oasu.DefaultSolrCoreState.closeIndexWriter closing IndexWriter
with IndexWriterCloser
[junit4:junit4]   2> 81700 T234 oasc.SolrCore.closeSearcher [collection1] Closing main
searcher on request.
[junit4:junit4]   2> 81700 T234 oejsh.ContextHandler.doStop stopped o.e.j.s.ServletContextHandler{/solr,null}
[junit4:junit4]   2> 82188 T447 oash.SnapPuller.fetchLatestIndex SEVERE Master at: http://127.0.0.1:54179/solr
is not available. Index fetch failed. Exception: org.apache.solr.client.solrj.SolrServerException:
Server refused connection at: http://127.0.0.1:54179/solr
[junit4:junit4]   2> !!!! WARNING: best effort to remove <http://sierranevada.servebeer.com:8080/job/slow-io-beasting/ws/solr/build/solr-core/test/J7/./org.apache.solr.handler.TestReplicationHandler$SolrInstance-1351319425535/slave/collection1/data/index.20121027093042051/_4.fld>
FAILED !!!!!
[junit4:junit4]   2> !!!! WARNING: best effort to remove <http://sierranevada.servebeer.com:8080/job/slow-io-beasting/ws/solr/build/solr-core/test/J7/./org.apache.solr.handler.TestReplicationHandler$SolrInstance-1351319425535/slave/collection1/data/index.20121027093042051>
FAILED !!!!!
[junit4:junit4]   2> !!!! WARNING: best effort to remove <http://sierranevada.servebeer.com:8080/job/slow-io-beasting/ws/solr/build/solr-core/test/J7/./org.apache.solr.handler.TestReplicationHandler$SolrInstance-1351319425535/slave/collection1/data>
FAILED !!!!!
[junit4:junit4]   2> !!!! WARNING: best effort to remove <http://sierranevada.servebeer.com:8080/job/slow-io-beasting/ws/solr/build/solr-core/test/J7/./org.apache.solr.handler.TestReplicationHandler$SolrInstance-1351319425535/slave/collection1>
FAILED !!!!!
[junit4:junit4]   2> 82828 T234 oas.SolrTestCaseJ4.deleteCore ###deleteCore
[junit4:junit4]   2> 205362 T234 oas.SolrTestCaseJ4.endTrackingSearchers SEVERE ERROR:
SolrIndexSearcher opens=63 closes=62
[junit4:junit4]   2> NOTE: test params are: codec=SimpleText, sim=DefaultSimilarity, locale=el_GR,
timezone=Europe/Tiraspol
[junit4:junit4]   2> NOTE: Windows Vista 6.0 x86/Sun Microsystems Inc. 1.6.0_23 (32-bit)/cpus=4,threads=1,free=3405024,total=20631552
[junit4:junit4]   2> NOTE: All tests run in this JVM: [PeerSyncTest, TestSolrCoreProperties,
CacheHeaderTest, TestElisionMultitermQuery, ResourceLoaderTest, TestBadConfig, DistributedSpellCheckComponentTest,
LegacyHTMLStripCharFilterTest, DocumentBuilderTest, BinaryUpdateRequestHandlerTest, SpellPossibilityIteratorTest,
UUIDFieldTest, TestSolrQueryParser, TestFunctionQuery, CopyFieldTest, BadIndexSchemaTest,
TestReplicationHandler]
[junit4:junit4]   2> NOTE: reproduce with: ant test  -Dtestcase=TestReplicationHandler
-Dtests.seed=7D7A3FDD0B6600E7 -Dtests.slow=true -Dtests.locale=el_GR -Dtests.timezone=Europe/Tiraspol
-Dtests.file.encoding=UTF-8
[junit4:junit4] ERROR   0.00s J7 | TestReplicationHandler (suite) <<<
[junit4:junit4]    > Throwable #1: java.lang.AssertionError: ERROR: SolrIndexSearcher opens=63
closes=62
[junit4:junit4]    > 	at __randomizedtesting.SeedInfo.seed([7D7A3FDD0B6600E7]:0)
[junit4:junit4]    > 	at org.junit.Assert.fail(Assert.java:93)
[junit4:junit4]    > 	at org.apache.solr.SolrTestCaseJ4.endTrackingSearchers(SolrTestCaseJ4.java:242)
[junit4:junit4]    > 	at org.apache.solr.SolrTestCaseJ4.afterClass(SolrTestCaseJ4.java:97)
[junit4:junit4]    > 	at sun.reflect.NativeMethodAccessorImpl.invoke0(Native Method)
[junit4:junit4]    > 	at sun.reflect.NativeMethodAccessorImpl.invoke(NativeMethodAccessorImpl.java:39)
[junit4:junit4]    > 	at sun.reflect.DelegatingMethodAccessorImpl.invoke(DelegatingMethodAccessorImpl.java:25)
[junit4:junit4]    > 	at java.lang.reflect.Method.invoke(Method.java:597)
[junit4:junit4]    > 	at com.carrotsearch.randomizedtesting.RandomizedRunner.invoke(RandomizedRunner.java:1559)
[junit4:junit4]    > 	at com.carrotsearch.randomizedtesting.RandomizedRunner.access$600(RandomizedRunner.java:79)
[junit4:junit4]    > 	at com.carrotsearch.randomizedtesting.RandomizedRunner$5.evaluate(RandomizedRunner.java:700)
[junit4:junit4]    > 	at com.carrotsearch.randomizedtesting.rules.StatementAdapter.evaluate(StatementAdapter.java:36)
[junit4:junit4]    > 	at com.carrotsearch.randomizedtesting.rules.SystemPropertiesRestoreRule$1.evaluate(SystemPropertiesRestoreRule.java:53)
[junit4:junit4]    > 	at org.apache.lucene.util.AbstractBeforeAfterRule$1.evaluate(AbstractBeforeAfterRule.java:45)
[junit4:junit4]    > 	at org.apache.lucene.util.TestRuleStoreClassName$1.evaluate(TestRuleStoreClassName.java:42)
[junit4:junit4]    > 	at com.carrotsearch.randomizedtesting.rules.SystemPropertiesInvariantRule$1.evaluate(SystemPropertiesInvariantRule.java:55)
[junit4:junit4]    > 	at com.carrotsearch.randomizedtesting.rules.NoShadowingOrOverridesOnMethodsRule$1.evaluate(NoShadowingOrOverridesOnMethodsRule.java:39)
[junit4:junit4]    > 	at com.carrotsearch.randomizedtesting.rules.NoShadowingOrOverridesOnMethodsRule$1.evaluate(NoShadowingOrOverridesOnMethodsRule.java:39)
[junit4:junit4]    > 	at com.carrotsearch.randomizedtesting.rules.StatementAdapter.evaluate(StatementAdapter.java:36)
[junit4:junit4]    > 	at org.apache.lucene.util.TestRuleAssertionsRequired$1.evaluate(TestRuleAssertionsRequired.java:43)
[junit4:junit4]    > 	at org.apache.lucene.util.TestRuleMarkFailure$1.evaluate(TestRuleMarkFailure.java:48)
[junit4:junit4]    > 	at org.apache.lucene.util.TestRuleIgnoreAfterMaxFailures$1.evaluate(TestRuleIgnoreAfterMaxFailures.java:70)
[junit4:junit4]    > 	at org.apache.lucene.util.TestRuleIgnoreTestSuites$1.evaluate(TestRuleIgnoreTestSuites.java:55)
[junit4:junit4]    > 	at com.carrotsearch.randomizedtesting.rules.StatementAdapter.evaluate(StatementAdapter.java:36)
[junit4:junit4]    > 	at com.carrotsearch.randomizedtesting.ThreadLeakControl$StatementRunner.run(ThreadLeakControl.java:358)
[junit4:junit4]    > 	at java.lang.Thread.run(Thread.java:662)
[junit4:junit4] Completed on J7 in 205.48s, 1 test, 1 failure <<< FAILURES!
[junit4:junit4] 
[junit4:junit4] HEARTBEAT J6: 2012-10-27T02:34:14, stalled for 70.7s at: BasicDistributedZk2Test.testDistribSearch
[junit4:junit4] HEARTBEAT J0: 2012-10-27T02:34:26, stalled for  361s at: BasicDistributedZkTest.testDistribSearch
[junit4:junit4] Suite: org.apache.solr.cloud.BasicDistributedZk2Test
[junit4:junit4] Completed on J6 in 115.91s, 1 test
[junit4:junit4] 
[junit4:junit4] Suite: org.apache.solr.cloud.BasicDistributedZkTest
[junit4:junit4] Completed on J0 in 403.18s, 1 test
[junit4:junit4] 
[junit4:junit4] Suite: org.apache.solr.core.CoreContainerCoreInitFailuresTest
[junit4:junit4] Completed on J0 in 2.01s, 2 tests
[junit4:junit4] 
[junit4:junit4] 
[junit4:junit4] Tests with failures:
[junit4:junit4]   - org.apache.solr.handler.TestReplicationHandler (suite)
[junit4:junit4] 
[junit4:junit4] 
[junit4:junit4] JVM J0:     2.89 ..   415.94 =   413.06s
[junit4:junit4] JVM J1:     2.59 ..   292.34 =   289.75s
[junit4:junit4] JVM J2:     3.38 ..   292.53 =   289.14s
[junit4:junit4] JVM J3:     2.57 ..   313.48 =   310.91s
[junit4:junit4] JVM J4:     2.57 ..   292.09 =   289.52s
[junit4:junit4] JVM J5:     2.57 ..   307.67 =   305.10s
[junit4:junit4] JVM J6:     2.32 ..   405.80 =   403.48s
[junit4:junit4] JVM J7:     2.86 ..   336.67 =   333.82s
[junit4:junit4] Execution time total: 6 minutes 55 seconds
[junit4:junit4] Tests summary: 233 suites, 965 tests, 1 suite-level error, 12 ignored (7 assumptions)

BUILD FAILED
<http://sierranevada.servebeer.com:8080/job/slow-io-beasting/ws/build.xml>:39: The following
error occurred while executing this line:
<http://sierranevada.servebeer.com:8080/job/slow-io-beasting/ws/solr/build.xml>:178:
The following error occurred while executing this line:
<http://sierranevada.servebeer.com:8080/job/slow-io-beasting/ws/lucene/module-build.xml>:61:
The following error occurred while executing this line:
<http://sierranevada.servebeer.com:8080/job/slow-io-beasting/ws/lucene/common-build.xml>:1159:
The following error occurred while executing this line:
<http://sierranevada.servebeer.com:8080/job/slow-io-beasting/ws/lucene/common-build.xml>:827:
There were test failures: 233 suites, 965 tests, 1 suite-level error, 12 ignored (7 assumptions)

Total time: 17 minutes 0 seconds
Build step 'Invoke Ant' marked build as failure

---------------------------------------------------------------------
To unsubscribe, e-mail: dev-unsubscribe@lucene.apache.org
For additional commands, e-mail: dev-help@lucene.apache.org


Mime
View raw message