lucene-dev mailing list archives

Site index · List index
Message view « Date » · « Thread »
Top « Date » · « Thread »
From Apache Jenkins Server <jenk...@builds.apache.org>
Subject [JENKINS] Lucene-Solr-NightlyTests-trunk - Build # 76 - Still Failing
Date Mon, 29 Oct 2012 16:53:51 GMT
Build: https://builds.apache.org/job/Lucene-Solr-NightlyTests-trunk/76/

4 tests failed.
FAILED:  junit.framework.TestSuite.org.apache.solr.schema.TestBinaryField

Error Message:
4 threads leaked from SUITE scope at org.apache.solr.schema.TestBinaryField:     1) Thread[id=18, name=qtp1179468258-18 Acceptor1 SelectChannelConnector@0.0.0.0:61576, state=BLOCKED, group=TGRP-TestBinaryField]         at sun.nio.ch.ServerSocketChannelImpl.accept(ServerSocketChannelImpl.java:147)         at org.eclipse.jetty.server.nio.SelectChannelConnector.accept(SelectChannelConnector.java:104)         at org.eclipse.jetty.server.AbstractConnector$Acceptor.run(AbstractConnector.java:933)         at org.eclipse.jetty.util.thread.QueuedThreadPool.runJob(QueuedThreadPool.java:599)         at org.eclipse.jetty.util.thread.QueuedThreadPool$3.run(QueuedThreadPool.java:534)         at java.lang.Thread.run(Thread.java:679)    2) Thread[id=22, name=qtp1179468258-22 Acceptor2 SelectChannelConnector@0.0.0.0:61576, state=BLOCKED, group=TGRP-TestBinaryField]         at sun.nio.ch.ServerSocketChannelImpl.accept(ServerSocketChannelImpl.java:147)         at org.eclipse.jetty.server.nio.SelectChannelConnector.accept(SelectChannelConnector.java:104)         at org.eclipse.jetty.server.AbstractConnector$Acceptor.run(AbstractConnector.java:933)         at org.eclipse.jetty.util.thread.QueuedThreadPool.runJob(QueuedThreadPool.java:599)         at org.eclipse.jetty.util.thread.QueuedThreadPool$3.run(QueuedThreadPool.java:534)         at java.lang.Thread.run(Thread.java:679)    3) Thread[id=21, name=qtp1179468258-21 Acceptor3 SelectChannelConnector@0.0.0.0:61576, state=BLOCKED, group=TGRP-TestBinaryField]         at sun.nio.ch.ServerSocketChannelImpl.accept(ServerSocketChannelImpl.java:147)         at org.eclipse.jetty.server.nio.SelectChannelConnector.accept(SelectChannelConnector.java:104)         at org.eclipse.jetty.server.AbstractConnector$Acceptor.run(AbstractConnector.java:933)         at org.eclipse.jetty.util.thread.QueuedThreadPool.runJob(QueuedThreadPool.java:599)         at org.eclipse.jetty.util.thread.QueuedThreadPool$3.run(QueuedThreadPool.java:534)         at java.lang.Thread.run(Thread.java:679)    4) Thread[id=23, name=qtp1179468258-23 Acceptor0 SelectChannelConnector@0.0.0.0:61576, state=RUNNABLE, group=TGRP-TestBinaryField]         at sun.nio.ch.ServerSocketChannelImpl.accept0(Native Method)         at sun.nio.ch.ServerSocketChannelImpl.accept(ServerSocketChannelImpl.java:163)         at org.eclipse.jetty.server.nio.SelectChannelConnector.accept(SelectChannelConnector.java:104)         at org.eclipse.jetty.server.AbstractConnector$Acceptor.run(AbstractConnector.java:933)         at org.eclipse.jetty.util.thread.QueuedThreadPool.runJob(QueuedThreadPool.java:599)         at org.eclipse.jetty.util.thread.QueuedThreadPool$3.run(QueuedThreadPool.java:534)         at java.lang.Thread.run(Thread.java:679)

Stack Trace:
com.carrotsearch.randomizedtesting.ThreadLeakError: 4 threads leaked from SUITE scope at org.apache.solr.schema.TestBinaryField: 
   1) Thread[id=18, name=qtp1179468258-18 Acceptor1 SelectChannelConnector@0.0.0.0:61576, state=BLOCKED, group=TGRP-TestBinaryField]
        at sun.nio.ch.ServerSocketChannelImpl.accept(ServerSocketChannelImpl.java:147)
        at org.eclipse.jetty.server.nio.SelectChannelConnector.accept(SelectChannelConnector.java:104)
        at org.eclipse.jetty.server.AbstractConnector$Acceptor.run(AbstractConnector.java:933)
        at org.eclipse.jetty.util.thread.QueuedThreadPool.runJob(QueuedThreadPool.java:599)
        at org.eclipse.jetty.util.thread.QueuedThreadPool$3.run(QueuedThreadPool.java:534)
        at java.lang.Thread.run(Thread.java:679)
   2) Thread[id=22, name=qtp1179468258-22 Acceptor2 SelectChannelConnector@0.0.0.0:61576, state=BLOCKED, group=TGRP-TestBinaryField]
        at sun.nio.ch.ServerSocketChannelImpl.accept(ServerSocketChannelImpl.java:147)
        at org.eclipse.jetty.server.nio.SelectChannelConnector.accept(SelectChannelConnector.java:104)
        at org.eclipse.jetty.server.AbstractConnector$Acceptor.run(AbstractConnector.java:933)
        at org.eclipse.jetty.util.thread.QueuedThreadPool.runJob(QueuedThreadPool.java:599)
        at org.eclipse.jetty.util.thread.QueuedThreadPool$3.run(QueuedThreadPool.java:534)
        at java.lang.Thread.run(Thread.java:679)
   3) Thread[id=21, name=qtp1179468258-21 Acceptor3 SelectChannelConnector@0.0.0.0:61576, state=BLOCKED, group=TGRP-TestBinaryField]
        at sun.nio.ch.ServerSocketChannelImpl.accept(ServerSocketChannelImpl.java:147)
        at org.eclipse.jetty.server.nio.SelectChannelConnector.accept(SelectChannelConnector.java:104)
        at org.eclipse.jetty.server.AbstractConnector$Acceptor.run(AbstractConnector.java:933)
        at org.eclipse.jetty.util.thread.QueuedThreadPool.runJob(QueuedThreadPool.java:599)
        at org.eclipse.jetty.util.thread.QueuedThreadPool$3.run(QueuedThreadPool.java:534)
        at java.lang.Thread.run(Thread.java:679)
   4) Thread[id=23, name=qtp1179468258-23 Acceptor0 SelectChannelConnector@0.0.0.0:61576, state=RUNNABLE, group=TGRP-TestBinaryField]
        at sun.nio.ch.ServerSocketChannelImpl.accept0(Native Method)
        at sun.nio.ch.ServerSocketChannelImpl.accept(ServerSocketChannelImpl.java:163)
        at org.eclipse.jetty.server.nio.SelectChannelConnector.accept(SelectChannelConnector.java:104)
        at org.eclipse.jetty.server.AbstractConnector$Acceptor.run(AbstractConnector.java:933)
        at org.eclipse.jetty.util.thread.QueuedThreadPool.runJob(QueuedThreadPool.java:599)
        at org.eclipse.jetty.util.thread.QueuedThreadPool$3.run(QueuedThreadPool.java:534)
        at java.lang.Thread.run(Thread.java:679)
	at __randomizedtesting.SeedInfo.seed([15813E5849A4AF7E]:0)


FAILED:  junit.framework.TestSuite.org.apache.solr.schema.TestBinaryField

Error Message:
There are still zombie threads that couldn't be terminated:    1) Thread[id=18, name=qtp1179468258-18 Acceptor1 SelectChannelConnector@0.0.0.0:61576, state=BLOCKED, group=TGRP-TestBinaryField]         at sun.nio.ch.ServerSocketChannelImpl.accept(ServerSocketChannelImpl.java:147)         at org.eclipse.jetty.server.nio.SelectChannelConnector.accept(SelectChannelConnector.java:104)         at org.eclipse.jetty.server.AbstractConnector$Acceptor.run(AbstractConnector.java:933)         at org.eclipse.jetty.util.thread.QueuedThreadPool.runJob(QueuedThreadPool.java:599)         at org.eclipse.jetty.util.thread.QueuedThreadPool$3.run(QueuedThreadPool.java:534)         at java.lang.Thread.run(Thread.java:679)    2) Thread[id=22, name=qtp1179468258-22 Acceptor2 SelectChannelConnector@0.0.0.0:61576, state=BLOCKED, group=TGRP-TestBinaryField]         at sun.nio.ch.ServerSocketChannelImpl.accept(ServerSocketChannelImpl.java:147)         at org.eclipse.jetty.server.nio.SelectChannelConnector.accept(SelectChannelConnector.java:104)         at org.eclipse.jetty.server.AbstractConnector$Acceptor.run(AbstractConnector.java:933)         at org.eclipse.jetty.util.thread.QueuedThreadPool.runJob(QueuedThreadPool.java:599)         at org.eclipse.jetty.util.thread.QueuedThreadPool$3.run(QueuedThreadPool.java:534)         at java.lang.Thread.run(Thread.java:679)    3) Thread[id=21, name=qtp1179468258-21 Acceptor3 SelectChannelConnector@0.0.0.0:61576, state=BLOCKED, group=TGRP-TestBinaryField]         at sun.nio.ch.ServerSocketChannelImpl.accept(ServerSocketChannelImpl.java:147)         at org.eclipse.jetty.server.nio.SelectChannelConnector.accept(SelectChannelConnector.java:104)         at org.eclipse.jetty.server.AbstractConnector$Acceptor.run(AbstractConnector.java:933)         at org.eclipse.jetty.util.thread.QueuedThreadPool.runJob(QueuedThreadPool.java:599)         at org.eclipse.jetty.util.thread.QueuedThreadPool$3.run(QueuedThreadPool.java:534)         at java.lang.Thread.run(Thread.java:679)    4) Thread[id=23, name=qtp1179468258-23 Acceptor0 SelectChannelConnector@0.0.0.0:61576, state=RUNNABLE, group=TGRP-TestBinaryField]         at sun.nio.ch.ServerSocketChannelImpl.accept0(Native Method)         at sun.nio.ch.ServerSocketChannelImpl.accept(ServerSocketChannelImpl.java:163)         at org.eclipse.jetty.server.nio.SelectChannelConnector.accept(SelectChannelConnector.java:104)         at org.eclipse.jetty.server.AbstractConnector$Acceptor.run(AbstractConnector.java:933)         at org.eclipse.jetty.util.thread.QueuedThreadPool.runJob(QueuedThreadPool.java:599)         at org.eclipse.jetty.util.thread.QueuedThreadPool$3.run(QueuedThreadPool.java:534)         at java.lang.Thread.run(Thread.java:679)

Stack Trace:
com.carrotsearch.randomizedtesting.ThreadLeakError: There are still zombie threads that couldn't be terminated:
   1) Thread[id=18, name=qtp1179468258-18 Acceptor1 SelectChannelConnector@0.0.0.0:61576, state=BLOCKED, group=TGRP-TestBinaryField]
        at sun.nio.ch.ServerSocketChannelImpl.accept(ServerSocketChannelImpl.java:147)
        at org.eclipse.jetty.server.nio.SelectChannelConnector.accept(SelectChannelConnector.java:104)
        at org.eclipse.jetty.server.AbstractConnector$Acceptor.run(AbstractConnector.java:933)
        at org.eclipse.jetty.util.thread.QueuedThreadPool.runJob(QueuedThreadPool.java:599)
        at org.eclipse.jetty.util.thread.QueuedThreadPool$3.run(QueuedThreadPool.java:534)
        at java.lang.Thread.run(Thread.java:679)
   2) Thread[id=22, name=qtp1179468258-22 Acceptor2 SelectChannelConnector@0.0.0.0:61576, state=BLOCKED, group=TGRP-TestBinaryField]
        at sun.nio.ch.ServerSocketChannelImpl.accept(ServerSocketChannelImpl.java:147)
        at org.eclipse.jetty.server.nio.SelectChannelConnector.accept(SelectChannelConnector.java:104)
        at org.eclipse.jetty.server.AbstractConnector$Acceptor.run(AbstractConnector.java:933)
        at org.eclipse.jetty.util.thread.QueuedThreadPool.runJob(QueuedThreadPool.java:599)
        at org.eclipse.jetty.util.thread.QueuedThreadPool$3.run(QueuedThreadPool.java:534)
        at java.lang.Thread.run(Thread.java:679)
   3) Thread[id=21, name=qtp1179468258-21 Acceptor3 SelectChannelConnector@0.0.0.0:61576, state=BLOCKED, group=TGRP-TestBinaryField]
        at sun.nio.ch.ServerSocketChannelImpl.accept(ServerSocketChannelImpl.java:147)
        at org.eclipse.jetty.server.nio.SelectChannelConnector.accept(SelectChannelConnector.java:104)
        at org.eclipse.jetty.server.AbstractConnector$Acceptor.run(AbstractConnector.java:933)
        at org.eclipse.jetty.util.thread.QueuedThreadPool.runJob(QueuedThreadPool.java:599)
        at org.eclipse.jetty.util.thread.QueuedThreadPool$3.run(QueuedThreadPool.java:534)
        at java.lang.Thread.run(Thread.java:679)
   4) Thread[id=23, name=qtp1179468258-23 Acceptor0 SelectChannelConnector@0.0.0.0:61576, state=RUNNABLE, group=TGRP-TestBinaryField]
        at sun.nio.ch.ServerSocketChannelImpl.accept0(Native Method)
        at sun.nio.ch.ServerSocketChannelImpl.accept(ServerSocketChannelImpl.java:163)
        at org.eclipse.jetty.server.nio.SelectChannelConnector.accept(SelectChannelConnector.java:104)
        at org.eclipse.jetty.server.AbstractConnector$Acceptor.run(AbstractConnector.java:933)
        at org.eclipse.jetty.util.thread.QueuedThreadPool.runJob(QueuedThreadPool.java:599)
        at org.eclipse.jetty.util.thread.QueuedThreadPool$3.run(QueuedThreadPool.java:534)
        at java.lang.Thread.run(Thread.java:679)
	at __randomizedtesting.SeedInfo.seed([15813E5849A4AF7E]:0)


FAILED:  junit.framework.TestSuite.org.apache.solr.servlet.CacheHeaderTest

Error Message:
4 threads leaked from SUITE scope at org.apache.solr.servlet.CacheHeaderTest:     1) Thread[id=134, name=qtp625527992-134 Acceptor3 SelectChannelConnector@0.0.0.0:54681, state=BLOCKED, group=TGRP-CacheHeaderTest]         at sun.nio.ch.ServerSocketChannelImpl.accept(ServerSocketChannelImpl.java:147)         at org.eclipse.jetty.server.nio.SelectChannelConnector.accept(SelectChannelConnector.java:104)         at org.eclipse.jetty.server.AbstractConnector$Acceptor.run(AbstractConnector.java:933)         at org.eclipse.jetty.util.thread.QueuedThreadPool.runJob(QueuedThreadPool.java:599)         at org.eclipse.jetty.util.thread.QueuedThreadPool$3.run(QueuedThreadPool.java:534)         at java.lang.Thread.run(Thread.java:679)    2) Thread[id=132, name=qtp625527992-132 Acceptor1 SelectChannelConnector@0.0.0.0:54681, state=BLOCKED, group=TGRP-CacheHeaderTest]         at sun.nio.ch.ServerSocketChannelImpl.accept(ServerSocketChannelImpl.java:147)         at org.eclipse.jetty.server.nio.SelectChannelConnector.accept(SelectChannelConnector.java:104)         at org.eclipse.jetty.server.AbstractConnector$Acceptor.run(AbstractConnector.java:933)         at org.eclipse.jetty.util.thread.QueuedThreadPool.runJob(QueuedThreadPool.java:599)         at org.eclipse.jetty.util.thread.QueuedThreadPool$3.run(QueuedThreadPool.java:534)         at java.lang.Thread.run(Thread.java:679)    3) Thread[id=131, name=qtp625527992-131 Acceptor0 SelectChannelConnector@0.0.0.0:54681, state=RUNNABLE, group=TGRP-CacheHeaderTest]         at sun.nio.ch.ServerSocketChannelImpl.accept0(Native Method)         at sun.nio.ch.ServerSocketChannelImpl.accept(ServerSocketChannelImpl.java:163)         at org.eclipse.jetty.server.nio.SelectChannelConnector.accept(SelectChannelConnector.java:104)         at org.eclipse.jetty.server.AbstractConnector$Acceptor.run(AbstractConnector.java:933)         at org.eclipse.jetty.util.thread.QueuedThreadPool.runJob(QueuedThreadPool.java:599)         at org.eclipse.jetty.util.thread.QueuedThreadPool$3.run(QueuedThreadPool.java:534)         at java.lang.Thread.run(Thread.java:679)    4) Thread[id=133, name=qtp625527992-133 Acceptor2 SelectChannelConnector@0.0.0.0:54681, state=BLOCKED, group=TGRP-CacheHeaderTest]         at sun.nio.ch.ServerSocketChannelImpl.accept(ServerSocketChannelImpl.java:147)         at org.eclipse.jetty.server.nio.SelectChannelConnector.accept(SelectChannelConnector.java:104)         at org.eclipse.jetty.server.AbstractConnector$Acceptor.run(AbstractConnector.java:933)         at org.eclipse.jetty.util.thread.QueuedThreadPool.runJob(QueuedThreadPool.java:599)         at org.eclipse.jetty.util.thread.QueuedThreadPool$3.run(QueuedThreadPool.java:534)         at java.lang.Thread.run(Thread.java:679)

Stack Trace:
com.carrotsearch.randomizedtesting.ThreadLeakError: 4 threads leaked from SUITE scope at org.apache.solr.servlet.CacheHeaderTest: 
   1) Thread[id=134, name=qtp625527992-134 Acceptor3 SelectChannelConnector@0.0.0.0:54681, state=BLOCKED, group=TGRP-CacheHeaderTest]
        at sun.nio.ch.ServerSocketChannelImpl.accept(ServerSocketChannelImpl.java:147)
        at org.eclipse.jetty.server.nio.SelectChannelConnector.accept(SelectChannelConnector.java:104)
        at org.eclipse.jetty.server.AbstractConnector$Acceptor.run(AbstractConnector.java:933)
        at org.eclipse.jetty.util.thread.QueuedThreadPool.runJob(QueuedThreadPool.java:599)
        at org.eclipse.jetty.util.thread.QueuedThreadPool$3.run(QueuedThreadPool.java:534)
        at java.lang.Thread.run(Thread.java:679)
   2) Thread[id=132, name=qtp625527992-132 Acceptor1 SelectChannelConnector@0.0.0.0:54681, state=BLOCKED, group=TGRP-CacheHeaderTest]
        at sun.nio.ch.ServerSocketChannelImpl.accept(ServerSocketChannelImpl.java:147)
        at org.eclipse.jetty.server.nio.SelectChannelConnector.accept(SelectChannelConnector.java:104)
        at org.eclipse.jetty.server.AbstractConnector$Acceptor.run(AbstractConnector.java:933)
        at org.eclipse.jetty.util.thread.QueuedThreadPool.runJob(QueuedThreadPool.java:599)
        at org.eclipse.jetty.util.thread.QueuedThreadPool$3.run(QueuedThreadPool.java:534)
        at java.lang.Thread.run(Thread.java:679)
   3) Thread[id=131, name=qtp625527992-131 Acceptor0 SelectChannelConnector@0.0.0.0:54681, state=RUNNABLE, group=TGRP-CacheHeaderTest]
        at sun.nio.ch.ServerSocketChannelImpl.accept0(Native Method)
        at sun.nio.ch.ServerSocketChannelImpl.accept(ServerSocketChannelImpl.java:163)
        at org.eclipse.jetty.server.nio.SelectChannelConnector.accept(SelectChannelConnector.java:104)
        at org.eclipse.jetty.server.AbstractConnector$Acceptor.run(AbstractConnector.java:933)
        at org.eclipse.jetty.util.thread.QueuedThreadPool.runJob(QueuedThreadPool.java:599)
        at org.eclipse.jetty.util.thread.QueuedThreadPool$3.run(QueuedThreadPool.java:534)
        at java.lang.Thread.run(Thread.java:679)
   4) Thread[id=133, name=qtp625527992-133 Acceptor2 SelectChannelConnector@0.0.0.0:54681, state=BLOCKED, group=TGRP-CacheHeaderTest]
        at sun.nio.ch.ServerSocketChannelImpl.accept(ServerSocketChannelImpl.java:147)
        at org.eclipse.jetty.server.nio.SelectChannelConnector.accept(SelectChannelConnector.java:104)
        at org.eclipse.jetty.server.AbstractConnector$Acceptor.run(AbstractConnector.java:933)
        at org.eclipse.jetty.util.thread.QueuedThreadPool.runJob(QueuedThreadPool.java:599)
        at org.eclipse.jetty.util.thread.QueuedThreadPool$3.run(QueuedThreadPool.java:534)
        at java.lang.Thread.run(Thread.java:679)
	at __randomizedtesting.SeedInfo.seed([15813E5849A4AF7E]:0)


FAILED:  junit.framework.TestSuite.org.apache.solr.servlet.CacheHeaderTest

Error Message:
There are still zombie threads that couldn't be terminated:    1) Thread[id=134, name=qtp625527992-134 Acceptor3 SelectChannelConnector@0.0.0.0:54681, state=BLOCKED, group=TGRP-CacheHeaderTest]         at sun.nio.ch.ServerSocketChannelImpl.accept(ServerSocketChannelImpl.java:147)         at org.eclipse.jetty.server.nio.SelectChannelConnector.accept(SelectChannelConnector.java:104)         at org.eclipse.jetty.server.AbstractConnector$Acceptor.run(AbstractConnector.java:933)         at org.eclipse.jetty.util.thread.QueuedThreadPool.runJob(QueuedThreadPool.java:599)         at org.eclipse.jetty.util.thread.QueuedThreadPool$3.run(QueuedThreadPool.java:534)         at java.lang.Thread.run(Thread.java:679)    2) Thread[id=132, name=qtp625527992-132 Acceptor1 SelectChannelConnector@0.0.0.0:54681, state=BLOCKED, group=TGRP-CacheHeaderTest]         at sun.nio.ch.ServerSocketChannelImpl.accept(ServerSocketChannelImpl.java:147)         at org.eclipse.jetty.server.nio.SelectChannelConnector.accept(SelectChannelConnector.java:104)         at org.eclipse.jetty.server.AbstractConnector$Acceptor.run(AbstractConnector.java:933)         at org.eclipse.jetty.util.thread.QueuedThreadPool.runJob(QueuedThreadPool.java:599)         at org.eclipse.jetty.util.thread.QueuedThreadPool$3.run(QueuedThreadPool.java:534)         at java.lang.Thread.run(Thread.java:679)    3) Thread[id=131, name=qtp625527992-131 Acceptor0 SelectChannelConnector@0.0.0.0:54681, state=RUNNABLE, group=TGRP-CacheHeaderTest]         at sun.nio.ch.ServerSocketChannelImpl.accept0(Native Method)         at sun.nio.ch.ServerSocketChannelImpl.accept(ServerSocketChannelImpl.java:163)         at org.eclipse.jetty.server.nio.SelectChannelConnector.accept(SelectChannelConnector.java:104)         at org.eclipse.jetty.server.AbstractConnector$Acceptor.run(AbstractConnector.java:933)         at org.eclipse.jetty.util.thread.QueuedThreadPool.runJob(QueuedThreadPool.java:599)         at org.eclipse.jetty.util.thread.QueuedThreadPool$3.run(QueuedThreadPool.java:534)         at java.lang.Thread.run(Thread.java:679)    4) Thread[id=133, name=qtp625527992-133 Acceptor2 SelectChannelConnector@0.0.0.0:54681, state=BLOCKED, group=TGRP-CacheHeaderTest]         at sun.nio.ch.ServerSocketChannelImpl.accept(ServerSocketChannelImpl.java:147)         at org.eclipse.jetty.server.nio.SelectChannelConnector.accept(SelectChannelConnector.java:104)         at org.eclipse.jetty.server.AbstractConnector$Acceptor.run(AbstractConnector.java:933)         at org.eclipse.jetty.util.thread.QueuedThreadPool.runJob(QueuedThreadPool.java:599)         at org.eclipse.jetty.util.thread.QueuedThreadPool$3.run(QueuedThreadPool.java:534)         at java.lang.Thread.run(Thread.java:679)

Stack Trace:
com.carrotsearch.randomizedtesting.ThreadLeakError: There are still zombie threads that couldn't be terminated:
   1) Thread[id=134, name=qtp625527992-134 Acceptor3 SelectChannelConnector@0.0.0.0:54681, state=BLOCKED, group=TGRP-CacheHeaderTest]
        at sun.nio.ch.ServerSocketChannelImpl.accept(ServerSocketChannelImpl.java:147)
        at org.eclipse.jetty.server.nio.SelectChannelConnector.accept(SelectChannelConnector.java:104)
        at org.eclipse.jetty.server.AbstractConnector$Acceptor.run(AbstractConnector.java:933)
        at org.eclipse.jetty.util.thread.QueuedThreadPool.runJob(QueuedThreadPool.java:599)
        at org.eclipse.jetty.util.thread.QueuedThreadPool$3.run(QueuedThreadPool.java:534)
        at java.lang.Thread.run(Thread.java:679)
   2) Thread[id=132, name=qtp625527992-132 Acceptor1 SelectChannelConnector@0.0.0.0:54681, state=BLOCKED, group=TGRP-CacheHeaderTest]
        at sun.nio.ch.ServerSocketChannelImpl.accept(ServerSocketChannelImpl.java:147)
        at org.eclipse.jetty.server.nio.SelectChannelConnector.accept(SelectChannelConnector.java:104)
        at org.eclipse.jetty.server.AbstractConnector$Acceptor.run(AbstractConnector.java:933)
        at org.eclipse.jetty.util.thread.QueuedThreadPool.runJob(QueuedThreadPool.java:599)
        at org.eclipse.jetty.util.thread.QueuedThreadPool$3.run(QueuedThreadPool.java:534)
        at java.lang.Thread.run(Thread.java:679)
   3) Thread[id=131, name=qtp625527992-131 Acceptor0 SelectChannelConnector@0.0.0.0:54681, state=RUNNABLE, group=TGRP-CacheHeaderTest]
        at sun.nio.ch.ServerSocketChannelImpl.accept0(Native Method)
        at sun.nio.ch.ServerSocketChannelImpl.accept(ServerSocketChannelImpl.java:163)
        at org.eclipse.jetty.server.nio.SelectChannelConnector.accept(SelectChannelConnector.java:104)
        at org.eclipse.jetty.server.AbstractConnector$Acceptor.run(AbstractConnector.java:933)
        at org.eclipse.jetty.util.thread.QueuedThreadPool.runJob(QueuedThreadPool.java:599)
        at org.eclipse.jetty.util.thread.QueuedThreadPool$3.run(QueuedThreadPool.java:534)
        at java.lang.Thread.run(Thread.java:679)
   4) Thread[id=133, name=qtp625527992-133 Acceptor2 SelectChannelConnector@0.0.0.0:54681, state=BLOCKED, group=TGRP-CacheHeaderTest]
        at sun.nio.ch.ServerSocketChannelImpl.accept(ServerSocketChannelImpl.java:147)
        at org.eclipse.jetty.server.nio.SelectChannelConnector.accept(SelectChannelConnector.java:104)
        at org.eclipse.jetty.server.AbstractConnector$Acceptor.run(AbstractConnector.java:933)
        at org.eclipse.jetty.util.thread.QueuedThreadPool.runJob(QueuedThreadPool.java:599)
        at org.eclipse.jetty.util.thread.QueuedThreadPool$3.run(QueuedThreadPool.java:534)
        at java.lang.Thread.run(Thread.java:679)
	at __randomizedtesting.SeedInfo.seed([15813E5849A4AF7E]:0)




Build Log:
[...truncated 7817 lines...]
[junit4:junit4] Suite: org.apache.solr.schema.TestBinaryField
[junit4:junit4]   2> 857 T14 oasc.SolrResourceLoader.<init> new SolrResourceLoader for directory: 'solr/collection1/'
[junit4:junit4]   2> 2108 T14 oejs.Server.doStart jetty-8.1.2.v20120308
[junit4:junit4]   2> 2416 T14 oejs.AbstractConnector.doStart Started SelectChannelConnector@0.0.0.0:61576
[junit4:junit4]   2> 2516 T14 oasc.SolrResourceLoader.locateSolrHome JNDI not configured for solr (NoInitialContextEx)
[junit4:junit4]   2> 2516 T14 oasc.SolrResourceLoader.locateSolrHome using system property solr.solr.home: /usr/home/hudson/hudson-slave/workspace/Lucene-Solr-NightlyTests-trunk/solr/build/solr-core/test/J1/./solrtest-TestBinaryField-1351529560432/example
[junit4:junit4]   2> 2517 T14 oasc.SolrResourceLoader.<init> new SolrResourceLoader for deduced Solr Home: '/usr/home/hudson/hudson-slave/workspace/Lucene-Solr-NightlyTests-trunk/solr/build/solr-core/test/J1/./solrtest-TestBinaryField-1351529560432/example/'
[junit4:junit4]   2> 2635 T14 oass.SolrDispatchFilter.init SolrDispatchFilter.init()
[junit4:junit4]   2> 2639 T14 oasc.SolrResourceLoader.locateSolrHome JNDI not configured for solr (NoInitialContextEx)
[junit4:junit4]   2> 2640 T14 oasc.SolrResourceLoader.locateSolrHome using system property solr.solr.home: /usr/home/hudson/hudson-slave/workspace/Lucene-Solr-NightlyTests-trunk/solr/build/solr-core/test/J1/./solrtest-TestBinaryField-1351529560432/example
[junit4:junit4]   2> 2679 T14 oasc.CoreContainer$Initializer.initialize looking for solr.xml: /usr/home/hudson/hudson-slave/workspace/Lucene-Solr-NightlyTests-trunk/solr/build/solr-core/test/J1/./solrtest-TestBinaryField-1351529560432/example/solr.xml
[junit4:junit4]   2> 2684 T14 oasc.CoreContainer.<init> New CoreContainer 266913157
[junit4:junit4]   2> 2685 T14 oasc.CoreContainer$Initializer.initialize no solr.xml file found - using default
[junit4:junit4]   2> 2686 T14 oasc.CoreContainer.load Loading CoreContainer using Solr Home: '/usr/home/hudson/hudson-slave/workspace/Lucene-Solr-NightlyTests-trunk/solr/build/solr-core/test/J1/./solrtest-TestBinaryField-1351529560432/example/'
[junit4:junit4]   2> 2686 T14 oasc.SolrResourceLoader.<init> new SolrResourceLoader for directory: '/usr/home/hudson/hudson-slave/workspace/Lucene-Solr-NightlyTests-trunk/solr/build/solr-core/test/J1/./solrtest-TestBinaryField-1351529560432/example/'
[junit4:junit4]   2> 2737 T14 oasc.CoreContainer.load Registering Log Listener
[junit4:junit4]   2> 2833 T14 oasc.CoreContainer.create Creating SolrCore 'collection1' using instanceDir: /usr/home/hudson/hudson-slave/workspace/Lucene-Solr-NightlyTests-trunk/solr/build/solr-core/test/J1/./solrtest-TestBinaryField-1351529560432/example/collection1
[junit4:junit4]   2> 2835 T14 oasc.SolrResourceLoader.<init> new SolrResourceLoader for directory: '/usr/home/hudson/hudson-slave/workspace/Lucene-Solr-NightlyTests-trunk/solr/build/solr-core/test/J1/./solrtest-TestBinaryField-1351529560432/example/collection1/'
[junit4:junit4]   2> 2930 T14 oasc.SolrConfig.<init> Using Lucene MatchVersion: LUCENE_50
[junit4:junit4]   2> 3085 T14 oasc.SolrConfig.<init> Loaded SolrConfig: solrconfig.xml
[junit4:junit4]   2> 3121 T14 oass.IndexSchema.readSchema Reading Solr Schema
[junit4:junit4]   2> 3131 T14 oass.IndexSchema.readSchema Schema name=test
[junit4:junit4]   2> 3667 T14 oass.IndexSchema.readSchema unique key field: id
[junit4:junit4]   2> 3781 T14 oasc.SolrCore.<init> [collection1] Opening new SolrCore at /usr/home/hudson/hudson-slave/workspace/Lucene-Solr-NightlyTests-trunk/solr/build/solr-core/test/J1/./solrtest-TestBinaryField-1351529560432/example/collection1/, dataDir=/usr/home/hudson/hudson-slave/workspace/Lucene-Solr-NightlyTests-trunk/solr/build/solr-core/test/J1/./solrtest-TestBinaryField-1351529560432/example/collection1/data/
[junit4:junit4]   2> 3782 T14 oasc.SolrCore.<init> JMX monitoring not detected for core: collection1
[junit4:junit4]   2> 3791 T14 oasc.SolrCore.initDirectoryFactory org.apache.solr.core.MockDirectoryFactory
[junit4:junit4]   2> 3836 T14 oasc.CachingDirectoryFactory.injectLockFactory WARNING No lockType configured for MockDirWrapper(org.apache.lucene.store.RAMDirectory@4054824 lockFactory=org.apache.lucene.store.SingleInstanceLockFactory@76c3358b) assuming 'simple'
[junit4:junit4]   2> 3837 T14 oasc.CachingDirectoryFactory.get return new directory for /usr/home/hudson/hudson-slave/workspace/Lucene-Solr-NightlyTests-trunk/solr/build/solr-core/test/J1/./solrtest-TestBinaryField-1351529560432/example/collection1/data forceNew:false
[junit4:junit4]   2> 3838 T14 oasc.CachingDirectoryFactory.close Releasing directory:/usr/home/hudson/hudson-slave/workspace/Lucene-Solr-NightlyTests-trunk/solr/build/solr-core/test/J1/./solrtest-TestBinaryField-1351529560432/example/collection1/data
[junit4:junit4]   2> 3838 T14 oasc.SolrCore.getNewIndexDir New index directory detected: old=null new=/usr/home/hudson/hudson-slave/workspace/Lucene-Solr-NightlyTests-trunk/solr/build/solr-core/test/J1/./solrtest-TestBinaryField-1351529560432/example/collection1/data/index/
[junit4:junit4]   2> 3839 T14 oasc.SolrCore.initIndex WARNING [collection1] Solr index directory '/usr/home/hudson/hudson-slave/workspace/Lucene-Solr-NightlyTests-trunk/solr/build/solr-core/test/J1/./solrtest-TestBinaryField-1351529560432/example/collection1/data/index' doesn't exist. Creating new index...
[junit4:junit4]   2> 3859 T14 oasc.CachingDirectoryFactory.get return new directory for /usr/home/hudson/hudson-slave/workspace/Lucene-Solr-NightlyTests-trunk/solr/build/solr-core/test/J1/./solrtest-TestBinaryField-1351529560432/example/collection1/data/index forceNew:false
[junit4:junit4]   2> 4231 T14 oasc.SolrDeletionPolicy.onCommit SolrDeletionPolicy.onCommit: commits:num=1
[junit4:junit4]   2> 		commit{dir=MockDirWrapper(org.apache.lucene.store.RAMDirectory@294ce5eb lockFactory=org.apache.lucene.store.SingleInstanceLockFactory@46dab859),segFN=segments_1,generation=1,filenames=[segments_1]
[junit4:junit4]   2> 4232 T14 oasc.SolrDeletionPolicy.updateCommits newest commit = 1[segments_1]
[junit4:junit4]   2> 4233 T14 oasc.CachingDirectoryFactory.close Releasing directory:/usr/home/hudson/hudson-slave/workspace/Lucene-Solr-NightlyTests-trunk/solr/build/solr-core/test/J1/./solrtest-TestBinaryField-1351529560432/example/collection1/data/index
[junit4:junit4]   2> 5321 T14 oasc.RequestHandlers.initHandlersFromConfig created standard: solr.StandardRequestHandler
[junit4:junit4]   2> 5322 T14 oasc.RequestHandlers.initHandlersFromConfig created defaults: solr.StandardRequestHandler
[junit4:junit4]   2> 5322 T14 oasc.RequestHandlers.initHandlersFromConfig adding lazy requestHandler: solr.StandardRequestHandler
[junit4:junit4]   2> 5326 T14 oasc.RequestHandlers.initHandlersFromConfig created lazy: solr.StandardRequestHandler
[junit4:junit4]   2> 5362 T14 oasc.RequestHandlers.initHandlersFromConfig created /update: solr.UpdateRequestHandler
[junit4:junit4]   2> 5420 T14 oasc.RequestHandlers.initHandlersFromConfig created /replication: solr.ReplicationHandler
[junit4:junit4]   2> 5592 T14 oashl.XMLLoader.init xsltCacheLifetimeSeconds=60
[junit4:junit4]   2> 5632 T14 oasc.CachingDirectoryFactory.close Releasing directory:/usr/home/hudson/hudson-slave/workspace/Lucene-Solr-NightlyTests-trunk/solr/build/solr-core/test/J1/./solrtest-TestBinaryField-1351529560432/example/collection1/data
[junit4:junit4]   2> 5703 T14 oass.SolrIndexSearcher.<init> Opening Searcher@30e33af5 main
[junit4:junit4]   2> 5797 T14 oasu.CommitTracker.<init> Hard AutoCommit: disabled
[junit4:junit4]   2> 5798 T14 oasu.CommitTracker.<init> Soft AutoCommit: disabled
[junit4:junit4]   2> 5931 T14 oashc.HttpShardHandlerFactory.getParameter Setting socketTimeout to: 0
[junit4:junit4]   2> 5931 T14 oashc.HttpShardHandlerFactory.getParameter Setting urlScheme to: http://
[junit4:junit4]   2> 5932 T14 oashc.HttpShardHandlerFactory.getParameter Setting connTimeout to: 0
[junit4:junit4]   2> 5932 T14 oashc.HttpShardHandlerFactory.getParameter Setting maxConnectionsPerHost to: 20
[junit4:junit4]   2> 5933 T14 oashc.HttpShardHandlerFactory.getParameter Setting corePoolSize to: 0
[junit4:junit4]   2> 5933 T14 oashc.HttpShardHandlerFactory.getParameter Setting maximumPoolSize to: 2147483647
[junit4:junit4]   2> 5934 T14 oashc.HttpShardHandlerFactory.getParameter Setting maxThreadIdleTime to: 5
[junit4:junit4]   2> 5934 T14 oashc.HttpShardHandlerFactory.getParameter Setting sizeOfQueue to: -1
[junit4:junit4]   2> 5935 T14 oashc.HttpShardHandlerFactory.getParameter Setting fairnessPolicy to: false
[junit4:junit4]   2> 5981 T14 oascsi.HttpClientUtil.createClient Creating new http client, config:maxConnectionsPerHost=20&maxConnections=10000&socketTimeout=0&connTimeout=0&retry=false
[junit4:junit4]   2> 6532 T14 oash.ReplicationHandler.inform Commits will be reserved for  10000
[junit4:junit4]   2> 6533 T14 oasc.CoreContainer.register registering core: collection1
[junit4:junit4]   2> 6533 T29 oasc.SolrCore.registerSearcher [collection1] Registered new searcher Searcher@30e33af5 main{StandardDirectoryReader(segments_1:1)}
[junit4:junit4]   2> 6534 T14 oass.SolrDispatchFilter.init user.dir=/usr/home/hudson/hudson-slave/workspace/Lucene-Solr-NightlyTests-trunk/solr/build/solr-core/test/J1
[junit4:junit4]   2> 6535 T14 oass.SolrDispatchFilter.init SolrDispatchFilter.init() done
[junit4:junit4]   2> 6616 T14 oascsi.HttpClientUtil.createClient Creating new http client, config:maxConnections=128&maxConnectionsPerHost=32&followRedirects=false
[junit4:junit4]   2> ASYNC  NEW_CORE C0 name=collection1 org.apache.solr.core.SolrCore@131a9310
[junit4:junit4]   2> 8101 T26 C0 oasc.CachingDirectoryFactory.close Releasing directory:/usr/home/hudson/hudson-slave/workspace/Lucene-Solr-NightlyTests-trunk/solr/build/solr-core/test/J1/./solrtest-TestBinaryField-1351529560432/example/collection1/data
[junit4:junit4]   2> 8106 T26 C0 oasc.SolrDeletionPolicy.onInit SolrDeletionPolicy.onInit: commits:num=1
[junit4:junit4]   2> 		commit{dir=MockDirWrapper(org.apache.lucene.store.RAMDirectory@294ce5eb lockFactory=org.apache.lucene.store.SingleInstanceLockFactory@46dab859),segFN=segments_1,generation=1,filenames=[segments_1]
[junit4:junit4]   2> 8107 T26 C0 oasc.SolrDeletionPolicy.updateCommits newest commit = 1[segments_1]
[junit4:junit4]   2> 8393 T26 C0 UPDATE [collection1] webapp=/example path=/update params={wt=javabin&version=2} {add=[1]} 0 559
[junit4:junit4]   2> 8597 T25 C0 UPDATE [collection1] webapp=/example path=/update params={wt=javabin&version=2} {add=[2]} 0 2
[junit4:junit4]   2> 8602 T26 C0 UPDATE [collection1] webapp=/example path=/update params={wt=javabin&version=2} {add=[3]} 0 0
[junit4:junit4]   2> 8659 T27 C0 oasu.DirectUpdateHandler2.commit start commit{flags=0,_version_=0,optimize=false,openSearcher=true,waitSearcher=true,expungeDeletes=false,softCommit=false}
[junit4:junit4]   2> 9533 T27 C0 oasc.SolrDeletionPolicy.onCommit SolrDeletionPolicy.onCommit: commits:num=2
[junit4:junit4]   2> 		commit{dir=MockDirWrapper(org.apache.lucene.store.RAMDirectory@294ce5eb lockFactory=org.apache.lucene.store.SingleInstanceLockFactory@46dab859),segFN=segments_1,generation=1,filenames=[segments_1]
[junit4:junit4]   2> 		commit{dir=MockDirWrapper(org.apache.lucene.store.RAMDirectory@294ce5eb lockFactory=org.apache.lucene.store.SingleInstanceLockFactory@46dab859),segFN=segments_2,generation=2,filenames=[_0_Direct_0.doc, _0.fnm, _0_nrm.cfe, segments_2, _0.fdx, _0_Direct_0.tip, _0_nrm.cfs, _0.si, _0_Direct_0.tim, _0.fdt]
[junit4:junit4]   2> 9534 T27 C0 oasc.SolrDeletionPolicy.updateCommits newest commit = 2[_0_Direct_0.doc, _0.fnm, _0_nrm.cfe, segments_2, _0.fdx, _0_Direct_0.tip, _0_nrm.cfs, _0.si, _0_Direct_0.tim, _0.fdt]
[junit4:junit4]   2> 9535 T27 C0 oasc.CachingDirectoryFactory.close Releasing directory:/usr/home/hudson/hudson-slave/workspace/Lucene-Solr-NightlyTests-trunk/solr/build/solr-core/test/J1/./solrtest-TestBinaryField-1351529560432/example/collection1/data
[junit4:junit4]   2> 9761 T27 C0 oass.SolrIndexSearcher.<init> Opening Searcher@343d511e main
[junit4:junit4]   2> 9764 T27 C0 oasu.DirectUpdateHandler2.commit end_commit_flush
[junit4:junit4]   2> 9770 T29 oasc.SolrCore.registerSearcher [collection1] Registered new searcher Searcher@343d511e main{StandardDirectoryReader(segments_2:3 _0(5.0):C3)}
[junit4:junit4]   2> 9772 T29 oasc.CachingDirectoryFactory.close Releasing directory:/usr/home/hudson/hudson-slave/workspace/Lucene-Solr-NightlyTests-trunk/solr/build/solr-core/test/J1/./solrtest-TestBinaryField-1351529560432/example/collection1/data/index
[junit4:junit4]   2> 9772 T27 C0 UPDATE [collection1] webapp=/example path=/update params={waitSearcher=true&wt=javabin&commit=true&softCommit=false&version=2} {commit=} 0 1119
[junit4:junit4]   2> 10223 T25 C0 REQ [collection1] webapp=/example path=/select params={wt=javabin&q=*:*&version=2} hits=3 status=0 QTime=417 
[junit4:junit4]   2> 10342 T14 oasc.CoreContainer.shutdown Shutting down CoreContainer instance=266913157
[junit4:junit4]   2> 10343 T14 oasc.SolrCore.close [collection1]  CLOSING SolrCore org.apache.solr.core.SolrCore@131a9310
[junit4:junit4]   2> 10344 T14 oasu.DirectUpdateHandler2.close closing DirectUpdateHandler2{commits=1,autocommits=0,soft autocommits=0,optimizes=0,rollbacks=0,expungeDeletes=0,docsPending=0,adds=0,deletesById=0,deletesByQuery=0,errors=0,cumulative_adds=3,cumulative_deletesById=0,cumulative_deletesByQuery=0,cumulative_errors=0}
[junit4:junit4]   2> 10345 T14 oasc.SolrCore.decrefSolrCoreState Closing SolrCoreState
[junit4:junit4]   2> 10346 T14 oasu.DefaultSolrCoreState.closeIndexWriter SolrCoreState ref count has reached 0 - closing IndexWriter
[junit4:junit4]   2> 10346 T14 oasu.DefaultSolrCoreState.closeIndexWriter closing IndexWriter with IndexWriterCloser
[junit4:junit4]   2> 10348 T14 C0 oasc.CachingDirectoryFactory.close Releasing directory:/usr/home/hudson/hudson-slave/workspace/Lucene-Solr-NightlyTests-trunk/solr/build/solr-core/test/J1/./solrtest-TestBinaryField-1351529560432/example/collection1/data/index
[junit4:junit4]   2> 10349 T14 oasc.SolrCore.closeSearcher [collection1] Closing main searcher on request.
[junit4:junit4]   2> 10351 T14 oasc.CachingDirectoryFactory.close Releasing directory:/usr/home/hudson/hudson-slave/workspace/Lucene-Solr-NightlyTests-trunk/solr/build/solr-core/test/J1/./solrtest-TestBinaryField-1351529560432/example/collection1/data/index
[junit4:junit4]   2> 10358 T14 oejsh.ContextHandler.doStop stopped o.e.j.s.ServletContextHandler{/example,null}
[junit4:junit4]   2> 10458 T14 oejut.QueuedThreadPool.doStop WARNING 4 threads could not be stopped
[junit4:junit4]   2> 10468 T13 ccr.ThreadLeakControl.checkThreadLeaks WARNING Will linger awaiting termination of 4 leaked thread(s).
[junit4:junit4]   2> 30580 T13 ccr.ThreadLeakControl.checkThreadLeaks SEVERE 4 threads leaked from SUITE scope at org.apache.solr.schema.TestBinaryField: 
[junit4:junit4]   2> 	   1) Thread[id=18, name=qtp1179468258-18 Acceptor1 SelectChannelConnector@0.0.0.0:61576, state=BLOCKED, group=TGRP-TestBinaryField]
[junit4:junit4]   2> 	        at sun.nio.ch.ServerSocketChannelImpl.accept(ServerSocketChannelImpl.java:147)
[junit4:junit4]   2> 	        at org.eclipse.jetty.server.nio.SelectChannelConnector.accept(SelectChannelConnector.java:104)
[junit4:junit4]   2> 	        at org.eclipse.jetty.server.AbstractConnector$Acceptor.run(AbstractConnector.java:933)
[junit4:junit4]   2> 	        at org.eclipse.jetty.util.thread.QueuedThreadPool.runJob(QueuedThreadPool.java:599)
[junit4:junit4]   2> 	        at org.eclipse.jetty.util.thread.QueuedThreadPool$3.run(QueuedThreadPool.java:534)
[junit4:junit4]   2> 	        at java.lang.Thread.run(Thread.java:679)
[junit4:junit4]   2> 	   2) Thread[id=22, name=qtp1179468258-22 Acceptor2 SelectChannelConnector@0.0.0.0:61576, state=BLOCKED, group=TGRP-TestBinaryField]
[junit4:junit4]   2> 	        at sun.nio.ch.ServerSocketChannelImpl.accept(ServerSocketChannelImpl.java:147)
[junit4:junit4]   2> 	        at org.eclipse.jetty.server.nio.SelectChannelConnector.accept(SelectChannelConnector.java:104)
[junit4:junit4]   2> 	        at org.eclipse.jetty.server.AbstractConnector$Acceptor.run(AbstractConnector.java:933)
[junit4:junit4]   2> 	        at org.eclipse.jetty.util.thread.QueuedThreadPool.runJob(QueuedThreadPool.java:599)
[junit4:junit4]   2> 	        at org.eclipse.jetty.util.thread.QueuedThreadPool$3.run(QueuedThreadPool.java:534)
[junit4:junit4]   2> 	        at java.lang.Thread.run(Thread.java:679)
[junit4:junit4]   2> 	   3) Thread[id=21, name=qtp1179468258-21 Acceptor3 SelectChannelConnector@0.0.0.0:61576, state=BLOCKED, group=TGRP-TestBinaryField]
[junit4:junit4]   2> 	        at sun.nio.ch.ServerSocketChannelImpl.accept(ServerSocketChannelImpl.java:147)
[junit4:junit4]   2> 	        at org.eclipse.jetty.server.nio.SelectChannelConnector.accept(SelectChannelConnector.java:104)
[junit4:junit4]   2> 	        at org.eclipse.jetty.server.AbstractConnector$Acceptor.run(AbstractConnector.java:933)
[junit4:junit4]   2> 	        at org.eclipse.jetty.util.thread.QueuedThreadPool.runJob(QueuedThreadPool.java:599)
[junit4:junit4]   2> 	        at org.eclipse.jetty.util.thread.QueuedThreadPool$3.run(QueuedThreadPool.java:534)
[junit4:junit4]   2> 	        at java.lang.Thread.run(Thread.java:679)
[junit4:junit4]   2> 	   4) Thread[id=23, name=qtp1179468258-23 Acceptor0 SelectChannelConnector@0.0.0.0:61576, state=RUNNABLE, group=TGRP-TestBinaryField]
[junit4:junit4]   2> 	        at sun.nio.ch.ServerSocketChannelImpl.accept0(Native Method)
[junit4:junit4]   2> 	        at sun.nio.ch.ServerSocketChannelImpl.accept(ServerSocketChannelImpl.java:163)
[junit4:junit4]   2> 	        at org.eclipse.jetty.server.nio.SelectChannelConnector.accept(SelectChannelConnector.java:104)
[junit4:junit4]   2> 	        at org.eclipse.jetty.server.AbstractConnector$Acceptor.run(AbstractConnector.java:933)
[junit4:junit4]   2> 	        at org.eclipse.jetty.util.thread.QueuedThreadPool.runJob(QueuedThreadPool.java:599)
[junit4:junit4]   2> 	        at org.eclipse.jetty.util.thread.QueuedThreadPool$3.run(QueuedThreadPool.java:534)
[junit4:junit4]   2> 	        at java.lang.Thread.run(Thread.java:679)
[junit4:junit4]   2> 30581 T13 ccr.ThreadLeakControl.tryToInterruptAll Starting to interrupt leaked threads:
[junit4:junit4]   2> 	   1) Thread[id=18, name=qtp1179468258-18 Acceptor1 SelectChannelConnector@0.0.0.0:61576, state=BLOCKED, group=TGRP-TestBinaryField]
[junit4:junit4]   2> 	   2) Thread[id=22, name=qtp1179468258-22 Acceptor2 SelectChannelConnector@0.0.0.0:61576, state=BLOCKED, group=TGRP-TestBinaryField]
[junit4:junit4]   2> 	   3) Thread[id=21, name=qtp1179468258-21 Acceptor3 SelectChannelConnector@0.0.0.0:61576, state=BLOCKED, group=TGRP-TestBinaryField]
[junit4:junit4]   2> 	   4) Thread[id=23, name=qtp1179468258-23 Acceptor0 SelectChannelConnector@0.0.0.0:61576, state=RUNNABLE, group=TGRP-TestBinaryField]
[junit4:junit4]   2> 33625 T13 ccr.ThreadLeakControl.tryToInterruptAll SEVERE There are still zombie threads that couldn't be terminated:
[junit4:junit4]   2> 	   1) Thread[id=18, name=qtp1179468258-18 Acceptor1 SelectChannelConnector@0.0.0.0:61576, state=BLOCKED, group=TGRP-TestBinaryField]
[junit4:junit4]   2> 	        at sun.nio.ch.ServerSocketChannelImpl.accept(ServerSocketChannelImpl.java:147)
[junit4:junit4]   2> 	        at org.eclipse.jetty.server.nio.SelectChannelConnector.accept(SelectChannelConnector.java:104)
[junit4:junit4]   2> 	        at org.eclipse.jetty.server.AbstractConnector$Acceptor.run(AbstractConnector.java:933)
[junit4:junit4]   2> 	        at org.eclipse.jetty.util.thread.QueuedThreadPool.runJob(QueuedThreadPool.java:599)
[junit4:junit4]   2> 	        at org.eclipse.jetty.util.thread.QueuedThreadPool$3.run(QueuedThreadPool.java:534)
[junit4:junit4]   2> 	        at java.lang.Thread.run(Thread.java:679)
[junit4:junit4]   2> 	   2) Thread[id=22, name=qtp1179468258-22 Acceptor2 SelectChannelConnector@0.0.0.0:61576, state=BLOCKED, group=TGRP-TestBinaryField]
[junit4:junit4]   2> 	        at sun.nio.ch.ServerSocketChannelImpl.accept(ServerSocketChannelImpl.java:147)
[junit4:junit4]   2> 	        at org.eclipse.jetty.server.nio.SelectChannelConnector.accept(SelectChannelConnector.java:104)
[junit4:junit4]   2> 	        at org.eclipse.jetty.server.AbstractConnector$Acceptor.run(AbstractConnector.java:933)
[junit4:junit4]   2> 	        at org.eclipse.jetty.util.thread.QueuedThreadPool.runJob(QueuedThreadPool.java:599)
[junit4:junit4]   2> 	        at org.eclipse.jetty.util.thread.QueuedThreadPool$3.run(QueuedThreadPool.java:534)
[junit4:junit4]   2> 	        at java.lang.Thread.run(Thread.java:679)
[junit4:junit4]   2> 	   3) Thread[id=21, name=qtp1179468258-21 Acceptor3 SelectChannelConnector@0.0.0.0:61576, state=BLOCKED, group=TGRP-TestBinaryField]
[junit4:junit4]   2> 	        at sun.nio.ch.ServerSocketChannelImpl.accept(ServerSocketChannelImpl.java:147)
[junit4:junit4]   2> 	        at org.eclipse.jetty.server.nio.SelectChannelConnector.accept(SelectChannelConnector.java:104)
[junit4:junit4]   2> 	        at org.eclipse.jetty.server.AbstractConnector$Acceptor.run(AbstractConnector.java:933)
[junit4:junit4]   2> 	        at org.eclipse.jetty.util.thread.QueuedThreadPool.runJob(QueuedThreadPool.java:599)
[junit4:junit4]   2> 	        at org.eclipse.jetty.util.thread.QueuedThreadPool$3.run(QueuedThreadPool.java:534)
[junit4:junit4]   2> 	        at java.lang.Thread.run(Thread.java:679)
[junit4:junit4]   2> 	   4) Thread[id=23, name=qtp1179468258-23 Acceptor0 SelectChannelConnector@0.0.0.0:61576, state=RUNNABLE, group=TGRP-TestBinaryField]
[junit4:junit4]   2> 	        at sun.nio.ch.ServerSocketChannelImpl.accept0(Native Method)
[junit4:junit4]   2> 	        at sun.nio.ch.ServerSocketChannelImpl.accept(ServerSocketChannelImpl.java:163)
[junit4:junit4]   2> 	        at org.eclipse.jetty.server.nio.SelectChannelConnector.accept(SelectChannelConnector.java:104)
[junit4:junit4]   2> 	        at org.eclipse.jetty.server.AbstractConnector$Acceptor.run(AbstractConnector.java:933)
[junit4:junit4]   2> 	        at org.eclipse.jetty.util.thread.QueuedThreadPool.runJob(QueuedThreadPool.java:599)
[junit4:junit4]   2> 	        at org.eclipse.jetty.util.thread.QueuedThreadPool$3.run(QueuedThreadPool.java:534)
[junit4:junit4]   2> 	        at java.lang.Thread.run(Thread.java:679)
[junit4:junit4]   2> NOTE: test params are: codec=Lucene41: {id=PostingsFormat(name=Direct)}, sim=DefaultSimilarity, locale=in, timezone=MST
[junit4:junit4]   2> NOTE: FreeBSD 9.0-RELEASE amd64/Sun Microsystems Inc. 1.6.0_32 (64-bit)/cpus=16,threads=5,free=144049808,total=157810688
[junit4:junit4]   2> NOTE: All tests run in this JVM: [ZkNodePropsTest, RAMDirectoryFactoryTest, TestBinaryField]
[junit4:junit4]   2> NOTE: download the large Jenkins line-docs file by running 'ant get-jenkins-line-docs' in the lucene directory.
[junit4:junit4]   2> NOTE: reproduce with: ant test  -Dtestcase=TestBinaryField -Dtests.seed=15813E5849A4AF7E -Dtests.multiplier=3 -Dtests.nightly=true -Dtests.slow=true -Dtests.linedocsfile=/home/hudson/lucene-data/enwiki.random.lines.txt -Dtests.locale=in -Dtests.timezone=MST -Dtests.file.encoding=ISO8859-1
[junit4:junit4] ERROR   0.00s J1 | TestBinaryField (suite) <<<
[junit4:junit4]    > Throwable #1: com.carrotsearch.randomizedtesting.ThreadLeakError: 4 threads leaked from SUITE scope at org.apache.solr.schema.TestBinaryField: 
[junit4:junit4]    >    1) Thread[id=18, name=qtp1179468258-18 Acceptor1 SelectChannelConnector@0.0.0.0:61576, state=BLOCKED, group=TGRP-TestBinaryField]
[junit4:junit4]    >         at sun.nio.ch.ServerSocketChannelImpl.accept(ServerSocketChannelImpl.java:147)
[junit4:junit4]    >         at org.eclipse.jetty.server.nio.SelectChannelConnector.accept(SelectChannelConnector.java:104)
[junit4:junit4]    >         at org.eclipse.jetty.server.AbstractConnector$Acceptor.run(AbstractConnector.java:933)
[junit4:junit4]    >         at org.eclipse.jetty.util.thread.QueuedThreadPool.runJob(QueuedThreadPool.java:599)
[junit4:junit4]    >         at org.eclipse.jetty.util.thread.QueuedThreadPool$3.run(QueuedThreadPool.java:534)
[junit4:junit4]    >         at java.lang.Thread.run(Thread.java:679)
[junit4:junit4]    >    2) Thread[id=22, name=qtp1179468258-22 Acceptor2 SelectChannelConnector@0.0.0.0:61576, state=BLOCKED, group=TGRP-TestBinaryField]
[junit4:junit4]    >         at sun.nio.ch.ServerSocketChannelImpl.accept(ServerSocketChannelImpl.java:147)
[junit4:junit4]    >         at org.eclipse.jetty.server.nio.SelectChannelConnector.accept(SelectChannelConnector.java:104)
[junit4:junit4]    >         at org.eclipse.jetty.server.AbstractConnector$Acceptor.run(AbstractConnector.java:933)
[junit4:junit4]    >         at org.eclipse.jetty.util.thread.QueuedThreadPool.runJob(QueuedThreadPool.java:599)
[junit4:junit4]    >         at org.eclipse.jetty.util.thread.QueuedThreadPool$3.run(QueuedThreadPool.java:534)
[junit4:junit4]    >         at java.lang.Thread.run(Thread.java:679)
[junit4:junit4]    >    3) Thread[id=21, name=qtp1179468258-21 Acceptor3 SelectChannelConnector@0.0.0.0:61576, state=BLOCKED, group=TGRP-TestBinaryField]
[junit4:junit4]    >         at sun.nio.ch.ServerSocketChannelImpl.accept(ServerSocketChannelImpl.java:147)
[junit4:junit4]    >         at org.eclipse.jetty.server.nio.SelectChannelConnector.accept(SelectChannelConnector.java:104)
[junit4:junit4]    >         at org.eclipse.jetty.server.AbstractConnector$Acceptor.run(AbstractConnector.java:933)
[junit4:junit4]    >         at org.eclipse.jetty.util.thread.QueuedThreadPool.runJob(QueuedThreadPool.java:599)
[junit4:junit4]    >         at org.eclipse.jetty.util.thread.QueuedThreadPool$3.run(QueuedThreadPool.java:534)
[junit4:junit4]    >         at java.lang.Thread.run(Thread.java:679)
[junit4:junit4]    >    4) Thread[id=23, name=qtp1179468258-23 Acceptor0 SelectChannelConnector@0.0.0.0:61576, state=RUNNABLE, group=TGRP-TestBinaryField]
[junit4:junit4]    >         at sun.nio.ch.ServerSocketChannelImpl.accept0(Native Method)
[junit4:junit4]    >         at sun.nio.ch.ServerSocketChannelImpl.accept(ServerSocketChannelImpl.java:163)
[junit4:junit4]    >         at org.eclipse.jetty.server.nio.SelectChannelConnector.accept(SelectChannelConnector.java:104)
[junit4:junit4]    >         at org.eclipse.jetty.server.AbstractConnector$Acceptor.run(AbstractConnector.java:933)
[junit4:junit4]    >         at org.eclipse.jetty.util.thread.QueuedThreadPool.runJob(QueuedThreadPool.java:599)
[junit4:junit4]    >         at org.eclipse.jetty.util.thread.QueuedThreadPool$3.run(QueuedThreadPool.java:534)
[junit4:junit4]    >         at java.lang.Thread.run(Thread.java:679)
[junit4:junit4]    > 	at __randomizedtesting.SeedInfo.seed([15813E5849A4AF7E]:0)
[junit4:junit4]    > Throwable #2: com.carrotsearch.randomizedtesting.ThreadLeakError: There are still zombie threads that couldn't be terminated:
[junit4:junit4]    >    1) Thread[id=18, name=qtp1179468258-18 Acceptor1 SelectChannelConnector@0.0.0.0:61576, state=BLOCKED, group=TGRP-TestBinaryField]
[junit4:junit4]    >         at sun.nio.ch.ServerSocketChannelImpl.accept(ServerSocketChannelImpl.java:147)
[junit4:junit4]    >         at org.eclipse.jetty.server.nio.SelectChannelConnector.accept(SelectChannelConnector.java:104)
[junit4:junit4]    >         at org.eclipse.jetty.server.AbstractConnector$Acceptor.run(AbstractConnector.java:933)
[junit4:junit4]    >         at org.eclipse.jetty.util.thread.QueuedThreadPool.runJob(QueuedThreadPool.java:599)
[junit4:junit4]    >         at org.eclipse.jetty.util.thread.QueuedThreadPool$3.run(QueuedThreadPool.java:534)
[junit4:junit4]    >         at java.lang.Thread.run(Thread.java:679)
[junit4:junit4]    >    2) Thread[id=22, name=qtp1179468258-22 Acceptor2 SelectChannelConnector@0.0.0.0:61576, state=BLOCKED, group=TGRP-TestBinaryField]
[junit4:junit4]    >         at sun.nio.ch.ServerSocketChannelImpl.accept(ServerSocketChannelImpl.java:147)
[junit4:junit4]    >         at org.eclipse.jetty.server.nio.SelectChannelConnector.accept(SelectChannelConnector.java:104)
[junit4:junit4]    >         at org.eclipse.jetty.server.AbstractConnector$Acceptor.run(AbstractConnector.java:933)
[junit4:junit4]    >         at org.eclipse.jetty.util.thread.QueuedThreadPool.runJob(QueuedThreadPool.java:599)
[junit4:junit4]    >         at org.eclipse.jetty.util.thread.QueuedThreadPool$3.run(QueuedThreadPool.java:534)
[junit4:junit4]    >         at java.lang.Thread.run(Thread.java:679)
[junit4:junit4]    >    3) Thread[id=21, name=qtp1179468258-21 Acceptor3 SelectChannelConnector@0.0.0.0:61576, state=BLOCKED, group=TGRP-TestBinaryField]
[junit4:junit4]    >         at sun.nio.ch.ServerSocketChannelImpl.accept(ServerSocketChannelImpl.java:147)
[junit4:junit4]    >         at org.eclipse.jetty.server.nio.SelectChannelConnector.accept(SelectChannelConnector.java:104)
[junit4:junit4]    >         at org.eclipse.jetty.server.AbstractConnector$Acceptor.run(AbstractConnector.java:933)
[junit4:junit4]    >         at org.eclipse.jetty.util.thread.QueuedThreadPool.runJob(QueuedThreadPool.java:599)
[junit4:junit4]    >         at org.eclipse.jetty.util.thread.QueuedThreadPool$3.run(QueuedThreadPool.java:534)
[junit4:junit4]    >         at java.lang.Thread.run(Thread.java:679)
[junit4:junit4]    >    4) Thread[id=23, name=qtp1179468258-23 Acceptor0 SelectChannelConnector@0.0.0.0:61576, state=RUNNABLE, group=TGRP-TestBinaryField]
[junit4:junit4]    >         at sun.nio.ch.ServerSocketChannelImpl.accept0(Native Method)
[junit4:junit4]    >         at sun.nio.ch.ServerSocketChannelImpl.accept(ServerSocketChannelImpl.java:163)
[junit4:junit4]    >         at org.eclipse.jetty.server.nio.SelectChannelConnector.accept(SelectChannelConnector.java:104)
[junit4:junit4]    >         at org.eclipse.jetty.server.AbstractConnector$Acceptor.run(AbstractConnector.java:933)
[junit4:junit4]    >         at org.eclipse.jetty.util.thread.QueuedThreadPool.runJob(QueuedThreadPool.java:599)
[junit4:junit4]    >         at org.eclipse.jetty.util.thread.QueuedThreadPool$3.run(QueuedThreadPool.java:534)
[junit4:junit4]    >         at java.lang.Thread.run(Thread.java:679)
[junit4:junit4]    > 	at __randomizedtesting.SeedInfo.seed([15813E5849A4AF7E]:0)
[junit4:junit4] Completed on J1 in 33.02s, 1 test, 2 errors <<< FAILURES!

[...truncated 499 lines...]
[junit4:junit4] Suite: org.apache.solr.servlet.CacheHeaderTest
[junit4:junit4]   2> 0 T124 oas.SolrTestCaseJ4.initCore ####initCore
[junit4:junit4]   2> Creating dataDir: /usr/home/hudson/hudson-slave/workspace/Lucene-Solr-NightlyTests-trunk/solr/build/solr-core/test/J0/./solrtest-CacheHeaderTest-1351529597439
[junit4:junit4]   2> 1 T124 oas.SolrTestCaseJ4.initCore ####initCore end
[junit4:junit4]   2> 348 T124 oejs.Server.doStart jetty-8.1.2.v20120308
[junit4:junit4]   2> 584 T124 oejs.AbstractConnector.doStart Started SelectChannelConnector@0.0.0.0:54681
[junit4:junit4]   2> 609 T124 oasc.SolrResourceLoader.locateSolrHome JNDI not configured for solr (NoInitialContextEx)
[junit4:junit4]   2> 610 T124 oasc.SolrResourceLoader.locateSolrHome using system property solr.solr.home: solr/
[junit4:junit4]   2> 610 T124 oasc.SolrResourceLoader.<init> new SolrResourceLoader for deduced Solr Home: 'solr/'
[junit4:junit4]   2> 638 T124 oass.SolrDispatchFilter.init SolrDispatchFilter.init()
[junit4:junit4]   2> 639 T124 oasc.SolrResourceLoader.locateSolrHome JNDI not configured for solr (NoInitialContextEx)
[junit4:junit4]   2> 639 T124 oasc.SolrResourceLoader.locateSolrHome using system property solr.solr.home: solr/
[junit4:junit4]   2> 640 T124 oasc.CoreContainer$Initializer.initialize looking for solr.xml: /usr/home/hudson/hudson-slave/workspace/Lucene-Solr-NightlyTests-trunk/solr/build/solr-core/test/J0/solr/solr.xml
[junit4:junit4]   2> 640 T124 oasc.CoreContainer.<init> New CoreContainer 837789599
[junit4:junit4]   2> 640 T124 oasc.CoreContainer$Initializer.initialize no solr.xml file found - using default
[junit4:junit4]   2> 641 T124 oasc.CoreContainer.load Loading CoreContainer using Solr Home: 'solr/'
[junit4:junit4]   2> 641 T124 oasc.SolrResourceLoader.<init> new SolrResourceLoader for directory: 'solr/'
[junit4:junit4]   2> 674 T124 oasc.CoreContainer.load Registering Log Listener
[junit4:junit4]   2> 715 T124 oasc.CoreContainer.create Creating SolrCore 'collection1' using instanceDir: solr/collection1
[junit4:junit4]   2> 717 T124 oasc.SolrResourceLoader.<init> new SolrResourceLoader for directory: 'solr/collection1/'
[junit4:junit4]   2> 772 T124 oasc.SolrConfig.<init> Using Lucene MatchVersion: LUCENE_50
[junit4:junit4]   2> 846 T124 oasc.SolrConfig.<init> Loaded SolrConfig: solrconfig.xml
[junit4:junit4]   2> 849 T124 oass.IndexSchema.readSchema Reading Solr Schema
[junit4:junit4]   2> 858 T124 oass.IndexSchema.readSchema Schema name=test
[junit4:junit4]   2> 1307 T124 oass.OpenExchangeRatesOrgProvider.init Initialized with rates=open-exchange-rates.json, refreshInterval=1440.
[junit4:junit4]   2> 1315 T124 oass.IndexSchema.readSchema default search field in schema is text
[junit4:junit4]   2> 1318 T124 oass.IndexSchema.readSchema unique key field: id
[junit4:junit4]   2> 1343 T124 oass.FileExchangeRateProvider.reload Reloading exchange rates from file currency.xml
[junit4:junit4]   2> 1352 T124 oass.FileExchangeRateProvider.reload Reloading exchange rates from file currency.xml
[junit4:junit4]   2> 1356 T124 oass.OpenExchangeRatesOrgProvider.reload Reloading exchange rates from open-exchange-rates.json
[junit4:junit4]   2> 1359 T124 oass.OpenExchangeRatesOrgProvider.reload Reloading exchange rates from open-exchange-rates.json
[junit4:junit4]   2> 1361 T124 oasc.SolrCore.<init> [collection1] Opening new SolrCore at solr/collection1/, dataDir=/usr/home/hudson/hudson-slave/workspace/Lucene-Solr-NightlyTests-trunk/solr/build/solr-core/test/J0/solrtest-CacheHeaderTest-1351529597439/
[junit4:junit4]   2> 1361 T124 oasc.JmxMonitoredMap.<init> JMX monitoring is enabled. Adding Solr mbeans to JMX Server: com.sun.jmx.mbeanserver.JmxMBeanServer@11e9c82e
[junit4:junit4]   2> 1361 T124 oasc.SolrCore.initDirectoryFactory org.apache.solr.core.MockDirectoryFactory
[junit4:junit4]   2> 1362 T124 oasc.CachingDirectoryFactory.injectLockFactory WARNING No lockType configured for MockDirWrapper(org.apache.lucene.store.RAMDirectory@1f2a45c7 lockFactory=org.apache.lucene.store.SingleInstanceLockFactory@104b1bcd) assuming 'simple'
[junit4:junit4]   2> 1363 T124 oasc.CachingDirectoryFactory.get return new directory for /usr/home/hudson/hudson-slave/workspace/Lucene-Solr-NightlyTests-trunk/solr/build/solr-core/test/J0/solrtest-CacheHeaderTest-1351529597439 forceNew:false
[junit4:junit4]   2> 1363 T124 oasc.CachingDirectoryFactory.close Releasing directory:/usr/home/hudson/hudson-slave/workspace/Lucene-Solr-NightlyTests-trunk/solr/build/solr-core/test/J0/solrtest-CacheHeaderTest-1351529597439
[junit4:junit4]   2> 1363 T124 oasc.SolrCore.getNewIndexDir New index directory detected: old=null new=/usr/home/hudson/hudson-slave/workspace/Lucene-Solr-NightlyTests-trunk/solr/build/solr-core/test/J0/solrtest-CacheHeaderTest-1351529597439/index/
[junit4:junit4]   2> 1364 T124 oasc.SolrCore.initIndex WARNING [collection1] Solr index directory '/usr/home/hudson/hudson-slave/workspace/Lucene-Solr-NightlyTests-trunk/solr/build/solr-core/test/J0/solrtest-CacheHeaderTest-1351529597439/index' doesn't exist. Creating new index...
[junit4:junit4]   2> 1364 T124 oasc.CachingDirectoryFactory.get return new directory for /usr/home/hudson/hudson-slave/workspace/Lucene-Solr-NightlyTests-trunk/solr/build/solr-core/test/J0/solrtest-CacheHeaderTest-1351529597439/index forceNew:false
[junit4:junit4]   2> 1366 T124 oasc.SolrDeletionPolicy.onCommit SolrDeletionPolicy.onCommit: commits:num=1
[junit4:junit4]   2> 		commit{dir=MockDirWrapper(NRTCachingDirectory(org.apache.lucene.store.RAMDirectory@530a3ffc lockFactory=org.apache.lucene.store.NativeFSLockFactory@15f068b9; maxCacheMB=0.978515625 maxMergeSizeMB=0.9638671875)),segFN=segments_1,generation=1,filenames=[segments_1]
[junit4:junit4]   2> 1367 T124 oasc.SolrDeletionPolicy.updateCommits newest commit = 1[segments_1]
[junit4:junit4]   2> 1367 T124 oasc.CachingDirectoryFactory.close Releasing directory:/usr/home/hudson/hudson-slave/workspace/Lucene-Solr-NightlyTests-trunk/solr/build/solr-core/test/J0/solrtest-CacheHeaderTest-1351529597439/index
[junit4:junit4]   2> 1367 T124 oasc.SolrCore.initWriters created xml: solr.XMLResponseWriter
[junit4:junit4]   2> 1369 T124 oasup.UpdateRequestProcessorChain.init inserting DistributedUpdateProcessorFactory into updateRequestProcessorChain "dedupe"
[junit4:junit4]   2> 1370 T124 oasup.UpdateRequestProcessorChain.init inserting DistributedUpdateProcessorFactory into updateRequestProcessorChain "dedupe-allfields"
[junit4:junit4]   2> 1370 T124 oasup.UpdateRequestProcessorChain.init inserting DistributedUpdateProcessorFactory into updateRequestProcessorChain "stored_sig"
[junit4:junit4]   2> 1370 T124 oasup.UpdateRequestProcessorChain.init inserting DistributedUpdateProcessorFactory into updateRequestProcessorChain "uniq-fields"
[junit4:junit4]   2> 1371 T124 oasup.UpdateRequestProcessorChain.init inserting DistributedUpdateProcessorFactory into updateRequestProcessorChain "distrib-dup-test-chain-implicit"
[junit4:junit4]   2> 1371 T124 oasc.RequestHandlers.initHandlersFromConfig adding lazy requestHandler: solr.ReplicationHandler
[junit4:junit4]   2> 1372 T124 oasc.RequestHandlers.initHandlersFromConfig created /replication: solr.ReplicationHandler
[junit4:junit4]   2> 1372 T124 oasc.RequestHandlers.initHandlersFromConfig created standard: solr.StandardRequestHandler
[junit4:junit4]   2> 1373 T124 oasc.RequestHandlers.initHandlersFromConfig created /get: solr.RealTimeGetHandler
[junit4:junit4]   2> 1373 T124 oasc.RequestHandlers.initHandlersFromConfig created dismax: solr.SearchHandler
[junit4:junit4]   2> 1374 T124 oasc.RequestHandlers.initHandlersFromConfig created mock: org.apache.solr.core.MockQuerySenderListenerReqHandler
[junit4:junit4]   2> 1374 T124 oasc.RequestHandlers.initHandlersFromConfig created /admin/: org.apache.solr.handler.admin.AdminHandlers
[junit4:junit4]   2> 1375 T124 oasc.RequestHandlers.initHandlersFromConfig created defaults: solr.StandardRequestHandler
[junit4:junit4]   2> 1375 T124 oasc.RequestHandlers.initHandlersFromConfig adding lazy requestHandler: solr.StandardRequestHandler
[junit4:junit4]   2> 1375 T124 oasc.RequestHandlers.initHandlersFromConfig created lazy: solr.StandardRequestHandler
[junit4:junit4]   2> 1376 T124 oasc.RequestHandlers.initHandlersFromConfig created /update: solr.UpdateRequestHandler
[junit4:junit4]   2> 1376 T124 oasc.RequestHandlers.initHandlersFromConfig created /terms: org.apache.solr.handler.component.SearchHandler
[junit4:junit4]   2> 1377 T124 oasc.RequestHandlers.initHandlersFromConfig created spellCheckCompRH: org.apache.solr.handler.component.SearchHandler
[junit4:junit4]   2> 1377 T124 oasc.RequestHandlers.initHandlersFromConfig created spellCheckCompRH_Direct: org.apache.solr.handler.component.SearchHandler
[junit4:junit4]   2> 1377 T124 oasc.RequestHandlers.initHandlersFromConfig created spellCheckWithWordbreak: org.apache.solr.handler.component.SearchHandler
[junit4:junit4]   2> 1378 T124 oasc.RequestHandlers.initHandlersFromConfig created spellCheckWithWordbreak_Direct: org.apache.solr.handler.component.SearchHandler
[junit4:junit4]   2> 1378 T124 oasc.RequestHandlers.initHandlersFromConfig created spellCheckCompRH1: org.apache.solr.handler.component.SearchHandler
[junit4:junit4]   2> 1379 T124 oasc.RequestHandlers.initHandlersFromConfig created tvrh: org.apache.solr.handler.component.SearchHandler
[junit4:junit4]   2> 1379 T124 oasc.RequestHandlers.initHandlersFromConfig created /mlt: solr.MoreLikeThisHandler
[junit4:junit4]   2> 1380 T124 oasc.RequestHandlers.initHandlersFromConfig created /debug/dump: solr.DumpRequestHandler
[junit4:junit4]   2> 1385 T124 oashl.XMLLoader.init xsltCacheLifetimeSeconds=60
[junit4:junit4]   2> 1388 T124 oasc.SolrCore.initDeprecatedSupport WARNING solrconfig.xml uses deprecated <admin/gettableFiles>, Please update your config to use the ShowFileRequestHandler.
[junit4:junit4]   2> 1388 T124 oasc.SolrCore.initDeprecatedSupport WARNING adding ShowFileRequestHandler with hidden files: []
[junit4:junit4]   2> 1390 T124 oasc.CachingDirectoryFactory.close Releasing directory:/usr/home/hudson/hudson-slave/workspace/Lucene-Solr-NightlyTests-trunk/solr/build/solr-core/test/J0/solrtest-CacheHeaderTest-1351529597439
[junit4:junit4]   2> 1391 T124 oass.SolrIndexSearcher.<init> Opening Searcher@55ac9683 main
[junit4:junit4]   2> 1391 T124 oasu.CommitTracker.<init> Hard AutoCommit: disabled
[junit4:junit4]   2> 1391 T124 oasu.CommitTracker.<init> Soft AutoCommit: disabled
[junit4:junit4]   2> 1392 T124 oashc.SpellCheckComponent.inform Initializing spell checkers
[junit4:junit4]   2> 1400 T124 oass.DirectSolrSpellChecker.init init: {name=direct,classname=DirectSolrSpellChecker,field=lowerfilt,minQueryLength=3}
[junit4:junit4]   2> 1448 T124 oashc.HttpShardHandlerFactory.getParameter Setting socketTimeout to: 0
[junit4:junit4]   2> 1449 T124 oashc.HttpShardHandlerFactory.getParameter Setting urlScheme to: http://
[junit4:junit4]   2> 1449 T124 oashc.HttpShardHandlerFactory.getParameter Setting connTimeout to: 0
[junit4:junit4]   2> 1449 T124 oashc.HttpShardHandlerFactory.getParameter Setting maxConnectionsPerHost to: 20
[junit4:junit4]   2> 1449 T124 oashc.HttpShardHandlerFactory.getParameter Setting corePoolSize to: 0
[junit4:junit4]   2> 1450 T124 oashc.HttpShardHandlerFactory.getParameter Setting maximumPoolSize to: 2147483647
[junit4:junit4]   2> 1450 T124 oashc.HttpShardHandlerFactory.getParameter Setting maxThreadIdleTime to: 5
[junit4:junit4]   2> 1450 T124 oashc.HttpShardHandlerFactory.getParameter Setting sizeOfQueue to: -1
[junit4:junit4]   2> 1451 T124 oashc.HttpShardHandlerFactory.getParameter Setting fairnessPolicy to: false
[junit4:junit4]   2> 1451 T124 oascsi.HttpClientUtil.createClient Creating new http client, config:maxConnectionsPerHost=20&maxConnections=10000&socketTimeout=0&connTimeout=0&retry=false
[junit4:junit4]   2> 1464 T139 oasc.SolrCore.registerSearcher [collection1] Registered new searcher Searcher@55ac9683 main{StandardDirectoryReader(segments_1:1)}
[junit4:junit4]   2> 1468 T124 oasc.CoreContainer.register registering core: collection1
[junit4:junit4]   2> 1468 T124 oass.SolrDispatchFilter.init user.dir=/usr/home/hudson/hudson-slave/workspace/Lucene-Solr-NightlyTests-trunk/solr/build/solr-core/test/J0
[junit4:junit4]   2> 1468 T124 oass.SolrDispatchFilter.init SolrDispatchFilter.init() done
[junit4:junit4]   2> 1469 T124 oas.SolrJettyTestBase.createJetty Jetty Assigned Port#54681
[junit4:junit4]   2> 1474 T124 oas.SolrTestCaseJ4.setUp ###Starting testCacheVetoHandler
[junit4:junit4]   2> 1493 T124 oascsi.HttpClientUtil.createClient Creating new http client, config:maxConnections=128&maxConnectionsPerHost=32&followRedirects=false
[junit4:junit4]   2> ASYNC  NEW_CORE C9 name=collection1 org.apache.solr.core.SolrCore@26f50154
[junit4:junit4]   2> 2450 T136 C9 oasc.CachingDirectoryFactory.close Releasing directory:/usr/home/hudson/hudson-slave/workspace/Lucene-Solr-NightlyTests-trunk/solr/build/solr-core/test/J0/solrtest-CacheHeaderTest-1351529597439
[junit4:junit4]   2> 2453 T136 C9 oasc.SolrDeletionPolicy.onInit SolrDeletionPolicy.onInit: commits:num=1
[junit4:junit4]   2> 		commit{dir=MockDirWrapper(NRTCachingDirectory(org.apache.lucene.store.RAMDirectory@530a3ffc lockFactory=org.apache.lucene.store.NativeFSLockFactory@15f068b9; maxCacheMB=0.978515625 maxMergeSizeMB=0.9638671875)),segFN=segments_1,generation=1,filenames=[segments_1]
[junit4:junit4]   2> 2453 T136 C9 oasc.SolrDeletionPolicy.updateCommits newest commit = 1[segments_1]
[junit4:junit4]   2> 2456 T136 C9 UPDATE [collection1] webapp=/solr path=/update params={stream.contentType=text/csv&stream.file=/usr/home/hudson/hudson-slave/workspace/Lucene-Solr-NightlyTests-trunk/solr/build/solr-core/test/J0/cachetest_csv1316913170tmp} {add=[100, 101, 102]} 0 77
[junit4:junit4]   2> 2615 T124 oas.SolrTestCaseJ4.tearDown ###Ending testCacheVetoHandler
[junit4:junit4]   2> 2628 T124 oas.SolrTestCaseJ4.setUp ###Starting testLastModified
[junit4:junit4]   2> 2632 T138 C9 REQ [collection1] webapp=/solr path=/select params={qt=standard&q=solr} hits=0 status=0 QTime=2 
[junit4:junit4]   2> 2656 T138 C9 REQ [collection1] webapp=/solr path=/select params={qt=standard&q=solr} hits=0 status=0 QTime=1 
[junit4:junit4]   2> 2667 T136 C9 REQ [collection1] webapp=/solr path=/select params={qt=standard&q=solr} hits=0 status=0 QTime=1 
[junit4:junit4]   2> 2671 T138 C9 REQ [collection1] webapp=/solr path=/select params={qt=standard&q=solr} hits=0 status=0 QTime=1 
[junit4:junit4]   2> 2677 T138 C9 REQ [collection1] webapp=/solr path=/select params={qt=standard&q=solr} hits=0 status=0 QTime=0 
[junit4:junit4]   2> 2684 T136 C9 REQ [collection1] webapp=/solr path=/select params={qt=standard&q=solr} hits=0 status=0 QTime=1 
[junit4:junit4]   2> 2684 T124 oas.SolrTestCaseJ4.tearDown ###Ending testLastModified
[junit4:junit4]   2> 2689 T124 oas.SolrTestCaseJ4.setUp ###Starting testCacheVetoException
[junit4:junit4]   2> 2693 T138 C9 oasc.SolrException.log Ignoring exception matching ignore_exception
[junit4:junit4]   2> 2694 T138 C9 REQ [collection1] webapp=/solr path=/select params={qt=standard&q=xyz_ignore_exception:solr} status=400 QTime=2 
[junit4:junit4]   2> 2695 T124 oas.SolrTestCaseJ4.tearDown ###Ending testCacheVetoException
[junit4:junit4]   2> 2705 T124 oas.SolrTestCaseJ4.setUp ###Starting testEtag
[junit4:junit4]   2> 2708 T137 C9 REQ [collection1] webapp=/solr path=/select params={qt=standard&q=solr} hits=0 status=0 QTime=1 
[junit4:junit4]   2> 2715 T136 C9 REQ [collection1] webapp=/solr path=/select params={qt=standard&q=solr} hits=0 status=0 QTime=4 
[junit4:junit4]   2> 2725 T136 C9 REQ [collection1] webapp=/solr path=/select params={qt=standard&q=solr} hits=0 status=0 QTime=1 
[junit4:junit4]   2> 2728 T138 C9 REQ [collection1] webapp=/solr path=/select params={qt=standard&q=solr} hits=0 status=0 QTime=1 
[junit4:junit4]   2> 2732 T137 C9 REQ [collection1] webapp=/solr path=/select params={qt=standard&q=solr} hits=0 status=0 QTime=1 
[junit4:junit4]   2> 2735 T136 C9 REQ [collection1] webapp=/solr path=/select params={qt=standard&q=solr} hits=0 status=0 QTime=1 
[junit4:junit4]   2> 2746 T138 C9 REQ [collection1] webapp=/solr path=/select params={qt=standard&q=solr} hits=0 status=0 QTime=1 
[junit4:junit4]   2> 2750 T137 C9 REQ [collection1] webapp=/solr path=/select params={qt=standard&q=solr} hits=0 status=0 QTime=1 
[junit4:junit4]   2> 2751 T124 oas.SolrTestCaseJ4.tearDown ###Ending testEtag
[junit4:junit4]   2> 2759 T124 oas.SolrTestCaseJ4.setUp ###Starting testCacheControl
[junit4:junit4]   2> 2762 T136 C9 REQ [collection1] webapp=/solr path=/select params={qt=standard&q=solr} hits=0 status=0 QTime=1 
[junit4:junit4]   2> 2766 T138 C9 REQ [collection1] webapp=/solr path=/select params={qt=standard&q=solr} hits=0 status=0 QTime=1 
[junit4:junit4]   2> 2774 T137 C9 REQ [collection1] webapp=/solr path=/select params={q=solr&qt=standard} hits=0 status=0 QTime=1 
[junit4:junit4]   2> 2775 T124 oas.SolrTestCaseJ4.tearDown ###Ending testCacheControl
[junit4:junit4]   2> 2822 T124 oasc.CoreContainer.shutdown Shutting down CoreContainer instance=837789599
[junit4:junit4]   2> 2822 T124 oasc.SolrCore.close [collection1]  CLOSING SolrCore org.apache.solr.core.SolrCore@26f50154
[junit4:junit4]   2> 2837 T124 oasu.DirectUpdateHandler2.close closing DirectUpdateHandler2{commits=0,autocommits=0,soft autocommits=0,optimizes=0,rollbacks=0,expungeDeletes=0,docsPending=3,adds=3,deletesById=0,deletesByQuery=0,errors=0,cumulative_adds=3,cumulative_deletesById=0,cumulative_deletesByQuery=0,cumulative_errors=0}
[junit4:junit4]   2> 2837 T124 oasc.SolrCore.decrefSolrCoreState Closing SolrCoreState
[junit4:junit4]   2> 2838 T124 oasu.DefaultSolrCoreState.closeIndexWriter SolrCoreState ref count has reached 0 - closing IndexWriter
[junit4:junit4]   2> 2838 T124 oasu.DefaultSolrCoreState.closeIndexWriter closing IndexWriter with IndexWriterCloser
[junit4:junit4]   2> 2843 T124 C9 oasc.SolrDeletionPolicy.onCommit SolrDeletionPolicy.onCommit: commits:num=2
[junit4:junit4]   2> 		commit{dir=MockDirWrapper(NRTCachingDirectory(org.apache.lucene.store.RAMDirectory@530a3ffc lockFactory=org.apache.lucene.store.NativeFSLockFactory@15f068b9; maxCacheMB=0.978515625 maxMergeSizeMB=0.9638671875)),segFN=segments_1,generation=1,filenames=[segments_1]
[junit4:junit4]   2> 		commit{dir=MockDirWrapper(NRTCachingDirectory(org.apache.lucene.store.RAMDirectory@530a3ffc lockFactory=org.apache.lucene.store.NativeFSLockFactory@15f068b9; maxCacheMB=0.978515625 maxMergeSizeMB=0.9638671875)),segFN=segments_2,generation=2,filenames=[_0.fnm, _0.pos, _0.tim, _0_nrm.cfe, segments_2, _0.fdx, _0_nrm.cfs, _0.si, _0.doc, _0.tip, _0.fdt]
[junit4:junit4]   2> 2844 T124 C9 oasc.SolrDeletionPolicy.updateCommits newest commit = 2[_0.fnm, _0.pos, _0.tim, _0_nrm.cfe, segments_2, _0.fdx, _0_nrm.cfs, _0.si, _0.doc, _0.tip, _0.fdt]
[junit4:junit4]   2> 2846 T124 C9 oasc.CachingDirectoryFactory.close Releasing directory:/usr/home/hudson/hudson-slave/workspace/Lucene-Solr-NightlyTests-trunk/solr/build/solr-core/test/J0/solrtest-CacheHeaderTest-1351529597439/index
[junit4:junit4]   2> 2847 T124 oasc.SolrCore.closeSearcher [collection1] Closing main searcher on request.
[junit4:junit4]   2> 2847 T124 oasc.CachingDirectoryFactory.close Releasing directory:/usr/home/hudson/hudson-slave/workspace/Lucene-Solr-NightlyTests-trunk/solr/build/solr-core/test/J0/solrtest-CacheHeaderTest-1351529597439/index
[junit4:junit4]   2> 2848 T124 oejsh.ContextHandler.doStop stopped o.e.j.s.ServletContextHandler{/solr,null}
[junit4:junit4]   2> 2950 T124 oejut.QueuedThreadPool.doStop WARNING 4 threads could not be stopped
[junit4:junit4]   2> 2951 T124 oas.SolrTestCaseJ4.deleteCore ###deleteCore
[junit4:junit4]   2> 2973 T123 ccr.ThreadLeakControl.checkThreadLeaks WARNING Will linger awaiting termination of 4 leaked thread(s).
[junit4:junit4]   2> 23106 T123 ccr.ThreadLeakControl.checkThreadLeaks SEVERE 4 threads leaked from SUITE scope at org.apache.solr.servlet.CacheHeaderTest: 
[junit4:junit4]   2> 	   1) Thread[id=134, name=qtp625527992-134 Acceptor3 SelectChannelConnector@0.0.0.0:54681, state=BLOCKED, group=TGRP-CacheHeaderTest]
[junit4:junit4]   2> 	        at sun.nio.ch.ServerSocketChannelImpl.accept(ServerSocketChannelImpl.java:147)
[junit4:junit4]   2> 	        at org.eclipse.jetty.server.nio.SelectChannelConnector.accept(SelectChannelConnector.java:104)
[junit4:junit4]   2> 	        at org.eclipse.jetty.server.AbstractConnector$Acceptor.run(AbstractConnector.java:933)
[junit4:junit4]   2> 	        at org.eclipse.jetty.util.thread.QueuedThreadPool.runJob(QueuedThreadPool.java:599)
[junit4:junit4]   2> 	        at org.eclipse.jetty.util.thread.QueuedThreadPool$3.run(QueuedThreadPool.java:534)
[junit4:junit4]   2> 	        at java.lang.Thread.run(Thread.java:679)
[junit4:junit4]   2> 	   2) Thread[id=132, name=qtp625527992-132 Acceptor1 SelectChannelConnector@0.0.0.0:54681, state=BLOCKED, group=TGRP-CacheHeaderTest]
[junit4:junit4]   2> 	        at sun.nio.ch.ServerSocketChannelImpl.accept(ServerSocketChannelImpl.java:147)
[junit4:junit4]   2> 	        at org.eclipse.jetty.server.nio.SelectChannelConnector.accept(SelectChannelConnector.java:104)
[junit4:junit4]   2> 	        at org.eclipse.jetty.server.AbstractConnector$Acceptor.run(AbstractConnector.java:933)
[junit4:junit4]   2> 	        at org.eclipse.jetty.util.thread.QueuedThreadPool.runJob(QueuedThreadPool.java:599)
[junit4:junit4]   2> 	        at org.eclipse.jetty.util.thread.QueuedThreadPool$3.run(QueuedThreadPool.java:534)
[junit4:junit4]   2> 	        at java.lang.Thread.run(Thread.java:679)
[junit4:junit4]   2> 	   3) Thread[id=131, name=qtp625527992-131 Acceptor0 SelectChannelConnector@0.0.0.0:54681, state=RUNNABLE, group=TGRP-CacheHeaderTest]
[junit4:junit4]   2> 	        at sun.nio.ch.ServerSocketChannelImpl.accept0(Native Method)
[junit4:junit4]   2> 	        at sun.nio.ch.ServerSocketChannelImpl.accept(ServerSocketChannelImpl.java:163)
[junit4:junit4]   2> 	        at org.eclipse.jetty.server.nio.SelectChannelConnector.accept(SelectChannelConnector.java:104)
[junit4:junit4]   2> 	        at org.eclipse.jetty.server.AbstractConnector$Acceptor.run(AbstractConnector.java:933)
[junit4:junit4]   2> 	        at org.eclipse.jetty.util.thread.QueuedThreadPool.runJob(QueuedThreadPool.java:599)
[junit4:junit4]   2> 	        at org.eclipse.jetty.util.thread.QueuedThreadPool$3.run(QueuedThreadPool.java:534)
[junit4:junit4]   2> 	        at java.lang.Thread.run(Thread.java:679)
[junit4:junit4]   2> 	   4) Thread[id=133, name=qtp625527992-133 Acceptor2 SelectChannelConnector@0.0.0.0:54681, state=BLOCKED, group=TGRP-CacheHeaderTest]
[junit4:junit4]   2> 	        at sun.nio.ch.ServerSocketChannelImpl.accept(ServerSocketChannelImpl.java:147)
[junit4:junit4]   2> 	        at org.eclipse.jetty.server.nio.SelectChannelConnector.accept(SelectChannelConnector.java:104)
[junit4:junit4]   2> 	        at org.eclipse.jetty.server.AbstractConnector$Acceptor.run(AbstractConnector.java:933)
[junit4:junit4]   2> 	        at org.eclipse.jetty.util.thread.QueuedThreadPool.runJob(QueuedThreadPool.java:599)
[junit4:junit4]   2> 	        at org.eclipse.jetty.util.thread.QueuedThreadPool$3.run(QueuedThreadPool.java:534)
[junit4:junit4]   2> 	        at java.lang.Thread.run(Thread.java:679)
[junit4:junit4]   2> 23107 T123 ccr.ThreadLeakControl.tryToInterruptAll Starting to interrupt leaked threads:
[junit4:junit4]   2> 	   1) Thread[id=134, name=qtp625527992-134 Acceptor3 SelectChannelConnector@0.0.0.0:54681, state=BLOCKED, group=TGRP-CacheHeaderTest]
[junit4:junit4]   2> 	   2) Thread[id=132, name=qtp625527992-132 Acceptor1 SelectChannelConnector@0.0.0.0:54681, state=BLOCKED, group=TGRP-CacheHeaderTest]
[junit4:junit4]   2> 	   3) Thread[id=131, name=qtp625527992-131 Acceptor0 SelectChannelConnector@0.0.0.0:54681, state=RUNNABLE, group=TGRP-CacheHeaderTest]
[junit4:junit4]   2> 	   4) Thread[id=133, name=qtp625527992-133 Acceptor2 SelectChannelConnector@0.0.0.0:54681, state=BLOCKED, group=TGRP-CacheHeaderTest]
[junit4:junit4]   2> 26150 T123 ccr.ThreadLeakControl.tryToInterruptAll SEVERE There are still zombie threads that couldn't be terminated:
[junit4:junit4]   2> 	   1) Thread[id=134, name=qtp625527992-134 Acceptor3 SelectChannelConnector@0.0.0.0:54681, state=BLOCKED, group=TGRP-CacheHeaderTest]
[junit4:junit4]   2> 	        at sun.nio.ch.ServerSocketChannelImpl.accept(ServerSocketChannelImpl.java:147)
[junit4:junit4]   2> 	        at org.eclipse.jetty.server.nio.SelectChannelConnector.accept(SelectChannelConnector.java:104)
[junit4:junit4]   2> 	        at org.eclipse.jetty.server.AbstractConnector$Acceptor.run(AbstractConnector.java:933)
[junit4:junit4]   2> 	        at org.eclipse.jetty.util.thread.QueuedThreadPool.runJob(QueuedThreadPool.java:599)
[junit4:junit4]   2> 	        at org.eclipse.jetty.util.thread.QueuedThreadPool$3.run(QueuedThreadPool.java:534)
[junit4:junit4]   2> 	        at java.lang.Thread.run(Thread.java:679)
[junit4:junit4]   2> 	   2) Thread[id=132, name=qtp625527992-132 Acceptor1 SelectChannelConnector@0.0.0.0:54681, state=BLOCKED, group=TGRP-CacheHeaderTest]
[junit4:junit4]   2> 	        at sun.nio.ch.ServerSocketChannelImpl.accept(ServerSocketChannelImpl.java:147)
[junit4:junit4]   2> 	        at org.eclipse.jetty.server.nio.SelectChannelConnector.accept(SelectChannelConnector.java:104)
[junit4:junit4]   2> 	        at org.eclipse.jetty.server.AbstractConnector$Acceptor.run(AbstractConnector.java:933)
[junit4:junit4]   2> 	        at org.eclipse.jetty.util.thread.QueuedThreadPool.runJob(QueuedThreadPool.java:599)
[junit4:junit4]   2> 	        at org.eclipse.jetty.util.thread.QueuedThreadPool$3.run(QueuedThreadPool.java:534)
[junit4:junit4]   2> 	        at java.lang.Thread.run(Thread.java:679)
[junit4:junit4]   2> 	   3) Thread[id=131, name=qtp625527992-131 Acceptor0 SelectChannelConnector@0.0.0.0:54681, state=RUNNABLE, group=TGRP-CacheHeaderTest]
[junit4:junit4]   2> 	        at sun.nio.ch.ServerSocketChannelImpl.accept0(Native Method)
[junit4:junit4]   2> 	        at sun.nio.ch.ServerSocketChannelImpl.accept(ServerSocketChannelImpl.java:163)
[junit4:junit4]   2> 	        at org.eclipse.jetty.server.nio.SelectChannelConnector.accept(SelectChannelConnector.java:104)
[junit4:junit4]   2> 	        at org.eclipse.jetty.server.AbstractConnector$Acceptor.run(AbstractConnector.java:933)
[junit4:junit4]   2> 	        at org.eclipse.jetty.util.thread.QueuedThreadPool.runJob(QueuedThreadPool.java:599)
[junit4:junit4]   2> 	        at org.eclipse.jetty.util.thread.QueuedThreadPool$3.run(QueuedThreadPool.java:534)
[junit4:junit4]   2> 	        at java.lang.Thread.run(Thread.java:679)
[junit4:junit4]   2> 	   4) Thread[id=133, name=qtp625527992-133 Acceptor2 SelectChannelConnector@0.0.0.0:54681, state=BLOCKED, group=TGRP-CacheHeaderTest]
[junit4:junit4]   2> 	        at sun.nio.ch.ServerSocketChannelImpl.accept(ServerSocketChannelImpl.java:147)
[junit4:junit4]   2> 	        at org.eclipse.jetty.server.nio.SelectChannelConnector.accept(SelectChannelConnector.java:104)
[junit4:junit4]   2> 	        at org.eclipse.jetty.server.AbstractConnector$Acceptor.run(AbstractConnector.java:933)
[junit4:junit4]   2> 	        at org.eclipse.jetty.util.thread.QueuedThreadPool.runJob(QueuedThreadPool.java:599)
[junit4:junit4]   2> 	        at org.eclipse.jetty.util.thread.QueuedThreadPool$3.run(QueuedThreadPool.java:534)
[junit4:junit4]   2> 	        at java.lang.Thread.run(Thread.java:679)
[junit4:junit4]   2> NOTE: test params are: codec=Asserting, sim=DefaultSimilarity, locale=ru_RU, timezone=MST7MDT
[junit4:junit4]   2> NOTE: FreeBSD 9.0-RELEASE amd64/Sun Microsystems Inc. 1.6.0_32 (64-bit)/cpus=16,threads=5,free=88925264,total=225509376
[junit4:junit4]   2> NOTE: All tests run in this JVM: [SystemInfoHandlerTest, TestBadConfig, TestStressLucene, AutoCommitTest, ResourceLoaderTest, ZkControllerTest, TestBinaryResponseWriter, CircularListTest, SpatialFilterTest, SolrRequestParserTest, PluginInfoTest, HighlighterConfigTest, SampleTest, TestQueryTypes, CacheHeaderTest]
[junit4:junit4]   2> NOTE: download the large Jenkins line-docs file by running 'ant get-jenkins-line-docs' in the lucene directory.
[junit4:junit4]   2> NOTE: reproduce with: ant test  -Dtestcase=CacheHeaderTest -Dtests.seed=15813E5849A4AF7E -Dtests.multiplier=3 -Dtests.nightly=true -Dtests.slow=true -Dtests.linedocsfile=/home/hudson/lucene-data/enwiki.random.lines.txt -Dtests.locale=ru_RU -Dtests.timezone=MST7MDT -Dtests.file.encoding=ISO8859-1
[junit4:junit4] ERROR   0.00s J0 | CacheHeaderTest (suite) <<<
[junit4:junit4]    > Throwable #1: com.carrotsearch.randomizedtesting.ThreadLeakError: 4 threads leaked from SUITE scope at org.apache.solr.servlet.CacheHeaderTest: 
[junit4:junit4]    >    1) Thread[id=134, name=qtp625527992-134 Acceptor3 SelectChannelConnector@0.0.0.0:54681, state=BLOCKED, group=TGRP-CacheHeaderTest]
[junit4:junit4]    >         at sun.nio.ch.ServerSocketChannelImpl.accept(ServerSocketChannelImpl.java:147)
[junit4:junit4]    >         at org.eclipse.jetty.server.nio.SelectChannelConnector.accept(SelectChannelConnector.java:104)
[junit4:junit4]    >         at org.eclipse.jetty.server.AbstractConnector$Acceptor.run(AbstractConnector.java:933)
[junit4:junit4]    >         at org.eclipse.jetty.util.thread.QueuedThreadPool.runJob(QueuedThreadPool.java:599)
[junit4:junit4]    >         at org.eclipse.jetty.util.thread.QueuedThreadPool$3.run(QueuedThreadPool.java:534)
[junit4:junit4]    >         at java.lang.Thread.run(Thread.java:679)
[junit4:junit4]    >    2) Thread[id=132, name=qtp625527992-132 Acceptor1 SelectChannelConnector@0.0.0.0:54681, state=BLOCKED, group=TGRP-CacheHeaderTest]
[junit4:junit4]    >         at sun.nio.ch.ServerSocketChannelImpl.accept(ServerSocketChannelImpl.java:147)
[junit4:junit4]    >         at org.eclipse.jetty.server.nio.SelectChannelConnector.accept(SelectChannelConnector.java:104)
[junit4:junit4]    >         at org.eclipse.jetty.server.AbstractConnector$Acceptor.run(AbstractConnector.java:933)
[junit4:junit4]    >         at org.eclipse.jetty.util.thread.QueuedThreadPool.runJob(QueuedThreadPool.java:599)
[junit4:junit4]    >         at org.eclipse.jetty.util.thread.QueuedThreadPool$3.run(QueuedThreadPool.java:534)
[junit4:junit4]    >         at java.lang.Thread.run(Thread.java:679)
[junit4:junit4]    >    3) Thread[id=131, name=qtp625527992-131 Acceptor0 SelectChannelConnector@0.0.0.0:54681, state=RUNNABLE, group=TGRP-CacheHeaderTest]
[junit4:junit4]    >         at sun.nio.ch.ServerSocketChannelImpl.accept0(Native Method)
[junit4:junit4]    >         at sun.nio.ch.ServerSocketChannelImpl.accept(ServerSocketChannelImpl.java:163)
[junit4:junit4]    >         at org.eclipse.jetty.server.nio.SelectChannelConnector.accept(SelectChannelConnector.java:104)
[junit4:junit4]    >         at org.eclipse.jetty.server.AbstractConnector$Acceptor.run(AbstractConnector.java:933)
[junit4:junit4]    >         at org.eclipse.jetty.util.thread.QueuedThreadPool.runJob(QueuedThreadPool.java:599)
[junit4:junit4]    >         at org.eclipse.jetty.util.thread.QueuedThreadPool$3.run(QueuedThreadPool.java:534)
[junit4:junit4]    >         at java.lang.Thread.run(Thread.java:679)
[junit4:junit4]    >    4) Thread[id=133, name=qtp625527992-133 Acceptor2 SelectChannelConnector@0.0.0.0:54681, state=BLOCKED, group=TGRP-CacheHeaderTest]
[junit4:junit4]    >         at sun.nio.ch.ServerSocketChannelImpl.accept(ServerSocketChannelImpl.java:147)
[junit4:junit4]    >         at org.eclipse.jetty.server.nio.SelectChannelConnector.accept(SelectChannelConnector.java:104)
[junit4:junit4]    >         at org.eclipse.jetty.server.AbstractConnector$Acceptor.run(AbstractConnector.java:933)
[junit4:junit4]    >         at org.eclipse.jetty.util.thread.QueuedThreadPool.runJob(QueuedThreadPool.java:599)
[junit4:junit4]    >         at org.eclipse.jetty.util.thread.QueuedThreadPool$3.run(QueuedThreadPool.java:534)
[junit4:junit4]    >         at java.lang.Thread.run(Thread.java:679)
[junit4:junit4]    > 	at __randomizedtesting.SeedInfo.seed([15813E5849A4AF7E]:0)
[junit4:junit4]    > Throwable #2: com.carrotsearch.randomizedtesting.ThreadLeakError: There are still zombie threads that couldn't be terminated:
[junit4:junit4]    >    1) Thread[id=134, name=qtp625527992-134 Acceptor3 SelectChannelConnector@0.0.0.0:54681, state=BLOCKED, group=TGRP-CacheHeaderTest]
[junit4:junit4]    >         at sun.nio.ch.ServerSocketChannelImpl.accept(ServerSocketChannelImpl.java:147)
[junit4:junit4]    >         at org.eclipse.jetty.server.nio.SelectChannelConnector.accept(SelectChannelConnector.java:104)
[junit4:junit4]    >         at org.eclipse.jetty.server.AbstractConnector$Acceptor.run(AbstractConnector.java:933)
[junit4:junit4]    >         at org.eclipse.jetty.util.thread.QueuedThreadPool.runJob(QueuedThreadPool.java:599)
[junit4:junit4]    >         at org.eclipse.jetty.util.thread.QueuedThreadPool$3.run(QueuedThreadPool.java:534)
[junit4:junit4]    >         at java.lang.Thread.run(Thread.java:679)
[junit4:junit4]    >    2) Thread[id=132, name=qtp625527992-132 Acceptor1 SelectChannelConnector@0.0.0.0:54681, state=BLOCKED, group=TGRP-CacheHeaderTest]
[junit4:junit4]    >         at sun.nio.ch.ServerSocketChannelImpl.accept(ServerSocketChannelImpl.java:147)
[junit4:junit4]    >         at org.eclipse.jetty.server.nio.SelectChannelConnector.accept(SelectChannelConnector.java:104)
[junit4:junit4]    >         at org.eclipse.jetty.server.AbstractConnector$Acceptor.run(AbstractConnector.java:933)
[junit4:junit4]    >         at org.eclipse.jetty.util.thread.QueuedThreadPool.runJob(QueuedThreadPool.java:599)
[junit4:junit4]    >         at org.eclipse.jetty.util.thread.QueuedThreadPool$3.run(QueuedThreadPool.java:534)
[junit4:junit4]    >         at java.lang.Thread.run(Thread.java:679)
[junit4:junit4]    >    3) Thread[id=131, name=qtp625527992-131 Acceptor0 SelectChannelConnector@0.0.0.0:54681, state=RUNNABLE, group=TGRP-CacheHeaderTest]
[junit4:junit4]    >         at sun.nio.ch.ServerSocketChannelImpl.accept0(Native Method)
[junit4:junit4]    >         at sun.nio.ch.ServerSocketChannelImpl.accept(ServerSocketChannelImpl.java:163)
[junit4:junit4]    >         at org.eclipse.jetty.server.nio.SelectChannelConnector.accept(SelectChannelConnector.java:104)
[junit4:junit4]    >         at org.eclipse.jetty.server.AbstractConnector$Acceptor.run(AbstractConnector.java:933)
[junit4:junit4]    >         at org.eclipse.jetty.util.thread.QueuedThreadPool.runJob(QueuedThreadPool.java:599)
[junit4:junit4]    >         at org.eclipse.jetty.util.thread.QueuedThreadPool$3.run(QueuedThreadPool.java:534)
[junit4:junit4]    >         at java.lang.Thread.run(Thread.java:679)
[junit4:junit4]    >    4) Thread[id=133, name=qtp625527992-133 Acceptor2 SelectChannelConnector@0.0.0.0:54681, state=BLOCKED, group=TGRP-CacheHeaderTest]
[junit4:junit4]    >         at sun.nio.ch.ServerSocketChannelImpl.accept(ServerSocketChannelImpl.java:147)
[junit4:junit4]    >         at org.eclipse.jetty.server.nio.SelectChannelConnector.accept(SelectChannelConnector.java:104)
[junit4:junit4]    >         at org.eclipse.jetty.server.AbstractConnector$Acceptor.run(AbstractConnector.java:933)
[junit4:junit4]    >         at org.eclipse.jetty.util.thread.QueuedThreadPool.runJob(QueuedThreadPool.java:599)
[junit4:junit4]    >         at org.eclipse.jetty.util.thread.QueuedThreadPool$3.run(QueuedThreadPool.java:534)
[junit4:junit4]    >         at java.lang.Thread.run(Thread.java:679)
[junit4:junit4]    > 	at __randomizedtesting.SeedInfo.seed([15813E5849A4AF7E]:0)
[junit4:junit4] Completed on J0 in 26.21s, 5 tests, 2 errors <<< FAILURES!

[...truncated 170 lines...]
BUILD FAILED
/usr/home/hudson/hudson-slave/workspace/Lucene-Solr-NightlyTests-trunk/build.xml:335: The following error occurred while executing this line:
/usr/home/hudson/hudson-slave/workspace/Lucene-Solr-NightlyTests-trunk/build.xml:39: The following error occurred while executing this line:
/usr/home/hudson/hudson-slave/workspace/Lucene-Solr-NightlyTests-trunk/solr/build.xml:178: The following error occurred while executing this line:
/usr/home/hudson/hudson-slave/workspace/Lucene-Solr-NightlyTests-trunk/lucene/module-build.xml:61: The following error occurred while executing this line:
/usr/home/hudson/hudson-slave/workspace/Lucene-Solr-NightlyTests-trunk/lucene/common-build.xml:1159: The following error occurred while executing this line:
/usr/home/hudson/hudson-slave/workspace/Lucene-Solr-NightlyTests-trunk/lucene/common-build.xml:827: There were test failures: 232 suites, 961 tests, 4 suite-level errors, 832 ignored (2 assumptions)

Total time: 109 minutes 28 seconds
Build step 'Invoke Ant' marked build as failure
Archiving artifacts
Recording test results
Email was triggered for: Failure
Sending email for trigger: Failure



Mime
View raw message