lucene-dev mailing list archives

Site index · List index
Message view « Date » · « Thread »
Top « Date » · « Thread »
From buil...@flonkings.com
Subject [JENKINS] Lucene-trunk-Linux-Java7-64-test-only - Build # 8705 - Failure!
Date Tue, 02 Oct 2012 10:52:09 GMT
Build: builds.flonkings.com/job/Lucene-trunk-Linux-Java7-64-test-only/8705/

1 tests failed.
REGRESSION:  org.apache.lucene.index.TestRollingUpdates.testRollingUpdates

Error Message:
expected:<134693> but was:<134218>

Stack Trace:
java.lang.AssertionError: expected:<134693> but was:<134218>
	at __randomizedtesting.SeedInfo.seed([4772D4F6A3BA7709:C989D58F1024D2C2]:0)
	at org.junit.Assert.fail(Assert.java:93)
	at org.junit.Assert.failNotEquals(Assert.java:647)
	at org.junit.Assert.assertEquals(Assert.java:128)
	at org.junit.Assert.assertEquals(Assert.java:472)
	at org.junit.Assert.assertEquals(Assert.java:456)
	at org.apache.lucene.index.TestRollingUpdates.testRollingUpdates(TestRollingUpdates.java:150)
	at sun.reflect.NativeMethodAccessorImpl.invoke0(Native Method)
	at sun.reflect.NativeMethodAccessorImpl.invoke(NativeMethodAccessorImpl.java:57)
	at sun.reflect.DelegatingMethodAccessorImpl.invoke(DelegatingMethodAccessorImpl.java:43)
	at java.lang.reflect.Method.invoke(Method.java:601)
	at com.carrotsearch.randomizedtesting.RandomizedRunner.invoke(RandomizedRunner.java:1559)
	at com.carrotsearch.randomizedtesting.RandomizedRunner.access$600(RandomizedRunner.java:79)
	at com.carrotsearch.randomizedtesting.RandomizedRunner$6.evaluate(RandomizedRunner.java:737)
	at com.carrotsearch.randomizedtesting.RandomizedRunner$7.evaluate(RandomizedRunner.java:773)
	at com.carrotsearch.randomizedtesting.RandomizedRunner$8.evaluate(RandomizedRunner.java:787)
	at org.apache.lucene.util.TestRuleSetupTeardownChained$1.evaluate(TestRuleSetupTeardownChained.java:50)
	at org.apache.lucene.util.TestRuleFieldCacheSanity$1.evaluate(TestRuleFieldCacheSanity.java:51)
	at org.apache.lucene.util.AbstractBeforeAfterRule$1.evaluate(AbstractBeforeAfterRule.java:45)
	at com.carrotsearch.randomizedtesting.rules.SystemPropertiesInvariantRule$1.evaluate(SystemPropertiesInvariantRule.java:55)
	at org.apache.lucene.util.TestRuleThreadAndTestName$1.evaluate(TestRuleThreadAndTestName.java:48)
	at org.apache.lucene.util.TestRuleIgnoreAfterMaxFailures$1.evaluate(TestRuleIgnoreAfterMaxFailures.java:70)
	at org.apache.lucene.util.TestRuleMarkFailure$1.evaluate(TestRuleMarkFailure.java:48)
	at com.carrotsearch.randomizedtesting.rules.StatementAdapter.evaluate(StatementAdapter.java:36)
	at com.carrotsearch.randomizedtesting.ThreadLeakControl$StatementRunner.run(ThreadLeakControl.java:358)
	at com.carrotsearch.randomizedtesting.ThreadLeakControl.forkTimeoutingTask(ThreadLeakControl.java:782)
	at com.carrotsearch.randomizedtesting.ThreadLeakControl$3.evaluate(ThreadLeakControl.java:442)
	at com.carrotsearch.randomizedtesting.RandomizedRunner.runSingleTest(RandomizedRunner.java:746)
	at com.carrotsearch.randomizedtesting.RandomizedRunner$3.evaluate(RandomizedRunner.java:648)
	at com.carrotsearch.randomizedtesting.RandomizedRunner$4.evaluate(RandomizedRunner.java:682)
	at com.carrotsearch.randomizedtesting.RandomizedRunner$5.evaluate(RandomizedRunner.java:693)
	at org.apache.lucene.util.AbstractBeforeAfterRule$1.evaluate(AbstractBeforeAfterRule.java:45)
	at org.apache.lucene.util.TestRuleStoreClassName$1.evaluate(TestRuleStoreClassName.java:42)
	at com.carrotsearch.randomizedtesting.rules.SystemPropertiesInvariantRule$1.evaluate(SystemPropertiesInvariantRule.java:55)
	at com.carrotsearch.randomizedtesting.rules.NoShadowingOrOverridesOnMethodsRule$1.evaluate(NoShadowingOrOverridesOnMethodsRule.java:39)
	at com.carrotsearch.randomizedtesting.rules.NoShadowingOrOverridesOnMethodsRule$1.evaluate(NoShadowingOrOverridesOnMethodsRule.java:39)
	at com.carrotsearch.randomizedtesting.rules.StatementAdapter.evaluate(StatementAdapter.java:36)
	at org.apache.lucene.util.TestRuleAssertionsRequired$1.evaluate(TestRuleAssertionsRequired.java:43)
	at org.apache.lucene.util.TestRuleMarkFailure$1.evaluate(TestRuleMarkFailure.java:48)
	at org.apache.lucene.util.TestRuleIgnoreAfterMaxFailures$1.evaluate(TestRuleIgnoreAfterMaxFailures.java:70)
	at org.apache.lucene.util.TestRuleIgnoreTestSuites$1.evaluate(TestRuleIgnoreTestSuites.java:55)
	at com.carrotsearch.randomizedtesting.rules.StatementAdapter.evaluate(StatementAdapter.java:36)
	at com.carrotsearch.randomizedtesting.ThreadLeakControl$StatementRunner.run(ThreadLeakControl.java:358)
	at java.lang.Thread.run(Thread.java:722)




Build Log:
[...truncated 19 lines...]
ERROR: Failed to update http://svn.apache.org/repos/asf/lucene/dev/nightly
org.tmatesoft.svn.core.SVNException: svn: Target path '/lucene/dev/nightly' does not exist
svn: REPORT of /repos/asf/!svn/vcc/default: 500 Internal Server Error (http://svn.apache.org)
	at org.tmatesoft.svn.core.internal.wc.SVNErrorManager.error(SVNErrorManager.java:64)
	at org.tmatesoft.svn.core.internal.wc.SVNErrorManager.error(SVNErrorManager.java:51)
	at org.tmatesoft.svn.core.internal.io.dav.DAVRepository.runReport(DAVRepository.java:1284)
	at org.tmatesoft.svn.core.internal.io.dav.DAVRepository.update(DAVRepository.java:830)
	at org.tmatesoft.svn.core.wc.SVNUpdateClient.update(SVNUpdateClient.java:564)
	at org.tmatesoft.svn.core.wc.SVNUpdateClient.doUpdate(SVNUpdateClient.java:401)
	at hudson.scm.subversion.UpdateUpdater$TaskImpl.perform(UpdateUpdater.java:136)
	at hudson.scm.subversion.WorkspaceUpdater$UpdateTask.delegateTo(WorkspaceUpdater.java:136)
	at hudson.scm.SubversionSCM$CheckOutTask.perform(SubversionSCM.java:788)
	at hudson.scm.SubversionSCM$CheckOutTask.invoke(SubversionSCM.java:769)
	at hudson.scm.SubversionSCM$CheckOutTask.invoke(SubversionSCM.java:753)
	at hudson.FilePath.act(FilePath.java:842)
	at hudson.FilePath.act(FilePath.java:824)
	at hudson.scm.SubversionSCM.checkout(SubversionSCM.java:743)
	at hudson.scm.SubversionSCM.checkout(SubversionSCM.java:685)
	at hudson.model.AbstractProject.checkout(AbstractProject.java:1249)
	at hudson.model.AbstractBuild$AbstractBuildExecution.defaultCheckout(AbstractBuild.java:589)
	at jenkins.scm.SCMCheckoutStrategy.checkout(SCMCheckoutStrategy.java:88)
	at hudson.model.AbstractBuild$AbstractBuildExecution.run(AbstractBuild.java:494)
	at hudson.model.Run.execute(Run.java:1488)
	at hudson.model.FreeStyleBuild.run(FreeStyleBuild.java:46)
	at hudson.model.ResourceController.execute(ResourceController.java:88)
	at hudson.model.Executor.run(Executor.java:236)
Caused by: org.tmatesoft.svn.core.SVNErrorMessage: svn: Target path '/lucene/dev/nightly' does not exist
	at org.tmatesoft.svn.core.SVNErrorMessage.create(SVNErrorMessage.java:200)
	at org.tmatesoft.svn.core.SVNErrorMessage.create(SVNErrorMessage.java:146)
	at org.tmatesoft.svn.core.SVNErrorMessage.create(SVNErrorMessage.java:89)
	at org.tmatesoft.svn.core.internal.io.dav.handlers.DAVErrorHandler.endElement(DAVErrorHandler.java:72)
	at org.tmatesoft.svn.core.internal.io.dav.handlers.BasicDAVHandler.endElement(BasicDAVHandler.java:99)
	at com.sun.org.apache.xerces.internal.parsers.AbstractSAXParser.endElement(AbstractSAXParser.java:606)
	at com.sun.org.apache.xerces.internal.impl.XMLDocumentFragmentScannerImpl.scanEndElement(XMLDocumentFragmentScannerImpl.java:1741)
	at com.sun.org.apache.xerces.internal.impl.XMLDocumentFragmentScannerImpl$FragmentContentDriver.next(XMLDocumentFragmentScannerImpl.java:2898)
	at com.sun.org.apache.xerces.internal.impl.XMLDocumentScannerImpl.next(XMLDocumentScannerImpl.java:607)
	at com.sun.org.apache.xerces.internal.impl.XMLNSDocumentScannerImpl.next(XMLNSDocumentScannerImpl.java:116)
	at com.sun.org.apache.xerces.internal.impl.XMLDocumentFragmentScannerImpl.scanDocument(XMLDocumentFragmentScannerImpl.java:488)
	at com.sun.org.apache.xerces.internal.parsers.XML11Configuration.parse(XML11Configuration.java:835)
	at com.sun.org.apache.xerces.internal.parsers.XML11Configuration.parse(XML11Configuration.java:764)
	at com.sun.org.apache.xerces.internal.parsers.XMLParser.parse(XMLParser.java:123)
	at com.sun.org.apache.xerces.internal.parsers.AbstractSAXParser.parse(AbstractSAXParser.java:1210)
	at com.sun.org.apache.xerces.internal.jaxp.SAXParserImpl$JAXPSAXParser.parse(SAXParserImpl.java:568)
	at org.tmatesoft.svn.core.internal.io.dav.http.HTTPConnection.readData(HTTPConnection.java:776)
	at org.tmatesoft.svn.core.internal.io.dav.http.HTTPConnection.readData(HTTPConnection.java:741)
	at org.tmatesoft.svn.core.internal.io.dav.http.HTTPConnection.readError(HTTPConnection.java:222)
	at org.tmatesoft.svn.core.internal.io.dav.http.HTTPRequest.readError(HTTPRequest.java:290)
	at org.tmatesoft.svn.core.internal.io.dav.http.HTTPRequest.dispatch(HTTPRequest.java:213)
	at org.tmatesoft.svn.core.internal.io.dav.http.HTTPConnection._request(HTTPConnection.java:379)
	at org.tmatesoft.svn.core.internal.io.dav.http.HTTPConnection.request(HTTPConnection.java:292)
	at org.tmatesoft.svn.core.internal.io.dav.http.HTTPConnection.request(HTTPConnection.java:283)
	at org.tmatesoft.svn.core.internal.io.dav.http.HTTPConnection.request(HTTPConnection.java:271)
	at org.tmatesoft.svn.core.internal.io.dav.DAVConnection.doReport(DAVConnection.java:283)
	at org.tmatesoft.svn.core.internal.io.dav.DAVRepository.runReport(DAVRepository.java:1282)
	... 20 more
Caused by: org.tmatesoft.svn.core.SVNErrorMessage: svn: REPORT of /repos/asf/!svn/vcc/default: 500 Internal Server Error (http://svn.apache.org)
	at org.tmatesoft.svn.core.SVNErrorMessage.create(SVNErrorMessage.java:200)
	at org.tmatesoft.svn.core.SVNErrorMessage.create(SVNErrorMessage.java:181)
	at org.tmatesoft.svn.core.SVNErrorMessage.create(SVNErrorMessage.java:133)
	at org.tmatesoft.svn.core.internal.io.dav.http.HTTPRequest.createDefaultErrorMessage(HTTPRequest.java:444)
	at org.tmatesoft.svn.core.internal.io.dav.http.HTTPRequest.readError(HTTPRequest.java:288)
	... 27 more
no change for http://svn.apache.org/repos/asf/lucene/dev/nightly since the previous build
No emails were triggered.
[EnvInject] - Executing scripts and injecting environment variables after the SCM step.
[EnvInject] - Injecting as environment variables the properties content 
NO_JAVADOCS=yes
TEST_JVM_ARGS=-XX:+UseG1GC

[EnvInject] - Variables injected successfully.
[lucene] $ /var/lib/jenkins/tools/Ant/Ant_1.8.3/bin/ant -file build.xml -Dtests.jvms=8 clean-jars clean test-core
Buildfile: /var/lib/jenkins/workspace/Lucene-trunk-Linux-Java7-64-test-only/checkout/lucene/build.xml

clean-jars:

clean:

test-core:

-clover.disable:

-clover.load:

-clover.classpath:

-clover.setup:

clover:

ivy-availability-check:

ivy-fail:

ivy-configure:
[ivy:configure] :: Ivy 2.2.0 - 20100923230623 :: http://ant.apache.org/ivy/ ::
[ivy:configure] :: loading settings :: file = /var/lib/jenkins/workspace/Lucene-trunk-Linux-Java7-64-test-only/checkout/lucene/ivy-settings.xml

resolve:

init:

compile-core:
    [mkdir] Created dir: /var/lib/jenkins/workspace/Lucene-trunk-Linux-Java7-64-test-only/checkout/lucene/build/core/classes/java
    [javac] Compiling 604 source files to /var/lib/jenkins/workspace/Lucene-trunk-Linux-Java7-64-test-only/checkout/lucene/build/core/classes/java
     [copy] Copying 2 files to /var/lib/jenkins/workspace/Lucene-trunk-Linux-Java7-64-test-only/checkout/lucene/build/core/classes/java

compile-test-framework:

ivy-availability-check:

ivy-fail:

ivy-configure:
[ivy:configure] :: loading settings :: file = /var/lib/jenkins/workspace/Lucene-trunk-Linux-Java7-64-test-only/checkout/lucene/ivy-settings.xml

resolve:

init:

compile-lucene-core:

ivy-availability-check:

ivy-fail:

ivy-configure:
[ivy:configure] :: loading settings :: file = /var/lib/jenkins/workspace/Lucene-trunk-Linux-Java7-64-test-only/checkout/lucene/ivy-settings.xml

resolve:

init:

-clover.disable:

-clover.load:

-clover.classpath:

-clover.setup:

clover:

compile-core:

compile-codecs:
     [echo] Building codecs...

ivy-availability-check:

ivy-fail:

ivy-configure:
[ivy:configure] :: loading settings :: file = /var/lib/jenkins/workspace/Lucene-trunk-Linux-Java7-64-test-only/checkout/lucene/ivy-settings.xml

resolve:

common.init:

compile-lucene-core:

init:

-clover.disable:

-clover.load:

-clover.classpath:

-clover.setup:

clover:

compile-core:
    [mkdir] Created dir: /var/lib/jenkins/workspace/Lucene-trunk-Linux-Java7-64-test-only/checkout/lucene/build/codecs/classes/java
    [javac] Compiling 66 source files to /var/lib/jenkins/workspace/Lucene-trunk-Linux-Java7-64-test-only/checkout/lucene/build/codecs/classes/java
     [copy] Copying 2 files to /var/lib/jenkins/workspace/Lucene-trunk-Linux-Java7-64-test-only/checkout/lucene/build/codecs/classes/java

-clover.disable:

-clover.load:

-clover.classpath:

-clover.setup:

clover:

common.compile-core:
    [mkdir] Created dir: /var/lib/jenkins/workspace/Lucene-trunk-Linux-Java7-64-test-only/checkout/lucene/build/test-framework/classes/java
    [javac] Compiling 89 source files to /var/lib/jenkins/workspace/Lucene-trunk-Linux-Java7-64-test-only/checkout/lucene/build/test-framework/classes/java
     [copy] Copying 3 files to /var/lib/jenkins/workspace/Lucene-trunk-Linux-Java7-64-test-only/checkout/lucene/build/test-framework/classes/java

compile-core:

compile-test:
    [mkdir] Created dir: /var/lib/jenkins/workspace/Lucene-trunk-Linux-Java7-64-test-only/checkout/lucene/build/core/classes/test
    [javac] Compiling 321 source files to /var/lib/jenkins/workspace/Lucene-trunk-Linux-Java7-64-test-only/checkout/lucene/build/core/classes/test
    [javac] /var/lib/jenkins/workspace/Lucene-trunk-Linux-Java7-64-test-only/checkout/lucene/core/src/test/org/apache/lucene/codecs/perfield/TestPerFieldPostingsFormat.java:36: warning: [unchecked] unchecked conversion
    [javac]     codec = new RandomCodec(new Random(random().nextLong()), Collections.EMPTY_SET);
    [javac]                                                                         ^
    [javac]   required: Set<String>
    [javac]   found:    Set
    [javac] Note: Some input files use or override a deprecated API.
    [javac] Note: Recompile with -Xlint:deprecation for details.
    [javac] 1 warning
     [copy] Copying 29 files to /var/lib/jenkins/workspace/Lucene-trunk-Linux-Java7-64-test-only/checkout/lucene/build/core/classes/test

install-junit4-taskdef:

validate:

test:
    [mkdir] Created dir: /var/lib/jenkins/workspace/Lucene-trunk-Linux-Java7-64-test-only/checkout/lucene/build/core/test
[junit4:junit4] <JUnit4> says aloha! Master seed: 4772D4F6A3BA7709
[junit4:junit4] Executing 308 suites with 8 JVMs.
[junit4:junit4] 
[junit4:junit4] Suite: org.apache.lucene.index.TestTerm
[junit4:junit4] Completed on J5 in 1.89s, 1 test
[junit4:junit4] 
[junit4:junit4] Suite: org.apache.lucene.util.TestBitUtil
[junit4:junit4] Completed on J1 in 2.04s, 2 tests
[junit4:junit4] 
[junit4:junit4] Suite: org.apache.lucene.search.TestFieldValueFilter
[junit4:junit4] Completed on J0 in 2.85s, 2 tests
[junit4:junit4] 
[junit4:junit4] Suite: org.apache.lucene.index.TestReaderClosed
[junit4:junit4] Completed on J6 in 3.16s, 2 tests
[junit4:junit4] 
[junit4:junit4] Suite: org.apache.lucene.store.TestByteArrayDataInput
[junit4:junit4] Completed on J5 in 0.12s, 1 test
[junit4:junit4] 
[junit4:junit4] Suite: org.apache.lucene.util.TestMaxFailuresRule
[junit4:junit4] Completed on J7 in 5.50s, 1 test
[junit4:junit4] 
[junit4:junit4] Suite: org.apache.lucene.util.junitcompat.TestReproduceMessage
[junit4:junit4] Completed on J1 in 3.64s, 21 tests
[junit4:junit4] 
[junit4:junit4] Suite: org.apache.lucene.search.TestMultiPhraseQuery
[junit4:junit4] Completed on J0 in 4.16s, 16 tests, 1 skipped
[junit4:junit4] 
[junit4:junit4] Suite: org.apache.lucene.index.TestForceMergeForever
[junit4:junit4] Completed on J5 in 4.93s, 1 test
[junit4:junit4] 
[junit4:junit4] Suite: org.apache.lucene.util.automaton.TestCompiledAutomaton
[junit4:junit4] Completed on J7 in 2.48s, 2 tests
[junit4:junit4] 
[junit4:junit4] Suite: org.apache.lucene.index.TestIndexWriterOnJRECrash
[junit4:junit4] IGNOR/A 0.21s J5 | TestIndexWriterOnJRECrash.testNRTThreads
[junit4:junit4]    > Assumption #1: 'nightly' test group is disabled (@Nightly)
[junit4:junit4] Completed on J5 in 0.42s, 1 test, 1 skipped
[junit4:junit4] 
[junit4:junit4] Suite: org.apache.lucene.search.payloads.TestPayloadExplanations
[junit4:junit4] Completed on J6 in 5.28s, 5 tests
[junit4:junit4] 
[junit4:junit4] Suite: org.apache.lucene.search.TestTopDocsCollector
[junit4:junit4] Completed on J0 in 1.60s, 8 tests
[junit4:junit4] 
[junit4:junit4] Suite: org.apache.lucene.search.TestFieldCacheRangeFilter
[junit4:junit4] Completed on J2 in 9.19s, 9 tests
[junit4:junit4] 
[junit4:junit4] Suite: org.apache.lucene.util.TestCharsRef
[junit4:junit4] Completed on J2 in 1.02s, 8 tests
[junit4:junit4] 
[junit4:junit4] Suite: org.apache.lucene.index.TestOmitNorms
[junit4:junit4] Completed on J3 in 10.10s, 5 tests
[junit4:junit4] 
[junit4:junit4] Suite: org.apache.lucene.search.similarities.TestSimilarity2
[junit4:junit4] Completed on J3 in 2.51s, 7 tests
[junit4:junit4] 
[junit4:junit4] Suite: org.apache.lucene.index.TestIndexableField
[junit4:junit4] Completed on J2 in 2.79s, 1 test
[junit4:junit4] 
[junit4:junit4] Suite: org.apache.lucene.util.automaton.TestDeterminizeLexicon
[junit4:junit4] Completed on J7 in 5.53s, 1 test
[junit4:junit4] 
[junit4:junit4] Suite: org.apache.lucene.index.TestPerSegmentDeletes
[junit4:junit4] Completed on J2 in 0.67s, 1 test
[junit4:junit4] 
[junit4:junit4] Suite: org.apache.lucene.search.TestAutomatonQueryUnicode
[junit4:junit4] Completed on J2 in 0.42s, 1 test
[junit4:junit4] 
[junit4:junit4] Suite: org.apache.lucene.util.automaton.TestUTF32ToUTF8
[junit4:junit4] Completed on J0 in 5.49s, 5 tests
[junit4:junit4] 
[junit4:junit4] Suite: org.apache.lucene.util.TestNamedSPILoader
[junit4:junit4] Completed on J2 in 0.29s, 3 tests
[junit4:junit4] 
[junit4:junit4] Suite: org.apache.lucene.index.TestTieredMergePolicy
[junit4:junit4] Completed on J4 in 16.35s, 4 tests
[junit4:junit4] 
[junit4:junit4] Suite: org.apache.lucene.search.TestPrefixRandom
[junit4:junit4] Completed on J7 in 3.57s, 1 test
[junit4:junit4] 
[junit4:junit4] Suite: org.apache.lucene.search.spans.TestSpansAdvanced
[junit4:junit4] Completed on J4 in 1.68s, 1 test
[junit4:junit4] 
[junit4:junit4] Suite: org.apache.lucene.index.Test2BTerms
[junit4:junit4] Completed on J4 in 0.25s, 1 test, 1 skipped
[junit4:junit4] 
[junit4:junit4] Suite: org.apache.lucene.index.TestCheckIndex
[junit4:junit4] Completed on J4 in 0.88s, 3 tests
[junit4:junit4] 
[junit4:junit4] Suite: org.apache.lucene.index.TestMaxTermFrequency
[junit4:junit4] Completed on J7 in 2.89s, 1 test
[junit4:junit4] 
[junit4:junit4] Suite: org.apache.lucene.search.spans.TestPayloadSpans
[junit4:junit4] Completed on J0 in 8.30s, 10 tests
[junit4:junit4] 
[junit4:junit4] Suite: org.apache.lucene.index.TestIsCurrent
[junit4:junit4] Completed on J0 in 0.40s, 2 tests
[junit4:junit4] 
[junit4:junit4] Suite: org.apache.lucene.TestSearchForDuplicates
[junit4:junit4] Completed on J0 in 1.97s, 1 test
[junit4:junit4] 
[junit4:junit4] Suite: org.apache.lucene.util.packed.TestPackedInts
[junit4:junit4] Completed on J1 in 19.73s, 16 tests
[junit4:junit4] 
[junit4:junit4] Suite: org.apache.lucene.index.TestStressAdvance
[junit4:junit4] Completed on J5 in 19.63s, 1 test
[junit4:junit4] 
[junit4:junit4] Suite: org.apache.lucene.codecs.lucene40.TestLucene40PostingsReader
[junit4:junit4] Completed on J6 in 19.41s, 1 test
[junit4:junit4] 
[junit4:junit4] Suite: org.apache.lucene.search.TestMultiTermConstantScore
[junit4:junit4] Completed on J0 in 4.97s, 7 tests
[junit4:junit4] 
[junit4:junit4] Suite: org.apache.lucene.util.TestRecyclingByteBlockAllocator
[junit4:junit4] Completed on J0 in 0.43s, 3 tests
[junit4:junit4] 
[junit4:junit4] Suite: org.apache.lucene.index.TestBackwardsCompatibility
[junit4:junit4] Completed on J2 in 19.30s, 13 tests
[junit4:junit4] 
[junit4:junit4] Suite: org.apache.lucene.index.TestAddIndexes
[junit4:junit4] Completed on J3 in 21.18s, 20 tests
[junit4:junit4] 
[junit4:junit4] Suite: org.apache.lucene.util.TestPagedBytes
[junit4:junit4] Completed on J5 in 6.99s, 3 tests
[junit4:junit4] 
[junit4:junit4] Suite: org.apache.lucene.util.TestBytesRefHash
[junit4:junit4] Completed on J0 in 4.11s, 7 tests
[junit4:junit4] 
[junit4:junit4] Suite: org.apache.lucene.index.TestBinaryTerms
[junit4:junit4] Completed on J3 in 0.50s, 1 test
[junit4:junit4] 
[junit4:junit4] Suite: org.apache.lucene.search.TestNGramPhraseQuery
[junit4:junit4] Completed on J0 in 0.28s, 1 test
[junit4:junit4] 
[junit4:junit4] Suite: org.apache.lucene.search.spans.TestNearSpansOrdered
[junit4:junit4] Completed on J2 in 1.17s, 10 tests
[junit4:junit4] 
[junit4:junit4] Suite: org.apache.lucene.codecs.perfield.TestPerFieldPostingsFormat
[junit4:junit4] Completed on J6 in 7.93s, 7 tests
[junit4:junit4] 
[junit4:junit4] Suite: org.apache.lucene.search.TestComplexExplanations
[junit4:junit4] Completed on J1 in 11.63s, 22 tests
[junit4:junit4] 
[junit4:junit4] Suite: org.apache.lucene.index.TestSnapshotDeletionPolicy
[junit4:junit4] Completed on J2 in 2.54s, 8 tests
[junit4:junit4] 
[junit4:junit4] Suite: org.apache.lucene.util.TestIntsRef
[junit4:junit4] Completed on J2 in 0.15s, 2 tests
[junit4:junit4] 
[junit4:junit4] Suite: org.apache.lucene.search.spans.TestBasics
[junit4:junit4] Completed on J7 in 18.67s, 24 tests
[junit4:junit4] 
[junit4:junit4] Suite: org.apache.lucene.search.TestDocBoost
[junit4:junit4] Completed on J7 in 0.29s, 1 test
[junit4:junit4] 
[junit4:junit4] Suite: org.apache.lucene.index.TestDocumentsWriterDeleteQueue
[junit4:junit4] Completed on J1 in 1.72s, 5 tests
[junit4:junit4] 
[junit4:junit4] Suite: org.apache.lucene.search.TestSubScorerFreqs
[junit4:junit4] Completed on J1 in 0.43s, 3 tests
[junit4:junit4] 
[junit4:junit4] Suite: org.apache.lucene.store.TestLockFactory
[junit4:junit4] IGNOR/A 0.24s J2 | TestLockFactory.testStressLocks
[junit4:junit4]    > Assumption #1: 'nightly' test group is disabled (@Nightly)
[junit4:junit4] IGNOR/A 0.02s J2 | TestLockFactory.testStressLocksNativeFSLockFactory
[junit4:junit4]    > Assumption #1: 'nightly' test group is disabled (@Nightly)
[junit4:junit4] Completed on J2 in 1.74s, 11 tests, 2 skipped
[junit4:junit4] 
[junit4:junit4] Suite: org.apache.lucene.util.junitcompat.TestExceptionInBeforeClassHooks
[junit4:junit4] Completed on J2 in 0.89s, 3 tests
[junit4:junit4] 
[junit4:junit4] Suite: org.apache.lucene.index.TestStressIndexing
[junit4:junit4] Completed on J7 in 2.27s, 1 test
[junit4:junit4] 
[junit4:junit4] Suite: org.apache.lucene.index.TestCompoundFile
[junit4:junit4] Completed on J5 in 6.49s, 18 tests
[junit4:junit4] 
[junit4:junit4] Suite: org.apache.lucene.util.TestDoubleBarrelLRUCache
[junit4:junit4] Completed on J7 in 1.39s, 2 tests
[junit4:junit4] 
[junit4:junit4] Suite: org.apache.lucene.index.TestParallelCompositeReader
[junit4:junit4] Completed on J1 in 4.40s, 8 tests
[junit4:junit4] 
[junit4:junit4] Suite: org.apache.lucene.search.TestScorerPerf
[junit4:junit4] Completed on J2 in 4.24s, 1 test
[junit4:junit4] 
[junit4:junit4] Suite: org.apache.lucene.util.junitcompat.TestSameRandomnessLocalePassedOrNot
[junit4:junit4] Completed on J2 in 0.37s, 1 test
[junit4:junit4] 
[junit4:junit4] Suite: org.apache.lucene.document.TestField
[junit4:junit4] Completed on J2 in 0.67s, 24 tests
[junit4:junit4] 
[junit4:junit4] Suite: org.apache.lucene.index.TestIndexWriterOnDiskFull
[junit4:junit4] Completed on J6 in 10.72s, 4 tests
[junit4:junit4] 
[junit4:junit4] Suite: org.apache.lucene.util.TestVirtualMethod
[junit4:junit4] Completed on J6 in 0.25s, 2 tests
[junit4:junit4] 
[junit4:junit4] Suite: org.apache.lucene.store.TestNRTCachingDirectory
[junit4:junit4] Completed on J0 in 11.94s, 5 tests
[junit4:junit4] 
[junit4:junit4] Suite: org.apache.lucene.TestSearch
[junit4:junit4] Completed on J6 in 0.56s, 2 tests
[junit4:junit4] 
[junit4:junit4] Suite: org.apache.lucene.search.TestBooleanQueryVisitSubscorers
[junit4:junit4] Completed on J6 in 0.68s, 3 tests
[junit4:junit4] 
[junit4:junit4] Suite: org.apache.lucene.index.TestIndexWriterDelete
[junit4:junit4] IGNOR/A 0.21s J3 | TestIndexWriterDelete.testApplyDeletesOnFlush
[junit4:junit4]    > Assumption #1: 'nightly' test group is disabled (@Nightly)
[junit4:junit4] Completed on J3 in 13.87s, 20 tests, 1 skipped
[junit4:junit4] 
[junit4:junit4] Suite: org.apache.lucene.index.TestFieldInfos
[junit4:junit4] Completed on J6 in 0.31s, 2 tests
[junit4:junit4] 
[junit4:junit4] Suite: org.apache.lucene.search.payloads.TestPayloadNearQuery
[junit4:junit4] Completed on J0 in 1.88s, 7 tests
[junit4:junit4] 
[junit4:junit4] Suite: org.apache.lucene.index.TestNorms
[junit4:junit4] Completed on J4 in 32.59s, 3 tests
[junit4:junit4] 
[junit4:junit4] Suite: org.apache.lucene.util.TestRollingBuffer
[junit4:junit4] Completed on J6 in 3.19s, 1 test
[junit4:junit4] 
[junit4:junit4] Suite: org.apache.lucene.index.TestDirectoryReader
[junit4:junit4] Completed on J7 in 9.47s, 23 tests
[junit4:junit4] 
[junit4:junit4] Suite: org.apache.lucene.util.TestFixedBitSet
[junit4:junit4] Completed on J2 in 6.86s, 5 tests
[junit4:junit4] 
[junit4:junit4] Suite: org.apache.lucene.search.TestPhrasePrefixQuery
[junit4:junit4] Completed on J2 in 0.27s, 1 test
[junit4:junit4] 
[junit4:junit4] Suite: org.apache.lucene.store.TestRAMDirectory
[junit4:junit4] Completed on J4 in 3.22s, 4 tests
[junit4:junit4] 
[junit4:junit4] Suite: org.apache.lucene.search.TestCustomSearcherSort
[junit4:junit4] Completed on J0 in 6.76s, 2 tests
[junit4:junit4] 
[junit4:junit4] Suite: org.apache.lucene.search.spans.TestSpanSearchEquivalence
[junit4:junit4] Completed on J2 in 2.54s, 8 tests
[junit4:junit4] 
[junit4:junit4] Suite: org.apache.lucene.index.TestIndexWriterCommit
[junit4:junit4] Completed on J1 in 12.82s, 12 tests
[junit4:junit4] 
[junit4:junit4] Suite: org.apache.lucene.store.TestMockDirectoryWrapper
[junit4:junit4] Completed on J1 in 0.16s, 2 tests
[junit4:junit4] 
[junit4:junit4] Suite: org.apache.lucene.analysis.tokenattributes.TestSimpleAttributeImpl
[junit4:junit4] Completed on J1 in 0.14s, 1 test
[junit4:junit4] 
[junit4:junit4] Suite: org.apache.lucene.codecs.lucene40.TestReuseDocsEnum
[junit4:junit4] Completed on J4 in 2.85s, 3 tests
[junit4:junit4] 
[junit4:junit4] Suite: org.apache.lucene.search.TestPrefixFilter
[junit4:junit4] Completed on J4 in 0.29s, 1 test
[junit4:junit4] 
[junit4:junit4] Suite: org.apache.lucene.index.TestIndexWriterConfig
[junit4:junit4] Completed on J4 in 0.62s, 9 tests
[junit4:junit4] 
[junit4:junit4] Suite: org.apache.lucene.search.TestFuzzyQuery
[junit4:junit4] Completed on J1 in 2.85s, 6 tests
[junit4:junit4] 
[junit4:junit4] Suite: org.apache.lucene.util.TestOpenBitSet
[junit4:junit4] Completed on J3 in 11.39s, 4 tests
[junit4:junit4] 
[junit4:junit4] Suite: org.apache.lucene.analysis.TestMockCharFilter
[junit4:junit4] Completed on J3 in 0.11s, 1 test
[junit4:junit4] 
[junit4:junit4] Suite: org.apache.lucene.search.TestElevationComparator
[junit4:junit4] Completed on J3 in 0.38s, 1 test
[junit4:junit4] 
[junit4:junit4] Suite: org.apache.lucene.index.TestUniqueTermCount
[junit4:junit4] Completed on J1 in 1.38s, 1 test
[junit4:junit4] 
[junit4:junit4] Suite: org.apache.lucene.search.TestExplanations
[junit4:junit4] Completed on J1 in 0.12s, 1 test
[junit4:junit4] 
[junit4:junit4] Suite: org.apache.lucene.index.TestRandomStoredFields
[junit4:junit4] Completed on J2 in 5.96s, 1 test
[junit4:junit4] 
[junit4:junit4] Suite: org.apache.lucene.search.TestRegexpRandom2
[junit4:junit4] Completed on J5 in 22.41s, 1 test
[junit4:junit4] 
[junit4:junit4] Suite: org.apache.lucene.index.TestParallelTermEnum
[junit4:junit4] Completed on J5 in 0.56s, 1 test
[junit4:junit4] 
[junit4:junit4] Suite: org.apache.lucene.index.TestDocsAndPositions
[junit4:junit4] Completed on J3 in 3.48s, 6 tests
[junit4:junit4] 
[junit4:junit4] Suite: org.apache.lucene.util.TestByteBlockPool
[junit4:junit4] Completed on J5 in 0.60s, 1 test
[junit4:junit4] 
[junit4:junit4] Suite: org.apache.lucene.search.TestWildcardRandom
[junit4:junit4] Completed on J5 in 1.51s, 1 test
[junit4:junit4] 
[junit4:junit4] Suite: org.apache.lucene.util.TestFieldCacheSanityChecker
[junit4:junit4] Completed on J3 in 3.82s, 3 tests
[junit4:junit4] 
[junit4:junit4] Suite: org.apache.lucene.util.automaton.TestDeterminism
[junit4:junit4] Completed on J5 in 2.57s, 2 tests
[junit4:junit4] 
[junit4:junit4] Suite: org.apache.lucene.search.TestTermRangeFilter
[junit4:junit4] Completed on J3 in 1.20s, 3 tests
[junit4:junit4] 
[junit4:junit4] Suite: org.apache.lucene.search.TestFieldCacheTermsFilter
[junit4:junit4] Completed on J5 in 0.38s, 1 test
[junit4:junit4] 
[junit4:junit4] Suite: org.apache.lucene.util.junitcompat.TestCodecReported
[junit4:junit4] Completed on J3 in 0.27s, 1 test
[junit4:junit4] 
[junit4:junit4] Suite: org.apache.lucene.search.TestTopDocsMerge
[junit4:junit4] Completed on J6 in 17.55s, 1 test
[junit4:junit4] 
[junit4:junit4] Suite: org.apache.lucene.util.junitcompat.TestLeaveFilesIfTestFails
[junit4:junit4] Completed on J5 in 0.26s, 1 test
[junit4:junit4] 
[junit4:junit4] Suite: org.apache.lucene.index.TestConcurrentMergeScheduler
[junit4:junit4] Completed on J0 in 13.99s, 4 tests
[junit4:junit4] 
[junit4:junit4] Suite: org.apache.lucene.index.TestSegmentTermEnum
[junit4:junit4] Completed on J0 in 0.25s, 2 tests
[junit4:junit4] 
[junit4:junit4] Suite: org.apache.lucene.document.TestDocument
[junit4:junit4] Completed on J5 in 0.66s, 11 tests
[junit4:junit4] 
[junit4:junit4] Suite: org.apache.lucene.codecs.lucene40.TestAllFilesHaveCodecHeader
[junit4:junit4] Completed on J0 in 0.50s, 1 test
[junit4:junit4] 
[junit4:junit4] Suite: org.apache.lucene.search.TestAutomatonQuery
[junit4:junit4] Completed on J3 in 1.14s, 6 tests
[junit4:junit4] 
[junit4:junit4] Suite: org.apache.lucene.analysis.TestCachingTokenFilter
[junit4:junit4] Completed on J0 in 0.16s, 1 test
[junit4:junit4] 
[junit4:junit4] Suite: org.apache.lucene.util.junitcompat.TestBeforeAfterOverrides
[junit4:junit4] Completed on J0 in 0.28s, 2 tests
[junit4:junit4] 
[junit4:junit4] Suite: org.apache.lucene.util.junitcompat.TestSetupTeardownChaining
[junit4:junit4] Completed on J3 in 0.23s, 2 tests
[junit4:junit4] 
[junit4:junit4] Suite: org.apache.lucene.store.TestWindowsMMap
[junit4:junit4] Completed on J5 in 1.80s, 1 test
[junit4:junit4] 
[junit4:junit4] Suite: org.apache.lucene.util.automaton.TestSpecialOperations
[junit4:junit4] Completed on J6 in 4.79s, 2 tests
[junit4:junit4] 
[junit4:junit4] Suite: org.apache.lucene.search.TestTimeLimitingCollector
[junit4:junit4] Completed on J2 in 13.39s, 6 tests
[junit4:junit4] 
[junit4:junit4] Suite: org.apache.lucene.index.TestTwoPhaseCommitTool
[junit4:junit4] Completed on J6 in 0.78s, 4 tests
[junit4:junit4] 
[junit4:junit4] Suite: org.apache.lucene.util.junitcompat.TestSeedFromUncaught
[junit4:junit4] Completed on J6 in 0.33s, 1 test
[junit4:junit4] 
[junit4:junit4] Suite: org.apache.lucene.TestAssertions
[junit4:junit4] Completed on J6 in 0.19s, 1 test
[junit4:junit4] 
[junit4:junit4] Suite: org.apache.lucene.index.TestThreadedForceMerge
[junit4:junit4] Completed on J5 in 4.30s, 1 test
[junit4:junit4] 
[junit4:junit4] Suite: org.apache.lucene.util.TestIdentityHashSet
[junit4:junit4] Completed on J6 in 1.36s, 1 test
[junit4:junit4] 
[junit4:junit4] Suite: org.apache.lucene.search.TestTermRangeQuery
[junit4:junit4] Completed on J5 in 0.90s, 7 tests
[junit4:junit4] 
[junit4:junit4] Suite: org.apache.lucene.index.TestTermVectorsReader
[junit4:junit4] Completed on J6 in 0.82s, 6 tests
[junit4:junit4] 
[junit4:junit4] Suite: org.apache.lucene.search.TestSimilarityProvider
[junit4:junit4] Completed on J6 in 0.31s, 1 test
[junit4:junit4] 
[junit4:junit4] Suite: org.apache.lucene.search.TestSort
[junit4:junit4] Completed on J7 in 26.43s, 25 tests
[junit4:junit4] 
[junit4:junit4] Suite: org.apache.lucene.index.TestIndexWriterWithThreads
[junit4:junit4] Completed on J0 in 9.65s, 12 tests
[junit4:junit4] 
[junit4:junit4] Suite: org.apache.lucene.search.TestMultiThreadTermVectors
[junit4:junit4] Completed on J7 in 3.34s, 1 test
[junit4:junit4] 
[junit4:junit4] Suite: org.apache.lucene.index.TestIndexWriterMergePolicy
[junit4:junit4] Completed on J1 in 28.33s, 7 tests
[junit4:junit4] 
[junit4:junit4] Suite: org.apache.lucene.index.TestDirectoryReaderReopen
[junit4:junit4] Completed on J6 in 12.05s, 5 tests
[junit4:junit4] 
[junit4:junit4] Suite: org.apache.lucene.search.MultiCollectorTest
[junit4:junit4] Completed on J6 in 0.16s, 3 tests
[junit4:junit4] 
[junit4:junit4] Suite: org.apache.lucene.store.TestMultiMMap
[junit4:junit4] Completed on J4 in 33.36s, 11 tests
[junit4:junit4] 
[junit4:junit4] Suite: org.apache.lucene.search.TestShardSearching
[junit4:junit4] Completed on J7 in 12.27s, 1 test
[junit4:junit4] 
[junit4:junit4] Suite: org.apache.lucene.search.spans.TestSpans
[junit4:junit4] Completed on J4 in 2.62s, 25 tests
[junit4:junit4] 
[junit4:junit4] Suite: org.apache.lucene.util.TestWeakIdentityMap
[junit4:junit4] Completed on J4 in 5.11s, 2 tests
[junit4:junit4] 
[junit4:junit4] Suite: org.apache.lucene.analysis.TestGraphTokenizers
[junit4:junit4] Completed on J3 in 30.90s, 21 tests
[junit4:junit4] 
[junit4:junit4] Suite: org.apache.lucene.util.TestAttributeSource
[junit4:junit4] Completed on J3 in 0.26s, 5 tests
[junit4:junit4] 
[junit4:junit4] Suite: org.apache.lucene.index.Test2BDocs
[junit4:junit4] Completed on J1 in 15.65s, 2 tests
[junit4:junit4] 
[junit4:junit4] Suite: org.apache.lucene.search.TestFieldCache
[junit4:junit4] Completed on J4 in 6.92s, 5 tests
[junit4:junit4] 
[junit4:junit4] Suite: org.apache.lucene.analysis.TestLookaheadTokenFilter
[junit4:junit4] Completed on J0 in 26.09s, 2 tests
[junit4:junit4] 
[junit4:junit4] Suite: org.apache.lucene.util.junitcompat.TestFailIfDirectoryNotClosed
[junit4:junit4] Completed on J4 in 0.30s, 1 test
[junit4:junit4] 
[junit4:junit4] Suite: org.apache.lucene.TestDemo
[junit4:junit4] Completed on J4 in 0.17s, 1 test
[junit4:junit4] 
[junit4:junit4] Suite: org.apache.lucene.index.TestMultiFields
[junit4:junit4] Completed on J1 in 2.51s, 3 tests
[junit4:junit4] 
[junit4:junit4] Suite: org.apache.lucene.store.TestFileSwitchDirectory
[junit4:junit4] Completed on J4 in 0.43s, 4 tests
[junit4:junit4] 
[junit4:junit4] Suite: org.apache.lucene.search.TestConstantScoreQuery
[junit4:junit4] Completed on J1 in 0.33s, 3 tests
[junit4:junit4] 
[junit4:junit4] Suite: org.apache.lucene.index.TestNoDeletionPolicy
[junit4:junit4] Completed on J1 in 0.57s, 4 tests
[junit4:junit4] 
[junit4:junit4] Suite: org.apache.lucene.index.TestPostingsOffsets
[junit4:junit4] Completed on J3 in 8.06s, 11 tests
[junit4:junit4] 
[junit4:junit4] Suite: org.apache.lucene.search.TestDisjunctionMaxQuery
[junit4:junit4] Completed on J4 in 3.81s, 10 tests
[junit4:junit4] 
[junit4:junit4] Suite: org.apache.lucene.util.fst.TestFSTs
[junit4:junit4] IGNOR/A 0.01s J2 | TestFSTs.testBigSet
[junit4:junit4]    > Assumption #1: 'nightly' test group is disabled (@Nightly)
[junit4:junit4] Completed on J2 in 37.27s, 17 tests, 1 skipped
[junit4:junit4] 
[junit4:junit4] Suite: org.apache.lucene.search.TestSearcherManager
[junit4:junit4] Completed on J0 in 5.76s, 6 tests
[junit4:junit4] 
[junit4:junit4] Suite: org.apache.lucene.search.TestQueryWrapperFilter
[junit4:junit4] Completed on J4 in 2.29s, 3 tests
[junit4:junit4] 
[junit4:junit4] Suite: org.apache.lucene.index.TestDocTermOrds
[junit4:junit4] Completed on J4 in 1.12s, 3 tests
[junit4:junit4] 
[junit4:junit4] Suite: org.apache.lucene.search.TestNot
[junit4:junit4] Completed on J4 in 0.14s, 1 test
[junit4:junit4] 
[junit4:junit4] Suite: org.apache.lucene.index.TestIndexWriterReader
[junit4:junit4] Completed on J5 in 37.99s, 20 tests
[junit4:junit4] 
[junit4:junit4] Suite: org.apache.lucene.index.TestIndexWriterNRTIsCurrent
[junit4:junit4] Completed on J1 in 7.04s, 1 test
[junit4:junit4] 
[junit4:junit4] Suite: org.apache.lucene.index.TestIndexWriterExceptions
[junit4:junit4] Completed on J6 in 29.77s, 25 tests
[junit4:junit4] 
[junit4:junit4] Suite: org.apache.lucene.index.TestByteSlices
[junit4:junit4] Completed on J4 in 6.29s, 1 test
[junit4:junit4] 
[junit4:junit4] Suite: org.apache.lucene.search.TestPhraseQuery
[junit4:junit4] Completed on J3 in 11.75s, 17 tests
[junit4:junit4] 
[junit4:junit4] Suite: org.apache.lucene.search.TestBoolean2
[junit4:junit4] Completed on J7 in 28.16s, 11 tests
[junit4:junit4] 
[junit4:junit4] Suite: org.apache.lucene.index.TestNRTThreads
[junit4:junit4] Completed on J0 in 8.89s, 1 test
[junit4:junit4] 
[junit4:junit4] Suite: org.apache.lucene.index.TestFlex
[junit4:junit4] Completed on J7 in 0.59s, 2 tests
[junit4:junit4] 
[junit4:junit4] Suite: org.apache.lucene.search.TestBooleanScorer
[junit4:junit4] Completed on J7 in 0.20s, 3 tests
[junit4:junit4] 
[junit4:junit4] Suite: org.apache.lucene.search.TestRegexpQuery
[junit4:junit4] Completed on J7 in 0.47s, 7 tests
[junit4:junit4] 
[junit4:junit4] Suite: org.apache.lucene.search.TestCachingWrapperFilter
[junit4:junit4] Completed on J7 in 0.38s, 5 tests
[junit4:junit4] 
[junit4:junit4] Suite: org.apache.lucene.index.TestCrashCausesCorruptIndex
[junit4:junit4] Completed on J3 in 2.62s, 1 test
[junit4:junit4] 
[junit4:junit4] Suite: org.apache.lucene.search.TestBooleanQuery
[junit4:junit4] Completed on J3 in 0.61s, 5 tests
[junit4:junit4] 
[junit4:junit4] Suite: org.apache.lucene.index.TestDeletionPolicy
[junit4:junit4] Completed on J6 in 5.92s, 6 tests
[junit4:junit4] 
[junit4:junit4] Suite: org.apache.lucene.index.TestTermsEnum
[junit4:junit4] Completed on J0 in 6.26s, 7 tests
[junit4:junit4] 
[junit4:junit4] Suite: org.apache.lucene.index.TestAtomicUpdate
[junit4:junit4] Completed on J4 in 6.86s, 1 test
[junit4:junit4] 
[junit4:junit4] Suite: org.apache.lucene.search.TestNumericRangeQuery32
[junit4:junit4] Completed on J2 in 16.72s, 27 tests
[junit4:junit4] 
[junit4:junit4] Suite: org.apache.lucene.index.TestDuelingCodecs
[junit4:junit4] Completed on J1 in 16.60s, 1 test
[junit4:junit4] 
[junit4:junit4] Suite: org.apache.lucene.index.TestNeverDelete
[junit4:junit4] Completed on J0 in 4.43s, 1 test
[junit4:junit4] 
[junit4:junit4] Suite: org.apache.lucene.search.TestNumericRangeQuery64
[junit4:junit4] Completed on J5 in 18.39s, 34 tests
[junit4:junit4] 
[junit4:junit4] Suite: org.apache.lucene.index.TestFlushByRamOrCountsPolicy
[junit4:junit4] Completed on J4 in 6.77s, 5 tests
[junit4:junit4] 
[junit4:junit4] Suite: org.apache.lucene.search.TestSearchAfter
[junit4:junit4] Completed on J2 in 8.02s, 1 test
[junit4:junit4] 
[junit4:junit4] Suite: org.apache.lucene.index.TestPersistentSnapshotDeletionPolicy
[junit4:junit4] Completed on J5 in 4.14s, 14 tests
[junit4:junit4] 
[junit4:junit4] Suite: org.apache.lucene.search.TestNRTManager
[junit4:junit4] Completed on J4 in 4.72s, 3 tests
[junit4:junit4] 
[junit4:junit4] Suite: org.apache.lucene.index.TestIndexWriterMerging
[junit4:junit4] Completed on J6 in 14.67s, 6 tests
[junit4:junit4] 
[junit4:junit4] Suite: org.apache.lucene.search.TestBooleanOr
[junit4:junit4] Completed on J7 in 19.78s, 6 tests
[junit4:junit4] 
[junit4:junit4] Suite: org.apache.lucene.search.TestSearchWithThreads
[junit4:junit4] Completed on J4 in 3.25s, 1 test
[junit4:junit4] 
[junit4:junit4] Suite: org.apache.lucene.index.TestIndexWriterUnicode
[junit4:junit4] Completed on J2 in 6.96s, 5 tests
[junit4:junit4] 
[junit4:junit4] Suite: org.apache.lucene.search.TestSloppyPhraseQuery
[junit4:junit4] Completed on J0 in 12.28s, 9 tests
[junit4:junit4] 
[junit4:junit4] Suite: org.apache.lucene.util.automaton.TestMinimize
[junit4:junit4] Completed on J1 in 13.31s, 3 tests
[junit4:junit4] 
[junit4:junit4] Suite: org.apache.lucene.util.TestArrayUtil
[junit4:junit4] Completed on J5 in 7.94s, 11 tests
[junit4:junit4] 
[junit4:junit4] Suite: org.apache.lucene.store.TestBufferedIndexInput
[junit4:junit4] Completed on J6 in 4.86s, 4 tests
[junit4:junit4] 
[junit4:junit4] Suite: org.apache.lucene.index.TestIndexWriter
[junit4:junit4] Completed on J3 in 22.37s, 51 tests
[junit4:junit4] 
[junit4:junit4] Suite: org.apache.lucene.index.TestIndexWriterForceMerge
[junit4:junit4] Completed on J7 in 5.42s, 4 tests
[junit4:junit4] 
[junit4:junit4] Suite: org.apache.lucene.index.TestCustomNorms
[junit4:junit4] Completed on J6 in 2.85s, 3 tests
[junit4:junit4] 
[junit4:junit4] Suite: org.apache.lucene.analysis.TestToken
[junit4:junit4] Completed on J0 in 5.05s, 10 tests
[junit4:junit4] 
[junit4:junit4] Suite: org.apache.lucene.index.TestDocumentsWriterStallControl
[junit4:junit4] Completed on J7 in 1.93s, 3 tests
[junit4:junit4] 
[junit4:junit4] Suite: org.apache.lucene.index.TestLongPostings
[junit4:junit4] Completed on J2 in 6.18s, 2 tests
[junit4:junit4] 
[junit4:junit4] Suite: org.apache.lucene.index.TestNRTReaderWithThreads
[junit4:junit4] Completed on J6 in 2.71s, 1 test
[junit4:junit4] 
[junit4:junit4] Suite: org.apache.lucene.analysis.TestMockAnalyzer
[junit4:junit4] Completed on J3 in 4.29s, 9 tests
[junit4:junit4] 
[junit4:junit4] Suite: org.apache.lucene.util.TestCollectionUtil
[junit4:junit4] Completed on J4 in 8.28s, 5 tests
[junit4:junit4] 
[junit4:junit4] Suite: org.apache.lucene.store.TestHugeRamFile
[junit4:junit4] Completed on J7 in 3.72s, 1 test
[junit4:junit4] 
[junit4:junit4] Suite: org.apache.lucene.search.TestSimpleExplanations
[junit4:junit4] Completed on J5 in 8.63s, 69 tests
[junit4:junit4] 
[junit4:junit4] Suite: org.apache.lucene.search.TestSloppyPhraseQuery2
[junit4:junit4] Completed on J2 in 4.48s, 9 tests
[junit4:junit4] 
[junit4:junit4] Suite: org.apache.lucene.index.TestConsistentFieldNumbers
[junit4:junit4] Completed on J3 in 3.40s, 4 tests
[junit4:junit4] 
[junit4:junit4] Suite: org.apache.lucene.index.TestDocValuesIndexing
[junit4:junit4] Completed on J0 in 5.15s, 16 tests
[junit4:junit4] 
[junit4:junit4] Suite: org.apache.lucene.index.TestStressNRT
[junit4:junit4] Completed on J6 in 4.66s, 1 test
[junit4:junit4] 
[junit4:junit4] Suite: org.apache.lucene.util.TestNumericUtils
[junit4:junit4] Completed on J5 in 3.53s, 12 tests
[junit4:junit4] 
[junit4:junit4] Suite: org.apache.lucene.codecs.lucene40.values.TestDocValues
[junit4:junit4] Completed on J7 in 4.16s, 14 tests
[junit4:junit4] 
[junit4:junit4] Suite: org.apache.lucene.search.TestMultiValuedNumericRangeQuery
[junit4:junit4] Completed on J3 in 5.23s, 1 test
[junit4:junit4] 
[junit4:junit4] Suite: org.apache.lucene.search.TestFieldCacheRewriteMethod
[junit4:junit4] Completed on J4 in 8.34s, 1 test
[junit4:junit4] 
[junit4:junit4] Suite: org.apache.lucene.analysis.tokenattributes.TestCharTermAttributeImpl
[junit4:junit4] Completed on J0 in 4.88s, 12 tests
[junit4:junit4] 
[junit4:junit4] Suite: org.apache.lucene.index.TestTransactions
[junit4:junit4] Completed on J4 in 1.14s, 1 test
[junit4:junit4] 
[junit4:junit4] Suite: org.apache.lucene.index.TestSegmentMerger
[junit4:junit4] Completed on J7 in 3.88s, 3 tests
[junit4:junit4] 
[junit4:junit4] Suite: org.apache.lucene.index.TestRollingUpdates
[junit4:junit4]   2> NOTE: reproduce with: ant test  -Dtestcase=TestRollingUpdates -Dtests.method=testRollingUpdates -Dtests.seed=4772D4F6A3BA7709 -Dtests.slow=true -Dtests.locale=sk_SK -Dtests.timezone=Europe/Tiraspol -Dtests.file.encoding=UTF-8
[junit4:junit4] FAILURE 2.61s J5 | TestRollingUpdates.testRollingUpdates <<<
[junit4:junit4]    > Throwable #1: java.lang.AssertionError: expected:<134693> but was:<134218>
[junit4:junit4]    > 	at __randomizedtesting.SeedInfo.seed([4772D4F6A3BA7709:C989D58F1024D2C2]:0)
[junit4:junit4]    > 	at org.junit.Assert.fail(Assert.java:93)
[junit4:junit4]    > 	at org.junit.Assert.failNotEquals(Assert.java:647)
[junit4:junit4]    > 	at org.junit.Assert.assertEquals(Assert.java:128)
[junit4:junit4]    > 	at org.junit.Assert.assertEquals(Assert.java:472)
[junit4:junit4]    > 	at org.junit.Assert.assertEquals(Assert.java:456)
[junit4:junit4]    > 	at org.apache.lucene.index.TestRollingUpdates.testRollingUpdates(TestRollingUpdates.java:150)
[junit4:junit4]    > 	at sun.reflect.NativeMethodAccessorImpl.invoke0(Native Method)
[junit4:junit4]    > 	at sun.reflect.NativeMethodAccessorImpl.invoke(NativeMethodAccessorImpl.java:57)
[junit4:junit4]    > 	at sun.reflect.DelegatingMethodAccessorImpl.invoke(DelegatingMethodAccessorImpl.java:43)
[junit4:junit4]    > 	at java.lang.reflect.Method.invoke(Method.java:601)
[junit4:junit4]    > 	at com.carrotsearch.randomizedtesting.RandomizedRunner.invoke(RandomizedRunner.java:1559)
[junit4:junit4]    > 	at com.carrotsearch.randomizedtesting.RandomizedRunner.access$600(RandomizedRunner.java:79)
[junit4:junit4]    > 	at com.carrotsearch.randomizedtesting.RandomizedRunner$6.evaluate(RandomizedRunner.java:737)
[junit4:junit4]    > 	at com.carrotsearch.randomizedtesting.RandomizedRunner$7.evaluate(RandomizedRunner.java:773)
[junit4:junit4]    > 	at com.carrotsearch.randomizedtesting.RandomizedRunner$8.evaluate(RandomizedRunner.java:787)
[junit4:junit4]    > 	at org.apache.lucene.util.TestRuleSetupTeardownChained$1.evaluate(TestRuleSetupTeardownChained.java:50)
[junit4:junit4]    > 	at org.apache.lucene.util.TestRuleFieldCacheSanity$1.evaluate(TestRuleFieldCacheSanity.java:51)
[junit4:junit4]    > 	at org.apache.lucene.util.AbstractBeforeAfterRule$1.evaluate(AbstractBeforeAfterRule.java:45)
[junit4:junit4]    > 	at com.carrotsearch.randomizedtesting.rules.SystemPropertiesInvariantRule$1.evaluate(SystemPropertiesInvariantRule.java:55)
[junit4:junit4]    > 	at org.apache.lucene.util.TestRuleThreadAndTestName$1.evaluate(TestRuleThreadAndTestName.java:48)
[junit4:junit4]    > 	at org.apache.lucene.util.TestRuleIgnoreAfterMaxFailures$1.evaluate(TestRuleIgnoreAfterMaxFailures.java:70)
[junit4:junit4]    > 	at org.apache.lucene.util.TestRuleMarkFailure$1.evaluate(TestRuleMarkFailure.java:48)
[junit4:junit4]    > 	at com.carrotsearch.randomizedtesting.rules.StatementAdapter.evaluate(StatementAdapter.java:36)
[junit4:junit4]    > 	at com.carrotsearch.randomizedtesting.ThreadLeakControl$StatementRunner.run(ThreadLeakControl.java:358)
[junit4:junit4]    > 	at com.carrotsearch.randomizedtesting.ThreadLeakControl.forkTimeoutingTask(ThreadLeakControl.java:782)
[junit4:junit4]    > 	at com.carrotsearch.randomizedtesting.ThreadLeakControl$3.evaluate(ThreadLeakControl.java:442)
[junit4:junit4]    > 	at com.carrotsearch.randomizedtesting.RandomizedRunner.runSingleTest(RandomizedRunner.java:746)
[junit4:junit4]    > 	at com.carrotsearch.randomizedtesting.RandomizedRunner$3.evaluate(RandomizedRunner.java:648)
[junit4:junit4]    > 	at com.carrotsearch.randomizedtesting.RandomizedRunner$4.evaluate(RandomizedRunner.java:682)
[junit4:junit4]    > 	at com.carrotsearch.randomizedtesting.RandomizedRunner$5.evaluate(RandomizedRunner.java:693)
[junit4:junit4]    > 	at org.apache.lucene.util.AbstractBeforeAfterRule$1.evaluate(AbstractBeforeAfterRule.java:45)
[junit4:junit4]    > 	at org.apache.lucene.util.TestRuleStoreClassName$1.evaluate(TestRuleStoreClassName.java:42)
[junit4:junit4]    > 	at com.carrotsearch.randomizedtesting.rules.SystemPropertiesInvariantRule$1.evaluate(SystemPropertiesInvariantRule.java:55)
[junit4:junit4]    > 	at com.carrotsearch.randomizedtesting.rules.NoShadowingOrOverridesOnMethodsRule$1.evaluate(NoShadowingOrOverridesOnMethodsRule.java:39)
[junit4:junit4]    > 	at com.carrotsearch.randomizedtesting.rules.NoShadowingOrOverridesOnMethodsRule$1.evaluate(NoShadowingOrOverridesOnMethodsRule.java:39)
[junit4:junit4]    > 	at com.carrotsearch.randomizedtesting.rules.StatementAdapter.evaluate(StatementAdapter.java:36)
[junit4:junit4]    > 	at org.apache.lucene.util.TestRuleAssertionsRequired$1.evaluate(TestRuleAssertionsRequired.java:43)
[junit4:junit4]    > 	at org.apache.lucene.util.TestRuleMarkFailure$1.evaluate(TestRuleMarkFailure.java:48)
[junit4:junit4]    > 	at org.apache.lucene.util.TestRuleIgnoreAfterMaxFailures$1.evaluate(TestRuleIgnoreAfterMaxFailures.java:70)
[junit4:junit4]    > 	at org.apache.lucene.util.TestRuleIgnoreTestSuites$1.evaluate(TestRuleIgnoreTestSuites.java:55)
[junit4:junit4]    > 	at com.carrotsearch.randomizedtesting.rules.StatementAdapter.evaluate(StatementAdapter.java:36)
[junit4:junit4]    > 	at com.carrotsearch.randomizedtesting.ThreadLeakControl$StatementRunner.run(ThreadLeakControl.java:358)
[junit4:junit4]    > 	at java.lang.Thread.run(Thread.java:722)
[junit4:junit4]   2> NOTE: test params are: codec=Lucene40: {}, sim=RandomSimilarityProvider(queryNorm=false,coord=yes): {body=IB LL-D2, titleTokenized=DFR I(ne)3(800.0)}, locale=sk_SK, timezone=Europe/Tiraspol
[junit4:junit4]   2> NOTE: Linux 3.2.0-26-generic amd64/Oracle Corporation 1.7.0_05 (64-bit)/cpus=8,threads=1,free=45176600,total=152043520
[junit4:junit4]   2> NOTE: All tests run in this JVM: [TestTerm, TestByteArrayDataInput, TestForceMergeForever, TestIndexWriterOnJRECrash, TestStressAdvance, TestPagedBytes, TestCompoundFile, TestRegexpRandom2, TestParallelTermEnum, TestByteBlockPool, TestWildcardRandom, TestDeterminism, TestFieldCacheTermsFilter, Nested1, TestDocument, TestWindowsMMap, TestThreadedForceMerge, TestTermRangeQuery, TestIndexWriterReader, TestNumericRangeQuery64, TestPersistentSnapshotDeletionPolicy, TestArrayUtil, TestSimpleExplanations, TestNumericUtils, TestRollingUpdates]
[junit4:junit4] Completed on J5 in 4.40s, 2 tests, 1 failure <<< FAILURES!
[junit4:junit4] 
[junit4:junit4] Suite: org.apache.lucene.index.TestFieldsReader
[junit4:junit4] Completed on J6 in 6.39s, 4 tests
[junit4:junit4] 
[junit4:junit4] Suite: org.apache.lucene.search.TestPrefixInBooleanQuery
[junit4:junit4] Completed on J0 in 2.70s, 4 tests
[junit4:junit4] 
[junit4:junit4] Suite: org.apache.lucene.util.automaton.TestLevenshteinAutomata
[junit4:junit4] Completed on J2 in 8.41s, 4 tests
[junit4:junit4] 
[junit4:junit4] Suite: org.apache.lucene.codecs.lucene40.TestBitVector
[junit4:junit4] Completed on J3 in 3.90s, 9 tests
[junit4:junit4] 
[junit4:junit4] Suite: org.apache.lucene.index.TestMixedCodecs
[junit4:junit4] Completed on J2 in 1.96s, 1 test
[junit4:junit4] 
[junit4:junit4] Suite: org.apache.lucene.util.TestRamUsageEstimatorOnWildAnimals
[junit4:junit4] Completed on J7 in 3.37s, 1 test
[junit4:junit4] 
[junit4:junit4] Suite: org.apache.lucene.index.TestCodecs
[junit4:junit4] Completed on J0 in 2.53s, 3 tests
[junit4:junit4] 
[junit4:junit4] Suite: org.apache.lucene.index.TestStressIndexing2
[junit4:junit4] Completed on J3 in 1.94s, 3 tests
[junit4:junit4] 
[junit4:junit4] Suite: org.apache.lucene.search.spans.TestSpanExplanations
[junit4:junit4] Completed on J6 in 4.53s, 31 tests
[junit4:junit4] 
[junit4:junit4] Suite: org.apache.lucene.index.TestIndexInput
[junit4:junit4] Completed on J2 in 1.96s, 3 tests
[junit4:junit4] 
[junit4:junit4] Suite: org.apache.lucene.index.TestLazyProxSkipping
[junit4:junit4] IGNOR/A 0.23s J6 | TestLazyProxSkipping.testLazySkipping
[junit4:junit4]    > Assumption #1: This test cannot run with SimpleText postings format
[junit4:junit4] Completed on J6 in 0.35s, 2 tests, 1 skipped
[junit4:junit4] 
[junit4:junit4] Suite: org.apache.lucene.index.TestTypePromotion
[junit4:junit4] Completed on J1 in 22.57s, 5 tests
[junit4:junit4] 
[junit4:junit4] Suite: org.apache.lucene.index.TestSegmentReader
[junit4:junit4] Completed on J4 in 6.41s, 6 tests
[junit4:junit4] 
[junit4:junit4] Suite: org.apache.lucene.index.TestDoc
[junit4:junit4] Completed on J6 in 0.76s, 1 test
[junit4:junit4] 
[junit4:junit4] Suite: org.apache.lucene.search.TestBooleanMinShouldMatch
[junit4:junit4] Completed on J5 in 6.33s, 17 tests
[junit4:junit4] 
[junit4:junit4] Suite: org.apache.lucene.index.TestCrash
[junit4:junit4] Completed on J7 in 3.07s, 5 tests
[junit4:junit4] 
[junit4:junit4] Suite: org.apache.lucene.TestMergeSchedulerExternal
[junit4:junit4] Completed on J1 in 1.08s, 2 tests
[junit4:junit4] 
[junit4:junit4] Suite: org.apache.lucene.search.similarities.TestSimilarityBase
[junit4:junit4] Completed on J3 in 2.56s, 29 tests
[junit4:junit4] 
[junit4:junit4] Suite: org.apache.lucene.index.TestSegmentTermDocs
[junit4:junit4] Completed on J0 in 3.44s, 5 tests
[junit4:junit4] 
[junit4:junit4] Suite: org.apache.lucene.search.payloads.TestPayloadTermQuery
[junit4:junit4] Completed on J2 in 1.84s, 6 tests
[junit4:junit4] 
[junit4:junit4] Suite: org.apache.lucene.index.TestOmitTf
[junit4:junit4] Completed on J5 in 1.28s, 6 tests
[junit4:junit4] 
[junit4:junit4] Suite: org.apache.lucene.index.TestDocValuesTypeCompatibility
[junit4:junit4] Completed on J6 in 1.90s, 5 tests
[junit4:junit4] 
[junit4:junit4] Suite: org.apache.lucene.store.TestCopyBytes
[junit4:junit4] Completed on J3 in 1.59s, 2 tests
[junit4:junit4] 
[junit4:junit4] Suite: org.apache.lucene.search.TestFilteredQuery
[junit4:junit4] Completed on J0 in 1.31s, 11 tests
[junit4:junit4] 
[junit4:junit4] Suite: org.apache.lucene.search.spans.TestFieldMaskingSpanQuery
[junit4:junit4] IGNOR/A 0.31s J1 | TestFieldMaskingSpanQuery.testSpans2
[junit4:junit4]    > Assumption #1: Broken scoring: LUCENE-3723
[junit4:junit4] IGNOR/A 0.04s J1 | TestFieldMaskingSpanQuery.testSimple2
[junit4:junit4]    > Assumption #1: Broken scoring: LUCENE-3723
[junit4:junit4] Completed on J1 in 2.07s, 11 tests, 2 skipped
[junit4:junit4] 
[junit4:junit4] Suite: org.apache.lucene.search.TestSimpleSearchEquivalence
[junit4:junit4] Completed on J7 in 2.47s, 12 tests
[junit4:junit4] 
[junit4:junit4] Suite: org.apache.lucene.index.TestTermVectorsWriter
[junit4:junit4] Completed on J3 in 0.77s, 13 tests
[junit4:junit4] 
[junit4:junit4] Suite: org.apache.lucene.index.TestDocumentWriter
[junit4:junit4] Completed on J2 in 2.31s, 7 tests
[junit4:junit4] 
[junit4:junit4] Suite: org.apache.lucene.util.TestUnicodeUtil
[junit4:junit4] Completed on J0 in 0.88s, 4 tests
[junit4:junit4] 
[junit4:junit4] Suite: org.apache.lucene.index.TestTermsEnum2
[junit4:junit4] Completed on J4 in 3.94s, 4 tests
[junit4:junit4] 
[junit4:junit4] Suite: org.apache.lucene.search.TestTermVectors
[junit4:junit4] Completed on J6 in 1.51s, 11 tests
[junit4:junit4] 
[junit4:junit4] Suite: org.apache.lucene.index.TestTransactionRollback
[junit4:junit4] Completed on J1 in 0.82s, 2 tests
[junit4:junit4] 
[junit4:junit4] Suite: org.apache.lucene.index.TestForTooMuchCloning
[junit4:junit4] Completed on J7 in 0.80s, 1 test
[junit4:junit4] 
[junit4:junit4] Suite: org.apache.lucene.util.TestSentinelIntSet
[junit4:junit4] Completed on J3 in 0.62s, 2 tests
[junit4:junit4] 
[junit4:junit4] Suite: org.apache.lucene.index.TestMultiLevelSkipList
[junit4:junit4] Completed on J0 in 0.57s, 1 test
[junit4:junit4] 
[junit4:junit4] Suite: org.apache.lucene.index.TestParallelAtomicReader
[junit4:junit4] Completed on J2 in 0.79s, 6 tests
[junit4:junit4] 
[junit4:junit4] Suite: org.apache.lucene.TestExternalCodecs
[junit4:junit4] Completed on J6 in 0.55s, 1 test
[junit4:junit4] 
[junit4:junit4] Suite: org.apache.lucene.util.automaton.TestBasicOperations
[junit4:junit4] Completed on J4 in 1.09s, 8 tests
[junit4:junit4] 
[junit4:junit4] Suite: org.apache.lucene.search.TestRegexpRandom
[junit4:junit4] Completed on J7 in 0.58s, 1 test
[junit4:junit4] 
[junit4:junit4] Suite: org.apache.lucene.index.TestPayloads
[junit4:junit4] Completed on J3 in 0.70s, 7 tests
[junit4:junit4] 
[junit4:junit4] Suite: org.apache.lucene.util.junitcompat.TestSystemPropertiesInvariantRule
[junit4:junit4] Completed on J6 in 0.39s, 5 tests
[junit4:junit4] 
[junit4:junit4] Suite: org.apache.lucene.index.TestPrefixCodedTerms
[junit4:junit4] Completed on J5 in 3.16s, 6 tests
[junit4:junit4] 
[junit4:junit4] Suite: org.apache.lucene.index.TestOmitPositions
[junit4:junit4] Completed on J1 in 1.52s, 4 tests
[junit4:junit4] 
[junit4:junit4] Suite: org.apache.lucene.index.TestSizeBoundedForceMerge
[junit4:junit4] Completed on J7 in 0.41s, 11 tests
[junit4:junit4] 
[junit4:junit4] Suite: org.apache.lucene.search.spans.TestSpansAdvanced2
[junit4:junit4] Completed on J2 in 0.78s, 4 tests
[junit4:junit4] 
[junit4:junit4] Suite: org.apache.lucene.search.spans.TestSpanMultiTermQueryWrapper
[junit4:junit4] Completed on J6 in 0.34s, 4 tests
[junit4:junit4] 
[junit4:junit4] Suite: org.apache.lucene.index.TestDocCount
[junit4:junit4] Completed on J1 in 0.16s, 1 test
[junit4:junit4] 
[junit4:junit4] Suite: org.apache.lucene.util.TestSmallFloat
[junit4:junit4] Completed on J2 in 0.20s, 2 tests
[junit4:junit4] 
[junit4:junit4] Suite: org.apache.lucene.search.spans.TestSpanExplanationsOfNonMatches
[junit4:junit4] Completed on J3 in 0.68s, 31 tests
[junit4:junit4] 
[junit4:junit4] Suite: org.apache.lucene.search.TestWildcard
[junit4:junit4] Completed on J4 in 0.87s, 8 tests
[junit4:junit4] 
[junit4:junit4] Suite: org.apache.lucene.search.TestSimpleExplanationsOfNonMatches
[junit4:junit4] Completed on J0 in 1.47s, 69 tests
[junit4:junit4] 
[junit4:junit4] Suite: org.apache.lucene.index.TestParallelReaderEmptyIndex
[junit4:junit4] Completed on J6 in 0.24s, 2 tests
[junit4:junit4] 
[junit4:junit4] Suite: org.apache.lucene.index.TestSumDocFreq
[junit4:junit4] Completed on J7 in 0.31s, 1 test
[junit4:junit4] 
[junit4:junit4] Suite: org.apache.lucene.search.TestComplexExplanationsOfNonMatches
[junit4:junit4] Completed on J5 in 0.61s, 22 tests
[junit4:junit4] 
[junit4:junit4] Suite: org.apache.lucene.search.TestDocIdSet
[junit4:junit4] Completed on J0 in 0.20s, 3 tests
[junit4:junit4] 
[junit4:junit4] Suite: org.apache.lucene.search.TestTermScorer
[junit4:junit4] Completed on J4 in 0.19s, 3 tests
[junit4:junit4] 
[junit4:junit4] Suite: org.apache.lucene.index.TestIndexFileDeleter
[junit4:junit4] Completed on J1 in 0.26s, 1 test
[junit4:junit4] 
[junit4:junit4] Suite: org.apache.lucene.index.Test2BPostings
[junit4:junit4] IGNOR/A 0.16s J7 | Test2BPostings.test
[junit4:junit4]    > Assumption #1: 'nightly' test group is disabled (@Nightly)
[junit4:junit4] Completed on J7 in 0.22s, 1 test, 1 skipped
[junit4:junit4] 
[junit4:junit4] Suite: org.apache.lucene.index.TestFilterAtomicReader
[junit4:junit4] Completed on J5 in 0.20s, 2 tests
[junit4:junit4] 
[junit4:junit4] Suite: org.apache.lucene.util.TestSetOnce
[junit4:junit4] Completed on J2 in 0.30s, 4 tests
[junit4:junit4] 
[junit4:junit4] Suite: org.apache.lucene.search.TestFilteredSearch
[junit4:junit4] Completed on J3 in 0.29s, 1 test
[junit4:junit4] 
[junit4:junit4] Suite: org.apache.lucene.search.TestDocValuesScoring
[junit4:junit4] Completed on J6 in 0.36s, 1 test
[junit4:junit4] 
[junit4:junit4] Suite: org.apache.lucene.search.TestDateFilter
[junit4:junit4] Completed on J0 in 0.14s, 2 tests
[junit4:junit4] 
[junit4:junit4] Suite: org.apache.lucene.document.TestDateTools
[junit4:junit4] Completed on J7 in 0.18s, 5 tests
[junit4:junit4] 
[junit4:junit4] Suite: org.apache.lucene.store.TestDirectory
[junit4:junit4] IGNOR/A 0.02s J5 | TestDirectory.testThreadSafety
[junit4:junit4]    > Assumption #1: 'nightly' test group is disabled (@Nightly)
[junit4:junit4] Completed on J5 in 0.23s, 8 tests, 1 skipped
[junit4:junit4] 
[junit4:junit4] Suite: org.apache.lucene.util.junitcompat.TestJUnitRuleOrder
[junit4:junit4] Completed on J2 in 0.09s, 1 test
[junit4:junit4] 
[junit4:junit4] Suite: org.apache.lucene.index.TestSameTokenSamePosition
[junit4:junit4] Completed on J3 in 0.18s, 2 tests
[junit4:junit4] 
[junit4:junit4] Suite: org.apache.lucene.search.TestMatchAllDocsQuery
[junit4:junit4] Completed on J6 in 0.21s, 2 tests
[junit4:junit4] 
[junit4:junit4] Suite: org.apache.lucene.search.TestMultiTermQueryRewrites
[junit4:junit4] Completed on J4 in 0.35s, 3 tests
[junit4:junit4] 
[junit4:junit4] Suite: org.apache.lucene.search.TestSimilarity
[junit4:junit4] Completed on J0 in 0.13s, 1 test
[junit4:junit4] 
[junit4:junit4] Suite: org.apache.lucene.search.TestPositionIncrement
[junit4:junit4] Completed on J1 in 0.25s, 2 tests
[junit4:junit4] 
[junit4:junit4] Suite: org.apache.lucene.search.TestDateSort
[junit4:junit4] Completed on J7 in 0.09s, 1 test
[junit4:junit4] 
[junit4:junit4] Suite: org.apache.lucene.search.TestCachingCollector
[junit4:junit4] Completed on J5 in 0.18s, 5 tests
[junit4:junit4] 
[junit4:junit4] Suite: org.apache.lucene.document.TestBinaryDocument
[junit4:junit4] Completed on J2 in 0.11s, 2 tests
[junit4:junit4] 
[junit4:junit4] Suite: org.apache.lucene.search.TestTopScoreDocCollector
[junit4:junit4] Completed on J6 in 0.09s, 1 test
[junit4:junit4] 
[junit4:junit4] Suite: org.apache.lucene.search.TestPrefixQuery
[junit4:junit4] Completed on J3 in 0.09s, 1 test
[junit4:junit4] 
[junit4:junit4] Suite: org.apache.lucene.search.spans.TestSpanFirstQuery
[junit4:junit4] Completed on J4 in 0.13s, 1 test
[junit4:junit4] 
[junit4:junit4] Suite: org.apache.lucene.store.TestLock
[junit4:junit4] Completed on J0 in 0.08s, 1 test
[junit4:junit4] 
[junit4:junit4] Suite: org.apache.lucene.util.TestBytesRef
[junit4:junit4] Completed on J1 in 0.09s, 5 tests
[junit4:junit4] 
[junit4:junit4] Suite: org.apache.lucene.util.TestPriorityQueue
[junit4:junit4] Completed on J7 in 0.23s, 4 tests
[junit4:junit4] 
[junit4:junit4] Suite: org.apache.lucene.index.TestNoMergePolicy
[junit4:junit4] Completed on J5 in 0.05s, 4 tests
[junit4:junit4] 
[junit4:junit4] Suite: org.apache.lucene.util.TestRamUsageEstimator
[junit4:junit4] Completed on J2 in 0.06s, 3 tests
[junit4:junit4] 
[junit4:junit4] Suite: org.apache.lucene.index.TestRollback
[junit4:junit4] Completed on J6 in 0.07s, 1 test
[junit4:junit4] 
[junit4:junit4] Suite: org.apache.lucene.search.TestPositiveScoresOnlyCollector
[junit4:junit4] Completed on J3 in 0.04s, 1 test
[junit4:junit4] 
[junit4:junit4] Suite: org.apache.lucene.search.TestScoreCachingWrappingScorer
[junit4:junit4] Completed on J4 in 0.08s, 1 test
[junit4:junit4] 
[junit4:junit4] Suite: org.apache.lucene.util.TestVersion
[junit4:junit4] Completed on J0 in 0.05s, 2 tests
[junit4:junit4] 
[junit4:junit4] Suite: org.apache.lucene.analysis.TestNumericTokenStream
[junit4:junit4] Completed on J1 in 0.08s, 4 tests
[junit4:junit4] 
[junit4:junit4] Suite: org.apache.lucene.index.TestIndexWriterLockRelease
[junit4:junit4] Completed on J7 in 0.03s, 1 test
[junit4:junit4] 
[junit4:junit4] Suite: org.apache.lucene.util.TestCloseableThreadLocal
[junit4:junit4] Completed on J5 in 0.04s, 3 tests
[junit4:junit4] 
[junit4:junit4] Suite: org.apache.lucene.util.TestVersionComparator
[junit4:junit4] Completed on J2 in 0.06s, 1 test
[junit4:junit4] 
[junit4:junit4] Suite: org.apache.lucene.index.TestNewestSegment
[junit4:junit4] Completed on J6 in 0.06s, 1 test
[junit4:junit4] 
[junit4:junit4] Suite: org.apache.lucene.index.TestNoMergeScheduler
[junit4:junit4] Completed on J3 in 0.07s, 3 tests
[junit4:junit4] 
[junit4:junit4] Suite: org.apache.lucene.index.TestIndexCommit
[junit4:junit4] Completed on J4 in 0.03s, 1 test
[junit4:junit4] 
[junit4:junit4] Suite: org.apache.lucene.index.TestTermdocPerf
[junit4:junit4] Completed on J0 in 0.05s, 1 test
[junit4:junit4] 
[junit4:junit4] Suite: org.apache.lucene.util.TestIOUtils
[junit4:junit4] Completed on J1 in 0.04s, 1 test
[junit4:junit4] 
[junit4:junit4] Suite: org.apache.lucene.analysis.TestCharFilter
[junit4:junit4] Completed on J5 in 0.06s, 4 tests
[junit4:junit4] 
[junit4:junit4] Suite: org.apache.lucene.TestWorstCaseTestBehavior
[junit4:junit4] Completed on J7 in 0.03s, 6 tests, 6 skipped
[junit4:junit4] 
[junit4:junit4] Suite: org.apache.lucene.index.TestPayloadsOnVectors
[junit4:junit4] Completed on J4 in 0.12s, 3 tests
[junit4:junit4] 
[junit4:junit4] Suite: org.apache.lucene.util.TestFilterIterator
[junit4:junit4] Completed on J5 in 0.13s, 8 tests
[junit4:junit4] 
[junit4:junit4] Suite: org.apache.lucene.search.TestConjunctions
[junit4:junit4] Completed on J1 in 0.93s, 1 test
[junit4:junit4] 
[junit4:junit4] Suite: org.apache.lucene.codecs.perfield.TestPerFieldPostingsFormat2
[junit4:junit4] Completed on J6 in 1.20s, 5 tests
[junit4:junit4] 
[junit4:junit4] Suite: org.apache.lucene.codecs.lucene40.TestLucene40PostingsFormat
[junit4:junit4] Completed on J2 in 2.63s, 7 tests
[junit4:junit4] 
[junit4:junit4] Suite: org.apache.lucene.index.TestPostingsFormat
[junit4:junit4] Completed on J0 in 2.66s, 7 tests
[junit4:junit4] 
[junit4:junit4] Suite: org.apache.lucene.index.TestBagOfPostings
[junit4:junit4] Completed on J3 in 6.18s, 1 test
[junit4:junit4] 
[junit4:junit4] 
[junit4:junit4] Tests with failures:
[junit4:junit4]   - org.apache.lucene.index.TestRollingUpdates.testRollingUpdates
[junit4:junit4] 
[junit4:junit4] 
[junit4:junit4] JVM J0:     1.87 ..   182.74 =   180.87s
[junit4:junit4] JVM J1:     1.87 ..   180.73 =   178.87s
[junit4:junit4] JVM J2:     1.87 ..   182.61 =   180.74s
[junit4:junit4] JVM J3:     1.87 ..   186.19 =   184.32s
[junit4:junit4] JVM J4:     1.87 ..   179.96 =   178.09s
[junit4:junit4] JVM J5:     1.66 ..   180.13 =   178.47s
[junit4:junit4] JVM J6:     1.86 ..   181.20 =   179.33s
[junit4:junit4] JVM J7:     1.65 ..   179.83 =   178.18s
[junit4:junit4] Execution time total: 3 minutes 6 seconds
[junit4:junit4] Tests summary: 308 suites, 1800 tests, 1 failure, 18 ignored (10 assumptions)

BUILD FAILED
/var/lib/jenkins/workspace/Lucene-trunk-Linux-Java7-64-test-only/checkout/lucene/build.xml:49: The following error occurred while executing this line:
/var/lib/jenkins/workspace/Lucene-trunk-Linux-Java7-64-test-only/checkout/lucene/common-build.xml:1143: The following error occurred while executing this line:
/var/lib/jenkins/workspace/Lucene-trunk-Linux-Java7-64-test-only/checkout/lucene/common-build.xml:816: There were test failures: 308 suites, 1800 tests, 1 failure, 18 ignored (10 assumptions)

Total time: 3 minutes 35 seconds
Build step 'Invoke Ant' marked build as failure
Archiving artifacts
Recording test results
Email was triggered for: Failure
Sending email for trigger: Failure




Mime
View raw message