lucene-dev mailing list archives

Site index · List index
Message view « Date » · « Thread »
Top « Date » · « Thread »
From Policeman Jenkins Server <jenk...@sd-datasolutions.de>
Subject [JENKINS] Lucene-Solr-4.x-Windows (32bit/jdk1.7.0_07) - Build # 1007 - Still Failing!
Date Tue, 02 Oct 2012 03:23:50 GMT
Build: http://jenkins.sd-datasolutions.de/job/Lucene-Solr-4.x-Windows/1007/
Java: 32bit/jdk1.7.0_07 -client -XX:+UseConcMarkSweepGC

1 tests failed.
FAILED:  org.apache.lucene.index.TestBagOfPostings.test

Error Message:
expected:<437> but was:<-1>

Stack Trace:
java.lang.AssertionError: expected:<437> but was:<-1>
	at __randomizedtesting.SeedInfo.seed([5420E26FA5494CAD:DC74DDB50BB52155]:0)
	at org.junit.Assert.fail(Assert.java:93)
	at org.junit.Assert.failNotEquals(Assert.java:647)
	at org.junit.Assert.assertEquals(Assert.java:128)
	at org.junit.Assert.assertEquals(Assert.java:472)
	at org.junit.Assert.assertEquals(Assert.java:456)
	at org.apache.lucene.index.TestBagOfPostings.test(TestBagOfPostings.java:114)
	at sun.reflect.NativeMethodAccessorImpl.invoke0(Native Method)
	at sun.reflect.NativeMethodAccessorImpl.invoke(NativeMethodAccessorImpl.java:57)
	at sun.reflect.DelegatingMethodAccessorImpl.invoke(DelegatingMethodAccessorImpl.java:43)
	at java.lang.reflect.Method.invoke(Method.java:601)
	at com.carrotsearch.randomizedtesting.RandomizedRunner.invoke(RandomizedRunner.java:1559)
	at com.carrotsearch.randomizedtesting.RandomizedRunner.access$600(RandomizedRunner.java:79)
	at com.carrotsearch.randomizedtesting.RandomizedRunner$6.evaluate(RandomizedRunner.java:737)
	at com.carrotsearch.randomizedtesting.RandomizedRunner$7.evaluate(RandomizedRunner.java:773)
	at com.carrotsearch.randomizedtesting.RandomizedRunner$8.evaluate(RandomizedRunner.java:787)
	at org.apache.lucene.util.TestRuleSetupTeardownChained$1.evaluate(TestRuleSetupTeardownChained.java:50)
	at org.apache.lucene.util.TestRuleFieldCacheSanity$1.evaluate(TestRuleFieldCacheSanity.java:51)
	at org.apache.lucene.util.AbstractBeforeAfterRule$1.evaluate(AbstractBeforeAfterRule.java:45)
	at com.carrotsearch.randomizedtesting.rules.SystemPropertiesInvariantRule$1.evaluate(SystemPropertiesInvariantRule.java:55)
	at org.apache.lucene.util.TestRuleThreadAndTestName$1.evaluate(TestRuleThreadAndTestName.java:48)
	at org.apache.lucene.util.TestRuleIgnoreAfterMaxFailures$1.evaluate(TestRuleIgnoreAfterMaxFailures.java:70)
	at org.apache.lucene.util.TestRuleMarkFailure$1.evaluate(TestRuleMarkFailure.java:48)
	at com.carrotsearch.randomizedtesting.rules.StatementAdapter.evaluate(StatementAdapter.java:36)
	at com.carrotsearch.randomizedtesting.ThreadLeakControl$StatementRunner.run(ThreadLeakControl.java:358)
	at com.carrotsearch.randomizedtesting.ThreadLeakControl.forkTimeoutingTask(ThreadLeakControl.java:782)
	at com.carrotsearch.randomizedtesting.ThreadLeakControl$3.evaluate(ThreadLeakControl.java:442)
	at com.carrotsearch.randomizedtesting.RandomizedRunner.runSingleTest(RandomizedRunner.java:746)
	at com.carrotsearch.randomizedtesting.RandomizedRunner$3.evaluate(RandomizedRunner.java:648)
	at com.carrotsearch.randomizedtesting.RandomizedRunner$4.evaluate(RandomizedRunner.java:682)
	at com.carrotsearch.randomizedtesting.RandomizedRunner$5.evaluate(RandomizedRunner.java:693)
	at org.apache.lucene.util.AbstractBeforeAfterRule$1.evaluate(AbstractBeforeAfterRule.java:45)
	at org.apache.lucene.util.TestRuleStoreClassName$1.evaluate(TestRuleStoreClassName.java:42)
	at com.carrotsearch.randomizedtesting.rules.SystemPropertiesInvariantRule$1.evaluate(SystemPropertiesInvariantRule.java:55)
	at com.carrotsearch.randomizedtesting.rules.NoShadowingOrOverridesOnMethodsRule$1.evaluate(NoShadowingOrOverridesOnMethodsRule.java:39)
	at com.carrotsearch.randomizedtesting.rules.NoShadowingOrOverridesOnMethodsRule$1.evaluate(NoShadowingOrOverridesOnMethodsRule.java:39)
	at com.carrotsearch.randomizedtesting.rules.StatementAdapter.evaluate(StatementAdapter.java:36)
	at org.apache.lucene.util.TestRuleAssertionsRequired$1.evaluate(TestRuleAssertionsRequired.java:43)
	at org.apache.lucene.util.TestRuleMarkFailure$1.evaluate(TestRuleMarkFailure.java:48)
	at org.apache.lucene.util.TestRuleIgnoreAfterMaxFailures$1.evaluate(TestRuleIgnoreAfterMaxFailures.java:70)
	at org.apache.lucene.util.TestRuleIgnoreTestSuites$1.evaluate(TestRuleIgnoreTestSuites.java:55)
	at com.carrotsearch.randomizedtesting.rules.StatementAdapter.evaluate(StatementAdapter.java:36)
	at com.carrotsearch.randomizedtesting.ThreadLeakControl$StatementRunner.run(ThreadLeakControl.java:358)
	at java.lang.Thread.run(Thread.java:722)




Build Log:
[...truncated 1060 lines...]
[junit4:junit4] Suite: org.apache.lucene.index.TestBagOfPostings
[junit4:junit4]   2> NOTE: reproduce with: ant test  -Dtestcase=TestBagOfPostings -Dtests.method=test
-Dtests.seed=5420E26FA5494CAD -Dtests.slow=true -Dtests.locale=hr_HR -Dtests.timezone=America/Virgin
-Dtests.file.encoding=US-ASCII
[junit4:junit4] FAILURE 1.56s | TestBagOfPostings.test <<<
[junit4:junit4]    > Throwable #1: java.lang.AssertionError: expected:<437> but was:<-1>
[junit4:junit4]    > 	at __randomizedtesting.SeedInfo.seed([5420E26FA5494CAD:DC74DDB50BB52155]:0)
[junit4:junit4]    > 	at org.junit.Assert.fail(Assert.java:93)
[junit4:junit4]    > 	at org.junit.Assert.failNotEquals(Assert.java:647)
[junit4:junit4]    > 	at org.junit.Assert.assertEquals(Assert.java:128)
[junit4:junit4]    > 	at org.junit.Assert.assertEquals(Assert.java:472)
[junit4:junit4]    > 	at org.junit.Assert.assertEquals(Assert.java:456)
[junit4:junit4]    > 	at org.apache.lucene.index.TestBagOfPostings.test(TestBagOfPostings.java:114)
[junit4:junit4]    > 	at sun.reflect.NativeMethodAccessorImpl.invoke0(Native Method)
[junit4:junit4]    > 	at sun.reflect.NativeMethodAccessorImpl.invoke(NativeMethodAccessorImpl.java:57)
[junit4:junit4]    > 	at sun.reflect.DelegatingMethodAccessorImpl.invoke(DelegatingMethodAccessorImpl.java:43)
[junit4:junit4]    > 	at java.lang.reflect.Method.invoke(Method.java:601)
[junit4:junit4]    > 	at com.carrotsearch.randomizedtesting.RandomizedRunner.invoke(RandomizedRunner.java:1559)
[junit4:junit4]    > 	at com.carrotsearch.randomizedtesting.RandomizedRunner.access$600(RandomizedRunner.java:79)
[junit4:junit4]    > 	at com.carrotsearch.randomizedtesting.RandomizedRunner$6.evaluate(RandomizedRunner.java:737)
[junit4:junit4]    > 	at com.carrotsearch.randomizedtesting.RandomizedRunner$7.evaluate(RandomizedRunner.java:773)
[junit4:junit4]    > 	at com.carrotsearch.randomizedtesting.RandomizedRunner$8.evaluate(RandomizedRunner.java:787)
[junit4:junit4]    > 	at org.apache.lucene.util.TestRuleSetupTeardownChained$1.evaluate(TestRuleSetupTeardownChained.java:50)
[junit4:junit4]    > 	at org.apache.lucene.util.TestRuleFieldCacheSanity$1.evaluate(TestRuleFieldCacheSanity.java:51)
[junit4:junit4]    > 	at org.apache.lucene.util.AbstractBeforeAfterRule$1.evaluate(AbstractBeforeAfterRule.java:45)
[junit4:junit4]    > 	at com.carrotsearch.randomizedtesting.rules.SystemPropertiesInvariantRule$1.evaluate(SystemPropertiesInvariantRule.java:55)
[junit4:junit4]    > 	at org.apache.lucene.util.TestRuleThreadAndTestName$1.evaluate(TestRuleThreadAndTestName.java:48)
[junit4:junit4]    > 	at org.apache.lucene.util.TestRuleIgnoreAfterMaxFailures$1.evaluate(TestRuleIgnoreAfterMaxFailures.java:70)
[junit4:junit4]    > 	at org.apache.lucene.util.TestRuleMarkFailure$1.evaluate(TestRuleMarkFailure.java:48)
[junit4:junit4]    > 	at com.carrotsearch.randomizedtesting.rules.StatementAdapter.evaluate(StatementAdapter.java:36)
[junit4:junit4]    > 	at com.carrotsearch.randomizedtesting.ThreadLeakControl$StatementRunner.run(ThreadLeakControl.java:358)
[junit4:junit4]    > 	at com.carrotsearch.randomizedtesting.ThreadLeakControl.forkTimeoutingTask(ThreadLeakControl.java:782)
[junit4:junit4]    > 	at com.carrotsearch.randomizedtesting.ThreadLeakControl$3.evaluate(ThreadLeakControl.java:442)
[junit4:junit4]    > 	at com.carrotsearch.randomizedtesting.RandomizedRunner.runSingleTest(RandomizedRunner.java:746)
[junit4:junit4]    > 	at com.carrotsearch.randomizedtesting.RandomizedRunner$3.evaluate(RandomizedRunner.java:648)
[junit4:junit4]    > 	at com.carrotsearch.randomizedtesting.RandomizedRunner$4.evaluate(RandomizedRunner.java:682)
[junit4:junit4]    > 	at com.carrotsearch.randomizedtesting.RandomizedRunner$5.evaluate(RandomizedRunner.java:693)
[junit4:junit4]    > 	at org.apache.lucene.util.AbstractBeforeAfterRule$1.evaluate(AbstractBeforeAfterRule.java:45)
[junit4:junit4]    > 	at org.apache.lucene.util.TestRuleStoreClassName$1.evaluate(TestRuleStoreClassName.java:42)
[junit4:junit4]    > 	at com.carrotsearch.randomizedtesting.rules.SystemPropertiesInvariantRule$1.evaluate(SystemPropertiesInvariantRule.java:55)
[junit4:junit4]    > 	at com.carrotsearch.randomizedtesting.rules.NoShadowingOrOverridesOnMethodsRule$1.evaluate(NoShadowingOrOverridesOnMethodsRule.java:39)
[junit4:junit4]    > 	at com.carrotsearch.randomizedtesting.rules.NoShadowingOrOverridesOnMethodsRule$1.evaluate(NoShadowingOrOverridesOnMethodsRule.java:39)
[junit4:junit4]    > 	at com.carrotsearch.randomizedtesting.rules.StatementAdapter.evaluate(StatementAdapter.java:36)
[junit4:junit4]    > 	at org.apache.lucene.util.TestRuleAssertionsRequired$1.evaluate(TestRuleAssertionsRequired.java:43)
[junit4:junit4]    > 	at org.apache.lucene.util.TestRuleMarkFailure$1.evaluate(TestRuleMarkFailure.java:48)
[junit4:junit4]    > 	at org.apache.lucene.util.TestRuleIgnoreAfterMaxFailures$1.evaluate(TestRuleIgnoreAfterMaxFailures.java:70)
[junit4:junit4]    > 	at org.apache.lucene.util.TestRuleIgnoreTestSuites$1.evaluate(TestRuleIgnoreTestSuites.java:55)
[junit4:junit4]    > 	at com.carrotsearch.randomizedtesting.rules.StatementAdapter.evaluate(StatementAdapter.java:36)
[junit4:junit4]    > 	at com.carrotsearch.randomizedtesting.ThreadLeakControl$StatementRunner.run(ThreadLeakControl.java:358)
[junit4:junit4]    > 	at java.lang.Thread.run(Thread.java:722)
[junit4:junit4]   2> NOTE: test params are: codec=Lucene3x, sim=RandomSimilarityProvider(queryNorm=true,coord=crazy):
{field=DFR I(F)Z(0.3)}, locale=hr_HR, timezone=America/Virgin
[junit4:junit4]   2> NOTE: Windows 7 6.1 x86/Oracle Corporation 1.7.0_07 (32-bit)/cpus=2,threads=1,free=418538048,total=523501568
[junit4:junit4]   2> NOTE: All tests run in this JVM: [TestByteBlockPool, TestCachingWrapperFilter,
Before3, Before3, TestFlushByRamOrCountsPolicy, TestCodecs, TestTwoPhaseCommitTool, TestSpansAdvanced2,
TestDeterminizeLexicon, TestBasicOperations, TestRegexpRandom, TestPhrasePrefixQuery, TestTopDocsCollector,
TestUTF32ToUTF8, TestFieldCacheRangeFilter, TestSimpleExplanationsOfNonMatches, TestSearch,
TestNRTThreads, TestSearcherManager, TestNumericRangeQuery64, TestNRTManager, TestBooleanScorer,
TestIndexWriterMergePolicy, TestSimpleAttributeImpl, Nested1, TestFixedBitSet, TestIndexWriterOnDiskFull,
TestRegexpQuery, TestTopScoreDocCollector, TestSumDocFreq, TestParallelTermEnum, TestUnicodeUtil,
TestFilteredQuery, TestScoreCachingWrappingScorer, TestNearSpansOrdered, TestLucene3xPostingsFormat,
TestTermVectorsWriter, TestSpanExplanations, TestBooleanQuery, TestIndexWriterExceptions,
TestMockCharFilter, TestDocsAndPositions, TestRamUsageEstimatorOnWildAnimals, TestFieldCacheTermsFilter,
TestRamUsageEstimator, TestDocCount, TestTransactionRollback, TestIndexWriterDelete, TestNRTCachingDirectory,
TestTermInfosReaderIndex, TestPagedBytes, TestCachingCollector, TestLucene40PostingsReader,
TestPayloadsOnVectors, TestNRTReaderWithThreads, TestFieldCache, TestCustomSearcherSort, TestCrash,
TestCloseableThreadLocal, TestDuelingCodecs, Test2BDocs, TestAddIndexes, TestSimilarityBase,
TestLockFactory, TestOpenBitSet, TestDocValuesScoring, TestDocValuesIndexing, TestWorstCaseTestBehavior,
TestSimpleExplanations, TestPayloadTermQuery, TestDocValuesTypeCompatibility, TestExplanations,
TestPayloadSpans, TestCustomNorms, NestedSetupChain, NestedTeardownChain, TestNewestSegment,
TestLock, TestNeverDelete, TestComplexExplanationsOfNonMatches, TestBytesRefHash, TestFilteredSearch,
TestPostingsOffsets, TestMultiTermConstantScore, Nested, Nested, Nested, Nested, Nested, Nested,
Nested, Nested, Nested, Nested, Nested, Nested, Nested, Nested, Nested, Nested, Nested, Nested,
Nested, Nested, Nested, TestHugeRamFile, TestNot, Nested, TestFileSwitchDirectory, TestNorms,
TestIsCurrent, TestOmitPositions, TestLazyProxSkipping, TestRandomStoredFields, TestScorerPerf,
TestConjunctions, TestParallelReaderEmptyIndex, ThrowInUncaught, TestForTooMuchCloning, TestBackwardsCompatibility3x,
TestDoc, TestPrefixQuery, TestMockDirectoryWrapper, TestSpanExplanationsOfNonMatches, TestNumericUtils,
TestDocumentsWriterStallControl, Nested, TestMaxTermFrequency, TestFieldInfos, TestDocTermOrds,
Test2BPostings, TestPayloadNearQuery, TestBackwardsCompatibility, TestAutomatonQuery, TestNumericRangeQuery32,
TestBinaryTerms, TestOmitTf, TestSameTokenSamePosition, TestAtomicUpdate, TestIndexWriterMerging,
TestTermsEnum2, TestIndexWriterOnJRECrash, TestByteArrayDataInput, TestStressAdvance, Test2BTerms,
TestSegmentTermDocs, TestAutomatonQueryUnicode, TestPrefixInBooleanQuery, TestNoMergeScheduler,
TestDemo, TestArrayUtil, TestTermsEnum, TestIndexFileDeleter, TestSpecialOperations, TestTermdocPerf,
TestAttributeSource, TestReuseDocsEnum, TestSearchAfter, TestImpersonation, TestRecyclingByteBlockAllocator,
TestTermRangeQuery, TestBitVector, TestCharFilter, TestIndexableField, TestVersion, TestDeterminism,
TestIndexWriterUnicode, TestIndexWriterConfig, TestReaderClosed, TestBooleanMinShouldMatch,
TestDateSort, TestAssertions, TestBytesRef, TestSubScorerFreqs, TestSurrogates, TestLevenshteinAutomata,
TestTermScorer, TestBoolean2, TestDisjunctionMaxQuery, TestIndexWriterWithThreads, TestPackedInts,
TestFSTs, TestGraphTokenizers, TestIndexWriterReader, TestLookaheadTokenFilter, TestShardSearching,
TestBasics, TestByteSlices, TestDeletionPolicy, TestIndexWriter, TestMultiMMap, TestTimeLimitingCollector,
TestTopDocsMerge, TestMinimize, TestSloppyPhraseQuery, TestPersistentSnapshotDeletionPolicy,
TestSort, TestDirectoryReaderReopen, TestSearchWithThreads, TestBufferedIndexInput, TestIndexWriterForceMerge,
TestCollectionUtil, TestLongPostings, TestIndexWriterCommit, TestDirectoryReader, TestToken,
TestWeakIdentityMap, TestTypePromotion, TestCompoundFile, TestStressIndexing, TestSnapshotDeletionPolicy,
TestMockAnalyzer, TestIndexWriterNRTIsCurrent, TestRegexpRandom2, TestTieredMergePolicy, TestConcurrentMergeScheduler,
TestSloppyPhraseQuery2, TestStressNRT, TestPhraseQuery, TestConsistentFieldNumbers, TestFieldCacheRewriteMethod,
TestDoubleBarrelLRUCache, TestComplexExplanations, TestCrashCausesCorruptIndex, TestRAMDirectory,
TestDocValues, TestMultiValuedNumericRangeQuery, TestCharTermAttributeImpl, TestOmitNorms,
TestFieldsReader, TestRollingUpdates, TestSegmentMerger, TestTransactions, TestThreadedForceMerge,
TestSegmentReader, TestPerFieldPostingsFormat, TestWindowsMMap, TestMixedCodecs, TestStressIndexing2,
TestIndexInput, TestSpanSearchEquivalence, TestMultiThreadTermVectors, TestSpans, TestParallelCompositeReader,
TestFieldCacheSanityChecker, TestMergeSchedulerExternal, TestForceMergeForever, TestSimpleSearchEquivalence,
TestFieldMaskingSpanQuery, TestCopyBytes, TestTermRangeFilter, TestDocumentsWriterDeleteQueue,
TestPrefixRandom, TestDocumentWriter, TestPayloadExplanations, TestQueryWrapperFilter, TestPrefixCodedTerms,
TestTermVectors, TestFlex, TestMultiPhraseQuery, TestCompiledAutomaton, TestMultiFields, TestSentinelIntSet,
TestTermVectorsReader, TestSimilarity2, TestAllFilesHaveCodecHeader, TestParallelAtomicReader,
TestMultiLevelSkipList, TestExternalCodecs, Nested3, Nested2, Nested1, TestPayloads, TestFuzzyQuery,
TestRollingBuffer, TestBooleanOr, InBeforeClass, InAfterClass, NonStringProperties, InTestMethod,
TestWildcard, TestSizeBoundedForceMerge, TestIdentityHashSet, TestSpanMultiTermQueryWrapper,
TestWildcardRandom, TestCheckIndex, TestUniqueTermCount, TestSearchForDuplicates, TestPerSegmentDeletes,
TestSmallFloat, TestDocument, TestSetOnce, TestNoDeletionPolicy, TestDocIdSet, Nested, Nested,
TestFilterAtomicReader, TestFieldValueFilter, TestDateFilter, TestMultiTermQueryRewrites,
TestSegmentTermEnum, TestSpansAdvanced, TestConstantScoreQuery, TestPositionIncrement, TestDateTools,
TestDirectory, TestCharsRef, Nested1, TestElevationComparator, TestMatchAllDocsQuery, TestSimilarity,
TestSimilarityProvider, TestBinaryDocument, TestSpanFirstQuery, TestIntsRef, TestPriorityQueue,
TestVirtualMethod, TestNoMergePolicy, TestDocBoost, TestNGramPhraseQuery, TestNamedSPILoader,
TestRollback, MultiCollectorTest, TestPositiveScoresOnlyCollector, TestPrefixFilter, TestBitUtil,
TestNumericTokenStream, TestIndexWriterLockRelease, TestVersionComparator, TestCachingTokenFilter,
TestIndexCommit, TestIOUtils, TestTerm, TestLucene40PostingsFormat, TestPerFieldPostingsFormat2,
TestField, TestBagOfPostings]
[junit4:junit4] Completed in 1.57s, 1 test, 1 failure <<< FAILURES!

[...truncated 24 lines...]
BUILD FAILED
C:\Users\JenkinsSlave\workspace\Lucene-Solr-4.x-Windows\build.xml:38: The following error
occurred while executing this line:
C:\Users\JenkinsSlave\workspace\Lucene-Solr-4.x-Windows\lucene\build.xml:49: The following
error occurred while executing this line:
C:\Users\JenkinsSlave\workspace\Lucene-Solr-4.x-Windows\lucene\common-build.xml:1143: The
following error occurred while executing this line:
C:\Users\JenkinsSlave\workspace\Lucene-Solr-4.x-Windows\lucene\common-build.xml:816: There
were test failures: 314 suites, 1833 tests, 1 failure, 16 ignored (8 assumptions)

Total time: 7 minutes 58 seconds
Build step 'Invoke Ant' marked build as failure
Recording test results
Description set: Java: 32bit/jdk1.7.0_07 -client -XX:+UseConcMarkSweepGC
Email was triggered for: Failure
Sending email for trigger: Failure



Mime
View raw message