lucene-dev mailing list archives

Site index · List index
Message view « Date » · « Thread »
Top « Date » · « Thread »
From Charlie Cron <hudsonsevilt...@gmail.com>
Subject Build failed in Jenkins: fast-io-beasting #6327
Date Tue, 30 Oct 2012 09:29:39 GMT
See <http://sierranevada.servebeer.com/job/fast-io-beasting/6327/>

------------------------------------------
[...truncated 13479 lines...]
[junit4:junit4]   2> 7222545 T106 oazs.PrepRequestProcessor.pRequest Got user-level KeeperException
when processing sessionid:0x13ab10139630002 type:delete cxid:0x15 zxid:0xfffffffffffffffe
txntype:unknown reqpath:n/a Error Path:/solr/overseer_elect/leader Error:KeeperErrorCode =
NoNode for /solr/overseer_elect/leader
[junit4:junit4]   2> 7222546 T70 oascc.SolrZkClient.makePath makePath: /overseer_elect/leader
[junit4:junit4]   2> 7222549 T70 oasc.Overseer.start Overseer (id=88577761503019010-127.0.0.1:7000_solr-n_0000000000)
starting
[junit4:junit4]   2> 7222550 T106 oazs.PrepRequestProcessor.pRequest Got user-level KeeperException
when processing sessionid:0x13ab10139630002 type:create cxid:0x1a zxid:0xfffffffffffffffe
txntype:unknown reqpath:n/a Error Path:/solr/overseer Error:KeeperErrorCode = NodeExists for
/solr/overseer
[junit4:junit4]   2> 7222552 T106 oazs.PrepRequestProcessor.pRequest Got user-level KeeperException
when processing sessionid:0x13ab10139630002 type:create cxid:0x1b zxid:0xfffffffffffffffe
txntype:unknown reqpath:n/a Error Path:/solr/overseer Error:KeeperErrorCode = NodeExists for
/solr/overseer
[junit4:junit4]   2> 7222553 T106 oazs.PrepRequestProcessor.pRequest Got user-level KeeperException
when processing sessionid:0x13ab10139630002 type:create cxid:0x1c zxid:0xfffffffffffffffe
txntype:unknown reqpath:n/a Error Path:/solr/overseer Error:KeeperErrorCode = NodeExists for
/solr/overseer
[junit4:junit4]   2> 7222556 T106 oazs.PrepRequestProcessor.pRequest Got user-level KeeperException
when processing sessionid:0x13ab10139630002 type:create cxid:0x1d zxid:0xfffffffffffffffe
txntype:unknown reqpath:n/a Error Path:/solr/overseer Error:KeeperErrorCode = NodeExists for
/solr/overseer
[junit4:junit4]   2> 7222559 T114 oasc.OverseerCollectionProcessor.run Process current
queue of collection messages
[junit4:junit4]   2> 7222560 T70 oascc.SolrZkClient.makePath makePath: /clusterstate.json
[junit4:junit4]   2> 7222563 T70 oascc.ZkStateReader.createClusterStateWatchersAndUpdate
Updating cluster state from ZooKeeper... 
[junit4:junit4]   2> 7222565 T113 oasc.Overseer$ClusterStateUpdater.run Starting to work
on the main queue
[junit4:junit4]   2> 7222566 T70 oasc.CoreContainer.create Creating SolrCore 'collection1'
using instanceDir: <http://sierranevada.servebeer.com/job/fast-io-beasting/ws/solr/build/solr-core/test-files/solr/collection1>
[junit4:junit4]   2> 7222567 T70 oasc.ZkController.createCollectionZkNode Check for collection
zkNode:collection1
[junit4:junit4]   2> 7222568 T70 oasc.ZkController.createCollectionZkNode Collection zkNode
exists
[junit4:junit4]   2> 7222568 T70 oasc.ZkController.readConfigName Load collection config
from:/collections/collection1
[junit4:junit4]   2> 7222569 T70 oasc.SolrResourceLoader.<init> new SolrResourceLoader
for directory: '<http://sierranevada.servebeer.com/job/fast-io-beasting/ws/solr/build/solr-core/test-files/solr/collection1/'>
[junit4:junit4]   2> 7222570 T70 oasc.SolrResourceLoader.replaceClassLoader Adding '<http://sierranevada.servebeer.com/job/fast-io-beasting/ws/solr/build/solr-core/test-files/solr/collection1/lib/classes/'>
to classloader
[junit4:junit4]   2> 7222570 T70 oasc.SolrResourceLoader.replaceClassLoader Adding '<http://sierranevada.servebeer.com/job/fast-io-beasting/ws/solr/build/solr-core/test-files/solr/collection1/lib/README'>
to classloader
[junit4:junit4]   2> 7222593 T70 oasc.SolrConfig.<init> Using Lucene MatchVersion:
LUCENE_41
[junit4:junit4]   2> 7222616 T70 oasc.SolrConfig.<init> Loaded SolrConfig: solrconfig.xml
[junit4:junit4]   2> 7222617 T70 oass.IndexSchema.readSchema Reading Solr Schema
[junit4:junit4]   2> 7222620 T70 oass.IndexSchema.readSchema Schema name=test
[junit4:junit4]   2> 7222736 T97 oaz.ClientCnxn$SendThread.startConnect WARNING Unexpected
exception java.lang.InterruptedException: sleep interrupted
[junit4:junit4]   2> 	at java.lang.Thread.sleep(Native Method)
[junit4:junit4]   2> 	at org.apache.zookeeper.ClientCnxn$SendThread.startConnect(ClientCnxn.java:1045)
[junit4:junit4]   2> 	at org.apache.zookeeper.ClientCnxn$SendThread.run(ClientCnxn.java:1101)
[junit4:junit4]   2> 
[junit4:junit4]   2> 7222736 T97 oaz.ClientCnxn$SendThread.startConnect Opening socket
connection to server localhost.localdomain/127.0.0.1:47882
[junit4:junit4]   2> 7222799 T70 oass.OpenExchangeRatesOrgProvider.init Initialized with
rates=open-exchange-rates.json, refreshInterval=1440.
[junit4:junit4]   2> 7222803 T70 oass.IndexSchema.readSchema default search field in schema
is text
[junit4:junit4]   2> 7222804 T70 oass.IndexSchema.readSchema unique key field: id
[junit4:junit4]   2> 7222806 T70 oasc.CoreContainer.create SEVERE Unable to create core:
collection1 java.lang.RuntimeException: java.io.IOException: Error opening /configs/conf1/stopwords.txt
[junit4:junit4]   2> 	at org.apache.solr.schema.IndexSchema.<init>(IndexSchema.java:116)
[junit4:junit4]   2> 	at org.apache.solr.core.CoreContainer.getSchemaFromZk(CoreContainer.java:1438)
[junit4:junit4]   2> 	at org.apache.solr.core.CoreContainer.create(CoreContainer.java:829)
[junit4:junit4]   2> 	at org.apache.solr.core.CoreContainer.load(CoreContainer.java:530)
[junit4:junit4]   2> 	at org.apache.solr.core.CoreContainer.load(CoreContainer.java:351)
[junit4:junit4]   2> 	at org.apache.solr.core.CoreContainer$Initializer.initialize(CoreContainer.java:303)
[junit4:junit4]   2> 	at org.apache.solr.cloud.LeaderElectionIntegrationTest.setupContainer(LeaderElectionIntegrationTest.java:152)
[junit4:junit4]   2> 	at org.apache.solr.cloud.LeaderElectionIntegrationTest.setUp(LeaderElectionIntegrationTest.java:100)
[junit4:junit4]   2> 	at sun.reflect.GeneratedMethodAccessor5.invoke(Unknown Source)
[junit4:junit4]   2> 	at sun.reflect.DelegatingMethodAccessorImpl.invoke(DelegatingMethodAccessorImpl.java:25)
[junit4:junit4]   2> 	at java.lang.reflect.Method.invoke(Method.java:597)
[junit4:junit4]   2> 	at com.carrotsearch.randomizedtesting.RandomizedRunner.invoke(RandomizedRunner.java:1559)
[junit4:junit4]   2> 	at com.carrotsearch.randomizedtesting.RandomizedRunner.access$600(RandomizedRunner.java:79)
[junit4:junit4]   2> 	at com.carrotsearch.randomizedtesting.RandomizedRunner$7.evaluate(RandomizedRunner.java:771)
[junit4:junit4]   2> 	at com.carrotsearch.randomizedtesting.RandomizedRunner$8.evaluate(RandomizedRunner.java:787)
[junit4:junit4]   2> 	at com.carrotsearch.randomizedtesting.rules.SystemPropertiesRestoreRule$1.evaluate(SystemPropertiesRestoreRule.java:53)
[junit4:junit4]   2> 	at org.apache.lucene.util.TestRuleSetupTeardownChained$1.evaluate(TestRuleSetupTeardownChained.java:50)
[junit4:junit4]   2> 	at org.apache.lucene.util.TestRuleFieldCacheSanity$1.evaluate(TestRuleFieldCacheSanity.java:51)
[junit4:junit4]   2> 	at org.apache.lucene.util.AbstractBeforeAfterRule$1.evaluate(AbstractBeforeAfterRule.java:45)
[junit4:junit4]   2> 	at com.carrotsearch.randomizedtesting.rules.SystemPropertiesInvariantRule$1.evaluate(SystemPropertiesInvariantRule.java:55)
[junit4:junit4]   2> 	at org.apache.lucene.util.TestRuleThreadAndTestName$1.evaluate(TestRuleThreadAndTestName.java:48)
[junit4:junit4]   2> 	at org.apache.lucene.util.TestRuleIgnoreAfterMaxFailures$1.evaluate(TestRuleIgnoreAfterMaxFailures.java:70)
[junit4:junit4]   2> 	at org.apache.lucene.util.TestRuleMarkFailure$1.evaluate(TestRuleMarkFailure.java:48)
[junit4:junit4]   2> 	at com.carrotsearch.randomizedtesting.rules.StatementAdapter.evaluate(StatementAdapter.java:36)
[junit4:junit4]   2> 	at com.carrotsearch.randomizedtesting.ThreadLeakControl$StatementRunner.run(ThreadLeakControl.java:358)
[junit4:junit4]   2> 	at com.carrotsearch.randomizedtesting.ThreadLeakControl.forkTimeoutingTask(ThreadLeakControl.java:782)
[junit4:junit4]   2> 	at com.carrotsearch.randomizedtesting.ThreadLeakControl$3.evaluate(ThreadLeakControl.java:442)
[junit4:junit4]   2> 	at com.carrotsearch.randomizedtesting.RandomizedRunner.runSingleTest(RandomizedRunner.java:746)
[junit4:junit4]   2> 	at com.carrotsearch.randomizedtesting.RandomizedRunner$3.evaluate(RandomizedRunner.java:648)
[junit4:junit4]   2> 	at com.carrotsearch.randomizedtesting.RandomizedRunner$4.evaluate(RandomizedRunner.java:682)
[junit4:junit4]   2> 	at com.carrotsearch.randomizedtesting.RandomizedRunner$5.evaluate(RandomizedRunner.java:693)
[junit4:junit4]   2> 	at com.carrotsearch.randomizedtesting.rules.StatementAdapter.evaluate(StatementAdapter.java:36)
[junit4:junit4]   2> 	at com.carrotsearch.randomizedtesting.rules.SystemPropertiesRestoreRule$1.evaluate(SystemPropertiesRestoreRule.java:53)
[junit4:junit4]   2> 	at org.apache.lucene.util.AbstractBeforeAfterRule$1.evaluate(AbstractBeforeAfterRule.java:45)
[junit4:junit4]   2> 	at org.apache.lucene.util.TestRuleStoreClassName$1.evaluate(TestRuleStoreClassName.java:42)
[junit4:junit4]   2> 	at com.carrotsearch.randomizedtesting.rules.SystemPropertiesInvariantRule$1.evaluate(SystemPropertiesInvariantRule.java:55)
[junit4:junit4]   2> 	at com.carrotsearch.randomizedtesting.rules.NoShadowingOrOverridesOnMethodsRule$1.evaluate(NoShadowingOrOverridesOnMethodsRule.java:39)
[junit4:junit4]   2> 	at com.carrotsearch.randomizedtesting.rules.NoShadowingOrOverridesOnMethodsRule$1.evaluate(NoShadowingOrOverridesOnMethodsRule.java:39)
[junit4:junit4]   2> 	at com.carrotsearch.randomizedtesting.rules.StatementAdapter.evaluate(StatementAdapter.java:36)
[junit4:junit4]   2> 	at org.apache.lucene.util.TestRuleAssertionsRequired$1.evaluate(TestRuleAssertionsRequired.java:43)
[junit4:junit4]   2> 	at org.apache.lucene.util.TestRuleMarkFailure$1.evaluate(TestRuleMarkFailure.java:48)
[junit4:junit4]   2> 	at org.apache.lucene.util.TestRuleIgnoreAfterMaxFailures$1.evaluate(TestRuleIgnoreAfterMaxFailures.java:70)
[junit4:junit4]   2> 	at org.apache.lucene.util.TestRuleIgnoreTestSuites$1.evaluate(TestRuleIgnoreTestSuites.java:55)
[junit4:junit4]   2> 	at com.carrotsearch.randomizedtesting.rules.StatementAdapter.evaluate(StatementAdapter.java:36)
[junit4:junit4]   2> 	at com.carrotsearch.randomizedtesting.ThreadLeakControl$StatementRunner.run(ThreadLeakControl.java:358)
[junit4:junit4]   2> 	at java.lang.Thread.run(Thread.java:662)
[junit4:junit4]   2> Caused by: java.io.IOException: Error opening /configs/conf1/stopwords.txt
[junit4:junit4]   2> 	at org.apache.solr.cloud.ZkSolrResourceLoader.openResource(ZkSolrResourceLoader.java:82)
[junit4:junit4]   2> 	at org.apache.lucene.analysis.util.AbstractAnalysisFactory.getLines(AbstractAnalysisFactory.java:163)
[junit4:junit4]   2> 	at org.apache.lucene.analysis.util.AbstractAnalysisFactory.getWordSet(AbstractAnalysisFactory.java:151)
[junit4:junit4]   2> 	at org.apache.lucene.analysis.core.StopFilterFactory.inform(StopFilterFactory.java:58)
[junit4:junit4]   2> 	at org.apache.solr.core.SolrResourceLoader.inform(SolrResourceLoader.java:611)
[junit4:junit4]   2> 	at org.apache.solr.schema.IndexSchema.<init>(IndexSchema.java:114)
[junit4:junit4]   2> 	... 45 more
[junit4:junit4]   2> Caused by: java.lang.InterruptedException
[junit4:junit4]   2> 	at java.lang.Object.wait(Native Method)
[junit4:junit4]   2> 	at java.lang.Object.wait(Object.java:485)
[junit4:junit4]   2> 	at org.apache.zookeeper.ClientCnxn.submitRequest(ClientCnxn.java:1345)
[junit4:junit4]   2> 	at org.apache.zookeeper.ZooKeeper.exists(ZooKeeper.java:810)
[junit4:junit4]   2> 	at org.apache.solr.common.cloud.SolrZkClient$4.execute(SolrZkClient.java:193)
[junit4:junit4]   2> 	at org.apache.solr.common.cloud.SolrZkClient$4.execute(SolrZkClient.java:190)
[junit4:junit4]   2> 	at org.apache.solr.common.cloud.ZkCmdExecutor.retryOperation(ZkCmdExecutor.java:63)
[junit4:junit4]   2> 	at org.apache.solr.common.cloud.SolrZkClient.exists(SolrZkClient.java:190)
[junit4:junit4]   2> 	at org.apache.solr.cloud.ZkController.pathExists(ZkController.java:493)
[junit4:junit4]   2> 	at org.apache.solr.cloud.ZkSolrResourceLoader.openResource(ZkSolrResourceLoader.java:77)
[junit4:junit4]   2> 	... 50 more
[junit4:junit4]   2> 
[junit4:junit4]   2> 7222807 T70 oasc.SolrException.log SEVERE null:java.lang.RuntimeException:
java.io.IOException: Error opening /configs/conf1/stopwords.txt
[junit4:junit4]   2> 		at org.apache.solr.schema.IndexSchema.<init>(IndexSchema.java:116)
[junit4:junit4]   2> 		at org.apache.solr.core.CoreContainer.getSchemaFromZk(CoreContainer.java:1438)
[junit4:junit4]   2> 		at org.apache.solr.core.CoreContainer.create(CoreContainer.java:829)
[junit4:junit4]   2> 		at org.apache.solr.core.CoreContainer.load(CoreContainer.java:530)
[junit4:junit4]   2> 		at org.apache.solr.core.CoreContainer.load(CoreContainer.java:351)
[junit4:junit4]   2> 		at org.apache.solr.core.CoreContainer$Initializer.initialize(CoreContainer.java:303)
[junit4:junit4]   2> 		at org.apache.solr.cloud.LeaderElectionIntegrationTest.setupContainer(LeaderElectionIntegrationTest.java:152)
[junit4:junit4]   2> 		at org.apache.solr.cloud.LeaderElectionIntegrationTest.setUp(LeaderElectionIntegrationTest.java:100)
[junit4:junit4]   2> 		at sun.reflect.GeneratedMethodAccessor5.invoke(Unknown Source)
[junit4:junit4]   2> 		at sun.reflect.DelegatingMethodAccessorImpl.invoke(DelegatingMethodAccessorImpl.java:25)
[junit4:junit4]   2> 		at java.lang.reflect.Method.invoke(Method.java:597)
[junit4:junit4]   2> 		at com.carrotsearch.randomizedtesting.RandomizedRunner.invoke(RandomizedRunner.java:1559)
[junit4:junit4]   2> 		at com.carrotsearch.randomizedtesting.RandomizedRunner.access$600(RandomizedRunner.java:79)
[junit4:junit4]   2> 		at com.carrotsearch.randomizedtesting.RandomizedRunner$7.evaluate(RandomizedRunner.java:771)
[junit4:junit4]   2> 		at com.carrotsearch.randomizedtesting.RandomizedRunner$8.evaluate(RandomizedRunner.java:787)
[junit4:junit4]   2> 		at com.carrotsearch.randomizedtesting.rules.SystemPropertiesRestoreRule$1.evaluate(SystemPropertiesRestoreRule.java:53)
[junit4:junit4]   2> 		at org.apache.lucene.util.TestRuleSetupTeardownChained$1.evaluate(TestRuleSetupTeardownChained.java:50)
[junit4:junit4]   2> 		at org.apache.lucene.util.TestRuleFieldCacheSanity$1.evaluate(TestRuleFieldCacheSanity.java:51)
[junit4:junit4]   2> 		at org.apache.lucene.util.AbstractBeforeAfterRule$1.evaluate(AbstractBeforeAfterRule.java:45)
[junit4:junit4]   2> 		at com.carrotsearch.randomizedtesting.rules.SystemPropertiesInvariantRule$1.evaluate(SystemPropertiesInvariantRule.java:55)
[junit4:junit4]   2> 		at org.apache.lucene.util.TestRuleThreadAndTestName$1.evaluate(TestRuleThreadAndTestName.java:48)
[junit4:junit4]   2> 		at org.apache.lucene.util.TestRuleIgnoreAfterMaxFailures$1.evaluate(TestRuleIgnoreAfterMaxFailures.java:70)
[junit4:junit4]   2> 		at org.apache.lucene.util.TestRuleMarkFailure$1.evaluate(TestRuleMarkFailure.java:48)
[junit4:junit4]   2> 		at com.carrotsearch.randomizedtesting.rules.StatementAdapter.evaluate(StatementAdapter.java:36)
[junit4:junit4]   2> 		at com.carrotsearch.randomizedtesting.ThreadLeakControl$StatementRunner.run(ThreadLeakControl.java:358)
[junit4:junit4]   2> 		at com.carrotsearch.randomizedtesting.ThreadLeakControl.forkTimeoutingTask(ThreadLeakControl.java:782)
[junit4:junit4]   2> 		at com.carrotsearch.randomizedtesting.ThreadLeakControl$3.evaluate(ThreadLeakControl.java:442)
[junit4:junit4]   2> 		at com.carrotsearch.randomizedtesting.RandomizedRunner.runSingleTest(RandomizedRunner.java:746)
[junit4:junit4]   2> 		at com.carrotsearch.randomizedtesting.RandomizedRunner$3.evaluate(RandomizedRunner.java:648)
[junit4:junit4]   2> 		at com.carrotsearch.randomizedtesting.RandomizedRunner$4.evaluate(RandomizedRunner.java:682)
[junit4:junit4]   2> 		at com.carrotsearch.randomizedtesting.RandomizedRunner$5.evaluate(RandomizedRunner.java:693)
[junit4:junit4]   2> 		at com.carrotsearch.randomizedtesting.rules.StatementAdapter.evaluate(StatementAdapter.java:36)
[junit4:junit4]   2> 		at com.carrotsearch.randomizedtesting.rules.SystemPropertiesRestoreRule$1.evaluate(SystemPropertiesRestoreRule.java:53)
[junit4:junit4]   2> 		at org.apache.lucene.util.AbstractBeforeAfterRule$1.evaluate(AbstractBeforeAfterRule.java:45)
[junit4:junit4]   2> 		at org.apache.lucene.util.TestRuleStoreClassName$1.evaluate(TestRuleStoreClassName.java:42)
[junit4:junit4]   2> 		at com.carrotsearch.randomizedtesting.rules.SystemPropertiesInvariantRule$1.evaluate(SystemPropertiesInvariantRule.java:55)
[junit4:junit4]   2> 		at com.carrotsearch.randomizedtesting.rules.NoShadowingOrOverridesOnMethodsRule$1.evaluate(NoShadowingOrOverridesOnMethodsRule.java:39)
[junit4:junit4]   2> 		at com.carrotsearch.randomizedtesting.rules.NoShadowingOrOverridesOnMethodsRule$1.evaluate(NoShadowingOrOverridesOnMethodsRule.java:39)
[junit4:junit4]   2> 		at com.carrotsearch.randomizedtesting.rules.StatementAdapter.evaluate(StatementAdapter.java:36)
[junit4:junit4]   2> 		at org.apache.lucene.util.TestRuleAssertionsRequired$1.evaluate(TestRuleAssertionsRequired.java:43)
[junit4:junit4]   2> 		at org.apache.lucene.util.TestRuleMarkFailure$1.evaluate(TestRuleMarkFailure.java:48)
[junit4:junit4]   2> 		at org.apache.lucene.util.TestRuleIgnoreAfterMaxFailures$1.evaluate(TestRuleIgnoreAfterMaxFailures.java:70)
[junit4:junit4]   2> 		at org.apache.lucene.util.TestRuleIgnoreTestSuites$1.evaluate(TestRuleIgnoreTestSuites.java:55)
[junit4:junit4]   2> 		at com.carrotsearch.randomizedtesting.rules.StatementAdapter.evaluate(StatementAdapter.java:36)
[junit4:junit4]   2> 		at com.carrotsearch.randomizedtesting.ThreadLeakControl$StatementRunner.run(ThreadLeakControl.java:358)
[junit4:junit4]   2> 		at java.lang.Thread.run(Thread.java:662)
[junit4:junit4]   2> 	Caused by: java.io.IOException: Error opening /configs/conf1/stopwords.txt
[junit4:junit4]   2> 		at org.apache.solr.cloud.ZkSolrResourceLoader.openResource(ZkSolrResourceLoader.java:82)
[junit4:junit4]   2> 		at org.apache.lucene.analysis.util.AbstractAnalysisFactory.getLines(AbstractAnalysisFactory.java:163)
[junit4:junit4]   2> 		at org.apache.lucene.analysis.util.AbstractAnalysisFactory.getWordSet(AbstractAnalysisFactory.java:151)
[junit4:junit4]   2> 		at org.apache.lucene.analysis.core.StopFilterFactory.inform(StopFilterFactory.java:58)
[junit4:junit4]   2> 		at org.apache.solr.core.SolrResourceLoader.inform(SolrResourceLoader.java:611)
[junit4:junit4]   2> 		at org.apache.solr.schema.IndexSchema.<init>(IndexSchema.java:114)
[junit4:junit4]   2> 		... 45 more
[junit4:junit4]   2> 	Caused by: java.lang.InterruptedException
[junit4:junit4]   2> 		at java.lang.Object.wait(Native Method)
[junit4:junit4]   2> 		at java.lang.Object.wait(Object.java:485)
[junit4:junit4]   2> 		at org.apache.zookeeper.ClientCnxn.submitRequest(ClientCnxn.java:1345)
[junit4:junit4]   2> 		at org.apache.zookeeper.ZooKeeper.exists(ZooKeeper.java:810)
[junit4:junit4]   2> 		at org.apache.solr.common.cloud.SolrZkClient$4.execute(SolrZkClient.java:193)
[junit4:junit4]   2> 		at org.apache.solr.common.cloud.SolrZkClient$4.execute(SolrZkClient.java:190)
[junit4:junit4]   2> 		at org.apache.solr.common.cloud.ZkCmdExecutor.retryOperation(ZkCmdExecutor.java:63)
[junit4:junit4]   2> 		at org.apache.solr.common.cloud.SolrZkClient.exists(SolrZkClient.java:190)
[junit4:junit4]   2> 		at org.apache.solr.cloud.ZkController.pathExists(ZkController.java:493)
[junit4:junit4]   2> 		at org.apache.solr.cloud.ZkSolrResourceLoader.openResource(ZkSolrResourceLoader.java:77)
[junit4:junit4]   2> 		... 50 more
[junit4:junit4]   2> 	
[junit4:junit4]   2> 7222808 T70 oasc.LeaderElectionIntegrationTest.setUp SEVERE !!!Could
not start container:7000 The exception thrown was: class java.lang.AssertionError Container
7000 has no cores!
[junit4:junit4]   2> 7222809 T105 oazs.SyncRequestProcessor.run SyncRequestProcessor exited!
[junit4:junit4]   2> 7222809 T106 oazs.PrepRequestProcessor.run PrepRequestProcessor exited
loop!
[junit4:junit4]   2> 7222809 T70 oazs.FinalRequestProcessor.shutdown shutdown of request
processor complete
[junit4:junit4]   2> 7222850 T70 oazs.NIOServerCnxn.closeSock Closed socket connection
for client /127.0.0.1:49922 which had sessionid 0x13ab10139630002
[junit4:junit4]   2> 7222850 T111 oaz.ClientCnxn$SendThread.run Unable to read additional
data from server sessionid 0x13ab10139630002, likely server has closed socket, closing socket
connection and attempting reconnect
[junit4:junit4]   2> 7222850 T103 oazs.NIOServerCnxn$Factory.run NIOServerCnxn factory
exited run method
[junit4:junit4]   2> 7222852 T70 oazs.FinalRequestProcessor.shutdown shutdown of request
processor complete
[junit4:junit4]   2> 7222852 T70 oas.SolrTestCaseJ4.tearDown ###Ending testSimpleSliceLeaderElection
[junit4:junit4]   2> 7222888 T104 oazs.SessionTrackerImpl.run SessionTrackerImpl exited
loop!
[junit4:junit4]   2> 7222951 T112 oascc.ConnectionManager.process Watcher org.apache.solr.common.cloud.ConnectionManager@7a46ef2a
name:ZooKeeperConnection Watcher:127.0.0.1:37452/solr got event WatchedEvent state:Disconnected
type:None path:null path:null type:None
[junit4:junit4]   2> 7222951 T112 oascc.ConnectionManager.process zkClient has disconnected
[junit4:junit4]   2> 7223237 T69 ccr.ThreadLeakControl.tryToInterruptAll SEVERE There are
still zombie threads that couldn't be terminated:
[junit4:junit4]   2> 	   1) Thread[id=70, name=SUITE-LeaderElectionIntegrationTest-seed#[3FA56ED7208D81C]-worker,
state=TIMED_WAITING, group=TGRP-LeaderElectionIntegrationTest]
[junit4:junit4]   2> 	        at java.lang.Thread.sleep(Native Method)
[junit4:junit4]   2> 	        at org.apache.solr.cloud.LeaderElectionIntegrationTest.afterClass(LeaderElectionIntegrationTest.java:317)
[junit4:junit4]   2> 	        at sun.reflect.NativeMethodAccessorImpl.invoke0(Native Method)
[junit4:junit4]   2> 	        at sun.reflect.NativeMethodAccessorImpl.invoke(NativeMethodAccessorImpl.java:39)
[junit4:junit4]   2> 	        at sun.reflect.DelegatingMethodAccessorImpl.invoke(DelegatingMethodAccessorImpl.java:25)
[junit4:junit4]   2> 	        at java.lang.reflect.Method.invoke(Method.java:597)
[junit4:junit4]   2> 	        at com.carrotsearch.randomizedtesting.RandomizedRunner.invoke(RandomizedRunner.java:1559)
[junit4:junit4]   2> 	        at com.carrotsearch.randomizedtesting.RandomizedRunner.access$600(RandomizedRunner.java:79)
[junit4:junit4]   2> 	        at com.carrotsearch.randomizedtesting.RandomizedRunner$5.evaluate(RandomizedRunner.java:700)
[junit4:junit4]   2> 	        at com.carrotsearch.randomizedtesting.rules.StatementAdapter.evaluate(StatementAdapter.java:36)
[junit4:junit4]   2> 	        at com.carrotsearch.randomizedtesting.rules.SystemPropertiesRestoreRule$1.evaluate(SystemPropertiesRestoreRule.java:53)
[junit4:junit4]   2> 	        at org.apache.lucene.util.AbstractBeforeAfterRule$1.evaluate(AbstractBeforeAfterRule.java:45)
[junit4:junit4]   2> 	        at org.apache.lucene.util.TestRuleStoreClassName$1.evaluate(TestRuleStoreClassName.java:42)
[junit4:junit4]   2> 	        at com.carrotsearch.randomizedtesting.rules.SystemPropertiesInvariantRule$1.evaluate(SystemPropertiesInvariantRule.java:55)
[junit4:junit4]   2> 	        at com.carrotsearch.randomizedtesting.rules.NoShadowingOrOverridesOnMethodsRule$1.evaluate(NoShadowingOrOverridesOnMethodsRule.java:39)
[junit4:junit4]   2> 	        at com.carrotsearch.randomizedtesting.rules.NoShadowingOrOverridesOnMethodsRule$1.evaluate(NoShadowingOrOverridesOnMethodsRule.java:39)
[junit4:junit4]   2> 	        at com.carrotsearch.randomizedtesting.rules.StatementAdapter.evaluate(StatementAdapter.java:36)
[junit4:junit4]   2> 	        at org.apache.lucene.util.TestRuleAssertionsRequired$1.evaluate(TestRuleAssertionsRequired.java:43)
[junit4:junit4]   2> 	        at org.apache.lucene.util.TestRuleMarkFailure$1.evaluate(TestRuleMarkFailure.java:48)
[junit4:junit4]   2> 	        at org.apache.lucene.util.TestRuleIgnoreAfterMaxFailures$1.evaluate(TestRuleIgnoreAfterMaxFailures.java:70)
[junit4:junit4]   2> 	        at org.apache.lucene.util.TestRuleIgnoreTestSuites$1.evaluate(TestRuleIgnoreTestSuites.java:55)
[junit4:junit4]   2> 	        at com.carrotsearch.randomizedtesting.rules.StatementAdapter.evaluate(StatementAdapter.java:36)
[junit4:junit4]   2> 	        at com.carrotsearch.randomizedtesting.ThreadLeakControl$StatementRunner.run(ThreadLeakControl.java:358)
[junit4:junit4]   2> 	        at java.lang.Thread.run(Thread.java:662)
[junit4:junit4]   2> NOTE: test params are: codec=Lucene41: {}, sim=RandomSimilarityProvider(queryNorm=false,coord=no):
{}, locale=ro, timezone=Australia/Tasmania
[junit4:junit4]   2> NOTE: Linux 3.2.0-24-generic amd64/Sun Microsystems Inc. 1.6.0_27
(64-bit)/cpus=8,threads=8,free=243063328,total=326762496
[junit4:junit4]   2> NOTE: All tests run in this JVM: [UniqFieldsUpdateProcessorFactoryTest,
SortByFunctionTest, SearchHandlerTest, IndexSchemaRuntimeFieldTest, CSVRequestHandlerTest,
JSONWriterTest, TestRemoteStreaming, TestXIncludeConfig, PolyFieldTest, CurrencyFieldTest,
ConvertedLegacyTest, TestMultiCoreConfBootstrap, LeaderElectionIntegrationTest]
[junit4:junit4]   2> NOTE: reproduce with: ant test  -Dtestcase=LeaderElectionIntegrationTest
-Dtests.seed=3FA56ED7208D81C -Dtests.slow=true -Dtests.locale=ro -Dtests.timezone=Australia/Tasmania
-Dtests.file.encoding=UTF-8
[junit4:junit4] ERROR   0.00s J6 | LeaderElectionIntegrationTest (suite) <<<
[junit4:junit4]    > Throwable #1: java.lang.Exception: Suite timeout exceeded (>= 7200000
msec).
[junit4:junit4]    > 	at __randomizedtesting.SeedInfo.seed([3FA56ED7208D81C]:0)
[junit4:junit4] Completed on J6 in 7223.29s, 1 test, 2 errors <<< FAILURES!
[junit4:junit4] 
[junit4:junit4] Suite: org.apache.solr.core.RAMDirectoryFactoryTest
[junit4:junit4] Completed on J6 in 0.01s, 1 test, 1 skipped
[junit4:junit4] 
[junit4:junit4] Suite: org.apache.solr.util.FileUtilsTest
[junit4:junit4] Completed on J6 in 0.01s, 1 test, 1 skipped
[junit4:junit4] 
[junit4:junit4] Suite: org.apache.solr.util.TestNumberUtils
[junit4:junit4] Completed on J6 in 0.01s, 1 test, 1 skipped
[junit4:junit4] 
[junit4:junit4] 
[junit4:junit4] Tests with failures:
[junit4:junit4]   - org.apache.solr.cloud.LeaderElectionIntegrationTest.testLeaderElectionAfterClientTimeout
[junit4:junit4]   - org.apache.solr.cloud.LeaderElectionIntegrationTest (suite)
[junit4:junit4] 
[junit4:junit4] 
[junit4:junit4] JVM J0:     1.16 ..   195.72 =   194.56s
[junit4:junit4] JVM J1:     0.89 ..   133.32 =   132.43s
[junit4:junit4] JVM J2:     1.13 ..   137.22 =   136.09s
[junit4:junit4] JVM J3:     1.12 ..   136.48 =   135.36s
[junit4:junit4] JVM J4:     1.12 ..   137.25 =   136.13s
[junit4:junit4] JVM J5:     1.41 ..   163.87 =   162.46s
[junit4:junit4] JVM J6:     0.90 ..  7254.68 =  7253.78s
[junit4:junit4] JVM J7:     0.89 ..   143.91 =   143.03s
[junit4:junit4] Execution time total: 2 hours 54 seconds
[junit4:junit4] Tests summary: 233 suites, 964 tests, 1 suite-level error, 1 error, 10 ignored
(2 assumptions)

BUILD FAILED
<http://sierranevada.servebeer.com/job/fast-io-beasting/ws/build.xml>:39: The following
error occurred while executing this line:
<http://sierranevada.servebeer.com/job/fast-io-beasting/ws/solr/build.xml>:178: The
following error occurred while executing this line:
<http://sierranevada.servebeer.com/job/fast-io-beasting/ws/lucene/module-build.xml>:61:
The following error occurred while executing this line:
<http://sierranevada.servebeer.com/job/fast-io-beasting/ws/lucene/common-build.xml>:1159:
The following error occurred while executing this line:
<http://sierranevada.servebeer.com/job/fast-io-beasting/ws/lucene/common-build.xml>:827:
There were test failures: 233 suites, 964 tests, 1 suite-level error, 1 error, 10 ignored
(2 assumptions)

Total time: 126 minutes 16 seconds
Build step 'Invoke Ant' marked build as failure

---------------------------------------------------------------------
To unsubscribe, e-mail: dev-unsubscribe@lucene.apache.org
For additional commands, e-mail: dev-help@lucene.apache.org


Mime
View raw message