lucene-dev mailing list archives

Site index · List index
Message view « Date » · « Thread »
Top « Date » · « Thread »
From Charlie Cron <hudsonsevilt...@gmail.com>
Subject Build failed in Jenkins: fast-io-beasting #6121
Date Sun, 28 Oct 2012 13:18:14 GMT
See <http://sierranevada.servebeer.com/job/fast-io-beasting/6121/>

------------------------------------------
[...truncated 13484 lines...]
[junit4:junit4]   2> 7222252 T81 oasc.SolrCore.decrefSolrCoreState Closing SolrCoreState
[junit4:junit4]   2> 7222253 T81 oasu.DefaultSolrCoreState.closeIndexWriter SolrCoreState
ref count has reached 0 - closing IndexWriter
[junit4:junit4]   2> 7222253 T81 oasu.DefaultSolrCoreState.closeIndexWriter closing IndexWriter
with IndexWriterCloser
[junit4:junit4]   2> 7222254 T81 oasc.SolrCore.closeSearcher [collection1] Closing main
searcher on request.
[junit4:junit4]   2> 7222536 T135 oaz.ClientCnxn$SendThread.startConnect Opening socket
connection to server localhost.localdomain/127.0.0.1:42588
[junit4:junit4]   2> 7222537 T135 oaz.ClientCnxn$SendThread.run WARNING Session 0x0 for
server null, unexpected error, closing socket connection and attempting reconnect java.net.ConnectException:
Connection refused
[junit4:junit4]   2> 	at sun.nio.ch.SocketChannelImpl.checkConnect(Native Method)
[junit4:junit4]   2> 	at sun.nio.ch.SocketChannelImpl.finishConnect(SocketChannelImpl.java:567)
[junit4:junit4]   2> 	at org.apache.zookeeper.ClientCnxn$SendThread.run(ClientCnxn.java:1143)
[junit4:junit4]   2> 
[junit4:junit4]   2> 7222740 T108 oaz.ClientCnxn$SendThread.startConnect WARNING Unexpected
exception java.lang.InterruptedException: sleep interrupted
[junit4:junit4]   2> 	at java.lang.Thread.sleep(Native Method)
[junit4:junit4]   2> 	at org.apache.zookeeper.ClientCnxn$SendThread.startConnect(ClientCnxn.java:1045)
[junit4:junit4]   2> 	at org.apache.zookeeper.ClientCnxn$SendThread.run(ClientCnxn.java:1101)
[junit4:junit4]   2> 
[junit4:junit4]   2> 7222740 T81 oaz.ZooKeeper.close Session: 0x13aa71790c20007 closed
[junit4:junit4]   2> 7222741 T108 oaz.ClientCnxn$SendThread.startConnect Opening socket
connection to server localhost.localdomain/127.0.0.1:42588
[junit4:junit4]   2> 7222741 T85 oazs.SyncRequestProcessor.run SyncRequestProcessor exited!
[junit4:junit4]   2> 7222742 T81 oazs.FinalRequestProcessor.shutdown shutdown of request
processor complete
[junit4:junit4]   2> 7222788 T81 oazs.FinalRequestProcessor.shutdown shutdown of request
processor complete
[junit4:junit4]   2> 7222788 T81 oas.SolrTestCaseJ4.tearDown ###Ending testSimpleSliceLeaderElection
[junit4:junit4]   2> 7222796 T81 oas.SolrTestCaseJ4.setUp ###Starting testLeaderElectionAfterClientTimeout
[junit4:junit4]   2> Creating dataDir: <http://sierranevada.servebeer.com/job/fast-io-beasting/ws/solr/build/solr-core/test/J3/./solrtest-LeaderElectionIntegrationTest-1351430293103>
[junit4:junit4]   2> 7222797 T81 oasc.ZkTestServer.run STARTING ZK TEST SERVER
[junit4:junit4]   2> 7222799 T137 oazs.ZooKeeperServer.setTickTime tickTime set to 1000
[junit4:junit4]   2> 7222799 T137 oazs.NIOServerCnxn$Factory.<init> binding to port
0.0.0.0/0.0.0.0:0
[junit4:junit4]   2> 7222800 T137 oazsp.FileTxnSnapLog.save Snapshotting: 0
[junit4:junit4]   2> 7222898 T81 oasc.ZkTestServer.run start zk server on port:50537
[junit4:junit4]   2> 7222898 T81 oaz.ZooKeeper.<init> Initiating client connection,
connectString=127.0.0.1:50537 sessionTimeout=10000 watcher=org.apache.solr.common.cloud.ConnectionManager@6fa053d5
[junit4:junit4]   2> 7222899 T142 oaz.ClientCnxn$SendThread.startConnect Opening socket
connection to server /127.0.0.1:50537
[junit4:junit4]   2> 7222901 T142 oaz.ClientCnxn$SendThread.primeConnection Socket connection
established to localhost.localdomain/127.0.0.1:50537, initiating session
[junit4:junit4]   2> 7222901 T138 oazs.NIOServerCnxn$Factory.run Accepted socket connection
from /127.0.0.1:43376
[junit4:junit4]   2> 7222901 T81 oascc.ConnectionManager.waitForConnected Waiting for client
to connect to ZooKeeper
[junit4:junit4]   2> 7222901 T138 oazs.NIOServerCnxn.readConnectRequest Client attempting
to establish new session at /127.0.0.1:43376
[junit4:junit4]   2> 7222902 T140 oazsp.FileTxnLog.append Creating new log file: log.1
[junit4:junit4]   2> 7222906 T140 oazs.NIOServerCnxn.finishSessionInit Established session
0x13aa785c6740000 with negotiated timeout 10000 for client /127.0.0.1:43376
[junit4:junit4]   2> 7222906 T142 oaz.ClientCnxn$SendThread.readConnectResult Session establishment
complete on server localhost.localdomain/127.0.0.1:50537, sessionid = 0x13aa785c6740000, negotiated
timeout = 10000
[junit4:junit4]   2> 7222907 T143 oascc.ConnectionManager.process Watcher org.apache.solr.common.cloud.ConnectionManager@6fa053d5
name:ZooKeeperConnection Watcher:127.0.0.1:50537 got event WatchedEvent state:SyncConnected
type:None path:null path:null type:None
[junit4:junit4]   2> 7222907 T81 oascc.ConnectionManager.waitForConnected Client is connected
to ZooKeeper
[junit4:junit4]   2> 7222908 T81 oascc.SolrZkClient.makePath makePath: /solr
[junit4:junit4]   2> 7222913 T141 oazs.PrepRequestProcessor.pRequest Processed session
termination for sessionid: 0x13aa785c6740000
[junit4:junit4]   2> 7222915 T143 oaz.ClientCnxn$EventThread.run EventThread shut down
[junit4:junit4]   2> 7222915 T81 oaz.ZooKeeper.close Session: 0x13aa785c6740000 closed
[junit4:junit4]   2> 7222916 T138 oazs.NIOServerCnxn.closeSock Closed socket connection
for client /127.0.0.1:43376 which had sessionid 0x13aa785c6740000
[junit4:junit4]   2> 7222916 T81 oaz.ZooKeeper.<init> Initiating client connection,
connectString=127.0.0.1:50537/solr sessionTimeout=10000 watcher=org.apache.solr.common.cloud.ConnectionManager@6bc947
[junit4:junit4]   2> 7222917 T144 oaz.ClientCnxn$SendThread.startConnect Opening socket
connection to server /127.0.0.1:50537
[junit4:junit4]   2> 7222918 T144 oaz.ClientCnxn$SendThread.primeConnection Socket connection
established to localhost.localdomain/127.0.0.1:50537, initiating session
[junit4:junit4]   2> 7222918 T138 oazs.NIOServerCnxn$Factory.run Accepted socket connection
from /127.0.0.1:43377
[junit4:junit4]   2> 7222918 T81 oascc.ConnectionManager.waitForConnected Waiting for client
to connect to ZooKeeper
[junit4:junit4]   2> 7222918 T138 oazs.NIOServerCnxn.readConnectRequest Client attempting
to establish new session at /127.0.0.1:43377
[junit4:junit4]   2> 7222920 T140 oazs.NIOServerCnxn.finishSessionInit Established session
0x13aa785c6740001 with negotiated timeout 10000 for client /127.0.0.1:43377
[junit4:junit4]   2> 7222920 T144 oaz.ClientCnxn$SendThread.readConnectResult Session establishment
complete on server localhost.localdomain/127.0.0.1:50537, sessionid = 0x13aa785c6740001, negotiated
timeout = 10000
[junit4:junit4]   2> 7222921 T145 oascc.ConnectionManager.process Watcher org.apache.solr.common.cloud.ConnectionManager@6bc947
name:ZooKeeperConnection Watcher:127.0.0.1:50537/solr got event WatchedEvent state:SyncConnected
type:None path:null path:null type:None
[junit4:junit4]   2> 7222921 T81 oascc.ConnectionManager.waitForConnected Client is connected
to ZooKeeper
[junit4:junit4]   2> 7222922 T81 oascc.SolrZkClient.makePath makePath: /collections/collection1
[junit4:junit4]   2> 7222928 T81 oascc.SolrZkClient.makePath makePath: /collections/collection1/shards
[junit4:junit4]   2> 7222932 T81 oascc.SolrZkClient.makePath makePath: /collections/control_collection
[junit4:junit4]   2> 7222935 T81 oascc.SolrZkClient.makePath makePath: /collections/control_collection/shards
[junit4:junit4]   2> 7222938 T81 oasc.AbstractZkTestCase.putConfig put <http://sierranevada.servebeer.com/job/fast-io-beasting/ws/solr/build/solr-core/test-files/solr/collection1/conf/solrconfig.xml>
to /configs/conf1/solrconfig.xml
[junit4:junit4]   2> 7222939 T81 oascc.SolrZkClient.makePath makePath: /configs/conf1/solrconfig.xml
[junit4:junit4]   2> 7222948 T81 oasc.AbstractZkTestCase.putConfig put <http://sierranevada.servebeer.com/job/fast-io-beasting/ws/solr/build/solr-core/test-files/solr/collection1/conf/schema.xml>
to /configs/conf1/schema.xml
[junit4:junit4]   2> 7222948 T81 oascc.SolrZkClient.makePath makePath: /configs/conf1/schema.xml
[junit4:junit4]   2> 7222954 T81 oasc.AbstractZkTestCase.putConfig put <http://sierranevada.servebeer.com/job/fast-io-beasting/ws/solr/build/solr-core/test-files/solr/collection1/conf/solrconfig.xml>
to /configs/conf1/solrconfig.xml
[junit4:junit4]   2> 7222955 T81 oascc.SolrZkClient.makePath makePath: /configs/conf1/solrconfig.xml
[junit4:junit4]   2> 7222959 T81 oasc.AbstractZkTestCase.putConfig put <http://sierranevada.servebeer.com/job/fast-io-beasting/ws/solr/build/solr-core/test-files/solr/collection1/conf/stopwords.txt>
to /configs/conf1/stopwords.txt
[junit4:junit4]   2> 7222959 T81 oascc.SolrZkClient.makePath makePath: /configs/conf1/stopwords.txt
[junit4:junit4]   2> 7222963 T81 oasc.AbstractZkTestCase.putConfig put <http://sierranevada.servebeer.com/job/fast-io-beasting/ws/solr/build/solr-core/test-files/solr/collection1/conf/protwords.txt>
to /configs/conf1/protwords.txt
[junit4:junit4]   2> 7222964 T81 oascc.SolrZkClient.makePath makePath: /configs/conf1/protwords.txt
[junit4:junit4]   2> 7222968 T81 oasc.AbstractZkTestCase.putConfig put <http://sierranevada.servebeer.com/job/fast-io-beasting/ws/solr/build/solr-core/test-files/solr/collection1/conf/currency.xml>
to /configs/conf1/currency.xml
[junit4:junit4]   2> 7222969 T81 oascc.SolrZkClient.makePath makePath: /configs/conf1/currency.xml
[junit4:junit4]   2> 7222972 T81 oasc.AbstractZkTestCase.putConfig put <http://sierranevada.servebeer.com/job/fast-io-beasting/ws/solr/build/solr-core/test-files/solr/collection1/conf/open-exchange-rates.json>
to /configs/conf1/open-exchange-rates.json
[junit4:junit4]   2> 7222972 T81 oascc.SolrZkClient.makePath makePath: /configs/conf1/open-exchange-rates.json
[junit4:junit4]   2> 7222977 T81 oasc.AbstractZkTestCase.putConfig put <http://sierranevada.servebeer.com/job/fast-io-beasting/ws/solr/build/solr-core/test-files/solr/collection1/conf/mapping-ISOLatin1Accent.txt>
to /configs/conf1/mapping-ISOLatin1Accent.txt
[junit4:junit4]   2> 7222978 T81 oascc.SolrZkClient.makePath makePath: /configs/conf1/mapping-ISOLatin1Accent.txt
[junit4:junit4]   2> 7222982 T81 oasc.AbstractZkTestCase.putConfig put <http://sierranevada.servebeer.com/job/fast-io-beasting/ws/solr/build/solr-core/test-files/solr/collection1/conf/old_synonyms.txt>
to /configs/conf1/old_synonyms.txt
[junit4:junit4]   2> 7222983 T81 oascc.SolrZkClient.makePath makePath: /configs/conf1/old_synonyms.txt
[junit4:junit4]   2> 7222987 T81 oasc.AbstractZkTestCase.putConfig put <http://sierranevada.servebeer.com/job/fast-io-beasting/ws/solr/build/solr-core/test-files/solr/collection1/conf/synonyms.txt>
to /configs/conf1/synonyms.txt
[junit4:junit4]   2> 7222987 T81 oascc.SolrZkClient.makePath makePath: /configs/conf1/synonyms.txt
[junit4:junit4]   2> 7222991 T141 oazs.PrepRequestProcessor.pRequest Processed session
termination for sessionid: 0x13aa785c6740001
[junit4:junit4]   2> 7222993 T145 oaz.ClientCnxn$EventThread.run EventThread shut down
[junit4:junit4]   2> 7222993 T138 oazs.NIOServerCnxn.closeSock Closed socket connection
for client /127.0.0.1:43377 which had sessionid 0x13aa785c6740001
[junit4:junit4]   2> 7222993 T81 oaz.ZooKeeper.close Session: 0x13aa785c6740001 closed
[junit4:junit4]   2> 7222994 T81 oasc.LeaderElectionIntegrationTest.setUp ####SETUP_START
testLeaderElectionAfterClientTimeout
[junit4:junit4]   2> 7222995 T81 oasc.SolrResourceLoader.locateSolrHome JNDI not configured
for solr (NoInitialContextEx)
[junit4:junit4]   2> 7222995 T81 oasc.SolrResourceLoader.locateSolrHome using system property
solr.solr.home: <http://sierranevada.servebeer.com/job/fast-io-beasting/ws/solr/build/solr-core/test-files/solr>
[junit4:junit4]   2> 7222996 T81 oasc.CoreContainer$Initializer.initialize looking for
solr.xml: <http://sierranevada.servebeer.com/job/fast-io-beasting/ws/solr/build/solr-core/test-files/solr/solr.xml>
[junit4:junit4]   2> 7222996 T81 oasc.CoreContainer.<init> New CoreContainer 120076578
[junit4:junit4]   2> 7222996 T81 oasc.CoreContainer.load Loading CoreContainer using Solr
Home: '<http://sierranevada.servebeer.com/job/fast-io-beasting/ws/solr/build/solr-core/test-files/solr/'>
[junit4:junit4]   2> 7222997 T81 oasc.SolrResourceLoader.<init> new SolrResourceLoader
for directory: '<http://sierranevada.servebeer.com/job/fast-io-beasting/ws/solr/build/solr-core/test-files/solr/'>
[junit4:junit4]   2> 7223014 T81 oasc.CoreContainer.load Registering Log Listener
[junit4:junit4]   2> 7223018 T81 oasc.CoreContainer.initZooKeeper Zookeeper client=127.0.0.1:50537/solr
[junit4:junit4]   2> 7223019 T81 oaz.ZooKeeper.<init> Initiating client connection,
connectString=127.0.0.1:50537/solr sessionTimeout=3000 watcher=org.apache.solr.common.cloud.ConnectionManager@3d2c7eb1
[junit4:junit4]   2> 7223019 T146 oaz.ClientCnxn$SendThread.startConnect Opening socket
connection to server /127.0.0.1:50537
[junit4:junit4]   2> 7223019 T81 oascc.ConnectionManager.waitForConnected Waiting for client
to connect to ZooKeeper
[junit4:junit4]   2> 7223020 T146 oaz.ClientCnxn$SendThread.primeConnection Socket connection
established to localhost.localdomain/127.0.0.1:50537, initiating session
[junit4:junit4]   2> 7223020 T138 oazs.NIOServerCnxn$Factory.run Accepted socket connection
from /127.0.0.1:43378
[junit4:junit4]   2> 7223021 T138 oazs.NIOServerCnxn.readConnectRequest Client attempting
to establish new session at /127.0.0.1:43378
[junit4:junit4]   2> 7223022 T140 oazs.NIOServerCnxn.finishSessionInit Established session
0x13aa785c6740002 with negotiated timeout 3000 for client /127.0.0.1:43378
[junit4:junit4]   2> 7223022 T146 oaz.ClientCnxn$SendThread.readConnectResult Session establishment
complete on server localhost.localdomain/127.0.0.1:50537, sessionid = 0x13aa785c6740002, negotiated
timeout = 3000
[junit4:junit4]   2> 7223023 T147 oascc.ConnectionManager.process Watcher org.apache.solr.common.cloud.ConnectionManager@3d2c7eb1
name:ZooKeeperConnection Watcher:127.0.0.1:50537/solr got event WatchedEvent state:SyncConnected
type:None path:null path:null type:None
[junit4:junit4]   2> 7223023 T81 oascc.ConnectionManager.waitForConnected Client is connected
to ZooKeeper
[junit4:junit4]   2> 7223026 T141 oazs.PrepRequestProcessor.pRequest Got user-level KeeperException
when processing sessionid:0x13aa785c6740002 type:create cxid:0x2 zxid:0xfffffffffffffffe txntype:unknown
reqpath:n/a Error Path:/solr/overseer Error:KeeperErrorCode = NodeExists for /solr/overseer
[junit4:junit4]   2> 7223028 T81 oascc.SolrZkClient.makePath makePath: /live_nodes
[junit4:junit4]   2> 7223029 T81 oasc.ZkController.createEphemeralLiveNode Register node
as live in ZooKeeper:/live_nodes/127.0.0.1:7000_solr
[junit4:junit4]   2> 7223030 T141 oazs.PrepRequestProcessor.pRequest Got user-level KeeperException
when processing sessionid:0x13aa785c6740002 type:delete cxid:0x7 zxid:0xfffffffffffffffe txntype:unknown
reqpath:n/a Error Path:/solr/live_nodes/127.0.0.1:7000_solr Error:KeeperErrorCode = NoNode
for /solr/live_nodes/127.0.0.1:7000_solr
[junit4:junit4]   2> 7223030 T81 oascc.SolrZkClient.makePath makePath: /live_nodes/127.0.0.1:7000_solr
[junit4:junit4]   2> 7223034 T81 oashc.HttpShardHandlerFactory.getParameter Setting socketTimeout
to: 0
[junit4:junit4]   2> 7223034 T81 oashc.HttpShardHandlerFactory.getParameter Setting urlScheme
to: http://
[junit4:junit4]   2> 7223035 T81 oashc.HttpShardHandlerFactory.getParameter Setting connTimeout
to: 0
[junit4:junit4]   2> 7223035 T81 oashc.HttpShardHandlerFactory.getParameter Setting maxConnectionsPerHost
to: 20
[junit4:junit4]   2> 7223035 T81 oashc.HttpShardHandlerFactory.getParameter Setting corePoolSize
to: 0
[junit4:junit4]   2> 7223035 T81 oashc.HttpShardHandlerFactory.getParameter Setting maximumPoolSize
to: 2147483647
[junit4:junit4]   2> 7223035 T81 oashc.HttpShardHandlerFactory.getParameter Setting maxThreadIdleTime
to: 5
[junit4:junit4]   2> 7223035 T81 oashc.HttpShardHandlerFactory.getParameter Setting sizeOfQueue
to: -1
[junit4:junit4]   2> 7223035 T81 oashc.HttpShardHandlerFactory.getParameter Setting fairnessPolicy
to: false
[junit4:junit4]   2> 7223036 T81 oascsi.HttpClientUtil.createClient Creating new http client,
config:maxConnectionsPerHost=20&maxConnections=10000&socketTimeout=0&connTimeout=0&retry=false
[junit4:junit4]   2> 7223040 T81 oascc.SolrZkClient.makePath makePath: /overseer_elect/election
[junit4:junit4]   2> 7223047 T141 oazs.PrepRequestProcessor.pRequest Got user-level KeeperException
when processing sessionid:0x13aa785c6740002 type:delete cxid:0x15 zxid:0xfffffffffffffffe
txntype:unknown reqpath:n/a Error Path:/solr/overseer_elect/leader Error:KeeperErrorCode =
NoNode for /solr/overseer_elect/leader
[junit4:junit4]   2> 7223052 T81 oascc.SolrZkClient.makePath makePath: /overseer_elect/leader
[junit4:junit4]   2> 7223055 T81 oasc.Overseer.start Overseer (id=88567335689125890-127.0.0.1:7000_solr-n_0000000000)
starting
[junit4:junit4]   2> 7223055 T141 oazs.PrepRequestProcessor.pRequest Got user-level KeeperException
when processing sessionid:0x13aa785c6740002 type:create cxid:0x1a zxid:0xfffffffffffffffe
txntype:unknown reqpath:n/a Error Path:/solr/overseer Error:KeeperErrorCode = NodeExists for
/solr/overseer
[junit4:junit4]   2> 7223058 T141 oazs.PrepRequestProcessor.pRequest Got user-level KeeperException
when processing sessionid:0x13aa785c6740002 type:create cxid:0x1b zxid:0xfffffffffffffffe
txntype:unknown reqpath:n/a Error Path:/solr/overseer Error:KeeperErrorCode = NodeExists for
/solr/overseer
[junit4:junit4]   2> 7223060 T141 oazs.PrepRequestProcessor.pRequest Got user-level KeeperException
when processing sessionid:0x13aa785c6740002 type:create cxid:0x1c zxid:0xfffffffffffffffe
txntype:unknown reqpath:n/a Error Path:/solr/overseer Error:KeeperErrorCode = NodeExists for
/solr/overseer
[junit4:junit4]   2> 7223062 T141 oazs.PrepRequestProcessor.pRequest Got user-level KeeperException
when processing sessionid:0x13aa785c6740002 type:create cxid:0x1d zxid:0xfffffffffffffffe
txntype:unknown reqpath:n/a Error Path:/solr/overseer Error:KeeperErrorCode = NodeExists for
/solr/overseer
[junit4:junit4]   2> 7223064 T149 oasc.OverseerCollectionProcessor.run Process current
queue of collection creations
[junit4:junit4]   2> 7223064 T81 oascc.SolrZkClient.makePath makePath: /clusterstate.json
[junit4:junit4]   2> 7223067 T81 oascc.ZkStateReader.createClusterStateWatchersAndUpdate
Updating cluster state from ZooKeeper... 
[junit4:junit4]   2> 7223068 T148 oasc.Overseer$ClusterStateUpdater.run Starting to work
on the main queue
[junit4:junit4]   2> 7223072 T81 oasc.CoreContainer.create Creating SolrCore 'collection1'
using instanceDir: <http://sierranevada.servebeer.com/job/fast-io-beasting/ws/solr/build/solr-core/test-files/solr/collection1>
[junit4:junit4]   2> 7223072 T81 oasc.ZkController.createCollectionZkNode Check for collection
zkNode:collection1
[junit4:junit4]   2> 7223072 T81 oasc.ZkController.createCollectionZkNode Collection zkNode
exists
[junit4:junit4]   2> 7223073 T81 oasc.ZkController.readConfigName Load collection config
from:/collections/collection1
[junit4:junit4]   2> 7223073 T81 oasc.SolrResourceLoader.<init> new SolrResourceLoader
for directory: '<http://sierranevada.servebeer.com/job/fast-io-beasting/ws/solr/build/solr-core/test-files/solr/collection1/'>
[junit4:junit4]   2> 7223074 T81 oasc.SolrResourceLoader.replaceClassLoader Adding '<http://sierranevada.servebeer.com/job/fast-io-beasting/ws/solr/build/solr-core/test-files/solr/collection1/lib/classes/'>
to classloader
[junit4:junit4]   2> 7223074 T81 oasc.SolrResourceLoader.replaceClassLoader Adding '<http://sierranevada.servebeer.com/job/fast-io-beasting/ws/solr/build/solr-core/test-files/solr/collection1/lib/README'>
to classloader
[junit4:junit4]   2> 7223094 T81 oasc.SolrConfig.<init> Using Lucene MatchVersion:
LUCENE_41
[junit4:junit4]   2> 7223115 T81 oasc.SolrConfig.<init> Loaded SolrConfig: solrconfig.xml
[junit4:junit4]   2> 7223116 T81 oass.IndexSchema.readSchema Reading Solr Schema
[junit4:junit4]   2> 7223119 T81 oass.IndexSchema.readSchema Schema name=test
[junit4:junit4]   2> 7223241 T80 ccr.ThreadLeakControl.tryToInterruptAll SEVERE There are
still zombie threads that couldn't be terminated:
[junit4:junit4]   2> 	   1) Thread[id=81, name=TEST-LeaderElectionIntegrationTest.testLeaderElectionAfterClientTimeout-seed#[9261C95A31CB3EA2],
state=RUNNABLE, group=TGRP-LeaderElectionIntegrationTest]
[junit4:junit4]   2> 	        at java.io.UnixFileSystem.getBooleanAttributes0(Native Method)
[junit4:junit4]   2> 	        at java.io.UnixFileSystem.getBooleanAttributes(UnixFileSystem.java:228)
[junit4:junit4]   2> 	        at java.io.File.exists(File.java:733)
[junit4:junit4]   2> 	        at sun.misc.URLClassPath$FileLoader.getResource(URLClassPath.java:999)
[junit4:junit4]   2> 	        at sun.misc.URLClassPath$FileLoader.findResource(URLClassPath.java:966)
[junit4:junit4]   2> 	        at sun.misc.URLClassPath.findResource(URLClassPath.java:146)
[junit4:junit4]   2> 	        at java.net.URLClassLoader$2.run(URLClassLoader.java:385)
[junit4:junit4]   2> 	        at java.security.AccessController.doPrivileged(Native Method)
[junit4:junit4]   2> 	        at java.net.URLClassLoader.findResource(URLClassLoader.java:382)
[junit4:junit4]   2> 	        at java.lang.ClassLoader.getResource(ClassLoader.java:1002)
[junit4:junit4]   2> 	        at java.lang.ClassLoader.getResourceAsStream(ClassLoader.java:1192)
[junit4:junit4]   2> 	        at com.sun.org.apache.xml.internal.dtm.SecuritySupport12$6.run(SecuritySupport12.java:119)
[junit4:junit4]   2> 	        at java.security.AccessController.doPrivileged(Native Method)
[junit4:junit4]   2> 	        at com.sun.org.apache.xml.internal.dtm.SecuritySupport12.getResourceAsStream(SecuritySupport12.java:112)
[junit4:junit4]   2> 	        at com.sun.org.apache.xml.internal.dtm.ObjectFactory.findJarServiceProviderName(ObjectFactory.java:542)
[junit4:junit4]   2> 	        at com.sun.org.apache.xml.internal.dtm.ObjectFactory.lookUpFactoryClassName(ObjectFactory.java:373)
[junit4:junit4]   2> 	        at com.sun.org.apache.xml.internal.dtm.ObjectFactory.lookUpFactoryClass(ObjectFactory.java:206)
[junit4:junit4]   2> 	        at com.sun.org.apache.xml.internal.dtm.ObjectFactory.createObject(ObjectFactory.java:131)
[junit4:junit4]   2> 	        at com.sun.org.apache.xml.internal.dtm.ObjectFactory.createObject(ObjectFactory.java:101)
[junit4:junit4]   2> 	        at com.sun.org.apache.xml.internal.dtm.DTMManager.newInstance(DTMManager.java:135)
[junit4:junit4]   2> 	        at com.sun.org.apache.xpath.internal.XPathContext.<init>(XPathContext.java:100)
[junit4:junit4]   2> 	        at com.sun.org.apache.xpath.internal.jaxp.XPathImpl.eval(XPathImpl.java:201)
[junit4:junit4]   2> 	        at com.sun.org.apache.xpath.internal.jaxp.XPathImpl.evaluate(XPathImpl.java:275)
[junit4:junit4]   2> 	        at org.apache.solr.schema.FieldTypePluginLoader.create(FieldTypePluginLoader.java:94)
[junit4:junit4]   2> 	        at org.apache.solr.schema.FieldTypePluginLoader.create(FieldTypePluginLoader.java:43)
[junit4:junit4]   2> 	        at org.apache.solr.util.plugin.AbstractPluginLoader.load(AbstractPluginLoader.java:151)
[junit4:junit4]   2> 	        at org.apache.solr.schema.IndexSchema.readSchema(IndexSchema.java:369)
[junit4:junit4]   2> 	        at org.apache.solr.schema.IndexSchema.<init>(IndexSchema.java:113)
[junit4:junit4]   2> 	        at org.apache.solr.core.CoreContainer.getSchemaFromZk(CoreContainer.java:1434)
[junit4:junit4]   2> 	        at org.apache.solr.core.CoreContainer.create(CoreContainer.java:825)
[junit4:junit4]   2> 	        at org.apache.solr.core.CoreContainer.load(CoreContainer.java:529)
[junit4:junit4]   2> 	        at org.apache.solr.core.CoreContainer.load(CoreContainer.java:351)
[junit4:junit4]   2> 	        at org.apache.solr.core.CoreContainer$Initializer.initialize(CoreContainer.java:303)
[junit4:junit4]   2> 	        at org.apache.solr.cloud.LeaderElectionIntegrationTest.setupContainer(LeaderElectionIntegrationTest.java:152)
[junit4:junit4]   2> 	        at org.apache.solr.cloud.LeaderElectionIntegrationTest.setUp(LeaderElectionIntegrationTest.java:100)
[junit4:junit4]   2> 	        at sun.reflect.GeneratedMethodAccessor7.invoke(Unknown Source)
[junit4:junit4]   2> 	        at sun.reflect.DelegatingMethodAccessorImpl.invoke(DelegatingMethodAccessorImpl.java:25)
[junit4:junit4]   2> 	        at java.lang.reflect.Method.invoke(Method.java:597)
[junit4:junit4]   2> 	        at com.carrotsearch.randomizedtesting.RandomizedRunner.invoke(RandomizedRunner.java:1559)
[junit4:junit4]   2> 	        at com.carrotsearch.randomizedtesting.RandomizedRunner.access$600(RandomizedRunner.java:79)
[junit4:junit4]   2> 	        at com.carrotsearch.randomizedtesting.RandomizedRunner$7.evaluate(RandomizedRunner.java:771)
[junit4:junit4]   2> 	        at com.carrotsearch.randomizedtesting.RandomizedRunner$8.evaluate(RandomizedRunner.java:787)
[junit4:junit4]   2> 	        at com.carrotsearch.randomizedtesting.rules.SystemPropertiesRestoreRule$1.evaluate(SystemPropertiesRestoreRule.java:53)
[junit4:junit4]   2> 	        at org.apache.lucene.util.TestRuleSetupTeardownChained$1.evaluate(TestRuleSetupTeardownChained.java:50)
[junit4:junit4]   2> 	        at org.apache.lucene.util.TestRuleFieldCacheSanity$1.evaluate(TestRuleFieldCacheSanity.java:51)
[junit4:junit4]   2> 	        at org.apache.lucene.util.AbstractBeforeAfterRule$1.evaluate(AbstractBeforeAfterRule.java:45)
[junit4:junit4]   2> 	        at com.carrotsearch.randomizedtesting.rules.SystemPropertiesInvariantRule$1.evaluate(SystemPropertiesInvariantRule.java:55)
[junit4:junit4]   2> 	        at org.apache.lucene.util.TestRuleThreadAndTestName$1.evaluate(TestRuleThreadAndTestName.java:48)
[junit4:junit4]   2> 	        at org.apache.lucene.util.TestRuleIgnoreAfterMaxFailures$1.evaluate(TestRuleIgnoreAfterMaxFailures.java:70)
[junit4:junit4]   2> 	        at org.apache.lucene.util.TestRuleMarkFailure$1.evaluate(TestRuleMarkFailure.java:48)
[junit4:junit4]   2> 	        at com.carrotsearch.randomizedtesting.rules.StatementAdapter.evaluate(StatementAdapter.java:36)
[junit4:junit4]   2> 	        at com.carrotsearch.randomizedtesting.ThreadLeakControl$StatementRunner.run(ThreadLeakControl.java:358)
[junit4:junit4]   2> 	        at com.carrotsearch.randomizedtesting.ThreadLeakControl.forkTimeoutingTask(ThreadLeakControl.java:782)
[junit4:junit4]   2> 	        at com.carrotsearch.randomizedtesting.ThreadLeakControl$3.evaluate(ThreadLeakControl.java:442)
[junit4:junit4]   2> 	        at com.carrotsearch.randomizedtesting.RandomizedRunner.runSingleTest(RandomizedRunner.java:746)
[junit4:junit4]   2> 	        at com.carrotsearch.randomizedtesting.RandomizedRunner$3.evaluate(RandomizedRunner.java:648)
[junit4:junit4]   2> 	        at com.carrotsearch.randomizedtesting.RandomizedRunner$4.evaluate(RandomizedRunner.java:682)
[junit4:junit4]   2> 	        at com.carrotsearch.randomizedtesting.RandomizedRunner$5.evaluate(RandomizedRunner.java:693)
[junit4:junit4]   2> 	        at com.carrotsearch.randomizedtesting.rules.StatementAdapter.evaluate(StatementAdapter.java:36)
[junit4:junit4]   2> 	        at com.carrotsearch.randomizedtesting.rules.SystemPropertiesRestoreRule$1.evaluate(SystemPropertiesRestoreRule.java:53)
[junit4:junit4]   2> 	        at org.apache.lucene.util.AbstractBeforeAfterRule$1.evaluate(AbstractBeforeAfterRule.java:45)
[junit4:junit4]   2> 	        at org.apache.lucene.util.TestRuleStoreClassName$1.evaluate(TestRuleStoreClassName.java:42)
[junit4:junit4]   2> 	        at com.carrotsearch.randomizedtesting.rules.SystemPropertiesInvariantRule$1.evaluate(SystemPropertiesInvariantRule.java:55)
[junit4:junit4]   2> 	        at com.carrotsearch.randomizedtesting.rules.NoShadowingOrOverridesOnMethodsRule$1.evaluate(NoShadowingOrOverridesOnMethodsRule.java:39)
[junit4:junit4]   2> 	        at com.carrotsearch.randomizedtesting.rules.NoShadowingOrOverridesOnMethodsRule$1.evaluate(NoShadowingOrOverridesOnMethodsRule.java:39)
[junit4:junit4]   2> 	        at com.carrotsearch.randomizedtesting.rules.StatementAdapter.evaluate(StatementAdapter.java:36)
[junit4:junit4]   2> 	        at org.apache.lucene.util.TestRuleAssertionsRequired$1.evaluate(TestRuleAssertionsRequired.java:43)
[junit4:junit4]   2> 	        at org.apache.lucene.util.TestRuleMarkFailure$1.evaluate(TestRuleMarkFailure.java:48)
[junit4:junit4]   2> 	        at org.apache.lucene.util.TestRuleIgnoreAfterMaxFailures$1.evaluate(TestRuleIgnoreAfterMaxFailures.java:70)
[junit4:junit4]   2> 	        at org.apache.lucene.util.TestRuleIgnoreTestSuites$1.evaluate(TestRuleIgnoreTestSuites.java:55)
[junit4:junit4]   2> 	        at com.carrotsearch.randomizedtesting.rules.StatementAdapter.evaluate(StatementAdapter.java:36)
[junit4:junit4]   2> 	        at com.carrotsearch.randomizedtesting.ThreadLeakControl$StatementRunner.run(ThreadLeakControl.java:358)
[junit4:junit4]   2> 	        at java.lang.Thread.run(Thread.java:662)
[junit4:junit4]   2> NOTE: test params are: codec=Lucene41: {}, sim=DefaultSimilarity,
locale=en_AU, timezone=America/Montevideo
[junit4:junit4]   2> NOTE: Linux 3.2.0-24-generic amd64/Sun Microsystems Inc. 1.6.0_27
(64-bit)/cpus=8,threads=13,free=210157608,total=268107776
[junit4:junit4]   2> NOTE: All tests run in this JVM: [XmlUpdateRequestHandlerTest, DirectUpdateHandlerTest,
TestValueSourceCache, IndexBasedSpellCheckerTest, TestSolrXMLSerializer, SpellCheckComponentTest,
TestMergePolicyConfig, PrimitiveFieldTypeTest, DOMUtilTest, TestOmitPositions, SpatialFilterTest,
QueryElevationComponentTest, JsonLoaderTest, TestPropInject, TestJmxMonitoredMap, SolrInfoMBeanTest,
TestConfig, LeaderElectionIntegrationTest]
[junit4:junit4]   2> NOTE: reproduce with: ant test  -Dtestcase=LeaderElectionIntegrationTest
-Dtests.seed=9261C95A31CB3EA2 -Dtests.slow=true -Dtests.locale=en_AU -Dtests.timezone=America/Montevideo
-Dtests.file.encoding=US-ASCII
[junit4:junit4] ERROR   0.00s J3 | LeaderElectionIntegrationTest (suite) <<<
[junit4:junit4]    > Throwable #1: java.lang.Exception: Suite timeout exceeded (>= 7200000
msec).
[junit4:junit4]    > 	at __randomizedtesting.SeedInfo.seed([9261C95A31CB3EA2]:0)
[junit4:junit4] Completed on J3 in 7223.27s, 1 test, 2 errors <<< FAILURES!
[junit4:junit4] 
[junit4:junit4] 
[junit4:junit4] Tests with failures:
[junit4:junit4]   - org.apache.solr.cloud.LeaderElectionIntegrationTest.testSimpleSliceLeaderElection
[junit4:junit4]   - org.apache.solr.cloud.LeaderElectionIntegrationTest (suite)
[junit4:junit4] 
[junit4:junit4] 
[junit4:junit4] JVM J0:     0.89 ..   160.89 =   159.99s
[junit4:junit4] JVM J1:     1.13 ..   120.72 =   119.59s
[junit4:junit4] JVM J2:     0.89 ..   116.78 =   115.88s
[junit4:junit4] JVM J3:     1.13 ..  7268.27 =  7267.15s
[junit4:junit4] JVM J4:     0.89 ..   124.04 =   123.15s
[junit4:junit4] JVM J5:     0.90 ..   116.32 =   115.42s
[junit4:junit4] JVM J6:     0.89 ..   142.40 =   141.51s
[junit4:junit4] JVM J7:     0.90 ..   146.18 =   145.28s
[junit4:junit4] Execution time total: 2 hours 1 minute 8 seconds
[junit4:junit4] Tests summary: 233 suites, 964 tests, 1 suite-level error, 1 error, 7 ignored
(2 assumptions)

BUILD FAILED
<http://sierranevada.servebeer.com/job/fast-io-beasting/ws/build.xml>:39: The following
error occurred while executing this line:
<http://sierranevada.servebeer.com/job/fast-io-beasting/ws/solr/build.xml>:178: The
following error occurred while executing this line:
<http://sierranevada.servebeer.com/job/fast-io-beasting/ws/lucene/module-build.xml>:61:
The following error occurred while executing this line:
<http://sierranevada.servebeer.com/job/fast-io-beasting/ws/lucene/common-build.xml>:1159:
The following error occurred while executing this line:
<http://sierranevada.servebeer.com/job/fast-io-beasting/ws/lucene/common-build.xml>:827:
There were test failures: 233 suites, 964 tests, 1 suite-level error, 1 error, 7 ignored (2
assumptions)

Total time: 125 minutes 54 seconds
Build step 'Invoke Ant' marked build as failure

---------------------------------------------------------------------
To unsubscribe, e-mail: dev-unsubscribe@lucene.apache.org
For additional commands, e-mail: dev-help@lucene.apache.org


Mime
View raw message