lucene-dev mailing list archives

Site index · List index
Message view « Date » · « Thread »
Top « Date » · « Thread »
From Apache Jenkins Server <jenk...@builds.apache.org>
Subject [JENKINS] Lucene-Solr-Tests-trunk-Java6 - Build # 15395 - Failure
Date Wed, 24 Oct 2012 09:01:46 GMT
Build: https://builds.apache.org/job/Lucene-Solr-Tests-trunk-Java6/15395/

3 tests failed.
REGRESSION:  org.apache.solr.cloud.RecoveryZkTest.testDistribSearch

Error Message:
Server at http://127.0.0.1:12865/solr/collection1 returned non ok status:404, message:Can not find: /solr/collection1/select

Stack Trace:
org.apache.solr.common.SolrException: Server at http://127.0.0.1:12865/solr/collection1 returned non ok status:404, message:Can not find: /solr/collection1/select
	at __randomizedtesting.SeedInfo.seed([2B01EE39547E9AED:AAE760212321FAD1]:0)
	at org.apache.solr.client.solrj.impl.HttpSolrServer.request(HttpSolrServer.java:372)
	at org.apache.solr.client.solrj.impl.HttpSolrServer.request(HttpSolrServer.java:181)
	at org.apache.solr.client.solrj.request.QueryRequest.process(QueryRequest.java:90)
	at org.apache.solr.client.solrj.SolrServer.query(SolrServer.java:301)
	at org.apache.solr.cloud.RecoveryZkTest.doTest(RecoveryZkTest.java:92)
	at org.apache.solr.BaseDistributedSearchTestCase.testDistribSearch(BaseDistributedSearchTestCase.java:695)
	at sun.reflect.NativeMethodAccessorImpl.invoke0(Native Method)
	at sun.reflect.NativeMethodAccessorImpl.invoke(NativeMethodAccessorImpl.java:57)
	at sun.reflect.DelegatingMethodAccessorImpl.invoke(DelegatingMethodAccessorImpl.java:43)
	at java.lang.reflect.Method.invoke(Method.java:616)
	at com.carrotsearch.randomizedtesting.RandomizedRunner.invoke(RandomizedRunner.java:1559)
	at com.carrotsearch.randomizedtesting.RandomizedRunner.access$600(RandomizedRunner.java:79)
	at com.carrotsearch.randomizedtesting.RandomizedRunner$6.evaluate(RandomizedRunner.java:737)
	at com.carrotsearch.randomizedtesting.RandomizedRunner$7.evaluate(RandomizedRunner.java:773)
	at com.carrotsearch.randomizedtesting.RandomizedRunner$8.evaluate(RandomizedRunner.java:787)
	at com.carrotsearch.randomizedtesting.rules.SystemPropertiesRestoreRule$1.evaluate(SystemPropertiesRestoreRule.java:53)
	at org.apache.lucene.util.TestRuleSetupTeardownChained$1.evaluate(TestRuleSetupTeardownChained.java:50)
	at org.apache.lucene.util.TestRuleFieldCacheSanity$1.evaluate(TestRuleFieldCacheSanity.java:51)
	at org.apache.lucene.util.AbstractBeforeAfterRule$1.evaluate(AbstractBeforeAfterRule.java:45)
	at com.carrotsearch.randomizedtesting.rules.SystemPropertiesInvariantRule$1.evaluate(SystemPropertiesInvariantRule.java:55)
	at org.apache.lucene.util.TestRuleThreadAndTestName$1.evaluate(TestRuleThreadAndTestName.java:48)
	at org.apache.lucene.util.TestRuleIgnoreAfterMaxFailures$1.evaluate(TestRuleIgnoreAfterMaxFailures.java:70)
	at org.apache.lucene.util.TestRuleMarkFailure$1.evaluate(TestRuleMarkFailure.java:48)
	at com.carrotsearch.randomizedtesting.rules.StatementAdapter.evaluate(StatementAdapter.java:36)
	at com.carrotsearch.randomizedtesting.ThreadLeakControl$StatementRunner.run(ThreadLeakControl.java:358)
	at com.carrotsearch.randomizedtesting.ThreadLeakControl.forkTimeoutingTask(ThreadLeakControl.java:782)
	at com.carrotsearch.randomizedtesting.ThreadLeakControl$3.evaluate(ThreadLeakControl.java:442)
	at com.carrotsearch.randomizedtesting.RandomizedRunner.runSingleTest(RandomizedRunner.java:746)
	at com.carrotsearch.randomizedtesting.RandomizedRunner$3.evaluate(RandomizedRunner.java:648)
	at com.carrotsearch.randomizedtesting.RandomizedRunner$4.evaluate(RandomizedRunner.java:682)
	at com.carrotsearch.randomizedtesting.RandomizedRunner$5.evaluate(RandomizedRunner.java:693)
	at com.carrotsearch.randomizedtesting.rules.StatementAdapter.evaluate(StatementAdapter.java:36)
	at com.carrotsearch.randomizedtesting.rules.SystemPropertiesRestoreRule$1.evaluate(SystemPropertiesRestoreRule.java:53)
	at org.apache.lucene.util.AbstractBeforeAfterRule$1.evaluate(AbstractBeforeAfterRule.java:45)
	at org.apache.lucene.util.TestRuleStoreClassName$1.evaluate(TestRuleStoreClassName.java:42)
	at com.carrotsearch.randomizedtesting.rules.SystemPropertiesInvariantRule$1.evaluate(SystemPropertiesInvariantRule.java:55)
	at com.carrotsearch.randomizedtesting.rules.NoShadowingOrOverridesOnMethodsRule$1.evaluate(NoShadowingOrOverridesOnMethodsRule.java:39)
	at com.carrotsearch.randomizedtesting.rules.NoShadowingOrOverridesOnMethodsRule$1.evaluate(NoShadowingOrOverridesOnMethodsRule.java:39)
	at com.carrotsearch.randomizedtesting.rules.StatementAdapter.evaluate(StatementAdapter.java:36)
	at org.apache.lucene.util.TestRuleAssertionsRequired$1.evaluate(TestRuleAssertionsRequired.java:43)
	at org.apache.lucene.util.TestRuleMarkFailure$1.evaluate(TestRuleMarkFailure.java:48)
	at org.apache.lucene.util.TestRuleIgnoreAfterMaxFailures$1.evaluate(TestRuleIgnoreAfterMaxFailures.java:70)
	at org.apache.lucene.util.TestRuleIgnoreTestSuites$1.evaluate(TestRuleIgnoreTestSuites.java:55)
	at com.carrotsearch.randomizedtesting.rules.StatementAdapter.evaluate(StatementAdapter.java:36)
	at com.carrotsearch.randomizedtesting.ThreadLeakControl$StatementRunner.run(ThreadLeakControl.java:358)
	at java.lang.Thread.run(Thread.java:679)


REGRESSION:  org.apache.solr.update.SoftAutoCommitTest.testSoftAndHardCommitMaxTimeRapidAdds

Error Message:
1: soft occured too fast: 1351068328618 + (500 * 1) !<= 1351068329057

Stack Trace:
java.lang.AssertionError: 1: soft occured too fast: 1351068328618 + (500 * 1) !<= 1351068329057
	at __randomizedtesting.SeedInfo.seed([2B01EE39547E9AED:77144000BFFCDB95]:0)
	at org.junit.Assert.fail(Assert.java:93)
	at org.junit.Assert.assertTrue(Assert.java:43)
	at org.apache.solr.update.SoftAutoCommitTest.testSoftAndHardCommitMaxTimeRapidAdds(SoftAutoCommitTest.java:312)
	at sun.reflect.NativeMethodAccessorImpl.invoke0(Native Method)
	at sun.reflect.NativeMethodAccessorImpl.invoke(NativeMethodAccessorImpl.java:57)
	at sun.reflect.DelegatingMethodAccessorImpl.invoke(DelegatingMethodAccessorImpl.java:43)
	at java.lang.reflect.Method.invoke(Method.java:616)
	at com.carrotsearch.randomizedtesting.RandomizedRunner.invoke(RandomizedRunner.java:1559)
	at com.carrotsearch.randomizedtesting.RandomizedRunner.access$600(RandomizedRunner.java:79)
	at com.carrotsearch.randomizedtesting.RandomizedRunner$6.evaluate(RandomizedRunner.java:737)
	at com.carrotsearch.randomizedtesting.RandomizedRunner$7.evaluate(RandomizedRunner.java:773)
	at com.carrotsearch.randomizedtesting.RandomizedRunner$8.evaluate(RandomizedRunner.java:787)
	at com.carrotsearch.randomizedtesting.rules.SystemPropertiesRestoreRule$1.evaluate(SystemPropertiesRestoreRule.java:53)
	at org.apache.lucene.util.TestRuleSetupTeardownChained$1.evaluate(TestRuleSetupTeardownChained.java:50)
	at org.apache.lucene.util.TestRuleFieldCacheSanity$1.evaluate(TestRuleFieldCacheSanity.java:51)
	at org.apache.lucene.util.AbstractBeforeAfterRule$1.evaluate(AbstractBeforeAfterRule.java:45)
	at com.carrotsearch.randomizedtesting.rules.SystemPropertiesInvariantRule$1.evaluate(SystemPropertiesInvariantRule.java:55)
	at org.apache.lucene.util.TestRuleThreadAndTestName$1.evaluate(TestRuleThreadAndTestName.java:48)
	at org.apache.lucene.util.TestRuleIgnoreAfterMaxFailures$1.evaluate(TestRuleIgnoreAfterMaxFailures.java:70)
	at org.apache.lucene.util.TestRuleMarkFailure$1.evaluate(TestRuleMarkFailure.java:48)
	at com.carrotsearch.randomizedtesting.rules.StatementAdapter.evaluate(StatementAdapter.java:36)
	at com.carrotsearch.randomizedtesting.ThreadLeakControl$StatementRunner.run(ThreadLeakControl.java:358)
	at com.carrotsearch.randomizedtesting.ThreadLeakControl.forkTimeoutingTask(ThreadLeakControl.java:782)
	at com.carrotsearch.randomizedtesting.ThreadLeakControl$3.evaluate(ThreadLeakControl.java:442)
	at com.carrotsearch.randomizedtesting.RandomizedRunner.runSingleTest(RandomizedRunner.java:746)
	at com.carrotsearch.randomizedtesting.RandomizedRunner$3.evaluate(RandomizedRunner.java:648)
	at com.carrotsearch.randomizedtesting.RandomizedRunner$4.evaluate(RandomizedRunner.java:682)
	at com.carrotsearch.randomizedtesting.RandomizedRunner$5.evaluate(RandomizedRunner.java:693)
	at com.carrotsearch.randomizedtesting.rules.StatementAdapter.evaluate(StatementAdapter.java:36)
	at com.carrotsearch.randomizedtesting.rules.SystemPropertiesRestoreRule$1.evaluate(SystemPropertiesRestoreRule.java:53)
	at org.apache.lucene.util.AbstractBeforeAfterRule$1.evaluate(AbstractBeforeAfterRule.java:45)
	at org.apache.lucene.util.TestRuleStoreClassName$1.evaluate(TestRuleStoreClassName.java:42)
	at com.carrotsearch.randomizedtesting.rules.SystemPropertiesInvariantRule$1.evaluate(SystemPropertiesInvariantRule.java:55)
	at com.carrotsearch.randomizedtesting.rules.NoShadowingOrOverridesOnMethodsRule$1.evaluate(NoShadowingOrOverridesOnMethodsRule.java:39)
	at com.carrotsearch.randomizedtesting.rules.NoShadowingOrOverridesOnMethodsRule$1.evaluate(NoShadowingOrOverridesOnMethodsRule.java:39)
	at com.carrotsearch.randomizedtesting.rules.StatementAdapter.evaluate(StatementAdapter.java:36)
	at org.apache.lucene.util.TestRuleAssertionsRequired$1.evaluate(TestRuleAssertionsRequired.java:43)
	at org.apache.lucene.util.TestRuleMarkFailure$1.evaluate(TestRuleMarkFailure.java:48)
	at org.apache.lucene.util.TestRuleIgnoreAfterMaxFailures$1.evaluate(TestRuleIgnoreAfterMaxFailures.java:70)
	at org.apache.lucene.util.TestRuleIgnoreTestSuites$1.evaluate(TestRuleIgnoreTestSuites.java:55)
	at com.carrotsearch.randomizedtesting.rules.StatementAdapter.evaluate(StatementAdapter.java:36)
	at com.carrotsearch.randomizedtesting.ThreadLeakControl$StatementRunner.run(ThreadLeakControl.java:358)
	at java.lang.Thread.run(Thread.java:679)


FAILED:  junit.framework.TestSuite.org.apache.solr.update.SoftAutoCommitTest

Error Message:
ERROR: SolrIndexSearcher opens=11 closes=9

Stack Trace:
java.lang.AssertionError: ERROR: SolrIndexSearcher opens=11 closes=9
	at __randomizedtesting.SeedInfo.seed([2B01EE39547E9AED]:0)
	at org.junit.Assert.fail(Assert.java:93)
	at org.apache.solr.SolrTestCaseJ4.endTrackingSearchers(SolrTestCaseJ4.java:241)
	at org.apache.solr.util.AbstractSolrTestCase.afterClassAbstractSolrTestCase(AbstractSolrTestCase.java:121)
	at sun.reflect.NativeMethodAccessorImpl.invoke0(Native Method)
	at sun.reflect.NativeMethodAccessorImpl.invoke(NativeMethodAccessorImpl.java:57)
	at sun.reflect.DelegatingMethodAccessorImpl.invoke(DelegatingMethodAccessorImpl.java:43)
	at java.lang.reflect.Method.invoke(Method.java:616)
	at com.carrotsearch.randomizedtesting.RandomizedRunner.invoke(RandomizedRunner.java:1559)
	at com.carrotsearch.randomizedtesting.RandomizedRunner.access$600(RandomizedRunner.java:79)
	at com.carrotsearch.randomizedtesting.RandomizedRunner$5.evaluate(RandomizedRunner.java:700)
	at com.carrotsearch.randomizedtesting.rules.StatementAdapter.evaluate(StatementAdapter.java:36)
	at com.carrotsearch.randomizedtesting.rules.SystemPropertiesRestoreRule$1.evaluate(SystemPropertiesRestoreRule.java:53)
	at org.apache.lucene.util.AbstractBeforeAfterRule$1.evaluate(AbstractBeforeAfterRule.java:45)
	at org.apache.lucene.util.TestRuleStoreClassName$1.evaluate(TestRuleStoreClassName.java:42)
	at com.carrotsearch.randomizedtesting.rules.SystemPropertiesInvariantRule$1.evaluate(SystemPropertiesInvariantRule.java:55)
	at com.carrotsearch.randomizedtesting.rules.NoShadowingOrOverridesOnMethodsRule$1.evaluate(NoShadowingOrOverridesOnMethodsRule.java:39)
	at com.carrotsearch.randomizedtesting.rules.NoShadowingOrOverridesOnMethodsRule$1.evaluate(NoShadowingOrOverridesOnMethodsRule.java:39)
	at com.carrotsearch.randomizedtesting.rules.StatementAdapter.evaluate(StatementAdapter.java:36)
	at org.apache.lucene.util.TestRuleAssertionsRequired$1.evaluate(TestRuleAssertionsRequired.java:43)
	at org.apache.lucene.util.TestRuleMarkFailure$1.evaluate(TestRuleMarkFailure.java:48)
	at org.apache.lucene.util.TestRuleIgnoreAfterMaxFailures$1.evaluate(TestRuleIgnoreAfterMaxFailures.java:70)
	at org.apache.lucene.util.TestRuleIgnoreTestSuites$1.evaluate(TestRuleIgnoreTestSuites.java:55)
	at com.carrotsearch.randomizedtesting.rules.StatementAdapter.evaluate(StatementAdapter.java:36)
	at com.carrotsearch.randomizedtesting.ThreadLeakControl$StatementRunner.run(ThreadLeakControl.java:358)
	at java.lang.Thread.run(Thread.java:679)




Build Log:
[...truncated 7781 lines...]
[junit4:junit4] Suite: org.apache.solr.update.SoftAutoCommitTest
[junit4:junit4]   2> -19 T10 oasu.AbstractSolrTestCase.setUp ####SETUP_START testSoftAndHardCommitMaxTimeRapidAdds
[junit4:junit4]   2> 93 T10 oasc.SolrResourceLoader.<init> new SolrResourceLoader for directory: '/usr/home/hudson/hudson-slave/workspace/Lucene-Solr-Tests-trunk-Java6/solr/build/solr-core/test-files/solr/collection1/'
[junit4:junit4]   2> 99 T10 oasc.SolrResourceLoader.replaceClassLoader Adding 'file:/usr/home/hudson/hudson-slave/workspace/Lucene-Solr-Tests-trunk-Java6/solr/build/solr-core/test-files/solr/collection1/lib/classes/' to classloader
[junit4:junit4]   2> 99 T10 oasc.SolrResourceLoader.replaceClassLoader Adding 'file:/usr/home/hudson/hudson-slave/workspace/Lucene-Solr-Tests-trunk-Java6/solr/build/solr-core/test-files/solr/collection1/lib/README' to classloader
[junit4:junit4]   2> 803 T10 oasc.SolrConfig.<init> Using Lucene MatchVersion: LUCENE_50
[junit4:junit4]   2> 1109 T10 oasc.SolrConfig.<init> Loaded SolrConfig: solrconfig.xml
[junit4:junit4]   2> 1178 T10 oass.IndexSchema.readSchema Reading Solr Schema
[junit4:junit4]   2> 1270 T10 oass.IndexSchema.readSchema Schema name=test
[junit4:junit4]   2> 3238 T10 oass.OpenExchangeRatesOrgProvider.init Initialized with rates=open-exchange-rates.json, refreshInterval=1440.
[junit4:junit4]   2> 3266 T10 oass.IndexSchema.readSchema default search field in schema is text
[junit4:junit4]   2> 3269 T10 oass.IndexSchema.readSchema unique key field: id
[junit4:junit4]   2> 3634 T10 oass.FileExchangeRateProvider.reload Reloading exchange rates from file currency.xml
[junit4:junit4]   2> 3648 T10 oass.FileExchangeRateProvider.reload Reloading exchange rates from file currency.xml
[junit4:junit4]   2> 3653 T10 oass.OpenExchangeRatesOrgProvider.reload Reloading exchange rates from open-exchange-rates.json
[junit4:junit4]   2> 3673 T10 oass.OpenExchangeRatesOrgProvider.reload Reloading exchange rates from open-exchange-rates.json
[junit4:junit4]   2> 3724 T10 oasc.SolrResourceLoader.locateSolrHome JNDI not configured for solr (NoInitialContextEx)
[junit4:junit4]   2> 3724 T10 oasc.SolrResourceLoader.locateSolrHome using system property solr.solr.home: /usr/home/hudson/hudson-slave/workspace/Lucene-Solr-Tests-trunk-Java6/solr/build/solr-core/test-files/solr
[junit4:junit4]   2> 3725 T10 oasc.SolrResourceLoader.<init> new SolrResourceLoader for directory: '/usr/home/hudson/hudson-slave/workspace/Lucene-Solr-Tests-trunk-Java6/solr/build/solr-core/test-files/solr/'
[junit4:junit4]   2> 3748 T10 oasc.CoreContainer.<init> New CoreContainer 1679426381
[junit4:junit4]   2> 3868 T10 oasc.SolrCore.<init> [collection1] Opening new SolrCore at /usr/home/hudson/hudson-slave/workspace/Lucene-Solr-Tests-trunk-Java6/solr/build/solr-core/test-files/solr/collection1/, dataDir=/usr/home/hudson/hudson-slave/workspace/Lucene-Solr-Tests-trunk-Java6/solr/build/solr-core/test/J1/./org.apache.solr.update.SoftAutoCommitTest-1351068320469/
[junit4:junit4]   2> 3872 T10 oasc.JmxMonitoredMap.<init> JMX monitoring is enabled. Adding Solr mbeans to JMX Server: com.sun.jmx.mbeanserver.JmxMBeanServer@27958cc2
[junit4:junit4]   2> 4127 T10 oasc.SolrCore.getNewIndexDir New index directory detected: old=null new=/usr/home/hudson/hudson-slave/workspace/Lucene-Solr-Tests-trunk-Java6/solr/build/solr-core/test/J1/./org.apache.solr.update.SoftAutoCommitTest-1351068320469/index/
[junit4:junit4]   2> 4128 T10 oasc.SolrCore.initIndex WARNING [collection1] Solr index directory '/usr/home/hudson/hudson-slave/workspace/Lucene-Solr-Tests-trunk-Java6/solr/build/solr-core/test/J1/./org.apache.solr.update.SoftAutoCommitTest-1351068320469/index' doesn't exist. Creating new index...
[junit4:junit4]   2> 4235 T10 oasc.CachingDirectoryFactory.get return new directory for /usr/home/hudson/hudson-slave/workspace/Lucene-Solr-Tests-trunk-Java6/solr/build/solr-core/test/J1/./org.apache.solr.update.SoftAutoCommitTest-1351068320469/index forceNew:false
[junit4:junit4]   2> 4676 T10 oasc.SolrDeletionPolicy.onCommit SolrDeletionPolicy.onCommit: commits:num=1
[junit4:junit4]   2> 		commit{dir=MockDirWrapper(org.apache.lucene.store.RAMDirectory@7f42731 lockFactory=org.apache.lucene.store.NativeFSLockFactory@3003e926),segFN=segments_1,generation=1,filenames=[segments_1]
[junit4:junit4]   2> 4676 T10 oasc.SolrDeletionPolicy.updateCommits newest commit = 1
[junit4:junit4]   2> 4721 T10 oasc.SolrCore.initWriters created xml: solr.XMLResponseWriter
[junit4:junit4]   2> 5664 T10 oasup.UpdateRequestProcessorChain.init inserting DistributedUpdateProcessorFactory into updateRequestProcessorChain "dedupe"
[junit4:junit4]   2> 5665 T10 oasup.UpdateRequestProcessorChain.init inserting DistributedUpdateProcessorFactory into updateRequestProcessorChain "dedupe-allfields"
[junit4:junit4]   2> 5666 T10 oasup.UpdateRequestProcessorChain.init inserting DistributedUpdateProcessorFactory into updateRequestProcessorChain "stored_sig"
[junit4:junit4]   2> 5673 T10 oasup.UpdateRequestProcessorChain.init inserting DistributedUpdateProcessorFactory into updateRequestProcessorChain "uniq-fields"
[junit4:junit4]   2> 5771 T10 oasup.UpdateRequestProcessorChain.init inserting DistributedUpdateProcessorFactory into updateRequestProcessorChain "distrib-dup-test-chain-implicit"
[junit4:junit4]   2> 5781 T10 oasc.RequestHandlers.initHandlersFromConfig adding lazy requestHandler: solr.ReplicationHandler
[junit4:junit4]   2> 5785 T10 oasc.RequestHandlers.initHandlersFromConfig created /replication: solr.ReplicationHandler
[junit4:junit4]   2> 5816 T10 oasc.RequestHandlers.initHandlersFromConfig created standard: solr.StandardRequestHandler
[junit4:junit4]   2> 5834 T10 oasc.RequestHandlers.initHandlersFromConfig created /get: solr.RealTimeGetHandler
[junit4:junit4]   2> 5888 T10 oasc.RequestHandlers.initHandlersFromConfig created dismax: solr.SearchHandler
[junit4:junit4]   2> 5890 T10 oasc.RequestHandlers.initHandlersFromConfig created mock: org.apache.solr.core.MockQuerySenderListenerReqHandler
[junit4:junit4]   2> 5894 T10 oasc.RequestHandlers.initHandlersFromConfig created /admin/: org.apache.solr.handler.admin.AdminHandlers
[junit4:junit4]   2> 5895 T10 oasc.RequestHandlers.initHandlersFromConfig created defaults: solr.StandardRequestHandler
[junit4:junit4]   2> 5896 T10 oasc.RequestHandlers.initHandlersFromConfig adding lazy requestHandler: solr.StandardRequestHandler
[junit4:junit4]   2> 5897 T10 oasc.RequestHandlers.initHandlersFromConfig created lazy: solr.StandardRequestHandler
[junit4:junit4]   2> 5924 T10 oasc.RequestHandlers.initHandlersFromConfig created /update: solr.UpdateRequestHandler
[junit4:junit4]   2> 5925 T10 oasc.RequestHandlers.initHandlersFromConfig created /terms: org.apache.solr.handler.component.SearchHandler
[junit4:junit4]   2> 5926 T10 oasc.RequestHandlers.initHandlersFromConfig created spellCheckCompRH: org.apache.solr.handler.component.SearchHandler
[junit4:junit4]   2> 5927 T10 oasc.RequestHandlers.initHandlersFromConfig created spellCheckCompRH_Direct: org.apache.solr.handler.component.SearchHandler
[junit4:junit4]   2> 5928 T10 oasc.RequestHandlers.initHandlersFromConfig created spellCheckWithWordbreak: org.apache.solr.handler.component.SearchHandler
[junit4:junit4]   2> 5929 T10 oasc.RequestHandlers.initHandlersFromConfig created spellCheckWithWordbreak_Direct: org.apache.solr.handler.component.SearchHandler
[junit4:junit4]   2> 5930 T10 oasc.RequestHandlers.initHandlersFromConfig created spellCheckCompRH1: org.apache.solr.handler.component.SearchHandler
[junit4:junit4]   2> 5931 T10 oasc.RequestHandlers.initHandlersFromConfig created tvrh: org.apache.solr.handler.component.SearchHandler
[junit4:junit4]   2> 5949 T10 oasc.RequestHandlers.initHandlersFromConfig created /mlt: solr.MoreLikeThisHandler
[junit4:junit4]   2> 5967 T10 oasc.RequestHandlers.initHandlersFromConfig created /debug/dump: solr.DumpRequestHandler
[junit4:junit4]   2> 6087 T10 oashl.XMLLoader.init xsltCacheLifetimeSeconds=60
[junit4:junit4]   2> 6111 T10 oasc.SolrCore.initDeprecatedSupport WARNING solrconfig.xml uses deprecated <admin/gettableFiles>, Please update your config to use the ShowFileRequestHandler.
[junit4:junit4]   2> 6132 T10 oasc.SolrCore.initDeprecatedSupport WARNING adding ShowFileRequestHandler with hidden files: [THROW.ERROR.ON.ADD.UPDATEPROCESSOR.JS, SOLRCONFIG-HIGHLIGHT.XML, SCHEMA-REQUIRED-FIELDS.XML, BAD-SCHEMA-DUP-DYNAMICFIELD.XML, SCHEMA-MINIMAL.XML, TRIVIAL.UPDATEPROCESSOR1.JS, SCHEMA-REPLICATION2.XML, SOLRCONFIG-CACHING.XML, SOLRCONFIG-REPEATER.XML, SOLRCONFIG-MERGEPOLICY.XML, BAD-SCHEMA-NONTEXT-ANALYZER.XML, CURRENCY.XML, SOLRCONFIG-TLOG.XML, SOLRCONFIG-MASTER.XML, BAD-SCHEMA-UNIQUEKEY-MULTIVALUED.XML, SCHEMA11.XML, SOLRCONFIG-BASIC.XML, DA_COMPOUNDDICTIONARY.TXT, MISSLEADING.EXTENSION.UPDATEPROCESSOR.JS.TXT, SCHEMA-COPYFIELD-TEST.XML, SOLRCONFIG-SLAVE.XML, SOLRCONFIG-PROPINJECT-INDEXDEFAULT.XML, ELEVATE.XML, TRIVIAL.UPDATEPROCESSOR0.JS, BAD-SOLRCONFIG-BOGUS-SCRIPTENGINE-NAME.XML, SCHEMA-CHARFILTERS.XML, SCHEMA-IB.XML, SOLRCONFIG-QUERYSENDER.XML, DA_UTF8.XML, SCHEMA-REPLICATION1.XML, SOLRCONFIG-SNIPPET-PROCESSOR.XML, CONDITIONAL.UPDATEPROCESSOR.JS, MISSING.FUNCTIONS.UPDATEPROCESSOR.JS, HYPHENATION.DTD, SOLRCONFIG-ENABLEPLUGIN.XML, SCHEMA-PHRASESUGGEST.XML, STEMDICT.TXT, HUNSPELL-TEST.AFF, SCHEMA-SNIPPET-TYPE.XML, STOPTYPES-1.TXT, STOPWORDSWRONGENCODING.TXT, SCHEMA-NUMERIC.XML, SOLRCONFIG-TRANSFORMERS.XML, SOLRCONFIG-PROPINJECT.XML, BAD-SCHEMA-NOT-INDEXED-BUT-TF.XML, SOLRCONFIG-SIMPLELOCK.XML, WDFTYPES.TXT, SCHEMA-REVERSED.XML, STOPTYPES-2.TXT, BAD-SCHEMA-CURRENCY-FT-MULTIVALUED.XML, SOLRCONFIG-SPELLCHECKCOMPONENT.XML, BAD-SCHEMA-CURRENCY-MULTIVALUED.XML, SOLRCONFIG-PHRASESUGGEST.XML, SCHEMA-DFR.XML, BAD-SCHEMA-NOT-INDEXED-BUT-POS.XML, KEEP-1.TXT, SCHEMA-SPATIAL.XML, OPEN-EXCHANGE-RATES.JSON, STOPWITHBOM.TXT, SCHEMA-BINARYFIELD.XML, SOLRCONFIG-SPELLCHECKER.XML, SOLRCONFIG-UPDATE-PROCESSOR-CHAINS.XML, BAD-SCHEMA-OMIT-TF-BUT-NOT-POS.XML, SCHEMA-XINCLUDE.XML, BAD-SCHEMA-DUP-FIELDTYPE.XML, SOLRCONFIG-MASTER1.XML, SYNONYMS.TXT, BAD-SCHEMA-CURRENCY-DYNAMIC-MULTIVALUED.XML, SCHEMA_CODEC.XML, SCHEMA.XML, SOLRCONFIG-SOLR-749.XML, SOLRCONFIG-MASTER1-KEEPONEBACKUP.XML, SOLRCONFIG-FUNCTIONQUERY.XML, STOP-2.TXT, SCHEMA-LMDIRICHLET.XML, SOLRCONFIG-TERMINDEX.XML, SOLRCONFIG-ELEVATE.XML, SCHEMA-FOLDING.XML, STOPWORDS.TXT, SCHEMA-STOP-KEEP.XML, BAD-SCHEMA-NOT-INDEXED-BUT-NORMS.XML, SOLRCONFIG-SOLCOREPROPERTIES.XML, STOP-1.TXT, SOLRCONFIG-MASTER2.XML, SCHEMA-SPELLCHECKER.XML, SOLRCONFIG-RESPONSE-LOG-COMPONENT.XML, SOLRCONFIG-LAZYWRITER.XML, SCHEMA-LUCENEMATCHVERSION.XML, BAD-MP-SOLRCONFIG.XML, FRENCHARTICLES.TXT, SCHEMA15.XML, SOLRCONFIG-REQHANDLER.INCL, SCHEMASURROUND.XML, SOLRCONFIG-MASTER3.XML, HUNSPELL-TEST.DIC, BAD-SCHEMA-CODEC-GLOBAL-VS-FT-MISMATCH.XML, SOLRCONFIG-XINCLUDE.XML, SOLRCONFIG-DELPOLICY1.XML, SOLRCONFIG-SLAVE1.XML, SCHEMA-SIM.XML, SCHEMA-SNIPPET-FIELD.XML, SCHEMA-COLLATE.XML, STOP-SNOWBALL.TXT, BAD-SCHEMA-SIM-GLOBAL-VS-FT-MISMATCH.XML, PROTWORDS.TXT, SCHEMA-TRIE.XML, SOLRCONFIG_CODEC.XML, BAD-SOLRCONFIG-INVALID-SCRIPTFILE.XML, JASUGGEST.TXT, SCHEMA-TFIDF.XML, SOLRCONFIG-SCRIPT-UPDATEPROCESSOR.XML, SCHEMA-LMJELINEKMERCER.XML, PHRASESUGGEST.TXT, BAD-SOLRCONFIG-MISSING-SCRIPTFILE.XML, BAD-SCHEMA-UNIQUEKEY-USES-DEFAULT.XML, OLD_SYNONYMS.TXT, SOLRCONFIG-DELPOLICY2.XML, XSLT, SOLRCONFIG-NATIVELOCK.XML, BAD-SCHEMA-DUP-FIELD.XML, SOLRCONFIG-NOCACHE.XML, SCHEMA-BM25.XML, ADDFIELDS.UPDATEPROCESSOR.JS, SOLRCONFIG-QUERYSENDER-NOQUERY.XML, SOLRCONFIG-ALTDIRECTORY.XML, COMPOUNDDICTIONARY.TXT, SOLRCONFIG-INDEXCONFIG.XML, SOLRCONFIG_PERF.XML, BAD-SCHEMA-ANALYZER-CLASS-AND-NESTED.XML, SCHEMA-NOT-REQUIRED-UNIQUE-KEY.XML, KEEP-2.TXT, BAD-SCHEMA-UNIQUEKEY-IS-COPYFIELD-DEST.XML, SCHEMA12.XML, MAPPING-ISOLATIN1ACCENT.TXT, BAD_SOLRCONFIG.XML, BAD-SCHEMA-EXTERNAL-FILEFIELD.XML]
[junit4:junit4]   2> 6189 T10 oass.SolrIndexSearcher.<init> Opening Searcher@2259a735 main
[junit4:junit4]   2> 6189 T10 oass.SolrIndexSearcher.getIndexDir WARNING WARNING: Directory impl does not support setting indexDir: org.apache.lucene.store.MockDirectoryWrapper
[junit4:junit4]   2> 6249 T10 oasu.CommitTracker.<init> Hard AutoCommit: disabled
[junit4:junit4]   2> 6250 T10 oasu.CommitTracker.<init> Soft AutoCommit: disabled
[junit4:junit4]   2> 6251 T10 oashc.SpellCheckComponent.inform Initializing spell checkers
[junit4:junit4]   2> 6393 T10 oass.DirectSolrSpellChecker.init init: {name=direct,classname=DirectSolrSpellChecker,field=lowerfilt,minQueryLength=3}
[junit4:junit4]   2> 6690 T10 oashc.HttpShardHandlerFactory.getParameter Setting socketTimeout to: 0
[junit4:junit4]   2> 6691 T10 oashc.HttpShardHandlerFactory.getParameter Setting urlScheme to: http://
[junit4:junit4]   2> 6691 T10 oashc.HttpShardHandlerFactory.getParameter Setting connTimeout to: 0
[junit4:junit4]   2> 6692 T10 oashc.HttpShardHandlerFactory.getParameter Setting maxConnectionsPerHost to: 20
[junit4:junit4]   2> 6693 T10 oashc.HttpShardHandlerFactory.getParameter Setting corePoolSize to: 0
[junit4:junit4]   2> 6693 T10 oashc.HttpShardHandlerFactory.getParameter Setting maximumPoolSize to: 2147483647
[junit4:junit4]   2> 6694 T10 oashc.HttpShardHandlerFactory.getParameter Setting maxThreadIdleTime to: 5
[junit4:junit4]   2> 6694 T10 oashc.HttpShardHandlerFactory.getParameter Setting sizeOfQueue to: -1
[junit4:junit4]   2> 6695 T10 oashc.HttpShardHandlerFactory.getParameter Setting fairnessPolicy to: false
[junit4:junit4]   2> 6729 T10 oascsi.HttpClientUtil.createClient Creating new http client, config:maxConnectionsPerHost=20&maxConnections=10000&socketTimeout=0&connTimeout=0&retry=false
[junit4:junit4]   2> 7257 T11 oasc.SolrCore.registerSearcher [collection1] Registered new searcher Searcher@2259a735 main{StandardDirectoryReader(segments_1:1)}
[junit4:junit4]   2> 7268 T10 oasc.CoreContainer.register registering core: collection1
[junit4:junit4]   2> 7277 T10 oasu.AbstractSolrTestCase.setUp ####SETUP_END testSoftAndHardCommitMaxTimeRapidAdds
[junit4:junit4]   2> ASYNC  NEW_CORE C0 name=collection1 org.apache.solr.core.SolrCore@39abdac9
[junit4:junit4]   2> 7711 T10 C0 oasc.SolrDeletionPolicy.onInit SolrDeletionPolicy.onInit: commits:num=1
[junit4:junit4]   2> 		commit{dir=MockDirWrapper(org.apache.lucene.store.RAMDirectory@7f42731 lockFactory=org.apache.lucene.store.NativeFSLockFactory@3003e926),segFN=segments_1,generation=1,filenames=[segments_1]
[junit4:junit4]   2> 7715 T10 C0 oasc.SolrDeletionPolicy.updateCommits newest commit = 1
[junit4:junit4]   2> 8096 T10 C0 UPDATE [collection1] webapp=null path=null params={} {add=[5000]} 0 742
[junit4:junit4]   2> 8179 T10 C0 UPDATE [collection1] webapp=null path=null params={} {add=[5001]} 0 2
[junit4:junit4]   2> 8198 T10 C0 UPDATE [collection1] webapp=null path=null params={} {add=[5002]} 0 2
[junit4:junit4]   2> 8218 T10 C0 UPDATE [collection1] webapp=null path=null params={} {add=[5003]} 0 2
[junit4:junit4]   2> 8252 T10 C0 UPDATE [collection1] webapp=null path=null params={} {add=[5004]} 0 3
[junit4:junit4]   2> 8594 T13 oasu.DirectUpdateHandler2.commit start commit{flags=0,_version_=0,optimize=false,openSearcher=true,waitSearcher=true,expungeDeletes=false,softCommit=true}
[junit4:junit4]   2> 8595 T10 oasu.AbstractSolrTestCase.tearDown ####TEARDOWN_START testSoftAndHardCommitMaxTimeRapidAdds
[junit4:junit4]   2> 8606 T10 oasc.CoreContainer.shutdown Shutting down CoreContainer instance=1679426381
[junit4:junit4]   2> 8606 T10 oasc.SolrCore.close [collection1]  CLOSING SolrCore org.apache.solr.core.SolrCore@39abdac9
[junit4:junit4]   2> 8648 T10 oasu.DirectUpdateHandler2.close closing DirectUpdateHandler2{commits=1,autocommit maxTime=1200ms,autocommits=0,soft autocommit maxTime=500ms,soft autocommits=1,optimizes=0,rollbacks=0,expungeDeletes=0,docsPending=5,adds=5,deletesById=0,deletesByQuery=0,errors=0,cumulative_adds=5,cumulative_deletesById=0,cumulative_deletesByQuery=0,cumulative_errors=0}
[junit4:junit4]   2> 8649 T10 oasc.SolrCore.decrefSolrCoreState Closing SolrCoreState
[junit4:junit4]   2> 8649 T10 oasu.DefaultSolrCoreState.closeIndexWriter SolrCoreState ref count has reached 0 - closing IndexWriter
[junit4:junit4]   2> 8650 T10 oasu.DefaultSolrCoreState.closeIndexWriter closing IndexWriter with IndexWriterCloser
[junit4:junit4]   2> 9422 T13 oass.SolrIndexSearcher.<init> Opening Searcher@c9c6201 main
[junit4:junit4]   2> 9423 T13 oass.SolrIndexSearcher.getIndexDir WARNING WARNING: Directory impl does not support setting indexDir: org.apache.lucene.store.MockDirectoryWrapper
[junit4:junit4]   2> 9423 T10 C0 oasc.SolrDeletionPolicy.onCommit SolrDeletionPolicy.onCommit: commits:num=2
[junit4:junit4]   2> 		commit{dir=MockDirWrapper(org.apache.lucene.store.RAMDirectory@7f42731 lockFactory=org.apache.lucene.store.NativeFSLockFactory@3003e926),segFN=segments_1,generation=1,filenames=[segments_1]
[junit4:junit4]   2> 		commit{dir=MockDirWrapper(org.apache.lucene.store.RAMDirectory@7f42731 lockFactory=org.apache.lucene.store.NativeFSLockFactory@3003e926),segFN=segments_2,generation=2,filenames=[_0_Asserting_0.tim, _0_Asserting_0.tip, _0_TestBloomFilteredLucene41Postings_0.tim, _0_TestBloomFilteredLucene41Postings_0.tip, _0_TestBloomFilteredLucene41Postings_0.pos, _0_SimpleText_0.pst, _0.si, _0_Asserting_0.doc, _0_MockRandom_0.tib, _0.fnm, _0_TestBloomFilteredLucene41Postings_0.blm, _0_nrm.cfs, _0_MockRandom_0.skp, _0_MockRandom_0.sd, _0_MockRandom_0.frq, _0_MockRandom_0.tiv, _0_MockRandom_0.doc, _0_nrm.cfe, _0_MockRandom_0.pos, segments_2, _0_TestBloomFilteredLucene41Postings_0.doc, _0.fdx, _0_Asserting_0.pos, _0_MockRandom_0.pyl, _0.fdt]
[junit4:junit4]   2> 9424 T10 C0 oasc.SolrDeletionPolicy.updateCommits newest commit = 2
[junit4:junit4]   2> 9425 T10 oasc.SolrCore.closeSearcher [collection1] Closing main searcher on request.
[junit4:junit4]   2> 9428 T10 oasc.SolrException.log SEVERE Error closing directory:java.lang.RuntimeException: MockDirectoryWrapper: cannot close: there are still open files: {_0_Asserting_0.tim=1, _0_MockRandom_0.tib=1, _0_TestBloomFilteredLucene41Postings_0.tim=1, _0_nrm.cfs=7, _0_TestBloomFilteredLucene41Postings_0.pos=1, _0_MockRandom_0.skp=1, _0_MockRandom_0.frq=1, _0_MockRandom_0.doc=1, _0_MockRandom_0.pos=1, _0_SimpleText_0.pst=1, _0_TestBloomFilteredLucene41Postings_0.doc=1, _0.fdx=1, _0_MockRandom_0.pyl=1, _0_Asserting_0.pos=1, _0.fdt=1, _0_Asserting_0.doc=1}
[junit4:junit4]   2> 		at org.apache.lucene.store.MockDirectoryWrapper.close(MockDirectoryWrapper.java:590)
[junit4:junit4]   2> 		at org.apache.solr.core.CachingDirectoryFactory.close(CachingDirectoryFactory.java:112)
[junit4:junit4]   2> 		at org.apache.solr.core.SolrCore.close(SolrCore.java:954)
[junit4:junit4]   2> 		at org.apache.solr.core.CoreContainer.shutdown(CoreContainer.java:590)
[junit4:junit4]   2> 		at org.apache.solr.util.TestHarness.close(TestHarness.java:447)
[junit4:junit4]   2> 		at org.apache.solr.util.AbstractSolrTestCase.tearDown(AbstractSolrTestCase.java:209)
[junit4:junit4]   2> 		at sun.reflect.NativeMethodAccessorImpl.invoke0(Native Method)
[junit4:junit4]   2> 		at sun.reflect.NativeMethodAccessorImpl.invoke(NativeMethodAccessorImpl.java:57)
[junit4:junit4]   2> 		at sun.reflect.DelegatingMethodAccessorImpl.invoke(DelegatingMethodAccessorImpl.java:43)
[junit4:junit4]   2> 		at java.lang.reflect.Method.invoke(Method.java:616)
[junit4:junit4]   2> 		at com.carrotsearch.randomizedtesting.RandomizedRunner.invoke(RandomizedRunner.java:1559)
[junit4:junit4]   2> 		at com.carrotsearch.randomizedtesting.RandomizedRunner.access$600(RandomizedRunner.java:79)
[junit4:junit4]   2> 		at com.carrotsearch.randomizedtesting.RandomizedRunner$8.evaluate(RandomizedRunner.java:795)
[junit4:junit4]   2> 		at com.carrotsearch.randomizedtesting.rules.SystemPropertiesRestoreRule$1.evaluate(SystemPropertiesRestoreRule.java:53)
[junit4:junit4]   2> 		at org.apache.lucene.util.TestRuleSetupTeardownChained$1.evaluate(TestRuleSetupTeardownChained.java:50)
[junit4:junit4]   2> 		at org.apache.lucene.util.TestRuleFieldCacheSanity$1.evaluate(TestRuleFieldCacheSanity.java:51)
[junit4:junit4]   2> 		at org.apache.lucene.util.AbstractBeforeAfterRule$1.evaluate(AbstractBeforeAfterRule.java:45)
[junit4:junit4]   2> 		at com.carrotsearch.randomizedtesting.rules.SystemPropertiesInvariantRule$1.evaluate(SystemPropertiesInvariantRule.java:55)
[junit4:junit4]   2> 		at org.apache.lucene.util.TestRuleThreadAndTestName$1.evaluate(TestRuleThreadAndTestName.java:48)
[junit4:junit4]   2> 		at org.apache.lucene.util.TestRuleIgnoreAfterMaxFailures$1.evaluate(TestRuleIgnoreAfterMaxFailures.java:70)
[junit4:junit4]   2> 		at org.apache.lucene.util.TestRuleMarkFailure$1.evaluate(TestRuleMarkFailure.java:48)
[junit4:junit4]   2> 		at com.carrotsearch.randomizedtesting.rules.StatementAdapter.evaluate(StatementAdapter.java:36)
[junit4:junit4]   2> 		at com.carrotsearch.randomizedtesting.ThreadLeakControl$StatementRunner.run(ThreadLeakControl.java:358)
[junit4:junit4]   2> 		at com.carrotsearch.randomizedtesting.ThreadLeakControl.forkTimeoutingTask(ThreadLeakControl.java:782)
[junit4:junit4]   2> 		at com.carrotsearch.randomizedtesting.ThreadLeakControl$3.evaluate(ThreadLeakControl.java:442)
[junit4:junit4]   2> 		at com.carrotsearch.randomizedtesting.RandomizedRunner.runSingleTest(RandomizedRunner.java:746)
[junit4:junit4]   2> 		at com.carrotsearch.randomizedtesting.RandomizedRunner$3.evaluate(RandomizedRunner.java:648)
[junit4:junit4]   2> 		at com.carrotsearch.randomizedtesting.RandomizedRunner$4.evaluate(RandomizedRunner.java:682)
[junit4:junit4]   2> 		at com.carrotsearch.randomizedtesting.RandomizedRunner$5.evaluate(RandomizedRunner.java:693)
[junit4:junit4]   2> 		at com.carrotsearch.randomizedtesting.rules.StatementAdapter.evaluate(StatementAdapter.java:36)
[junit4:junit4]   2> 		at com.carrotsearch.randomizedtesting.rules.SystemPropertiesRestoreRule$1.evaluate(SystemPropertiesRestoreRule.java:53)
[junit4:junit4]   2> 		at org.apache.lucene.util.AbstractBeforeAfterRule$1.evaluate(AbstractBeforeAfterRule.java:45)
[junit4:junit4]   2> 		at org.apache.lucene.util.TestRuleStoreClassName$1.evaluate(TestRuleStoreClassName.java:42)
[junit4:junit4]   2> 		at com.carrotsearch.randomizedtesting.rules.SystemPropertiesInvariantRule$1.evaluate(SystemPropertiesInvariantRule.java:55)
[junit4:junit4]   2> 		at com.carrotsearch.randomizedtesting.rules.NoShadowingOrOverridesOnMethodsRule$1.evaluate(NoShadowingOrOverridesOnMethodsRule.java:39)
[junit4:junit4]   2> 		at com.carrotsearch.randomizedtesting.rules.NoShadowingOrOverridesOnMethodsRule$1.evaluate(NoShadowingOrOverridesOnMethodsRule.java:39)
[junit4:junit4]   2> 		at com.carrotsearch.randomizedtesting.rules.StatementAdapter.evaluate(StatementAdapter.java:36)
[junit4:junit4]   2> 		at org.apache.lucene.util.TestRuleAssertionsRequired$1.evaluate(TestRuleAssertionsRequired.java:43)
[junit4:junit4]   2> 		at org.apache.lucene.util.TestRuleMarkFailure$1.evaluate(TestRuleMarkFailure.java:48)
[junit4:junit4]   2> 		at org.apache.lucene.util.TestRuleIgnoreAfterMaxFailures$1.evaluate(TestRuleIgnoreAfterMaxFailures.java:70)
[junit4:junit4]   2> 		at org.apache.lucene.util.TestRuleIgnoreTestSuites$1.evaluate(TestRuleIgnoreTestSuites.java:55)
[junit4:junit4]   2> 		at com.carrotsearch.randomizedtesting.rules.StatementAdapter.evaluate(StatementAdapter.java:36)
[junit4:junit4]   2> 		at com.carrotsearch.randomizedtesting.ThreadLeakControl$StatementRunner.run(ThreadLeakControl.java:358)
[junit4:junit4]   2> 		at java.lang.Thread.run(Thread.java:679)
[junit4:junit4]   2> 	Caused by: java.lang.RuntimeException: unclosed IndexInput: _0_MockRandom_0.skp
[junit4:junit4]   2> 		at org.apache.lucene.store.MockDirectoryWrapper.addFileHandle(MockDirectoryWrapper.java:481)
[junit4:junit4]   2> 		at org.apache.lucene.store.MockDirectoryWrapper.openInput(MockDirectoryWrapper.java:523)
[junit4:junit4]   2> 		at org.apache.lucene.codecs.sep.SepPostingsReader.<init>(SepPostingsReader.java:71)
[junit4:junit4]   2> 		at org.apache.lucene.codecs.mockrandom.MockRandomPostingsFormat.fieldsProducer(MockRandomPostingsFormat.java:311)
[junit4:junit4]   2> 		at org.apache.lucene.codecs.perfield.PerFieldPostingsFormat$FieldsReader.<init>(PerFieldPostingsFormat.java:194)
[junit4:junit4]   2> 		at org.apache.lucene.codecs.perfield.PerFieldPostingsFormat.fieldsProducer(PerFieldPostingsFormat.java:233)
[junit4:junit4]   2> 		at org.apache.lucene.index.SegmentCoreReaders.<init>(SegmentCoreReaders.java:107)
[junit4:junit4]   2> 		at org.apache.lucene.index.SegmentReader.<init>(SegmentReader.java:57)
[junit4:junit4]   2> 		at org.apache.lucene.index.ReadersAndLiveDocs.getReader(ReadersAndLiveDocs.java:120)
[junit4:junit4]   2> 		at org.apache.lucene.index.ReadersAndLiveDocs.getReadOnlyClone(ReadersAndLiveDocs.java:205)
[junit4:junit4]   2> 		at org.apache.lucene.index.StandardDirectoryReader.open(StandardDirectoryReader.java:96)
[junit4:junit4]   2> 		at org.apache.lucene.index.IndexWriter.getReader(IndexWriter.java:364)
[junit4:junit4]   2> 		at org.apache.lucene.index.StandardDirectoryReader.doOpenIfChanged(StandardDirectoryReader.java:257)
[junit4:junit4]   2> 		at org.apache.lucene.index.DirectoryReader.openIfChanged(DirectoryReader.java:249)
[junit4:junit4]   2> 		at org.apache.solr.core.SolrCore.openNewSearcher(SolrCore.java:1300)
[junit4:junit4]   2> 		at org.apache.solr.core.SolrCore.getSearcher(SolrCore.java:1473)
[junit4:junit4]   2> 		at org.apache.solr.update.DirectUpdateHandler2.commit(DirectUpdateHandler2.java:546)
[junit4:junit4]   2> 		at org.apache.solr.update.CommitTracker.run(CommitTracker.java:215)
[junit4:junit4]   2> 		at java.util.concurrent.Executors$RunnableAdapter.call(Executors.java:471)
[junit4:junit4]   2> 		at java.util.concurrent.FutureTask$Sync.innerRun(FutureTask.java:334)
[junit4:junit4]   2> 		at java.util.concurrent.FutureTask.run(FutureTask.java:166)
[junit4:junit4]   2> 		at java.util.concurrent.ScheduledThreadPoolExecutor$ScheduledFutureTask.access$101(ScheduledThreadPoolExecutor.java:165)
[junit4:junit4]   2> 		at java.util.concurrent.ScheduledThreadPoolExecutor$ScheduledFutureTask.run(ScheduledThreadPoolExecutor.java:266)
[junit4:junit4]   2> 		at java.util.concurrent.ThreadPoolExecutor.runWorker(ThreadPoolExecutor.java:1110)
[junit4:junit4]   2> 		at java.util.concurrent.ThreadPoolExecutor$Worker.run(ThreadPoolExecutor.java:603)
[junit4:junit4]   2> 		... 1 more
[junit4:junit4]   2> 	
[junit4:junit4]   2> 9430 T13 oasc.SolrException.log SEVERE Error closing searcher:org.apache.solr.core.SolrCore$8@1769c398:java.lang.IllegalArgumentException: Unknown directory: MockDirWrapper(org.apache.lucene.store.RAMDirectory@7f42731 lockFactory=org.apache.lucene.store.NativeFSLockFactory@3003e926) {}
[junit4:junit4]   2> 		at org.apache.solr.core.CachingDirectoryFactory.close(CachingDirectoryFactory.java:126)
[junit4:junit4]   2> 		at org.apache.solr.core.CachingDirectoryFactory.release(CachingDirectoryFactory.java:245)
[junit4:junit4]   2> 		at org.apache.solr.search.SolrIndexSearcher.close(SolrIndexSearcher.java:283)
[junit4:junit4]   2> 		at org.apache.solr.core.SolrCore$8.close(SolrCore.java:1645)
[junit4:junit4]   2> 		at org.apache.solr.util.RefCounted.decref(RefCounted.java:57)
[junit4:junit4]   2> 		at org.apache.solr.core.SolrCore.getSearcher(SolrCore.java:1611)
[junit4:junit4]   2> 		at org.apache.solr.update.DirectUpdateHandler2.commit(DirectUpdateHandler2.java:546)
[junit4:junit4]   2> 		at org.apache.solr.update.CommitTracker.run(CommitTracker.java:215)
[junit4:junit4]   2> 		at java.util.concurrent.Executors$RunnableAdapter.call(Executors.java:471)
[junit4:junit4]   2> 		at java.util.concurrent.FutureTask$Sync.innerRun(FutureTask.java:334)
[junit4:junit4]   2> 		at java.util.concurrent.FutureTask.run(FutureTask.java:166)
[junit4:junit4]   2> 		at java.util.concurrent.ScheduledThreadPoolExecutor$ScheduledFutureTask.access$101(ScheduledThreadPoolExecutor.java:165)
[junit4:junit4]   2> 		at java.util.concurrent.ScheduledThreadPoolExecutor$ScheduledFutureTask.run(ScheduledThreadPoolExecutor.java:266)
[junit4:junit4]   2> 		at java.util.concurrent.ThreadPoolExecutor.runWorker(ThreadPoolExecutor.java:1110)
[junit4:junit4]   2> 		at java.util.concurrent.ThreadPoolExecutor$Worker.run(ThreadPoolExecutor.java:603)
[junit4:junit4]   2> 		at java.lang.Thread.run(Thread.java:679)
[junit4:junit4]   2> 	
[junit4:junit4]   2> 9431 T13 oasc.SolrException.log SEVERE Error closing searcher:org.apache.solr.core.SolrCore$8@4b69d75d:java.lang.IllegalArgumentException: Unknown directory: MockDirWrapper(org.apache.lucene.store.RAMDirectory@7f42731 lockFactory=org.apache.lucene.store.NativeFSLockFactory@3003e926) {}
[junit4:junit4]   2> 		at org.apache.solr.core.CachingDirectoryFactory.close(CachingDirectoryFactory.java:126)
[junit4:junit4]   2> 		at org.apache.solr.core.CachingDirectoryFactory.release(CachingDirectoryFactory.java:245)
[junit4:junit4]   2> 		at org.apache.solr.search.SolrIndexSearcher.close(SolrIndexSearcher.java:283)
[junit4:junit4]   2> 		at org.apache.solr.core.SolrCore$8.close(SolrCore.java:1645)
[junit4:junit4]   2> 		at org.apache.solr.util.RefCounted.decref(RefCounted.java:57)
[junit4:junit4]   2> 		at org.apache.solr.core.SolrCore.getSearcher(SolrCore.java:1615)
[junit4:junit4]   2> 		at org.apache.solr.update.DirectUpdateHandler2.commit(DirectUpdateHandler2.java:546)
[junit4:junit4]   2> 		at org.apache.solr.update.CommitTracker.run(CommitTracker.java:215)
[junit4:junit4]   2> 		at java.util.concurrent.Executors$RunnableAdapter.call(Executors.java:471)
[junit4:junit4]   2> 		at java.util.concurrent.FutureTask$Sync.innerRun(FutureTask.java:334)
[junit4:junit4]   2> 		at java.util.concurrent.FutureTask.run(FutureTask.java:166)
[junit4:junit4]   2> 		at java.util.concurrent.ScheduledThreadPoolExecutor$ScheduledFutureTask.access$101(ScheduledThreadPoolExecutor.java:165)
[junit4:junit4]   2> 		at java.util.concurrent.ScheduledThreadPoolExecutor$ScheduledFutureTask.run(ScheduledThreadPoolExecutor.java:266)
[junit4:junit4]   2> 		at java.util.concurrent.ThreadPoolExecutor.runWorker(ThreadPoolExecutor.java:1110)
[junit4:junit4]   2> 		at java.util.concurrent.ThreadPoolExecutor$Worker.run(ThreadPoolExecutor.java:603)
[junit4:junit4]   2> 		at java.lang.Thread.run(Thread.java:679)
[junit4:junit4]   2> 	
[junit4:junit4]   2> 9432 T13 oasc.SolrException.log SEVERE auto commit error...:org.apache.solr.common.SolrException: java.util.concurrent.RejectedExecutionException
[junit4:junit4]   2> 		at org.apache.solr.core.SolrCore.getSearcher(SolrCore.java:1594)
[junit4:junit4]   2> 		at org.apache.solr.update.DirectUpdateHandler2.commit(DirectUpdateHandler2.java:546)
[junit4:junit4]   2> 		at org.apache.solr.update.CommitTracker.run(CommitTracker.java:215)
[junit4:junit4]   2> 		at java.util.concurrent.Executors$RunnableAdapter.call(Executors.java:471)
[junit4:junit4]   2> 		at java.util.concurrent.FutureTask$Sync.innerRun(FutureTask.java:334)
[junit4:junit4]   2> 		at java.util.concurrent.FutureTask.run(FutureTask.java:166)
[junit4:junit4]   2> 		at java.util.concurrent.ScheduledThreadPoolExecutor$ScheduledFutureTask.access$101(ScheduledThreadPoolExecutor.java:165)
[junit4:junit4]   2> 		at java.util.concurrent.ScheduledThreadPoolExecutor$ScheduledFutureTask.run(ScheduledThreadPoolExecutor.java:266)
[junit4:junit4]   2> 		at java.util.concurrent.ThreadPoolExecutor.runWorker(ThreadPoolExecutor.java:1110)
[junit4:junit4]   2> 		at java.util.concurrent.ThreadPoolExecutor$Worker.run(ThreadPoolExecutor.java:603)
[junit4:junit4]   2> 		at java.lang.Thread.run(Thread.java:679)
[junit4:junit4]   2> 	Caused by: java.util.concurrent.RejectedExecutionException
[junit4:junit4]   2> 		at java.util.concurrent.ThreadPoolExecutor$AbortPolicy.rejectedExecution(ThreadPoolExecutor.java:1956)
[junit4:junit4]   2> 		at java.util.concurrent.ThreadPoolExecutor.reject(ThreadPoolExecutor.java:816)
[junit4:junit4]   2> 		at java.util.concurrent.ThreadPoolExecutor.execute(ThreadPoolExecutor.java:1337)
[junit4:junit4]   2> 		at java.util.concurrent.AbstractExecutorService.submit(AbstractExecutorService.java:120)
[junit4:junit4]   2> 		at java.util.concurrent.Executors$DelegatedExecutorService.submit(Executors.java:642)
[junit4:junit4]   2> 		at org.apache.solr.core.SolrCore.getSearcher(SolrCore.java:1510)
[junit4:junit4]   2> 		... 10 more
[junit4:junit4]   2> 	
[junit4:junit4]   2> NOTE: reproduce with: ant test  -Dtestcase=SoftAutoCommitTest -Dtests.method=testSoftAndHardCommitMaxTimeRapidAdds -Dtests.seed=2B01EE39547E9AED -Dtests.multiplier=3 -Dtests.slow=true -Dtests.locale=ar_DZ -Dtests.timezone=Asia/Muscat -Dtests.file.encoding=ISO8859-1
[junit4:junit4] FAILURE 9.73s J1 | SoftAutoCommitTest.testSoftAndHardCommitMaxTimeRapidAdds <<<
[junit4:junit4]    > Throwable #1: java.lang.AssertionError: 1: soft occured too fast: 1351068328618 + (500 * 1) !<= 1351068329057
[junit4:junit4]    > 	at __randomizedtesting.SeedInfo.seed([2B01EE39547E9AED:77144000BFFCDB95]:0)
[junit4:junit4]    > 	at org.junit.Assert.fail(Assert.java:93)
[junit4:junit4]    > 	at org.junit.Assert.assertTrue(Assert.java:43)
[junit4:junit4]    > 	at org.apache.solr.update.SoftAutoCommitTest.testSoftAndHardCommitMaxTimeRapidAdds(SoftAutoCommitTest.java:312)
[junit4:junit4]    > 	at sun.reflect.NativeMethodAccessorImpl.invoke0(Native Method)
[junit4:junit4]    > 	at sun.reflect.NativeMethodAccessorImpl.invoke(NativeMethodAccessorImpl.java:57)
[junit4:junit4]    > 	at sun.reflect.DelegatingMethodAccessorImpl.invoke(DelegatingMethodAccessorImpl.java:43)
[junit4:junit4]    > 	at java.lang.reflect.Method.invoke(Method.java:616)
[junit4:junit4]    > 	at com.carrotsearch.randomizedtesting.RandomizedRunner.invoke(RandomizedRunner.java:1559)
[junit4:junit4]    > 	at com.carrotsearch.randomizedtesting.RandomizedRunner.access$600(RandomizedRunner.java:79)
[junit4:junit4]    > 	at com.carrotsearch.randomizedtesting.RandomizedRunner$6.evaluate(RandomizedRunner.java:737)
[junit4:junit4]    > 	at com.carrotsearch.randomizedtesting.RandomizedRunner$7.evaluate(RandomizedRunner.java:773)
[junit4:junit4]    > 	at com.carrotsearch.randomizedtesting.RandomizedRunner$8.evaluate(RandomizedRunner.java:787)
[junit4:junit4]    > 	at com.carrotsearch.randomizedtesting.rules.SystemPropertiesRestoreRule$1.evaluate(SystemPropertiesRestoreRule.java:53)
[junit4:junit4]    > 	at org.apache.lucene.util.TestRuleSetupTeardownChained$1.evaluate(TestRuleSetupTeardownChained.java:50)
[junit4:junit4]    > 	at org.apache.lucene.util.TestRuleFieldCacheSanity$1.evaluate(TestRuleFieldCacheSanity.java:51)
[junit4:junit4]    > 	at org.apache.lucene.util.AbstractBeforeAfterRule$1.evaluate(AbstractBeforeAfterRule.java:45)
[junit4:junit4]    > 	at com.carrotsearch.randomizedtesting.rules.SystemPropertiesInvariantRule$1.evaluate(SystemPropertiesInvariantRule.java:55)
[junit4:junit4]    > 	at org.apache.lucene.util.TestRuleThreadAndTestName$1.evaluate(TestRuleThreadAndTestName.java:48)
[junit4:junit4]    > 	at org.apache.lucene.util.TestRuleIgnoreAfterMaxFailures$1.evaluate(TestRuleIgnoreAfterMaxFailures.java:70)
[junit4:junit4]    > 	at org.apache.lucene.util.TestRuleMarkFailure$1.evaluate(TestRuleMarkFailure.java:48)
[junit4:junit4]    > 	at com.carrotsearch.randomizedtesting.rules.StatementAdapter.evaluate(StatementAdapter.java:36)
[junit4:junit4]    > 	at com.carrotsearch.randomizedtesting.ThreadLeakControl$StatementRunner.run(ThreadLeakControl.java:358)
[junit4:junit4]    > 	at com.carrotsearch.randomizedtesting.ThreadLeakControl.forkTimeoutingTask(ThreadLeakControl.java:782)
[junit4:junit4]    > 	at com.carrotsearch.randomizedtesting.ThreadLeakControl$3.evaluate(ThreadLeakControl.java:442)
[junit4:junit4]    > 	at com.carrotsearch.randomizedtesting.RandomizedRunner.runSingleTest(RandomizedRunner.java:746)
[junit4:junit4]    > 	at com.carrotsearch.randomizedtesting.RandomizedRunner$3.evaluate(RandomizedRunner.java:648)
[junit4:junit4]    > 	at com.carrotsearch.randomizedtesting.RandomizedRunner$4.evaluate(RandomizedRunner.java:682)
[junit4:junit4]    > 	at com.carrotsearch.randomizedtesting.RandomizedRunner$5.evaluate(RandomizedRunner.java:693)
[junit4:junit4]    > 	at com.carrotsearch.randomizedtesting.rules.StatementAdapter.evaluate(StatementAdapter.java:36)
[junit4:junit4]    > 	at com.carrotsearch.randomizedtesting.rules.SystemPropertiesRestoreRule$1.evaluate(SystemPropertiesRestoreRule.java:53)
[junit4:junit4]    > 	at org.apache.lucene.util.AbstractBeforeAfterRule$1.evaluate(AbstractBeforeAfterRule.java:45)
[junit4:junit4]    > 	at org.apache.lucene.util.TestRuleStoreClassName$1.evaluate(TestRuleStoreClassName.java:42)
[junit4:junit4]    > 	at com.carrotsearch.randomizedtesting.rules.SystemPropertiesInvariantRule$1.evaluate(SystemPropertiesInvariantRule.java:55)
[junit4:junit4]    > 	at com.carrotsearch.randomizedtesting.rules.NoShadowingOrOverridesOnMethodsRule$1.evaluate(NoShadowingOrOverridesOnMethodsRule.java:39)
[junit4:junit4]    > 	at com.carrotsearch.randomizedtesting.rules.NoShadowingOrOverridesOnMethodsRule$1.evaluate(NoShadowingOrOverridesOnMethodsRule.java:39)
[junit4:junit4]    > 	at com.carrotsearch.randomizedtesting.rules.StatementAdapter.evaluate(StatementAdapter.java:36)
[junit4:junit4]    > 	at org.apache.lucene.util.TestRuleAssertionsRequired$1.evaluate(TestRuleAssertionsRequired.java:43)
[junit4:junit4]    > 	at org.apache.lucene.util.TestRuleMarkFailure$1.evaluate(TestRuleMarkFailure.java:48)
[junit4:junit4]    > 	at org.apache.lucene.util.TestRuleIgnoreAfterMaxFailures$1.evaluate(TestRuleIgnoreAfterMaxFailures.java:70)
[junit4:junit4]    > 	at org.apache.lucene.util.TestRuleIgnoreTestSuites$1.evaluate(TestRuleIgnoreTestSuites.java:55)
[junit4:junit4]    > 	at com.carrotsearch.randomizedtesting.rules.StatementAdapter.evaluate(StatementAdapter.java:36)
[junit4:junit4]    > 	at com.carrotsearch.randomizedtesting.ThreadLeakControl$StatementRunner.run(ThreadLeakControl.java:358)
[junit4:junit4]    > 	at java.lang.Thread.run(Thread.java:679)
[junit4:junit4]   2> 9683 T10 oasu.AbstractSolrTestCase.setUp ####SETUP_START testSoftAndHardCommitMaxTimeDelete
[junit4:junit4]   2> 9687 T10 oasc.SolrResourceLoader.<init> new SolrResourceLoader for directory: '/usr/home/hudson/hudson-slave/workspace/Lucene-Solr-Tests-trunk-Java6/solr/build/solr-core/test-files/solr/collection1/'
[junit4:junit4]   2> 9689 T10 oasc.SolrResourceLoader.replaceClassLoader Adding 'file:/usr/home/hudson/hudson-slave/workspace/Lucene-Solr-Tests-trunk-Java6/solr/build/solr-core/test-files/solr/collection1/lib/classes/' to classloader
[junit4:junit4]   2> 9690 T10 oasc.SolrResourceLoader.replaceClassLoader Adding 'file:/usr/home/hudson/hudson-slave/workspace/Lucene-Solr-Tests-trunk-Java6/solr/build/solr-core/test-files/solr/collection1/lib/README' to classloader
[junit4:junit4]   2> 9868 T10 oasc.SolrConfig.<init> Using Lucene MatchVersion: LUCENE_50
[junit4:junit4]   2> 9972 T10 oasc.SolrConfig.<init> Loaded SolrConfig: solrconfig.xml
[junit4:junit4]   2> 9973 T10 oass.IndexSchema.readSchema Reading Solr Schema
[junit4:junit4]   2> 10015 T10 oass.IndexSchema.readSchema Schema name=test
[junit4:junit4]   2> 10551 T10 oass.OpenExchangeRatesOrgProvider.init Initialized with rates=open-exchange-rates.json, refreshInterval=1440.
[junit4:junit4]   2> 10562 T10 oass.IndexSchema.readSchema default search field in schema is text
[junit4:junit4]   2> 10566 T10 oass.IndexSchema.readSchema unique key field: id
[junit4:junit4]   2> 10583 T10 oass.FileExchangeRateProvider.reload Reloading exchange rates from file currency.xml
[junit4:junit4]   2> 10587 T10 oass.FileExchangeRateProvider.reload Reloading exchange rates from file currency.xml
[junit4:junit4]   2> 10590 T10 oass.OpenExchangeRatesOrgProvider.reload Reloading exchange rates from open-exchange-rates.json
[junit4:junit4]   2> 10593 T10 oass.OpenExchangeRatesOrgProvider.reload Reloading exchange rates from open-exchange-rates.json
[junit4:junit4]   2> 10595 T10 oasc.SolrResourceLoader.locateSolrHome JNDI not configured for solr (NoInitialContextEx)
[junit4:junit4]   2> 10596 T10 oasc.SolrResourceLoader.locateSolrHome using system property solr.solr.home: /usr/home/hudson/hudson-slave/workspace/Lucene-Solr-Tests-trunk-Java6/solr/build/solr-core/test-files/solr
[junit4:junit4]   2> 10596 T10 oasc.SolrResourceLoader.<init> new SolrResourceLoader for directory: '/usr/home/hudson/hudson-slave/workspace/Lucene-Solr-Tests-trunk-Java6/solr/build/solr-core/test-files/solr/'
[junit4:junit4]   2> 10604 T10 oasc.CoreContainer.<init> New CoreContainer 1954648890
[junit4:junit4]   2> 10605 T10 oasc.SolrCore.<init> [collection1] Opening new SolrCore at /usr/home/hudson/hudson-slave/workspace/Lucene-Solr-Tests-trunk-Java6/solr/build/solr-core/test-files/solr/collection1/, dataDir=/usr/home/hudson/hudson-slave/workspace/Lucene-Solr-Tests-trunk-Java6/solr/build/solr-core/test/J1/./org.apache.solr.update.SoftAutoCommitTest-1351068330147/
[junit4:junit4]   2> 10605 T10 oasc.JmxMonitoredMap.<init> JMX monitoring is enabled. Adding Solr mbeans to JMX Server: com.sun.jmx.mbeanserver.JmxMBeanServer@27958cc2
[junit4:junit4]   2> 10606 T10 oasc.SolrCore.getNewIndexDir New index directory detected: old=null new=/usr/home/hudson/hudson-slave/workspace/Lucene-Solr-Tests-trunk-Java6/solr/build/solr-core/test/J1/./org.apache.solr.update.SoftAutoCommitTest-1351068330147/index/
[junit4:junit4]   2> 10607 T10 oasc.SolrCore.initIndex WARNING [collection1] Solr index directory '/usr/home/hudson/hudson-slave/workspace/Lucene-Solr-Tests-trunk-Java6/solr/build/solr-core/test/J1/./org.apache.solr.update.SoftAutoCommitTest-1351068330147/index' doesn't exist. Creating new index...
[junit4:junit4]   2> 10607 T10 oasc.CachingDirectoryFactory.get return new directory for /usr/home/hudson/hudson-slave/workspace/Lucene-Solr-Tests-trunk-Java6/solr/build/solr-core/test/J1/./org.apache.solr.update.SoftAutoCommitTest-1351068330147/index forceNew:false
[junit4:junit4]   2> 10609 T10 oasc.SolrDeletionPolicy.onCommit SolrDeletionPolicy.onCommit: commits:num=1
[junit4:junit4]   2> 		commit{dir=MockDirWrapper(org.apache.lucene.store.RAMDirectory@4b25ee49 lockFactory=org.apache.lucene.store.NativeFSLockFactory@219a6087),segFN=segments_1,generation=1,filenames=[segments_1]
[junit4:junit4]   2> 10610 T10 oasc.SolrDeletionPolicy.updateCommits newest commit = 1
[junit4:junit4]   2> 10611 T10 oasc.SolrCore.initWriters created xml: solr.XMLResponseWriter
[junit4:junit4]   2> 10613 T10 oasup.UpdateRequestProcessorChain.init inserting DistributedUpdateProcessorFactory into updateRequestProcessorChain "dedupe"
[junit4:junit4]   2> 10613 T10 oasup.UpdateRequestProcessorChain.init inserting DistributedUpdateProcessorFactory into updateRequestProcessorChain "dedupe-allfields"
[junit4:junit4]   2> 10614 T10 oasup.UpdateRequestProcessorChain.init inserting DistributedUpdateProcessorFactory into updateRequestProcessorChain "stored_sig"
[junit4:junit4]   2> 10614 T10 oasup.UpdateRequestProcessorChain.init inserting DistributedUpdateProcessorFactory into updateRequestProcessorChain "uniq-fields"
[junit4:junit4]   2> 10615 T10 oasup.UpdateRequestProcessorChain.init inserting DistributedUpdateProcessorFactory into updateRequestProcessorChain "distrib-dup-test-chain-implicit"
[junit4:junit4]   2> 10615 T10 oasc.RequestHandlers.initHandlersFromConfig adding lazy requestHandler: solr.ReplicationHandler
[junit4:junit4]   2> 10616 T10 oasc.RequestHandlers.initHandlersFromConfig created /replication: solr.ReplicationHandler
[junit4:junit4]   2> 10617 T10 oasc.RequestHandlers.initHandlersFromConfig created standard: solr.StandardRequestHandler
[junit4:junit4]   2> 10618 T10 oasc.RequestHandlers.initHandlersFromConfig created /get: solr.RealTimeGetHandler
[junit4:junit4]   2> 10618 T10 oasc.RequestHandlers.initHandlersFromConfig created dismax: solr.SearchHandler
[junit4:junit4]   2> 10619 T10 oasc.RequestHandlers.initHandlersFromConfig created mock: org.apache.solr.core.MockQuerySenderListenerReqHandler
[junit4:junit4]   2> 10620 T10 oasc.RequestHandlers.initHandlersFromConfig created /admin/: org.apache.solr.handler.admin.AdminHandlers
[junit4:junit4]   2> 10621 T10 oasc.RequestHandlers.initHandlersFromConfig created defaults: solr.StandardRequestHandler
[junit4:junit4]   2> 10621 T10 oasc.RequestHandlers.initHandlersFromConfig adding lazy requestHandler: solr.StandardRequestHandler
[junit4:junit4]   2> 10622 T10 oasc.RequestHandlers.initHandlersFromConfig created lazy: solr.StandardRequestHandler
[junit4:junit4]   2> 10622 T10 oasc.RequestHandlers.initHandlersFromConfig created /update: solr.UpdateRequestHandler
[junit4:junit4]   2> 10623 T10 oasc.RequestHandlers.initHandlersFromConfig created /terms: org.apache.solr.handler.component.SearchHandler
[junit4:junit4]   2> 10624 T10 oasc.RequestHandlers.initHandlersFromConfig created spellCheckCompRH: org.apache.solr.handler.component.SearchHandler
[junit4:junit4]   2> 10625 T10 oasc.RequestHandlers.initHandlersFromConfig created spellCheckCompRH_Direct: org.apache.solr.handler.component.SearchHandler
[junit4:junit4]   2> 10626 T10 oasc.RequestHandlers.initHandlersFromConfig created spellCheckWithWordbreak: org.apache.solr.handler.component.SearchHandler
[junit4:junit4]   2> 10626 T10 oasc.RequestHandlers.initHandlersFromConfig created spellCheckWithWordbreak_Direct: org.apache.solr.handler.component.SearchHandler
[junit4:junit4]   2> 10627 T10 oasc.RequestHandlers.initHandlersFromConfig created spellCheckCompRH1: org.apache.solr.handler.component.SearchHandler
[junit4:junit4]   2> 10628 T10 oasc.RequestHandlers.initHandlersFromConfig created tvrh: org.apache.solr.handler.component.SearchHandler
[junit4:junit4]   2> 10629 T10 oasc.RequestHandlers.initHandlersFromConfig created /mlt: solr.MoreLikeThisHandler
[junit4:junit4]   2> 10630 T10 oasc.RequestHandlers.initHandlersFromConfig created /debug/dump: solr.DumpRequestHandler
[junit4:junit4]   2> 10635 T10 oashl.XMLLoader.init xsltCacheLifetimeSeconds=60
[junit4:junit4]   2> 10638 T10 oasc.SolrCore.initDeprecatedSupport WARNING solrconfig.xml uses deprecated <admin/gettableFiles>, Please update your config to use the ShowFileRequestHandler.
[junit4:junit4]   2> 10640 T10 oasc.SolrCore.initDeprecatedSupport WARNING adding ShowFileRequestHandler with hidden files: [THROW.ERROR.ON.ADD.UPDATEPROCESSOR.JS, SOLRCONFIG-HIGHLIGHT.XML, SCHEMA-REQUIRED-FIELDS.XML, BAD-SCHEMA-DUP-DYNAMICFIELD.XML, SCHEMA-MINIMAL.XML, TRIVIAL.UPDATEPROCESSOR1.JS, SCHEMA-REPLICATION2.XML, SOLRCONFIG-CACHING.XML, SOLRCONFIG-REPEATER.XML, SOLRCONFIG-MERGEPOLICY.XML, BAD-SCHEMA-NONTEXT-ANALYZER.XML, CURRENCY.XML, SOLRCONFIG-TLOG.XML, SOLRCONFIG-MASTER.XML, BAD-SCHEMA-UNIQUEKEY-MULTIVALUED.XML, SCHEMA11.XML, SOLRCONFIG-BASIC.XML, DA_COMPOUNDDICTIONARY.TXT, MISSLEADING.EXTENSION.UPDATEPROCESSOR.JS.TXT, SCHEMA-COPYFIELD-TEST.XML, SOLRCONFIG-SLAVE.XML, SOLRCONFIG-PROPINJECT-INDEXDEFAULT.XML, ELEVATE.XML, TRIVIAL.UPDATEPROCESSOR0.JS, BAD-SOLRCONFIG-BOGUS-SCRIPTENGINE-NAME.XML, SCHEMA-CHARFILTERS.XML, SCHEMA-IB.XML, SOLRCONFIG-QUERYSENDER.XML, DA_UTF8.XML, SCHEMA-REPLICATION1.XML, SOLRCONFIG-SNIPPET-PROCESSOR.XML, CONDITIONAL.UPDATEPROCESSOR.JS, MISSING.FUNCTIONS.UPDATEPROCESSOR.JS, HYPHENATION.DTD, SOLRCONFIG-ENABLEPLUGIN.XML, SCHEMA-PHRASESUGGEST.XML, STEMDICT.TXT, HUNSPELL-TEST.AFF, SCHEMA-SNIPPET-TYPE.XML, STOPTYPES-1.TXT, STOPWORDSWRONGENCODING.TXT, SCHEMA-NUMERIC.XML, SOLRCONFIG-TRANSFORMERS.XML, SOLRCONFIG-PROPINJECT.XML, BAD-SCHEMA-NOT-INDEXED-BUT-TF.XML, SOLRCONFIG-SIMPLELOCK.XML, WDFTYPES.TXT, SCHEMA-REVERSED.XML, STOPTYPES-2.TXT, BAD-SCHEMA-CURRENCY-FT-MULTIVALUED.XML, SOLRCONFIG-SPELLCHECKCOMPONENT.XML, BAD-SCHEMA-CURRENCY-MULTIVALUED.XML, SOLRCONFIG-PHRASESUGGEST.XML, SCHEMA-DFR.XML, BAD-SCHEMA-NOT-INDEXED-BUT-POS.XML, KEEP-1.TXT, SCHEMA-SPATIAL.XML, OPEN-EXCHANGE-RATES.JSON, STOPWITHBOM.TXT, SCHEMA-BINARYFIELD.XML, SOLRCONFIG-SPELLCHECKER.XML, SOLRCONFIG-UPDATE-PROCESSOR-CHAINS.XML, BAD-SCHEMA-OMIT-TF-BUT-NOT-POS.XML, SCHEMA-XINCLUDE.XML, BAD-SCHEMA-DUP-FIELDTYPE.XML, SOLRCONFIG-MASTER1.XML, SYNONYMS.TXT, BAD-SCHEMA-CURRENCY-DYNAMIC-MULTIVALUED.XML, SCHEMA_CODEC.XML, SCHEMA.XML, SOLRCONFIG-SOLR-749.XML, SOLRCONFIG-MASTER1-KEEPONEBACKUP.XML, SOLRCONFIG-FUNCTIONQUERY.XML, STOP-2.TXT, SCHEMA-LMDIRICHLET.XML, SOLRCONFIG-TERMINDEX.XML, SOLRCONFIG-ELEVATE.XML, SCHEMA-FOLDING.XML, STOPWORDS.TXT, SCHEMA-STOP-KEEP.XML, BAD-SCHEMA-NOT-INDEXED-BUT-NORMS.XML, SOLRCONFIG-SOLCOREPROPERTIES.XML, STOP-1.TXT, SOLRCONFIG-MASTER2.XML, SCHEMA-SPELLCHECKER.XML, SOLRCONFIG-RESPONSE-LOG-COMPONENT.XML, SOLRCONFIG-LAZYWRITER.XML, SCHEMA-LUCENEMATCHVERSION.XML, BAD-MP-SOLRCONFIG.XML, FRENCHARTICLES.TXT, SCHEMA15.XML, SOLRCONFIG-REQHANDLER.INCL, SCHEMASURROUND.XML, SOLRCONFIG-MASTER3.XML, HUNSPELL-TEST.DIC, BAD-SCHEMA-CODEC-GLOBAL-VS-FT-MISMATCH.XML, SOLRCONFIG-XINCLUDE.XML, SOLRCONFIG-DELPOLICY1.XML, SOLRCONFIG-SLAVE1.XML, SCHEMA-SIM.XML, SCHEMA-SNIPPET-FIELD.XML, SCHEMA-COLLATE.XML, STOP-SNOWBALL.TXT, BAD-SCHEMA-SIM-GLOBAL-VS-FT-MISMATCH.XML, PROTWORDS.TXT, SCHEMA-TRIE.XML, SOLRCONFIG_CODEC.XML, BAD-SOLRCONFIG-INVALID-SCRIPTFILE.XML, JASUGGEST.TXT, SCHEMA-TFIDF.XML, SOLRCONFIG-SCRIPT-UPDATEPROCESSOR.XML, SCHEMA-LMJELINEKMERCER.XML, PHRASESUGGEST.TXT, BAD-SOLRCONFIG-MISSING-SCRIPTFILE.XML, BAD-SCHEMA-UNIQUEKEY-USES-DEFAULT.XML, OLD_SYNONYMS.TXT, SOLRCONFIG-DELPOLICY2.XML, XSLT, SOLRCONFIG-NATIVELOCK.XML, BAD-SCHEMA-DUP-FIELD.XML, SOLRCONFIG-NOCACHE.XML, SCHEMA-BM25.XML, ADDFIELDS.UPDATEPROCESSOR.JS, SOLRCONFIG-QUERYSENDER-NOQUERY.XML, SOLRCONFIG-ALTDIRECTORY.XML, COMPOUNDDICTIONARY.TXT, SOLRCONFIG-INDEXCONFIG.XML, SOLRCONFIG_PERF.XML, BAD-SCHEMA-ANALYZER-CLASS-AND-NESTED.XML, SCHEMA-NOT-REQUIRED-UNIQUE-KEY.XML, KEEP-2.TXT, BAD-SCHEMA-UNIQUEKEY-IS-COPYFIELD-DEST.XML, SCHEMA12.XML, MAPPING-ISOLATIN1ACCENT.TXT, BAD_SOLRCONFIG.XML, BAD-SCHEMA-EXTERNAL-FILEFIELD.XML]
[junit4:junit4]   2> 10643 T10 oass.SolrIndexSearcher.<init> Opening Searcher@61efb003 main
[junit4:junit4]   2> 10644 T10 oass.SolrIndexSearcher.getIndexDir WARNING WARNING: Directory impl does not support setting indexDir: org.apache.lucene.store.MockDirectoryWrapper
[junit4:junit4]   2> 10644 T10 oasu.CommitTracker.<init> Hard AutoCommit: disabled
[junit4:junit4]   2> 10645 T10 oasu.CommitTracker.<init> Soft AutoCommit: disabled
[junit4:junit4]   2> 10646 T10 oashc.SpellCheckComponent.inform Initializing spell checkers
[junit4:junit4]   2> 10689 T10 oass.DirectSolrSpellChecker.init init: {name=direct,classname=DirectSolrSpellChecker,field=lowerfilt,minQueryLength=3}
[junit4:junit4]   2> 10734 T10 oashc.HttpShardHandlerFactory.getParameter Setting socketTimeout to: 0
[junit4:junit4]   2> 10734 T10 oashc.HttpShardHandlerFactory.getParameter Setting urlScheme to: http://
[junit4:junit4]   2> 10734 T10 oashc.HttpShardHandlerFactory.getParameter Setting connTimeout to: 0
[junit4:junit4]   2> 10735 T10 oashc.HttpShardHandlerFactory.getParameter Setting maxConnectionsPerHost to: 20
[junit4:junit4]   2> 10735 T10 oashc.HttpShardHandlerFactory.getParameter Setting corePoolSize to: 0
[junit4:junit4]   2> 10736 T10 oashc.HttpShardHandlerFactory.getParameter Setting maximumPoolSize to: 2147483647
[junit4:junit4]   2> 10736 T10 oashc.HttpShardHandlerFactory.getParameter Setting maxThreadIdleTime to: 5
[junit4:junit4]   2> 10737 T10 oashc.HttpShardHandlerFactory.getParameter Setting sizeOfQueue to: -1
[junit4:junit4]   2> 10737 T10 oashc.HttpShardHandlerFactory.getParameter Setting fairnessPolicy to: false
[junit4:junit4]   2> 10737 T10 oascsi.HttpClientUtil.createClient Creating new http client, config:maxConnectionsPerHost=20&maxConnections=10000&socketTimeout=0&connTimeout=0&retry=false
[junit4:junit4]   2> 10757 T14 oasc.SolrCore.registerSearcher [collection1] Registered new searcher Searcher@61efb003 main{StandardDirectoryReader(segments_1:1)}
[junit4:junit4]   2> 10764 T10 oasc.CoreContainer.register registering core: collection1
[junit4:junit4]   2> 10772 T10 oasu.AbstractSolrTestCase.setUp ####SETUP_END testSoftAndHardCommitMaxTimeDelete
[junit4:junit4]   2> ASYNC  NEW_CORE C1 name=collection1 org.apache.solr.core.SolrCore@66e90097
[junit4:junit4]   2> 10782 T10 C1 oasc.SolrDeletionPolicy.onInit SolrDeletionPolicy.onInit: commits:num=1
[junit4:junit4]   2> 		commit{dir=MockDirWrapper(org.apache.lucene.store.RAMDirectory@4b25ee49 lockFactory=org.apache.lucene.store.NativeFSLockFactory@219a6087),segFN=segments_1,generation=1,filenames=[segments_1]
[junit4:junit4]   2> 10783 T10 C1 oasc.SolrDeletionPolicy.updateCommits newest commit = 1
[junit4:junit4]   2> 10786 T10 C1 UPDATE [collection1] webapp=null path=null params={} {add=[529]} 0 6
[junit4:junit4]   2> 10800 T10 C1 oasu.DirectUpdateHandler2.commit start commit{flags=0,_version_=0,optimize=false,openSearcher=true,waitSearcher=true,expungeDeletes=false,softCommit=false}
[junit4:junit4]   2> 10811 T10 C1 oasc.SolrDeletionPolicy.onCommit SolrDeletionPolicy.onCommit: commits:num=2
[junit4:junit4]   2> 		commit{dir=MockDirWrapper(org.apache.lucene.store.RAMDirectory@4b25ee49 lockFactory=org.apache.lucene.store.NativeFSLockFactory@219a6087),segFN=segments_1,generation=1,filenames=[segments_1]
[junit4:junit4]   2> 		commit{dir=MockDirWrapper(org.apache.lucene.store.RAMDirectory@4b25ee49 lockFactory=org.apache.lucene.store.NativeFSLockFactory@219a6087),segFN=segments_2,generation=2,filenames=[_0_Asserting_0.tim, _0_MockRandom_0.tib, _0.fnm, _0_TestBloomFilteredLucene41Postings_0.blm, _0_Asserting_0.tip, _0_TestBloomFilteredLucene41Postings_0.tim, _0_nrm.cfs, _0_TestBloomFilteredLucene41Postings_0.tip, _0_TestBloomFilteredLucene41Postings_0.pos, _0_MockRandom_0.sd, _0_MockRandom_0.doc, _0_MockRandom_0.pos, _0_SimpleText_0.pst, _0_nrm.cfe, _0_MockRandom_0.tii, _0_TestBloomFilteredLucene41Postings_0.doc, segments_2, _0.fdx, _0.si, _0_Asserting_0.pos, _0_Asserting_0.doc, _0.fdt]
[junit4:junit4]   2> 10811 T10 C1 oasc.SolrDeletionPolicy.updateCommits newest commit = 2
[junit4:junit4]   2> 10868 T10 C1 oass.SolrIndexSearcher.<init> Opening Searcher@43ad4a main
[junit4:junit4]   2> 10868 T10 C1 oass.SolrIndexSearcher.getIndexDir WARNING WARNING: Directory impl does not support setting indexDir: org.apache.lucene.store.MockDirectoryWrapper
[junit4:junit4]   2> 10872 T10 C1 oasu.DirectUpdateHandler2.commit end_commit_flush
[junit4:junit4]   2> 10878 T14 oasc.SolrCore.registerSearcher [collection1] Registered new searcher Searcher@43ad4a main{StandardDirectoryReader(segments_2:3 _0(5.0):C1)}
[junit4:junit4]   2> 10879 T10 C1 UPDATE [collection1] webapp=null path=null params={} {commit=} 0 80
[junit4:junit4]   2> 10888 T10 C1 UPDATE [collection1] webapp=null path=null params={} {delete=[529]} 0 3
[junit4:junit4]   2> 11390 T16 oasu.DirectUpdateHandler2.commit start commit{flags=0,_version_=0,optimize=false,openSearcher=true,waitSearcher=true,expungeDeletes=false,softCommit=true}
[junit4:junit4]   2> 11488 T16 oass.SolrIndexSearcher.<init> Opening Searcher@186b6ac8 main
[junit4:junit4]   2> 11489 T16 oass.SolrIndexSearcher.getIndexDir WARNING WARNING: Directory impl does not support setting indexDir: org.apache.lucene.store.MockDirectoryWrapper
[junit4:junit4]   2> 11490 T16 oasu.DirectUpdateHandler2.commit end_commit_flush
[junit4:junit4]   2> 11494 T14 oasc.SolrCore.registerSearcher [collection1] Registered new searcher Searcher@186b6ac8 main{StandardDirectoryReader(segments_2:5:nrt)}
[junit4:junit4]   2> 11508 T10 C1 UPDATE [collection1] webapp=null path=null params={} {add=[550]} 0 5
[junit4:junit4]   2> 12009 T16 oasu.DirectUpdateHandler2.commit start commit{flags=0,_version_=0,optimize=false,openSearcher=true,waitSearcher=true,expungeDeletes=false,softCommit=true}
[junit4:junit4]   2> 12023 T16 oass.SolrIndexSearcher.<init> Opening Searcher@25098594 main
[junit4:junit4]   2> 12023 T16 oass.SolrIndexSearcher.getIndexDir WARNING WARNING: Directory impl does not support setting indexDir: org.apache.lucene.store.MockDirectoryWrapper
[junit4:junit4]   2> 12024 T16 oasu.DirectUpdateHandler2.commit end_commit_flush
[junit4:junit4]   2> 12031 T14 oasc.SolrCore.registerSearcher [collection1] Registered new searcher Searcher@25098594 main{StandardDirectoryReader(segments_2:7:nrt _1(5.0):C1)}
[junit4:junit4]   2> 12090 T15 oasu.DirectUpdateHandler2.commit start commit{flags=0,_version_=0,optimize=false,openSearcher=true,waitSearcher=true,expungeDeletes=false,softCommit=false}
[junit4:junit4]   2> 12092 T15 oasc.SolrDeletionPolicy.onCommit SolrDeletionPolicy.onCommit: commits:num=2
[junit4:junit4]   2> 		commit{dir=MockDirWrapper(org.apache.lucene.store.RAMDirectory@4b25ee49 lockFactory=org.apache.lucene.store.NativeFSLockFactory@219a6087),segFN=segments_2,generation=2,filenames=[_0_Asserting_0.tim, _0_MockRandom_0.tib, _0.fnm, _0_TestBloomFilteredLucene41Postings_0.blm, _0_Asserting_0.tip, _0_TestBloomFilteredLucene41Postings_0.tim, _0_nrm.cfs, _0_TestBloomFilteredLucene41Postings_0.tip, _0_TestBloomFilteredLucene41Postings_0.pos, _0_MockRandom_0.sd, _0_MockRandom_0.doc, _0_MockRandom_0.pos, _0_SimpleText_0.pst, _0_nrm.cfe, _0_MockRandom_0.tii, _0_TestBloomFilteredLucene41Postings_0.doc, segments_2, _0.fdx, _0.si, _0_Asserting_0.pos, _0_Asserting_0.doc, _0.fdt]
[junit4:junit4]   2> 		commit{dir=MockDirWrapper(org.apache.lucene.store.RAMDirectory@4b25ee49 lockFactory=org.apache.lucene.store.NativeFSLockFactory@219a6087),segFN=segments_3,generation=3,filenames=[_1_nrm.cfs, _1_TestBloomFilteredLucene41Postings_0.pos, _1_Asserting_0.pos, _1_TestBloomFilteredLucene41Postings_0.tim, _1_MockRandom_0.tip, _1_Asserting_0.doc, _1_MockRandom_0.sd, _1_MockRandom_0.tim, _1_TestBloomFilteredLucene41Postings_0.doc, _1_TestBloomFilteredLucene41Postings_0.tip, _1.fnm, _1_MockRandom_0.pos, _1_nrm.cfe, _1.fdx, _1_Asserting_0.tim, _1_TestBloomFilteredLucene41Postings_0.blm, _1.fdt, _1_Asserting_0.tip, _1.si, _1_MockRandom_0.doc, segments_3, _1_SimpleText_0.pst]
[junit4:junit4]   2> 12092 T15 oasc.SolrDeletionPolicy.updateCommits newest commit = 3
[junit4:junit4]   2> 12094 T15 oass.SolrIndexSearcher.<init> Opening Searcher@2cfb1135 main
[junit4:junit4]   2> 12094 T15 oass.SolrIndexSearcher.getIndexDir WARNING WARNING: Directory impl does not support setting indexDir: org.apache.lucene.store.MockDirectoryWrapper
[junit4:junit4]   2> 12095 T15 oasu.DirectUpdateHandler2.commit end_commit_flush
[junit4:junit4]   2> 12100 T14 oasc.SolrCore.registerSearcher [collection1] Registered new searcher Searcher@2cfb1135 main{StandardDirectoryReader(segments_2:7:nrt _1(5.0):C1)}
[junit4:junit4]   2> 14095 T10 oasu.AbstractSolrTestCase.tearDown ####TEARDOWN_START testSoftAndHardCommitMaxTimeDelete
[junit4:junit4]   2> 14096 T10 oasc.CoreContainer.shutdown Shutting down CoreContainer instance=1954648890
[junit4:junit4]   2> 14096 T10 oasc.SolrCore.close [collection1]  CLOSING SolrCore org.apache.solr.core.SolrCore@66e90097
[junit4:junit4]   2> 14123 T10 oasu.DirectUpdateHandler2.close closing DirectUpdateHandler2{commits=4,autocommit maxTime=1200ms,autocommits=1,soft autocommit maxTime=500ms,soft autocommits=2,optimizes=0,rollbacks=0,expungeDeletes=0,docsPending=0,adds=0,deletesById=0,deletesByQuery=0,errors=0,cumulative_adds=2,cumulative_deletesById=1,cumulative_deletesByQuery=0,cumulative_errors=0}
[junit4:junit4]   2> 14125 T10 oasc.SolrCore.decrefSolrCoreState Closing SolrCoreState
[junit4:junit4]   2> 14126 T10 oasu.DefaultSolrCoreState.closeIndexWriter SolrCoreState ref count has reached 0 - closing IndexWriter
[junit4:junit4]   2> 14127 T10 oasu.DefaultSolrCoreState.closeIndexWriter closing IndexWriter with IndexWriterCloser
[junit4:junit4]   2> 14129 T10 oasc.SolrCore.closeSearcher [collection1] Closing main searcher on request.
[junit4:junit4]   2> 14352 T10 oasu.AbstractSolrTestCase.setUp ####SETUP_START testSoftAndHardCommitMaxTimeMixedAdds
[junit4:junit4]   2> 14355 T10 oasc.SolrResourceLoader.<init> new SolrResourceLoader for directory: '/usr/home/hudson/hudson-slave/workspace/Lucene-Solr-Tests-trunk-Java6/solr/build/solr-core/test-files/solr/collection1/'
[junit4:junit4]   2> 14357 T10 oasc.SolrResourceLoader.replaceClassLoader Adding 'file:/usr/home/hudson/hudson-slave/workspace/Lucene-Solr-Tests-trunk-Java6/solr/build/solr-core/test-files/solr/collection1/lib/classes/' to classloader
[junit4:junit4]   2> 14358 T10 oasc.SolrResourceLoader.replaceClassLoader Adding 'file:/usr/home/hudson/hudson-slave/workspace/Lucene-Solr-Tests-trunk-Java6/solr/build/solr-core/test-files/solr/collection1/lib/README' to classloader
[junit4:junit4]   2> 14511 T10 oasc.SolrConfig.<init> Using Lucene MatchVersion: LUCENE_50
[junit4:junit4]   2> 14570 T10 oasc.SolrConfig.<init> Loaded SolrConfig: solrconfig.xml
[junit4:junit4]   2> 14571 T10 oass.IndexSchema.readSchema Reading Solr Schema
[junit4:junit4]   2> 14606 T10 oass.IndexSchema.readSchema Schema name=test
[junit4:junit4]   2> 15188 T10 oass.OpenExchangeRatesOrgProvider.init Initialized with rates=open-exchange-rates.json, refreshInterval=1440.
[junit4:junit4]   2> 15200 T10 oass.IndexSchema.readSchema default search field in schema is text
[junit4:junit4]   2> 15203 T10 oass.IndexSchema.readSchema unique key field: id
[junit4:junit4]   2> 15220 T10 oass.FileExchangeRateProvider.reload Reloading exchange rates from file currency.xml
[junit4:junit4]   2> 15225 T10 oass.FileExchangeRateProvider.reload Reloading exchange rates from file currency.xml
[junit4:junit4]   2> 15229 T10 oass.OpenExchangeRatesOrgProvider.reload Reloading exchange rates from open-exchange-rates.json
[junit4:junit4]   2> 15231 T10 oass.OpenExchangeRatesOrgProvider.reload Reloading exchange rates from open-exchange-rates.json
[junit4:junit4]   2> 15233 T10 oasc.SolrResourceLoader.locateSolrHome JNDI not configured for solr (NoInitialContextEx)
[junit4:junit4]   2> 15234 T10 oasc.SolrResourceLoader.locateSolrHome using system property solr.solr.home: /usr/home/hudson/hudson-slave/workspace/Lucene-Solr-Tests-trunk-Java6/solr/build/solr-core/test-files/solr
[junit4:junit4]   2> 15234 T10 oasc.SolrResourceLoader.<init> new SolrResourceLoader for directory: '/usr/home/hudson/hudson-slave/workspace/Lucene-Solr-Tests-trunk-Java6/solr/build/solr-core/test-files/solr/'
[junit4:junit4]   2> 15242 T10 oasc.CoreContainer.<init> New CoreContainer 74955508
[junit4:junit4]   2> 15243 T10 oasc.SolrCore.<init> [collection1] Opening new SolrCore at /usr/home/hudson/hudson-slave/workspace/Lucene-Solr-Tests-trunk-Java6/solr/build/solr-core/test-files/solr/collection1/, dataDir=/usr/home/hudson/hudson-slave/workspace/Lucene-Solr-Tests-trunk-Java6/solr/build/solr-core/test/J1/./org.apache.solr.update.SoftAutoCommitTest-1351068334816/
[junit4:junit4]   2> 15243 T10 oasc.JmxMonitoredMap.<init> JMX monitoring is enabled. Adding Solr mbeans to JMX Server: com.sun.jmx.mbeanserver.JmxMBeanServer@27958cc2
[junit4:junit4]   2> 15244 T10 oasc.SolrCore.getNewIndexDir New index directory detected: old=null new=/usr/home/hudson/hudson-slave/workspace/Lucene-Solr-Tests-trunk-Java6/solr/build/solr-core/test/J1/./org.apache.solr.update.SoftAutoCommitTest-1351068334816/index/
[junit4:junit4]   2> 15245 T10 oasc.SolrCore.initIndex WARNING [collection1] Solr index directory '/usr/home/hudson/hudson-slave/workspace/Lucene-Solr-Tests-trunk-Java6/solr/build/solr-core/test/J1/./org.apache.solr.update.SoftAutoCommitTest-1351068334816/index' doesn't exist. Creating new index...
[junit4:junit4]   2> 15246 T10 oasc.CachingDirectoryFactory.get return new directory for /usr/home/hudson/hudson-slave/workspace/Lucene-Solr-Tests-trunk-Java6/solr/build/solr-core/test/J1/./org.apache.solr.update.SoftAutoCommitTest-1351068334816/index forceNew:false
[junit4:junit4]   2> 15253 T10 oasc.SolrDeletionPolicy.onCommit SolrDeletionPolicy.onCommit: commits:num=1
[junit4:junit4]   2> 		commit{dir=MockDirWrapper(org.apache.lucene.store.RAMDirectory@5da0b94d lockFactory=org.apache.lucene.store.NativeFSLockFactory@50f8ae79),segFN=segments_1,generation=1,filenames=[segments_1]
[junit4:junit4]   2> 15253 T10 oasc.SolrDeletionPolicy.updateCommits newest commit = 1
[junit4:junit4]   2> 15254 T10 oasc.SolrCore.initWriters created xml: solr.XMLResponseWriter
[junit4:junit4]   2> 15256 T10 oasup.UpdateRequestProcessorChain.init inserting DistributedUpdateProcessorFactory into updateRequestProcessorChain "dedupe"
[junit4:junit4]   2> 15257 T10 oasup.UpdateRequestProcessorChain.init inserting DistributedUpdateProcessorFactory into updateRequestProcessorChain "dedupe-allfields"
[junit4:junit4]   2> 15257 T10 oasup.UpdateRequestProcessorChain.init inserting DistributedUpdateProcessorFactory into updateRequestProcessorChain "stored_sig"
[junit4:junit4]   2> 15258 T10 oasup.UpdateRequestProcessorChain.init inserting DistributedUpdateProcessorFactory into updateRequestProcessorChain "uniq-fields"
[junit4:junit4]   2> 15259 T10 oasup.UpdateRequestProcessorChain.init inserting DistributedUpdateProcessorFactory into updateRequestProcessorChain "distrib-dup-test-chain-implicit"
[junit4:junit4]   2> 15259 T10 oasc.RequestHandlers.initHandlersFromConfig adding lazy requestHandler: solr.ReplicationHandler
[junit4:junit4]   2> 15260 T10 oasc.RequestHandlers.initHandlersFromConfig created /replication: solr.ReplicationHandler
[junit4:junit4]   2> 15261 T10 oasc.RequestHandlers.initHandlersFromConfig created standard: solr.StandardRequestHandler
[junit4:junit4]   2> 15261 T10 oasc.RequestHandlers.initHandlersFromConfig created /get: solr.RealTimeGetHandler
[junit4:junit4]   2> 15262 T10 oasc.RequestHandlers.initHandlersFromConfig created dismax: solr.SearchHandler
[junit4:junit4]   2> 15263 T10 oasc.RequestHandlers.initHandlersFromConfig created mock: org.apache.solr.core.MockQuerySenderListenerReqHandler
[junit4:junit4]   2> 15263 T10 oasc.RequestHandlers.initHandlersFromConfig created /admin/: org.apache.solr.handler.admin.AdminHandlers
[junit4:junit4]   2> 15264 T10 oasc.RequestHandlers.initHandlersFromConfig created defaults: solr.StandardRequestHandler
[junit4:junit4]   2> 15265 T10 oasc.RequestHandlers.initHandlersFromConfig adding lazy requestHandler: solr.StandardRequestHandler
[junit4:junit4]   2> 15265 T10 oasc.RequestHandlers.initHandlersFromConfig created lazy: solr.StandardRequestHandler
[junit4:junit4]   2> 15266 T10 oasc.RequestHandlers.initHandlersFromConfig created /update: solr.UpdateRequestHandler
[junit4:junit4]   2> 15266 T10 oasc.RequestHandlers.initHandlersFromConfig created /terms: org.apache.solr.handler.component.SearchHandler
[junit4:junit4]   2> 15267 T10 oasc.RequestHandlers.initHandlersFromConfig created spellCheckCompRH: org.apache.solr.handler.component.SearchHandler
[junit4:junit4]   2> 15268 T10 oasc.RequestHandlers.initHandlersFromConfig created spellCheckCompRH_Direct: org.apache.solr.handler.component.SearchHandler
[junit4:junit4]   2> 15268 T10 oasc.RequestHandlers.initHandlersFromConfig created spellCheckWithWordbreak: org.apache.solr.handler.component.SearchHandler
[junit4:junit4]   2> 15269 T10 oasc.RequestHandlers.initHandlersFromConfig created spellCheckWithWordbreak_Direct: org.apache.solr.handler.component.SearchHandler
[junit4:junit4]   2> 15270 T10 oasc.RequestHandlers.initHandlersFromConfig created spellCheckCompRH1: org.apache.solr.handler.component.SearchHandler
[junit4:junit4]   2> 15270 T10 oasc.RequestHandlers.initHandlersFromConfig created tvrh: org.apache.solr.handler.component.SearchHandler
[junit4:junit4]   2> 15271 T10 oasc.RequestHandlers.initHandlersFromConfig created /mlt: solr.MoreLikeThisHandler
[junit4:junit4]   2> 15272 T10 oasc.RequestHandlers.initHandlersFromConfig created /debug/dump: solr.DumpRequestHandler
[junit4:junit4]   2> 15277 T10 oashl.XMLLoader.init xsltCacheLifetimeSeconds=60
[junit4:junit4]   2> 15281 T10 oasc.SolrCore.initDeprecatedSupport WARNING solrconfig.xml uses deprecated <admin/gettableFiles>, Please update your config to use the ShowFileRequestHandler.
[junit4:junit4]   2> 15282 T10 oasc.SolrCore.initDeprecatedSupport WARNING adding ShowFileRequestHandler with hidden files: [THROW.ERROR.ON.ADD.UPDATEPROCESSOR.JS, SOLRCONFIG-HIGHLIGHT.XML, SCHEMA-REQUIRED-FIELDS.XML, BAD-SCHEMA-DUP-DYNAMICFIELD.XML, SCHEMA-MINIMAL.XML, TRIVIAL.UPDATEPROCESSOR1.JS, SCHEMA-REPLICATION2.XML, SOLRCONFIG-CACHING.XML, SOLRCONFIG-REPEATER.XML, SOLRCONFIG-MERGEPOLICY.XML, BAD-SCHEMA-NONTEXT-ANALYZER.XML, CURRENCY.XML, SOLRCONFIG-TLOG.XML, SOLRCONFIG-MASTER.XML, BAD-SCHEMA-UNIQUEKEY-MULTIVALUED.XML, SCHEMA11.XML, SOLRCONFIG-BASIC.XML, DA_COMPOUNDDICTIONARY.TXT, MISSLEADING.EXTENSION.UPDATEPROCESSOR.JS.TXT, SCHEMA-COPYFIELD-TEST.XML, SOLRCONFIG-SLAVE.XML, SOLRCONFIG-PROPINJECT-INDEXDEFAULT.XML, ELEVATE.XML, TRIVIAL.UPDATEPROCESSOR0.JS, BAD-SOLRCONFIG-BOGUS-SCRIPTENGINE-NAME.XML, SCHEMA-CHARFILTERS.XML, SCHEMA-IB.XML, SOLRCONFIG-QUERYSENDER.XML, DA_UTF8.XML, SCHEMA-REPLICATION1.XML, SOLRCONFIG-SNIPPET-PROCESSOR.XML, CONDITIONAL.UPDATEPROCESSOR.JS, MISSING.FUNCTIONS.UPDATEPROCESSOR.JS, HYPHENATION.DTD, SOLRCONFIG-ENABLEPLUGIN.XML, SCHEMA-PHRASESUGGEST.XML, STEMDICT.TXT, HUNSPELL-TEST.AFF, SCHEMA-SNIPPET-TYPE.XML, STOPTYPES-1.TXT, STOPWORDSWRONGENCODING.TXT, SCHEMA-NUMERIC.XML, SOLRCONFIG-TRANSFORMERS.XML, SOLRCONFIG-PROPINJECT.XML, BAD-SCHEMA-NOT-INDEXED-BUT-TF.XML, SOLRCONFIG-SIMPLELOCK.XML, WDFTYPES.TXT, SCHEMA-REVERSED.XML, STOPTYPES-2.TXT, BAD-SCHEMA-CURRENCY-FT-MULTIVALUED.XML, SOLRCONFIG-SPELLCHECKCOMPONENT.XML, BAD-SCHEMA-CURRENCY-MULTIVALUED.XML, SOLRCONFIG-PHRASESUGGEST.XML, SCHEMA-DFR.XML, BAD-SCHEMA-NOT-INDEXED-BUT-POS.XML, KEEP-1.TXT, SCHEMA-SPATIAL.XML, OPEN-EXCHANGE-RATES.JSON, STOPWITHBOM.TXT, SCHEMA-BINARYFIELD.XML, SOLRCONFIG-SPELLCHECKER.XML, SOLRCONFIG-UPDATE-PROCESSOR-CHAINS.XML, BAD-SCHEMA-OMIT-TF-BUT-NOT-POS.XML, SCHEMA-XINCLUDE.XML, BAD-SCHEMA-DUP-FIELDTYPE.XML, SOLRCONFIG-MASTER1.XML, SYNONYMS.TXT, BAD-SCHEMA-CURRENCY-DYNAMIC-MULTIVALUED.XML, SCHEMA_CODEC.XML, SCHEMA.XML, SOLRCONFIG-SOLR-749.XML, SOLRCONFIG-MASTER1-KEEPONEBACKUP.XML, SOLRCONFIG-FUNCTIONQUERY.XML, STOP-2.TXT, SCHEMA-LMDIRICHLET.XML, SOLRCONFIG-TERMINDEX.XML, SOLRCONFIG-ELEVATE.XML, SCHEMA-FOLDING.XML, STOPWORDS.TXT, SCHEMA-STOP-KEEP.XML, BAD-SCHEMA-NOT-INDEXED-BUT-NORMS.XML, SOLRCONFIG-SOLCOREPROPERTIES.XML, STOP-1.TXT, SOLRCONFIG-MASTER2.XML, SCHEMA-SPELLCHECKER.XML, SOLRCONFIG-RESPONSE-LOG-COMPONENT.XML, SOLRCONFIG-LAZYWRITER.XML, SCHEMA-LUCENEMATCHVERSION.XML, BAD-MP-SOLRCONFIG.XML, FRENCHARTICLES.TXT, SCHEMA15.XML, SOLRCONFIG-REQHANDLER.INCL, SCHEMASURROUND.XML, SOLRCONFIG-MASTER3.XML, HUNSPELL-TEST.DIC, BAD-SCHEMA-CODEC-GLOBAL-VS-FT-MISMATCH.XML, SOLRCONFIG-XINCLUDE.XML, SOLRCONFIG-DELPOLICY1.XML, SOLRCONFIG-SLAVE1.XML, SCHEMA-SIM.XML, SCHEMA-SNIPPET-FIELD.XML, SCHEMA-COLLATE.XML, STOP-SNOWBALL.TXT, BAD-SCHEMA-SIM-GLOBAL-VS-FT-MISMATCH.XML, PROTWORDS.TXT, SCHEMA-TRIE.XML, SOLRCONFIG_CODEC.XML, BAD-SOLRCONFIG-INVALID-SCRIPTFILE.XML, JASUGGEST.TXT, SCHEMA-TFIDF.XML, SOLRCONFIG-SCRIPT-UPDATEPROCESSOR.XML, SCHEMA-LMJELINEKMERCER.XML, PHRASESUGGEST.TXT, BAD-SOLRCONFIG-MISSING-SCRIPTFILE.XML, BAD-SCHEMA-UNIQUEKEY-USES-DEFAULT.XML, OLD_SYNONYMS.TXT, SOLRCONFIG-DELPOLICY2.XML, XSLT, SOLRCONFIG-NATIVELOCK.XML, BAD-SCHEMA-DUP-FIELD.XML, SOLRCONFIG-NOCACHE.XML, SCHEMA-BM25.XML, ADDFIELDS.UPDATEPROCESSOR.JS, SOLRCONFIG-QUERYSENDER-NOQUERY.XML, SOLRCONFIG-ALTDIRECTORY.XML, COMPOUNDDICTIONARY.TXT, SOLRCONFIG-INDEXCONFIG.XML, SOLRCONFIG_PERF.XML, BAD-SCHEMA-ANALYZER-CLASS-AND-NESTED.XML, SCHEMA-NOT-REQUIRED-UNIQUE-KEY.XML, KEEP-2.TXT, BAD-SCHEMA-UNIQUEKEY-IS-COPYFIELD-DEST.XML, SCHEMA12.XML, MAPPING-ISOLATIN1ACCENT.TXT, BAD_SOLRCONFIG.XML, BAD-SCHEMA-EXTERNAL-FILEFIELD.XML]
[junit4:junit4]   2> 15286 T10 oass.SolrIndexSearcher.<init> Opening Searcher@57004a1a main
[junit4:junit4]   2> 15286 T10 oass.SolrIndexSearcher.getIndexDir WARNING WARNING: Directory impl does not support setting indexDir: org.apache.lucene.store.MockDirectoryWrapper
[junit4:junit4]   2> 15287 T10 oasu.CommitTracker.<init> Hard AutoCommit: disabled
[junit4:junit4]   2> 15288 T10 oasu.CommitTracker.<init> Soft AutoCommit: disabled
[junit4:junit4]   2> 15288 T10 oashc.SpellCheckComponent.inform Initializing spell checkers
[junit4:junit4]   2> 15301 T10 oass.DirectSolrSpellChecker.init init: {name=direct,classname=DirectSolrSpellChecker,field=lowerfilt,minQueryLength=3}
[junit4:junit4]   2> 15354 T10 oashc.HttpShardHandlerFactory.getParameter Setting socketTimeout to: 0
[junit4:junit4]   2> 15355 T10 oashc.HttpShardHandlerFactory.getParameter Setting urlScheme to: http://
[junit4:junit4]   2> 15356 T10 oashc.HttpShardHandlerFactory.getParameter Setting connTimeout to: 0
[junit4:junit4]   2> 15356 T10 oashc.HttpShardHandlerFactory.getParameter Setting maxConnectionsPerHost to: 20
[junit4:junit4]   2> 15357 T10 oashc.HttpShardHandlerFactory.getParameter Setting corePoolSize to: 0
[junit4:junit4]   2> 15358 T10 oashc.HttpShardHandlerFactory.getParameter Setting maximumPoolSize to: 2147483647
[junit4:junit4]   2> 15359 T10 oashc.HttpShardHandlerFactory.getParameter Setting maxThreadIdleTime to: 5
[junit4:junit4]   2> 15360 T10 oashc.HttpShardHandlerFactory.getParameter Setting sizeOfQueue to: -1
[junit4:junit4]   2> 15361 T10 oashc.HttpShardHandlerFactory.getParameter Setting fairnessPolicy to: false
[junit4:junit4]   2> 15362 T10 oascsi.HttpClientUtil.createClient Creating new http client, config:maxConnectionsPerHost=20&maxConnections=10000&socketTimeout=0&connTimeout=0&retry=false
[junit4:junit4]   2> 15395 T17 oasc.SolrCore.registerSearcher [collection1] Registered new searcher Searcher@57004a1a main{StandardDirectoryReader(segments_1:1)}
[junit4:junit4]   2> 15409 T10 oasc.CoreContainer.register registering core: collection1
[junit4:junit4]   2> 15422 T10 oasu.AbstractSolrTestCase.setUp ####SETUP_END testSoftAndHardCommitMaxTimeMixedAdds
[junit4:junit4]   2> ASYNC  NEW_CORE C2 name=collection1 org.apache.solr.core.SolrCore@5092eb76
[junit4:junit4]   2> 15439 T10 C2 oasc.SolrDeletionPolicy.onInit SolrDeletionPolicy.onInit: commits:num=1
[junit4:junit4]   2> 		commit{dir=MockDirWrapper(org.apache.lucene.store.RAMDirectory@5da0b94d lockFactory=org.apache.lucene.store.NativeFSLockFactory@50f8ae79),segFN=segments_1,generation=1,filenames=[segments_1]
[junit4:junit4]   2> 15441 T10 C2 oasc.SolrDeletionPolicy.updateCommits newest commit = 1
[junit4:junit4]   2> 15447 T10 C2 UPDATE [collection1] webapp=null path=null params={} {add=[529]} 0 12
[junit4:junit4]   2> 15948 T19 oasu.DirectUpdateHandler2.commit start commit{flags=0,_version_=0,optimize=false,openSearcher=true,waitSearcher=true,expungeDeletes=false,softCommit=true}
[junit4:junit4]   2> 15958 T19 oass.SolrIndexSearcher.<init> Opening Searcher@2bb64b70 main
[junit4:junit4]   2> 15959 T19 oass.SolrIndexSearcher.getIndexDir WARNING WARNING: Directory impl does not support setting indexDir: org.apache.lucene.store.MockDirectoryWrapper
[junit4:junit4]   2> 15960 T19 oasu.DirectUpdateHandler2.commit end_commit_flush
[junit4:junit4]   2> 15962 T17 oasc.SolrCore.registerSearcher [collection1] Registered new searcher Searcher@2bb64b70 main{StandardDirectoryReader(segments_1:3:nrt _0(5.0):C1)}
[junit4:junit4]   2> 15972 T10 C2 UPDATE [collection1] webapp=null path=null params={} {add=[530]} 0 3
[junit4:junit4]   2> 16473 T19 oasu.DirectUpdateHandler2.commit start commit{flags=0,_version_=0,optimize=false,openSearcher=true,waitSearcher=true,expungeDeletes=false,softCommit=true}
[junit4:junit4]   2> 16506 T19 oass.SolrIndexSearcher.<init> Opening Searcher@2904b5ae main
[junit4:junit4]   2> 16506 T19 oass.SolrIndexSearcher.getIndexDir WARNING WARNING: Directory impl does not support setting indexDir: org.apache.lucene.store.MockDirectoryWrapper
[junit4:junit4]   2> 16507 T19 oasu.DirectUpdateHandler2.commit end_commit_flush
[junit4:junit4]   2> 16509 T17 oasc.SolrCore.registerSearcher [collection1] Registered new searcher Searcher@2904b5ae main{StandardDirectoryReader(segments_1:5:nrt _0(5.0):C1 _1(5.0):C1)}
[junit4:junit4]   2> 16648 T18 oasu.DirectUpdateHandler2.commit start commit{flags=0,_version_=0,optimize=false,openSearcher=true,waitSearcher=true,expungeDeletes=false,softCommit=false}
[junit4:junit4]   2> 16650 T18 oasc.SolrDeletionPolicy.onCommit SolrDeletionPolicy.onCommit: commits:num=2
[junit4:junit4]   2> 		commit{dir=MockDirWrapper(org.apache.lucene.store.RAMDirectory@5da0b94d lockFactory=org.apache.lucene.store.NativeFSLockFactory@50f8ae79),segFN=segments_1,generation=1,filenames=[segments_1]
[junit4:junit4]   2> 		commit{dir=MockDirWrapper(org.apache.lucene.store.RAMDirectory@5da0b94d lockFactory=org.apache.lucene.store.NativeFSLockFactory@50f8ae79),segFN=segments_2,generation=2,filenames=[_0_Asserting_0.tim, _1_TestBloomFilteredLucene41Postings_0.pos, _1_TestBloomFilteredLucene41Postings_0.tim, _0_Asserting_0.tip, _0_TestBloomFilteredLucene41Postings_0.tim, _1_Asserting_0.doc, _1_TestBloomFilteredLucene41Postings_0.tip, _0_TestBloomFilteredLucene41Postings_0.tip, _1_MockRandom_0.pos, _1.fnm, _0_TestBloomFilteredLucene41Postings_0.pos, _1_Asserting_0.tim, _1_Asserting_0.tip, _0_SimpleText_0.pst, _0.si, _0_Asserting_0.doc, _1_Asserting_0.pos, _1_nrm.cfs, _0_MockRandom_0.tib, _0.fnm, _0_TestBloomFilteredLucene41Postings_0.blm, _1_MockRandom_0.tip, _1_MockRandom_0.tim, _1_MockRandom_0.sd, _1_MockRandom_0.skp, _1_TestBloomFilteredLucene41Postings_0.doc, _0_nrm.cfs, _1_nrm.cfe, _1.fdx, _1_TestBloomFilteredLucene41Postings_0.blm, _0_MockRandom_0.sd, _1_MockRandom_0.pyl, _0_MockRandom_0.tiv, _1.fdt, _0_MockRandom_0.doc, _1.si, _0_nrm.cfe, _0_MockRandom_0.pos, segments_2, _0_TestBloomFilteredLucene41Postings_0.doc, _1_MockRandom_0.doc, _0.fdx, _1_MockRandom_0.frq, _0_Asserting_0.pos, _0.fdt, _1_SimpleText_0.pst]
[junit4:junit4]   2> 16651 T18 oasc.SolrDeletionPolicy.updateCommits newest commit = 2
[junit4:junit4]   2> 16652 T18 oass.SolrIndexSearcher.<init> Opening Searcher@43179c1c main
[junit4:junit4]   2> 16652 T18 oass.SolrIndexSearcher.getIndexDir WARNING WARNING: Directory impl does not support setting indexDir: org.apache.lucene.store.MockDirectoryWrapper
[junit4:junit4]   2> 16652 T18 oasu.DirectUpdateHandler2.commit end_commit_flush
[junit4:junit4]   2> 16655 T17 oasc.SolrCore.registerSearcher [collection1] Registered new searcher Searcher@43179c1c main{StandardDirectoryReader(segments_1:5:nrt _0(5.0):C1 _1(5.0):C1)}
[junit4:junit4]   2> 19853 T10 oasu.AbstractSolrTestCase.tearDown ####TEARDOWN_START testSoftAndHardCommitMaxTimeMixedAdds
[junit4:junit4]   2> 19854 T10 oasc.CoreContainer.shutdown Shutting down CoreContainer instance=74955508
[junit4:junit4]   2> 19854 T10 oasc.SolrCore.close [collection1]  CLOSING SolrCore org.apache.solr.core.SolrCore@5092eb76
[junit4:junit4]   2> 19879 T10 oasu.DirectUpdateHandler2.close closing DirectUpdateHandler2{commits=3,autocommit maxTime=1200ms,autocommits=1,soft autocommit maxTime=500ms,soft autocommits=2,optimizes=0,rollbacks=0,expungeDeletes=0,docsPending=0,adds=0,deletesById=0,deletesByQuery=0,errors=0,cumulative_adds=2,cumulative_deletesById=0,cumulative_deletesByQuery=0,cumulative_errors=0}
[junit4:junit4]   2> 19880 T10 oasc.SolrCore.decrefSolrCoreState Closing SolrCoreState
[junit4:junit4]   2> 19881 T10 oasu.DefaultSolrCoreState.closeIndexWriter SolrCoreState ref count has reached 0 - closing IndexWriter
[junit4:junit4]   2> 19881 T10 oasu.DefaultSolrCoreState.closeIndexWriter closing IndexWriter with IndexWriterCloser
[junit4:junit4]   2> 19883 T10 oasc.SolrCore.closeSearcher [collection1] Closing main searcher on request.
[junit4:junit4]   2> 141058 T10 oas.SolrTestCaseJ4.endTrackingSearchers SEVERE ERROR: SolrIndexSearcher opens=11 closes=9
[junit4:junit4]   2> NOTE: test params are: codec=Lucene41: {timestamp=PostingsFormat(name=Asserting), range_facet_l=PostingsFormat(name=Asserting), id=PostingsFormat(name=TestBloomFilteredLucene41Postings), range_facet_sl=PostingsFormat(name=TestBloomFilteredLucene41Postings), text=PostingsFormat(name=SimpleText), range_facet_si=PostingsFormat(name=Asserting), subject=PostingsFormat(name=Asserting), multiDefault=PostingsFormat(name=Asserting), intDefault=PostingsFormat(name=MockRandom)}, sim=DefaultSimilarity, locale=ar_DZ, timezone=Asia/Muscat
[junit4:junit4]   2> NOTE: FreeBSD 9.0-RELEASE amd64/Sun Microsystems Inc. 1.6.0_32 (64-bit)/cpus=16,threads=1,free=152990784,total=172949504
[junit4:junit4]   2> NOTE: All tests run in this JVM: [SoftAutoCommitTest]
[junit4:junit4]   2> NOTE: reproduce with: ant test  -Dtestcase=SoftAutoCommitTest -Dtests.seed=2B01EE39547E9AED -Dtests.multiplier=3 -Dtests.slow=true -Dtests.locale=ar_DZ -Dtests.timezone=Asia/Muscat -Dtests.file.encoding=ISO8859-1
[junit4:junit4] ERROR   0.00s J1 | SoftAutoCommitTest (suite) <<<
[junit4:junit4]    > Throwable #1: java.lang.AssertionError: ERROR: SolrIndexSearcher opens=11 closes=9
[junit4:junit4]    > 	at __randomizedtesting.SeedInfo.seed([2B01EE39547E9AED]:0)
[junit4:junit4]    > 	at org.junit.Assert.fail(Assert.java:93)
[junit4:junit4]    > 	at org.apache.solr.SolrTestCaseJ4.endTrackingSearchers(SolrTestCaseJ4.java:241)
[junit4:junit4]    > 	at org.apache.solr.util.AbstractSolrTestCase.afterClassAbstractSolrTestCase(AbstractSolrTestCase.java:121)
[junit4:junit4]    > 	at sun.reflect.NativeMethodAccessorImpl.invoke0(Native Method)
[junit4:junit4]    > 	at sun.reflect.NativeMethodAccessorImpl.invoke(NativeMethodAccessorImpl.java:57)
[junit4:junit4]    > 	at sun.reflect.DelegatingMethodAccessorImpl.invoke(DelegatingMethodAccessorImpl.java:43)
[junit4:junit4]    > 	at java.lang.reflect.Method.invoke(Method.java:616)
[junit4:junit4]    > 	at com.carrotsearch.randomizedtesting.RandomizedRunner.invoke(RandomizedRunner.java:1559)
[junit4:junit4]    > 	at com.carrotsearch.randomizedtesting.RandomizedRunner.access$600(RandomizedRunner.java:79)
[junit4:junit4]    > 	at com.carrotsearch.randomizedtesting.RandomizedRunner$5.evaluate(RandomizedRunner.java:700)
[junit4:junit4]    > 	at com.carrotsearch.randomizedtesting.rules.StatementAdapter.evaluate(StatementAdapter.java:36)
[junit4:junit4]    > 	at com.carrotsearch.randomizedtesting.rules.SystemPropertiesRestoreRule$1.evaluate(SystemPropertiesRestoreRule.java:53)
[junit4:junit4]    > 	at org.apache.lucene.util.AbstractBeforeAfterRule$1.evaluate(AbstractBeforeAfterRule.java:45)
[junit4:junit4]    > 	at org.apache.lucene.util.TestRuleStoreClassName$1.evaluate(TestRuleStoreClassName.java:42)
[junit4:junit4]    > 	at com.carrotsearch.randomizedtesting.rules.SystemPropertiesInvariantRule$1.evaluate(SystemPropertiesInvariantRule.java:55)
[junit4:junit4]    > 	at com.carrotsearch.randomizedtesting.rules.NoShadowingOrOverridesOnMethodsRule$1.evaluate(NoShadowingOrOverridesOnMethodsRule.java:39)
[junit4:junit4]    > 	at com.carrotsearch.randomizedtesting.rules.NoShadowingOrOverridesOnMethodsRule$1.evaluate(NoShadowingOrOverridesOnMethodsRule.java:39)
[junit4:junit4]    > 	at com.carrotsearch.randomizedtesting.rules.StatementAdapter.evaluate(StatementAdapter.java:36)
[junit4:junit4]    > 	at org.apache.lucene.util.TestRuleAssertionsRequired$1.evaluate(TestRuleAssertionsRequired.java:43)
[junit4:junit4]    > 	at org.apache.lucene.util.TestRuleMarkFailure$1.evaluate(TestRuleMarkFailure.java:48)
[junit4:junit4]    > 	at org.apache.lucene.util.TestRuleIgnoreAfterMaxFailures$1.evaluate(TestRuleIgnoreAfterMaxFailures.java:70)
[junit4:junit4]    > 	at org.apache.lucene.util.TestRuleIgnoreTestSuites$1.evaluate(TestRuleIgnoreTestSuites.java:55)
[junit4:junit4]    > 	at com.carrotsearch.randomizedtesting.rules.StatementAdapter.evaluate(StatementAdapter.java:36)
[junit4:junit4]    > 	at com.carrotsearch.randomizedtesting.ThreadLeakControl$StatementRunner.run(ThreadLeakControl.java:358)
[junit4:junit4]    > 	at java.lang.Thread.run(Thread.java:679)
[junit4:junit4] Completed on J1 in 142.63s, 3 tests, 2 failures <<< FAILURES!

[...truncated 227 lines...]
[junit4:junit4] Suite: org.apache.solr.cloud.RecoveryZkTest
[junit4:junit4]   2> 3 T901 oas.SolrTestCaseJ4.setUp ###Starting testDistribSearch
[junit4:junit4]   2> Creating dataDir: /usr/home/hudson/hudson-slave/workspace/Lucene-Solr-Tests-trunk-Java6/solr/build/solr-core/test/J1/./solrtest-RecoveryZkTest-1351068889979
[junit4:junit4]   2> 4 T901 oasc.ZkTestServer.run STARTING ZK TEST SERVER
[junit4:junit4]   2> 6 T902 oazs.ZooKeeperServer.setTickTime tickTime set to 1000
[junit4:junit4]   2> 7 T902 oazs.NIOServerCnxn$Factory.<init> binding to port 0.0.0.0/0.0.0.0:0
[junit4:junit4]   2> 8 T902 oazsp.FileTxnSnapLog.save Snapshotting: 0
[junit4:junit4]   2> 105 T901 oasc.ZkTestServer.run start zk server on port:12846
[junit4:junit4]   2> 105 T901 oaz.ZooKeeper.<init> Initiating client connection, connectString=127.0.0.1:12846 sessionTimeout=10000 watcher=org.apache.solr.common.cloud.ConnectionManager@77c143b0
[junit4:junit4]   2> 106 T907 oaz.ClientCnxn$SendThread.startConnect Opening socket connection to server /127.0.0.1:12846
[junit4:junit4]   2> 106 T901 oascc.ConnectionManager.waitForConnected Waiting for client to connect to ZooKeeper
[junit4:junit4]   2> 107 T907 oaz.ClientCnxn$SendThread.primeConnection Socket connection established to localhost/127.0.0.1:12846, initiating session
[junit4:junit4]   2> 107 T903 oazs.NIOServerCnxn$Factory.run Accepted socket connection from /140.211.11.196:12847
[junit4:junit4]   2> 107 T903 oazs.NIOServerCnxn.readConnectRequest Client attempting to establish new session at /140.211.11.196:12847
[junit4:junit4]   2> 107 T905 oazsp.FileTxnLog.append Creating new log file: log.1
[junit4:junit4]   2> 111 T905 oazs.NIOServerCnxn.finishSessionInit Established session 0x13a91fb337f0000 with negotiated timeout 10000 for client /140.211.11.196:12847
[junit4:junit4]   2> 111 T907 oaz.ClientCnxn$SendThread.readConnectResult Session establishment complete on server localhost/127.0.0.1:12846, sessionid = 0x13a91fb337f0000, negotiated timeout = 10000
[junit4:junit4]   2> 111 T908 oascc.ConnectionManager.process Watcher org.apache.solr.common.cloud.ConnectionManager@77c143b0 name:ZooKeeperConnection Watcher:127.0.0.1:12846 got event WatchedEvent state:SyncConnected type:None path:null path:null type:None
[junit4:junit4]   2> 112 T901 oascc.ConnectionManager.waitForConnected Client is connected to ZooKeeper
[junit4:junit4]   2> 112 T901 oascc.SolrZkClient.makePath makePath: /solr
[junit4:junit4]   2> 114 T906 oazs.PrepRequestProcessor.pRequest Processed session termination for sessionid: 0x13a91fb337f0000
[junit4:junit4]   2> 115 T908 oaz.ClientCnxn$EventThread.run EventThread shut down
[junit4:junit4]   2> 115 T901 oaz.ZooKeeper.close Session: 0x13a91fb337f0000 closed
[junit4:junit4]   2> 116 T903 oazs.NIOServerCnxn.closeSock Closed socket connection for client /140.211.11.196:12847 which had sessionid 0x13a91fb337f0000
[junit4:junit4]   2> 116 T901 oaz.ZooKeeper.<init> Initiating client connection, connectString=127.0.0.1:12846/solr sessionTimeout=10000 watcher=org.apache.solr.common.cloud.ConnectionManager@7b5898fc
[junit4:junit4]   2> 116 T909 oaz.ClientCnxn$SendThread.startConnect Opening socket connection to server /127.0.0.1:12846
[junit4:junit4]   2> 116 T901 oascc.ConnectionManager.waitForConnected Waiting for client to connect to ZooKeeper
[junit4:junit4]   2> 117 T909 oaz.ClientCnxn$SendThread.primeConnection Socket connection established to localhost/127.0.0.1:12846, initiating session
[junit4:junit4]   2> 117 T903 oazs.NIOServerCnxn$Factory.run Accepted socket connection from /140.211.11.196:12848
[junit4:junit4]   2> 117 T903 oazs.NIOServerCnxn.readConnectRequest Client attempting to establish new session at /140.211.11.196:12848
[junit4:junit4]   2> 125 T905 oazs.NIOServerCnxn.finishSessionInit Established session 0x13a91fb337f0001 with negotiated timeout 10000 for client /140.211.11.196:12848
[junit4:junit4]   2> 125 T909 oaz.ClientCnxn$SendThread.readConnectResult Session establishment complete on server localhost/127.0.0.1:12846, sessionid = 0x13a91fb337f0001, negotiated timeout = 10000
[junit4:junit4]   2> 125 T910 oascc.ConnectionManager.process Watcher org.apache.solr.common.cloud.ConnectionManager@7b5898fc name:ZooKeeperConnection Watcher:127.0.0.1:12846/solr got event WatchedEvent state:SyncConnected type:None path:null path:null type:None
[junit4:junit4]   2> 125 T901 oascc.ConnectionManager.waitForConnected Client is connected to ZooKeeper
[junit4:junit4]   2> 126 T901 oascc.SolrZkClient.makePath makePath: /collections/collection1
[junit4:junit4]   2> 130 T901 oascc.SolrZkClient.makePath makePath: /collections/collection1/shards
[junit4:junit4]   2> 139 T901 oascc.SolrZkClient.makePath makePath: /collections/control_collection
[junit4:junit4]   2> 142 T901 oascc.SolrZkClient.makePath makePath: /collections/control_collection/shards
[junit4:junit4]   2> 153 T901 oasc.AbstractZkTestCase.putConfig put /usr/home/hudson/hudson-slave/workspace/Lucene-Solr-Tests-trunk-Java6/solr/build/solr-core/test-files/solr/collection1/conf/solrconfig.xml to /configs/conf1/solrconfig.xml
[junit4:junit4]   2> 154 T901 oascc.SolrZkClient.makePath makePath: /configs/conf1/solrconfig.xml
[junit4:junit4]   2> 239 T901 oasc.AbstractZkTestCase.putConfig put /usr/home/hudson/hudson-slave/workspace/Lucene-Solr-Tests-trunk-Java6/solr/build/solr-core/test-files/solr/collection1/conf/schema.xml to /configs/conf1/schema.xml
[junit4:junit4]   2> 240 T901 oascc.SolrZkClient.makePath makePath: /configs/conf1/schema.xml
[junit4:junit4]   2> 343 T901 oasc.AbstractZkTestCase.putConfig put /usr/home/hudson/hudson-slave/workspace/Lucene-Solr-Tests-trunk-Java6/solr/build/solr-core/test-files/solr/collection1/conf/solrconfig.xml to /configs/conf1/solrconfig.xml
[junit4:junit4]   2> 344 T901 oascc.SolrZkClient.makePath makePath: /configs/conf1/solrconfig.xml
[junit4:junit4]   2> 347 T901 oasc.AbstractZkTestCase.putConfig put /usr/home/hudson/hudson-slave/workspace/Lucene-Solr-Tests-trunk-Java6/solr/build/solr-core/test-files/solr/collection1/conf/stopwords.txt to /configs/conf1/stopwords.txt
[junit4:junit4]   2> 347 T901 oascc.SolrZkClient.makePath makePath: /configs/conf1/stopwords.txt
[junit4:junit4]   2> 349 T901 oasc.AbstractZkTestCase.putConfig put /usr/home/hudson/hudson-slave/workspace/Lucene-Solr-Tests-trunk-Java6/solr/build/solr-core/test-files/solr/collection1/conf/protwords.txt to /configs/conf1/protwords.txt
[junit4:junit4]   2> 350 T901 oascc.SolrZkClient.makePath makePath: /configs/conf1/protwords.txt
[junit4:junit4]   2> 358 T901 oasc.AbstractZkTestCase.putConfig put /usr/home/hudson/hudson-slave/workspace/Lucene-Solr-Tests-trunk-Java6/solr/build/solr-core/test-files/solr/collection1/conf/currency.xml to /configs/conf1/currency.xml
[junit4:junit4]   2> 358 T901 oascc.SolrZkClient.makePath makePath: /configs/conf1/currency.xml
[junit4:junit4]   2> 361 T901 oasc.AbstractZkTestCase.putConfig put /usr/home/hudson/hudson-slave/workspace/Lucene-Solr-Tests-trunk-Java6/solr/build/solr-core/test-files/solr/collection1/conf/open-exchange-rates.json to /configs/conf1/open-exchange-rates.json
[junit4:junit4]   2> 361 T901 oascc.SolrZkClient.makePath makePath: /configs/conf1/open-exchange-rates.json
[junit4:junit4]   2> 363 T901 oasc.AbstractZkTestCase.putConfig put /usr/home/hudson/hudson-slave/workspace/Lucene-Solr-Tests-trunk-Java6/solr/build/solr-core/test-files/solr/collection1/conf/mapping-ISOLatin1Accent.txt to /configs/conf1/mapping-ISOLatin1Accent.txt
[junit4:junit4]   2> 364 T901 oascc.SolrZkClient.makePath makePath: /configs/conf1/mapping-ISOLatin1Accent.txt
[junit4:junit4]   2> 371 T901 oasc.AbstractZkTestCase.putConfig put /usr/home/hudson/hudson-slave/workspace/Lucene-Solr-Tests-trunk-Java6/solr/build/solr-core/test-files/solr/collection1/conf/old_synonyms.txt to /configs/conf1/old_synonyms.txt
[junit4:junit4]   2> 371 T901 oascc.SolrZkClient.makePath makePath: /configs/conf1/old_synonyms.txt
[junit4:junit4]   2> 374 T901 oasc.AbstractZkTestCase.putConfig put /usr/home/hudson/hudson-slave/workspace/Lucene-Solr-Tests-trunk-Java6/solr/build/solr-core/test-files/solr/collection1/conf/synonyms.txt to /configs/conf1/synonyms.txt
[junit4:junit4]   2> 374 T901 oascc.SolrZkClient.makePath makePath: /configs/conf1/synonyms.txt
[junit4:junit4]   2> 377 T906 oazs.PrepRequestProcessor.pRequest Processed session termination for sessionid: 0x13a91fb337f0001
[junit4:junit4]   2> 384 T910 oaz.ClientCnxn$EventThread.run EventThread shut down
[junit4:junit4]   2> 384 T901 oaz.ZooKeeper.close Session: 0x13a91fb337f0001 closed
[junit4:junit4]   2> 385 T903 oazs.NIOServerCnxn.closeSock Closed socket connection for client /140.211.11.196:12848 which had sessionid 0x13a91fb337f0001
[junit4:junit4]   2> 599 T901 oejs.Server.doStart jetty-8.1.2.v20120308
[junit4:junit4]   2> 603 T901 oejs.AbstractConnector.doStart Started SocketConnector@0.0.0.0:12851
[junit4:junit4]   2> 603 T901 oasc.SolrResourceLoader.locateSolrHome JNDI not configured for solr (NoInitialContextEx)
[junit4:junit4]   2> 604 T901 oasc.SolrResourceLoader.locateSolrHome using system property solr.solr.home: /usr/home/hudson/hudson-slave/workspace/Lucene-Solr-Tests-trunk-Java6/solr/build/solr-core/test/J1/./org.apache.solr.cloud.RecoveryZkTest-controljetty-1351068890360
[junit4:junit4]   2> 604 T901 oasc.SolrResourceLoader.<init> new SolrResourceLoader for deduced Solr Home: '/usr/home/hudson/hudson-slave/workspace/Lucene-Solr-Tests-trunk-Java6/solr/build/solr-core/test/J1/./org.apache.solr.cloud.RecoveryZkTest-controljetty-1351068890360/'
[junit4:junit4]   2> 646 T901 oass.SolrDispatchFilter.init SolrDispatchFilter.init()
[junit4:junit4]   2> 647 T901 oasc.SolrResourceLoader.locateSolrHome JNDI not configured for solr (NoInitialContextEx)
[junit4:junit4]   2> 647 T901 oasc.SolrResourceLoader.locateSolrHome using system property solr.solr.home: /usr/home/hudson/hudson-slave/workspace/Lucene-Solr-Tests-trunk-Java6/solr/build/solr-core/test/J1/./org.apache.solr.cloud.RecoveryZkTest-controljetty-1351068890360
[junit4:junit4]   2> 647 T901 oasc.CoreContainer$Initializer.initialize looking for solr.xml: /usr/home/hudson/hudson-slave/workspace/Lucene-Solr-Tests-trunk-Java6/solr/build/solr-core/test/J1/./org.apache.solr.cloud.RecoveryZkTest-controljetty-1351068890360/solr.xml
[junit4:junit4]   2> 648 T901 oasc.CoreContainer.<init> New CoreContainer 1860875328
[junit4:junit4]   2> 648 T901 oasc.CoreContainer.load Loading CoreContainer using Solr Home: '/usr/home/hudson/hudson-slave/workspace/Lucene-Solr-Tests-trunk-Java6/solr/build/solr-core/test/J1/./org.apache.solr.cloud.RecoveryZkTest-controljetty-1351068890360/'
[junit4:junit4]   2> 649 T901 oasc.SolrResourceLoader.<init> new SolrResourceLoader for directory: '/usr/home/hudson/hudson-slave/workspace/Lucene-Solr-Tests-trunk-Java6/solr/build/solr-core/test/J1/./org.apache.solr.cloud.RecoveryZkTest-controljetty-1351068890360/'
[junit4:junit4]   2> 683 T901 oasc.CoreContainer.load Registering Log Listener
[junit4:junit4]   2> 697 T901 oasc.CoreContainer.initZooKeeper Zookeeper client=127.0.0.1:12846/solr
[junit4:junit4]   2> 698 T901 oaz.ZooKeeper.<init> Initiating client connection, connectString=127.0.0.1:12846/solr sessionTimeout=5000 watcher=org.apache.solr.common.cloud.ConnectionManager@53e12a40
[junit4:junit4]   2> 699 T920 oaz.ClientCnxn$SendThread.startConnect Opening socket connection to server /127.0.0.1:12846
[junit4:junit4]   2> 699 T901 oascc.ConnectionManager.waitForConnected Waiting for client to connect to ZooKeeper
[junit4:junit4]   2> 700 T920 oaz.ClientCnxn$SendThread.primeConnection Socket connection established to localhost/127.0.0.1:12846, initiating session
[junit4:junit4]   2> 700 T903 oazs.NIOServerCnxn$Factory.run Accepted socket connection from /140.211.11.196:12852
[junit4:junit4]   2> 700 T903 oazs.NIOServerCnxn.readConnectRequest Client attempting to establish new session at /140.211.11.196:12852
[junit4:junit4]   2> 757 T905 oazs.NIOServerCnxn.finishSessionInit Established session 0x13a91fb337f0002 with negotiated timeout 5000 for client /140.211.11.196:12852
[junit4:junit4]   2> 757 T920 oaz.ClientCnxn$SendThread.readConnectResult Session establishment complete on server localhost/127.0.0.1:12846, sessionid = 0x13a91fb337f0002, negotiated timeout = 5000
[junit4:junit4]   2> 758 T921 oascc.ConnectionManager.process Watcher org.apache.solr.common.cloud.ConnectionManager@53e12a40 name:ZooKeeperConnection Watcher:127.0.0.1:12846/solr got event WatchedEvent state:SyncConnected type:None path:null path:null type:None
[junit4:junit4]   2> 758 T901 oascc.ConnectionManager.waitForConnected Client is connected to ZooKeeper
[junit4:junit4]   2> 769 T906 oazs.PrepRequestProcessor.pRequest Got user-level KeeperException when processing sessionid:0x13a91fb337f0002 type:create cxid:0x2 zxid:0xfffffffffffffffe txntype:unknown reqpath:n/a Error Path:/solr/overseer Error:KeeperErrorCode = NodeExists for /solr/overseer
[junit4:junit4]   2> 797 T901 oascc.SolrZkClient.makePath makePath: /live_nodes
[junit4:junit4]   2> 800 T901 oasc.ZkController.createEphemeralLiveNode Register node as live in ZooKeeper:/live_nodes/127.0.0.1:12851_solr
[junit4:junit4]   2> 801 T906 oazs.PrepRequestProcessor.pRequest Got user-level KeeperException when processing sessionid:0x13a91fb337f0002 type:delete cxid:0x7 zxid:0xfffffffffffffffe txntype:unknown reqpath:n/a Error Path:/solr/live_nodes/127.0.0.1:12851_solr Error:KeeperErrorCode = NoNode for /solr/live_nodes/127.0.0.1:12851_solr
[junit4:junit4]   2> 812 T901 oascc.SolrZkClient.makePath makePath: /live_nodes/127.0.0.1:12851_solr
[junit4:junit4]   2> 840 T901 oashc.HttpShardHandlerFactory.getParameter Setting socketTimeout to: 0
[junit4:junit4]   2> 840 T901 oashc.HttpShardHandlerFactory.getParameter Setting urlScheme to: http://
[junit4:junit4]   2> 841 T901 oashc.HttpShardHandlerFactory.getParameter Setting connTimeout to: 0
[junit4:junit4]   2> 841 T901 oashc.HttpShardHandlerFactory.getParameter Setting maxConnectionsPerHost to: 20
[junit4:junit4]   2> 841 T901 oashc.HttpShardHandlerFactory.getParameter Setting corePoolSize to: 0
[junit4:junit4]   2> 841 T901 oashc.HttpShardHandlerFactory.getParameter Setting maximumPoolSize to: 2147483647
[junit4:junit4]   2> 842 T901 oashc.HttpShardHandlerFactory.getParameter Setting maxThreadIdleTime to: 5
[junit4:junit4]   2> 842 T901 oashc.HttpShardHandlerFactory.getParameter Setting sizeOfQueue to: -1
[junit4:junit4]   2> 842 T901 oashc.HttpShardHandlerFactory.getParameter Setting fairnessPolicy to: false
[junit4:junit4]   2> 843 T901 oascsi.HttpClientUtil.createClient Creating new http client, config:maxConnectionsPerHost=20&maxConnections=10000&socketTimeout=0&connTimeout=0&retry=false
[junit4:junit4]   2> 854 T901 oascc.SolrZkClient.makePath makePath: /overseer_elect/election
[junit4:junit4]   2> 926 T906 oazs.PrepRequestProcessor.pRequest Got user-level KeeperException when processing sessionid:0x13a91fb337f0002 type:delete cxid:0x15 zxid:0xfffffffffffffffe txntype:unknown reqpath:n/a Error Path:/solr/overseer_elect/leader Error:KeeperErrorCode = NoNode for /solr/overseer_elect/leader
[junit4:junit4]   2> 1003 T901 oascc.SolrZkClient.makePath makePath: /overseer_elect/leader
[junit4:junit4]   2> 1037 T901 oasc.Overseer.start Overseer (id=88543650773925890-127.0.0.1:12851_solr-n_0000000000) starting
[junit4:junit4]   2> 1038 T906 oazs.PrepRequestProcessor.pRequest Got user-level KeeperException when processing sessionid:0x13a91fb337f0002 type:create cxid:0x1a zxid:0xfffffffffffffffe txntype:unknown reqpath:n/a Error Path:/solr/overseer Error:KeeperErrorCode = NodeExists for /solr/overseer
[junit4:junit4]   2> 1126 T906 oazs.PrepRequestProcessor.pRequest Got user-level KeeperException when processing sessionid:0x13a91fb337f0002 type:create cxid:0x1b zxid:0xfffffffffffffffe txntype:unknown reqpath:n/a Error Path:/solr/overseer Error:KeeperErrorCode = NodeExists for /solr/overseer
[junit4:junit4]   2> 1155 T906 oazs.PrepRequestProcessor.pRequest Got user-level KeeperException when processing sessionid:0x13a91fb337f0002 type:create cxid:0x1c zxid:0xfffffffffffffffe txntype:unknown reqpath:n/a Error Path:/solr/overseer Error:KeeperErrorCode = NodeExists for /solr/overseer
[junit4:junit4]   2> 1199 T906 oazs.PrepRequestProcessor.pRequest Got user-level KeeperException when processing sessionid:0x13a91fb337f0002 type:create cxid:0x1d zxid:0xfffffffffffffffe txntype:unknown reqpath:n/a Error Path:/solr/overseer Error:KeeperErrorCode = NodeExists for /solr/overseer
[junit4:junit4]   2> 1240 T923 oasc.OverseerCollectionProcessor.run Process current queue of collection creations
[junit4:junit4]   2> 1241 T901 oascc.SolrZkClient.makePath makePath: /clusterstate.json
[junit4:junit4]   2> 1274 T901 oascc.ZkStateReader.createClusterStateWatchersAndUpdate Updating cluster state from ZooKeeper... 
[junit4:junit4]   2> 1276 T922 oasc.Overseer$ClusterStateUpdater.run Starting to work on the main queue
[junit4:junit4]   2> 1281 T901 oasc.CoreContainer.create Creating SolrCore 'collection1' using instanceDir: /usr/home/hudson/hudson-slave/workspace/Lucene-Solr-Tests-trunk-Java6/solr/build/solr-core/test/J1/./org.apache.solr.cloud.RecoveryZkTest-controljetty-1351068890360/collection1
[junit4:junit4]   2> 1281 T901 oasc.ZkController.createCollectionZkNode Check for collection zkNode:control_collection
[junit4:junit4]   2> 1282 T901 oasc.ZkController.createCollectionZkNode Collection zkNode exists
[junit4:junit4]   2> 1282 T901 oasc.ZkController.readConfigName Load collection config from:/collections/control_collection
[junit4:junit4]   2> 1284 T901 oasc.SolrResourceLoader.<init> new SolrResourceLoader for directory: '/usr/home/hudson/hudson-slave/workspace/Lucene-Solr-Tests-trunk-Java6/solr/build/solr-core/test/J1/./org.apache.solr.cloud.RecoveryZkTest-controljetty-1351068890360/collection1/'
[junit4:junit4]   2> 1285 T901 oasc.SolrResourceLoader.replaceClassLoader Adding 'file:/usr/home/hudson/hudson-slave/workspace/Lucene-Solr-Tests-trunk-Java6/solr/build/solr-core/test/J1/org.apache.solr.cloud.RecoveryZkTest-controljetty-1351068890360/collection1/lib/README' to classloader
[junit4:junit4]   2> 1286 T901 oasc.SolrResourceLoader.replaceClassLoader Adding 'file:/usr/home/hudson/hudson-slave/workspace/Lucene-Solr-Tests-trunk-Java6/solr/build/solr-core/test/J1/org.apache.solr.cloud.RecoveryZkTest-controljetty-1351068890360/collection1/lib/classes/' to classloader
[junit4:junit4]   2> 1354 T901 oasc.SolrConfig.<init> Using Lucene MatchVersion: LUCENE_50
[junit4:junit4]   2> 1466 T901 oasc.SolrConfig.<init> Loaded SolrConfig: solrconfig.xml
[junit4:junit4]   2> 1568 T901 oass.IndexSchema.readSchema Reading Solr Schema
[junit4:junit4]   2> 1575 T901 oass.IndexSchema.readSchema Schema name=test
[junit4:junit4]   2> 2226 T901 oass.OpenExchangeRatesOrgProvider.init Initialized with rates=open-exchange-rates.json, refreshInterval=1440.
[junit4:junit4]   2> 2238 T901 oass.IndexSchema.readSchema default search field in schema is text
[junit4:junit4]   2> 2243 T901 oass.IndexSchema.readSchema unique key field: id
[junit4:junit4]   2> 2266 T901 oass.FileExchangeRateProvider.reload Reloading exchange rates from file currency.xml
[junit4:junit4]   2> 2271 T901 oass.FileExchangeRateProvider.reload Reloading exchange rates from file currency.xml
[junit4:junit4]   2> 2276 T901 oass.OpenExchangeRatesOrgProvider.reload Reloading exchange rates from open-exchange-rates.json
[junit4:junit4]   2> 2278 T901 oass.OpenExchangeRatesOrgProvider.reload Reloading exchange rates from open-exchange-rates.json
[junit4:junit4]   2> 2279 T901 oasc.SolrCore.<init> [collection1] Opening new SolrCore at /usr/home/hudson/hudson-slave/workspace/Lucene-Solr-Tests-trunk-Java6/solr/build/solr-core/test/J1/./org.apache.solr.cloud.RecoveryZkTest-controljetty-1351068890360/collection1/, dataDir=./org.apache.solr.cloud.RecoveryZkTest-1351068889978/control/data/
[junit4:junit4]   2> 2280 T901 oasc.JmxMonitoredMap.<init> JMX monitoring is enabled. Adding Solr mbeans to JMX Server: com.sun.jmx.mbeanserver.JmxMBeanServer@27958cc2
[junit4:junit4]   2> 2322 T901 oasc.SolrCore.getNewIndexDir New index directory detected: old=null new=./org.apache.solr.cloud.RecoveryZkTest-1351068889978/control/data/index/
[junit4:junit4]   2> 2323 T901 oasc.SolrCore.initIndex WARNING [collection1] Solr index directory './org.apache.solr.cloud.RecoveryZkTest-1351068889978/control/data/index' doesn't exist. Creating new index...
[junit4:junit4]   2> 2324 T901 oasc.CachingDirectoryFactory.get return new directory for /usr/home/hudson/hudson-slave/workspace/Lucene-Solr-Tests-trunk-Java6/solr/build/solr-core/test/J1/./org.apache.solr.cloud.RecoveryZkTest-1351068889978/control/data/index forceNew:false
[junit4:junit4]   2> 2351 T901 oasc.SolrDeletionPolicy.onCommit SolrDeletionPolicy.onCommit: commits:num=1
[junit4:junit4]   2> 		commit{dir=/usr/home/hudson/hudson-slave/workspace/Lucene-Solr-Tests-trunk-Java6/solr/build/solr-core/test/J1/org.apache.solr.cloud.RecoveryZkTest-1351068889978/control/data/index,segFN=segments_1,generation=1,filenames=[segments_1]
[junit4:junit4]   2> 2352 T901 oasc.SolrDeletionPolicy.updateCommits newest commit = 1
[junit4:junit4]   2> 2353 T901 oasc.SolrCore.initWriters created xml: solr.XMLResponseWriter
[junit4:junit4]   2> 2355 T901 oasup.UpdateRequestProcessorChain.init inserting DistributedUpdateProcessorFactory into updateRequestProcessorChain "dedupe"
[junit4:junit4]   2> 2356 T901 oasup.UpdateRequestProcessorChain.init inserting DistributedUpdateProcessorFactory into updateRequestProcessorChain "dedupe-allfields"
[junit4:junit4]   2> 2356 T901 oasup.UpdateRequestProcessorChain.init inserting DistributedUpdateProcessorFactory into updateRequestProcessorChain "stored_sig"
[junit4:junit4]   2> 2357 T901 oasup.UpdateRequestProcessorChain.init inserting DistributedUpdateProcessorFactory into updateRequestProcessorChain "uniq-fields"
[junit4:junit4]   2> 2357 T901 oasup.UpdateRequestProcessorChain.init inserting DistributedUpdateProcessorFactory into updateRequestProcessorChain "distrib-dup-test-chain-implicit"
[junit4:junit4]   2> 2358 T901 oasc.RequestHandlers.initHandlersFromConfig adding lazy requestHandler: solr.ReplicationHandler
[junit4:junit4]   2> 2358 T901 oasc.RequestHandlers.initHandlersFromConfig created /replication: solr.ReplicationHandler
[junit4:junit4]   2> 2359 T901 oasc.RequestHandlers.initHandlersFromConfig created standard: solr.StandardRequestHandler
[junit4:junit4]   2> 2360 T901 oasc.RequestHandlers.initHandlersFromConfig created /get: solr.RealTimeGetHandler
[junit4:junit4]   2> 2360 T901 oasc.RequestHandlers.initHandlersFromConfig created dismax: solr.SearchHandler
[junit4:junit4]   2> 2361 T901 oasc.RequestHandlers.initHandlersFromConfig created mock: org.apache.solr.core.MockQuerySenderListenerReqHandler
[junit4:junit4]   2> 2362 T901 oasc.RequestHandlers.initHandlersFromConfig created /admin/: org.apache.solr.handler.admin.AdminHandlers
[junit4:junit4]   2> 2362 T901 oasc.RequestHandlers.initHandlersFromConfig created defaults: solr.StandardRequestHandler
[junit4:junit4]   2> 2363 T901 oasc.RequestHandlers.initHandlersFromConfig adding lazy requestHandler: solr.StandardRequestHandler
[junit4:junit4]   2> 2363 T901 oasc.RequestHandlers.initHandlersFromConfig created lazy: solr.StandardRequestHandler
[junit4:junit4]   2> 2364 T901 oasc.RequestHandlers.initHandlersFromConfig created /update: solr.UpdateRequestHandler
[junit4:junit4]   2> 2364 T901 oasc.RequestHandlers.initHandlersFromConfig created /terms: org.apache.solr.handler.component.SearchHandler
[junit4:junit4]   2> 2365 T901 oasc.RequestHandlers.initHandlersFromConfig created spellCheckCompRH: org.apache.solr.handler.component.SearchHandler
[junit4:junit4]   2> 2366 T901 oasc.RequestHandlers.initHandlersFromConfig created spellCheckCompRH_Direct: org.apache.solr.handler.component.SearchHandler
[junit4:junit4]   2> 2366 T901 oasc.RequestHandlers.initHandlersFromConfig created spellCheckWithWordbreak: org.apache.solr.handler.component.SearchHandler
[junit4:junit4]   2> 2367 T901 oasc.RequestHandlers.initHandlersFromConfig created spellCheckWithWordbreak_Direct: org.apache.solr.handler.component.SearchHandler
[junit4:junit4]   2> 2367 T901 oasc.RequestHandlers.initHandlersFromConfig created spellCheckCompRH1: org.apache.solr.handler.component.SearchHandler
[junit4:junit4]   2> 2368 T901 oasc.RequestHandlers.initHandlersFromConfig created tvrh: org.apache.solr.handler.component.SearchHandler
[junit4:junit4]   2> 2369 T901 oasc.RequestHandlers.initHandlersFromConfig created /mlt: solr.MoreLikeThisHandler
[junit4:junit4]   2> 2369 T901 oasc.RequestHandlers.initHandlersFromConfig created /debug/dump: solr.DumpRequestHandler
[junit4:junit4]   2> 2378 T901 oashl.XMLLoader.init xsltCacheLifetimeSeconds=60
[junit4:junit4]   2> 2384 T901 oasc.SolrCore.initDeprecatedSupport WARNING solrconfig.xml uses deprecated <admin/gettableFiles>, Please update your config to use the ShowFileRequestHandler.
[junit4:junit4]   2> 2385 T901 oasc.SolrCore.initDeprecatedSupport WARNING adding ShowFileRequestHandler with hidden files: [SCHEMA.XML, OLD_SYNONYMS.TXT, STOPWORDS.TXT, PROTWORDS.TXT, OPEN-EXCHANGE-RATES.JSON, SYNONYMS.TXT, CURRENCY.XML, MAPPING-ISOLATIN1ACCENT.TXT]
[junit4:junit4]   2> 2389 T901 oass.SolrIndexSearcher.<init> Opening Searcher@413692c8 main
[junit4:junit4]   2> 2391 T901 oasu.CommitTracker.<init> Hard AutoCommit: disabled
[junit4:junit4]   2> 2391 T901 oasu.CommitTracker.<init> Soft AutoCommit: disabled
[junit4:junit4]   2> 2392 T901 oashc.SpellCheckComponent.inform Initializing spell checkers
[junit4:junit4]   2> 2405 T901 oass.DirectSolrSpellChecker.init init: {name=direct,classname=DirectSolrSpellChecker,field=lowerfilt,minQueryLength=3}
[junit4:junit4]   2> 2454 T924 oasc.SolrCore.registerSearcher [collection1] Registered new searcher Searcher@413692c8 main{StandardDirectoryReader(segments_1:1)}
[junit4:junit4]   2> 2459 T906 oazs.PrepRequestProcessor.pRequest Got user-level KeeperException when processing sessionid:0x13a91fb337f0002 type:create cxid:0x56 zxid:0xfffffffffffffffe txntype:unknown reqpath:n/a Error Path:/solr/overseer/queue Error:KeeperErrorCode = NoNode for /solr/overseer/queue
[junit4:junit4]   2> 2471 T901 oasc.CoreContainer.register registering core: collection1
[junit4:junit4]   2> 2472 T901 oasc.ZkController.register Register shard - core:collection1 address:http://127.0.0.1:12851/solr shardId:control_shard
[junit4:junit4]   2> 2473 T901 oascc.SolrZkClient.makePath makePath: /collections/control_collection/leader_elect/control_shard/election
[junit4:junit4]   2> 2487 T906 oazs.PrepRequestProcessor.pRequest Got user-level KeeperException when processing sessionid:0x13a91fb337f0002 type:delete cxid:0x65 zxid:0xfffffffffffffffe txntype:unknown reqpath:n/a Error Path:/solr/collections/control_collection/leaders Error:KeeperErrorCode = NoNode for /solr/collections/control_collection/leaders
[junit4:junit4]   2> 2489 T901 oasc.ShardLeaderElectionContext.runLeaderProcess Running the leader process.
[junit4:junit4]   2> 2490 T906 oazs.PrepRequestProcessor.pRequest Got user-level KeeperException when processing sessionid:0x13a91fb337f0002 type:create cxid:0x66 zxid:0xfffffffffffffffe txntype:unknown reqpath:n/a Error Path:/solr/overseer Error:KeeperErrorCode = NodeExists for /solr/overseer
[junit4:junit4]   2> 2783 T922 oascc.ZkStateReader.updateClusterState Updating cloud state from ZooKeeper... 
[junit4:junit4]   2> 2785 T906 oazs.PrepRequestProcessor.pRequest Got user-level KeeperException when processing sessionid:0x13a91fb337f0002 type:create cxid:0x6d zxid:0xfffffffffffffffe txntype:unknown reqpath:n/a Error Path:/solr/overseer/queue-work Error:KeeperErrorCode = NoNode for /solr/overseer/queue-work
[junit4:junit4]   2> 2811 T921 oascc.ZkStateReader$2.process A cluster state change has occurred - updating...
[junit4:junit4]   2> 2999 T901 oasc.ShardLeaderElectionContext.waitForReplicasToComeUp Enough replicas found to continue.
[junit4:junit4]   2> 3000 T901 oasc.ShardLeaderElectionContext.runLeaderProcess I may be the new leader - try and sync
[junit4:junit4]   2> 3000 T901 oasc.SyncStrategy.sync Sync replicas to http://127.0.0.1:12851/solr/collection1/
[junit4:junit4]   2> 3001 T901 oasc.SyncStrategy.syncReplicas Sync Success - now sync replicas to me
[junit4:junit4]   2> 3001 T901 oasc.SyncStrategy.syncToMe http://127.0.0.1:12851/solr/collection1/ has no replicas
[junit4:junit4]   2> 3002 T901 oasc.ShardLeaderElectionContext.runLeaderProcess I am the new leader: http://127.0.0.1:12851/solr/collection1/
[junit4:junit4]   2> 3002 T901 oascc.SolrZkClient.makePath makePath: /collections/control_collection/leaders/control_shard
[junit4:junit4]   2> 3007 T906 oazs.PrepRequestProcessor.pRequest Got user-level KeeperException when processing sessionid:0x13a91fb337f0002 type:create cxid:0x8b zxid:0xfffffffffffffffe txntype:unknown reqpath:n/a Error Path:/solr/overseer Error:KeeperErrorCode = NodeExists for /solr/overseer
[junit4:junit4]   2> 3324 T922 oascc.ZkStateReader.updateClusterState Updating cloud state from ZooKeeper... 
[junit4:junit4]   2> 3337 T921 oascc.ZkStateReader$2.process A cluster state change has occurred - updating...
[junit4:junit4]   2> 3375 T901 oasc.ZkController.register We are http://127.0.0.1:12851/solr/collection1/ and leader is http://127.0.0.1:12851/solr/collection1/
[junit4:junit4]   2> 3375 T901 oasc.ZkController.register No LogReplay needed for core=collection1 baseURL=http://127.0.0.1:12851/solr
[junit4:junit4]   2> 3376 T901 oasc.ZkController.checkRecovery I am the leader, no recovery necessary
[junit4:junit4]   2> 3378 T901 oascc.ZkStateReader.updateClusterState Updating cloud state from ZooKeeper... 
[junit4:junit4]   2> 3379 T901 oass.SolrDispatchFilter.init user.dir=/usr/home/hudson/hudson-slave/workspace/Lucene-Solr-Tests-trunk-Java6/solr/build/solr-core/test/J1
[junit4:junit4]   2> 3380 T901 oass.SolrDispatchFilter.init SolrDispatchFilter.init() done
[junit4:junit4]   2> 3380 T901 oascsi.HttpClientUtil.createClient Creating new http client, config:maxConnections=128&maxConnectionsPerHost=32&followRedirects=false
[junit4:junit4]   2> 3534 T901 oejs.Server.doStart jetty-8.1.2.v20120308
[junit4:junit4]   2> 3536 T901 oejs.AbstractConnector.doStart Started SocketConnector@0.0.0.0:12862
[junit4:junit4]   2> 3537 T901 oasc.SolrResourceLoader.locateSolrHome JNDI not configured for solr (NoInitialContextEx)
[junit4:junit4]   2> 3537 T901 oasc.SolrResourceLoader.locateSolrHome using system property solr.solr.home: /usr/home/hudson/hudson-slave/workspace/Lucene-Solr-Tests-trunk-Java6/solr/build/solr-core/test/J1/./org.apache.solr.cloud.RecoveryZkTest-jetty1-1351068893369
[junit4:junit4]   2> 3538 T901 oasc.SolrResourceLoader.<init> new SolrResourceLoader for deduced Solr Home: '/usr/home/hudson/hudson-slave/workspace/Lucene-Solr-Tests-trunk-Java6/solr/build/solr-core/test/J1/./org.apache.solr.cloud.RecoveryZkTest-jetty1-1351068893369/'
[junit4:junit4]   2> 3570 T901 oass.SolrDispatchFilter.init SolrDispatchFilter.init()
[junit4:junit4]   2> 3570 T901 oasc.SolrResourceLoader.locateSolrHome JNDI not configured for solr (NoInitialContextEx)
[junit4:junit4]   2> 3571 T901 oasc.SolrResourceLoader.locateSolrHome using system property solr.solr.home: /usr/home/hudson/hudson-slave/workspace/Lucene-Solr-Tests-trunk-Java6/solr/build/solr-core/test/J1/./org.apache.solr.cloud.RecoveryZkTest-jetty1-1351068893369
[junit4:junit4]   2> 3571 T901 oasc.CoreContainer$Initializer.initialize looking for solr.xml: /usr/home/hudson/hudson-slave/workspace/Lucene-Solr-Tests-trunk-Java6/solr/build/solr-core/test/J1/./org.apache.solr.cloud.RecoveryZkTest-jetty1-1351068893369/solr.xml
[junit4:junit4]   2> 3572 T901 oasc.CoreContainer.<init> New CoreContainer 1514204209
[junit4:junit4]   2> 3572 T901 oasc.CoreContainer.load Loading CoreContainer using Solr Home: '/usr/home/hudson/hudson-slave/workspace/Lucene-Solr-Tests-trunk-Java6/solr/build/solr-core/test/J1/./org.apache.solr.cloud.RecoveryZkTest-jetty1-1351068893369/'
[junit4:junit4]   2> 3572 T901 oasc.SolrResourceLoader.<init> new SolrResourceLoader for directory: '/usr/home/hudson/hudson-slave/workspace/Lucene-Solr-Tests-trunk-Java6/solr/build/solr-core/test/J1/./org.apache.solr.cloud.RecoveryZkTest-jetty1-1351068893369/'
[junit4:junit4]   2> 3595 T901 oasc.CoreContainer.load Registering Log Listener
[junit4:junit4]   2> 3608 T901 oasc.CoreContainer.initZooKeeper Zookeeper client=127.0.0.1:12846/solr
[junit4:junit4]   2> 3609 T901 oaz.ZooKeeper.<init> Initiating client connection, connectString=127.0.0.1:12846/solr sessionTimeout=5000 watcher=org.apache.solr.common.cloud.ConnectionManager@39769fc1
[junit4:junit4]   2> 3610 T934 oaz.ClientCnxn$SendThread.startConnect Opening socket connection to server /127.0.0.1:12846
[junit4:junit4]   2> 3610 T901 oascc.ConnectionManager.waitForConnected Waiting for client to connect to ZooKeeper
[junit4:junit4]   2> 3611 T934 oaz.ClientCnxn$SendThread.primeConnection Socket connection established to localhost/127.0.0.1:12846, initiating session
[junit4:junit4]   2> 3612 T903 oazs.NIOServerCnxn$Factory.run Accepted socket connection from /140.211.11.196:12863
[junit4:junit4]   2> 3612 T903 oazs.NIOServerCnxn.readConnectRequest Client attempting to establish new session at /140.211.11.196:12863
[junit4:junit4]   2> 3614 T905 oazs.NIOServerCnxn.finishSessionInit Established session 0x13a91fb337f0003 with negotiated timeout 5000 for client /140.211.11.196:12863
[junit4:junit4]   2> 3614 T934 oaz.ClientCnxn$SendThread.readConnectResult Session establishment complete on server localhost/127.0.0.1:12846, sessionid = 0x13a91fb337f0003, negotiated timeout = 5000
[junit4:junit4]   2> 3614 T935 oascc.ConnectionManager.process Watcher org.apache.solr.common.cloud.ConnectionManager@39769fc1 name:ZooKeeperConnection Watcher:127.0.0.1:12846/solr got event WatchedEvent state:SyncConnected type:None path:null path:null type:None
[junit4:junit4]   2> 3614 T901 oascc.ConnectionManager.waitForConnected Client is connected to ZooKeeper
[junit4:junit4]   2> 3615 T906 oazs.PrepRequestProcessor.pRequest Got user-level KeeperException when processing sessionid:0x13a91fb337f0003 type:create cxid:0x1 zxid:0xfffffffffffffffe txntype:unknown reqpath:n/a Error Path:/solr/overseer Error:KeeperErrorCode = NodeExists for /solr/overseer
[junit4:junit4]   2> 3624 T906 oazs.PrepRequestProcessor.pRequest Got user-level KeeperException when processing sessionid:0x13a91fb337f0003 type:create cxid:0x2 zxid:0xfffffffffffffffe txntype:unknown reqpath:n/a Error Path:/solr/overseer Error:KeeperErrorCode = NodeExists for /solr/overseer
[junit4:junit4]   2> 3626 T901 oasc.ZkController.createEphemeralLiveNode Register node as live in ZooKeeper:/live_nodes/127.0.0.1:12862_solr
[junit4:junit4]   2> 3626 T906 oazs.PrepRequestProcessor.pRequest Got user-level KeeperException when processing sessionid:0x13a91fb337f0003 type:delete cxid:0x4 zxid:0xfffffffffffffffe txntype:unknown reqpath:n/a Error Path:/solr/live_nodes/127.0.0.1:12862_solr Error:KeeperErrorCode = NoNode for /solr/live_nodes/127.0.0.1:12862_solr
[junit4:junit4]   2> 3628 T901 oascc.SolrZkClient.makePath makePath: /live_nodes/127.0.0.1:12862_solr
[junit4:junit4]   2> 3636 T921 oascc.ZkStateReader$3.process Updating live nodes
[junit4:junit4]   2> 3637 T901 oashc.HttpShardHandlerFactory.getParameter Setting socketTimeout to: 0
[junit4:junit4]   2> 3637 T901 oashc.HttpShardHandlerFactory.getParameter Setting urlScheme to: http://
[junit4:junit4]   2> 3638 T901 oashc.HttpShardHandlerFactory.getParameter Setting connTimeout to: 0
[junit4:junit4]   2> 3638 T901 oashc.HttpShardHandlerFactory.getParameter Setting maxConnectionsPerHost to: 20
[junit4:junit4]   2> 3638 T901 oashc.HttpShardHandlerFactory.getParameter Setting corePoolSize to: 0
[junit4:junit4]   2> 3639 T901 oashc.HttpShardHandlerFactory.getParameter Setting maximumPoolSize to: 2147483647
[junit4:junit4]   2> 3639 T901 oashc.HttpShardHandlerFactory.getParameter Setting maxThreadIdleTime to: 5
[junit4:junit4]   2> 3640 T901 oashc.HttpShardHandlerFactory.getParameter Setting sizeOfQueue to: -1
[junit4:junit4]   2> 3640 T901 oashc.HttpShardHandlerFactory.getParameter Setting fairnessPolicy to: false
[junit4:junit4]   2> 3641 T901 oascsi.HttpClientUtil.createClient Creating new http client, config:maxConnectionsPerHost=20&maxConnections=10000&socketTimeout=0&connTimeout=0&retry=false
[junit4:junit4]   2> 3658 T901 oascc.ZkStateReader.createClusterStateWatchersAndUpdate Updating cluster state from ZooKeeper... 
[junit4:junit4]   2> 3668 T901 oasc.CoreContainer.create Creating SolrCore 'collection1' using instanceDir: /usr/home/hudson/hudson-slave/workspace/Lucene-Solr-Tests-trunk-Java6/solr/build/solr-core/test/J1/./org.apache.solr.cloud.RecoveryZkTest-jetty1-1351068893369/collection1
[junit4:junit4]   2> 3669 T901 oasc.ZkController.createCollectionZkNode Check for collection zkNode:collection1
[junit4:junit4]   2> 3669 T901 oasc.ZkController.createCollectionZkNode Collection zkNode exists
[junit4:junit4]   2> 3670 T901 oasc.ZkController.readConfigName Load collection config from:/collections/collection1
[junit4:junit4]   2> 3671 T901 oasc.SolrResourceLoader.<init> new SolrResourceLoader for directory: '/usr/home/hudson/hudson-slave/workspace/Lucene-Solr-Tests-trunk-Java6/solr/build/solr-core/test/J1/./org.apache.solr.cloud.RecoveryZkTest-jetty1-1351068893369/collection1/'
[junit4:junit4]   2> 3673 T901 oasc.SolrResourceLoader.replaceClassLoader Adding 'file:/usr/home/hudson/hudson-slave/workspace/Lucene-Solr-Tests-trunk-Java6/solr/build/solr-core/test/J1/org.apache.solr.cloud.RecoveryZkTest-jetty1-1351068893369/collection1/lib/classes/' to classloader
[junit4:junit4]   2> 3674 T901 oasc.SolrResourceLoader.replaceClassLoader Adding 'file:/usr/home/hudson/hudson-slave/workspace/Lucene-Solr-Tests-trunk-Java6/solr/build/solr-core/test/J1/org.apache.solr.cloud.RecoveryZkTest-jetty1-1351068893369/collection1/lib/README' to classloader
[junit4:junit4]   2> 3726 T901 oasc.SolrConfig.<init> Using Lucene MatchVersion: LUCENE_50
[junit4:junit4]   2> 3799 T901 oasc.SolrConfig.<init> Loaded SolrConfig: solrconfig.xml
[junit4:junit4]   2> 3841 T922 oascc.ZkStateReader.updateClusterState Updating cloud state from ZooKeeper... 
[junit4:junit4]   2> 3855 T921 oascc.ZkStateReader$2.process A cluster state change has occurred - updating...
[junit4:junit4]   2> 3900 T935 oascc.ZkStateReader$2.process A cluster state change has occurred - updating...
[junit4:junit4]   2> 3900 T901 oass.IndexSchema.readSchema Reading Solr Schema
[junit4:junit4]   2> 3906 T901 oass.IndexSchema.readSchema Schema name=test
[junit4:junit4]   2> 4498 T901 oass.OpenExchangeRatesOrgProvider.init Initialized with rates=open-exchange-rates.json, refreshInterval=1440.
[junit4:junit4]   2> 4510 T901 oass.IndexSchema.readSchema default search field in schema is text
[junit4:junit4]   2> 4514 T901 oass.IndexSchema.readSchema unique key field: id
[junit4:junit4]   2> 4527 T901 oass.FileExchangeRateProvider.reload Reloading exchange rates from file currency.xml
[junit4:junit4]   2> 4532 T901 oass.FileExchangeRateProvider.reload Reloading exchange rates from file currency.xml
[junit4:junit4]   2> 4537 T901 oass.OpenExchangeRatesOrgProvider.reload Reloading exchange rates from open-exchange-rates.json
[junit4:junit4]   2> 4539 T901 oass.OpenExchangeRatesOrgProvider.reload Reloading exchange rates from open-exchange-rates.json
[junit4:junit4]   2> 4540 T901 oasc.SolrCore.<init> [collection1] Opening new SolrCore at /usr/home/hudson/hudson-slave/workspace/Lucene-Solr-Tests-trunk-Java6/solr/build/solr-core/test/J1/./org.apache.solr.cloud.RecoveryZkTest-jetty1-1351068893369/collection1/, dataDir=./org.apache.solr.cloud.RecoveryZkTest-1351068889978/jetty1/
[junit4:junit4]   2> 4541 T901 oasc.JmxMonitoredMap.<init> JMX monitoring is enabled. Adding Solr mbeans to JMX Server: com.sun.jmx.mbeanserver.JmxMBeanServer@27958cc2
[junit4:junit4]   2> 4542 T901 oasc.SolrCore.getNewIndexDir New index directory detected: old=null new=./org.apache.solr.cloud.RecoveryZkTest-1351068889978/jetty1/index/
[junit4:junit4]   2> 4543 T901 oasc.SolrCore.initIndex WARNING [collection1] Solr index directory './org.apache.solr.cloud.RecoveryZkTest-1351068889978/jetty1/index' doesn't exist. Creating new index...
[junit4:junit4]   2> 4544 T901 oasc.CachingDirectoryFactory.get return new directory for /usr/home/hudson/hudson-slave/workspace/Lucene-Solr-Tests-trunk-Java6/solr/build/solr-core/test/J1/./org.apache.solr.cloud.RecoveryZkTest-1351068889978/jetty1/index forceNew:false
[junit4:junit4]   2> 4550 T901 oasc.SolrDeletionPolicy.onCommit SolrDeletionPolicy.onCommit: commits:num=1
[junit4:junit4]   2> 		commit{dir=/usr/home/hudson/hudson-slave/workspace/Lucene-Solr-Tests-trunk-Java6/solr/build/solr-core/test/J1/org.apache.solr.cloud.RecoveryZkTest-1351068889978/jetty1/index,segFN=segments_1,generation=1,filenames=[segments_1]
[junit4:junit4]   2> 4551 T901 oasc.SolrDeletionPolicy.updateCommits newest commit = 1
[junit4:junit4]   2> 4551 T901 oasc.SolrCore.initWriters created xml: solr.XMLResponseWriter
[junit4:junit4]   2> 4554 T901 oasup.UpdateRequestProcessorChain.init inserting DistributedUpdateProcessorFactory into updateRequestProcessorChain "dedupe"
[junit4:junit4]   2> 4554 T901 oasup.UpdateRequestProcessorChain.init inserting DistributedUpdateProcessorFactory into updateRequestProcessorChain "dedupe-allfields"
[junit4:junit4]   2> 4555 T901 oasup.UpdateRequestProcessorChain.init inserting DistributedUpdateProcessorFactory into updateRequestProcessorChain "stored_sig"
[junit4:junit4]   2> 4556 T901 oasup.UpdateRequestProcessorChain.init inserting DistributedUpdateProcessorFactory into updateRequestProcessorChain "uniq-fields"
[junit4:junit4]   2> 4556 T901 oasup.UpdateRequestProcessorChain.init inserting DistributedUpdateProcessorFactory into updateRequestProcessorChain "distrib-dup-test-chain-implicit"
[junit4:junit4]   2> 4557 T901 oasc.RequestHandlers.initHandlersFromConfig adding lazy requestHandler: solr.ReplicationHandler
[junit4:junit4]   2> 4557 T901 oasc.RequestHandlers.initHandlersFromConfig created /replication: solr.ReplicationHandler
[junit4:junit4]   2> 4558 T901 oasc.RequestHandlers.initHandlersFromConfig created standard: solr.StandardRequestHandler
[junit4:junit4]   2> 4559 T901 oasc.RequestHandlers.initHandlersFromConfig created /get: solr.RealTimeGetHandler
[junit4:junit4]   2> 4560 T901 oasc.RequestHandlers.initHandlersFromConfig created dismax: solr.SearchHandler
[junit4:junit4]   2> 4560 T901 oasc.RequestHandlers.initHandlersFromConfig created mock: org.apache.solr.core.MockQuerySenderListenerReqHandler
[junit4:junit4]   2> 4561 T901 oasc.RequestHandlers.initHandlersFromConfig created /admin/: org.apache.solr.handler.admin.AdminHandlers
[junit4:junit4]   2> 4562 T901 oasc.RequestHandlers.initHandlersFromConfig created defaults: solr.StandardRequestHandler
[junit4:junit4]   2> 4562 T901 oasc.RequestHandlers.initHandlersFromConfig adding lazy requestHandler: solr.StandardRequestHandler
[junit4:junit4]   2> 4563 T901 oasc.RequestHandlers.initHandlersFromConfig created lazy: solr.StandardRequestHandler
[junit4:junit4]   2> 4563 T901 oasc.RequestHandlers.initHandlersFromConfig created /update: solr.UpdateRequestHandler
[junit4:junit4]   2> 4564 T901 oasc.RequestHandlers.initHandlersFromConfig created /terms: org.apache.solr.handler.component.SearchHandler
[junit4:junit4]   2> 4565 T901 oasc.RequestHandlers.initHandlersFromConfig created spellCheckCompRH: org.apache.solr.handler.component.SearchHandler
[junit4:junit4]   2> 4566 T901 oasc.RequestHandlers.initHandlersFromConfig created spellCheckCompRH_Direct: org.apache.solr.handler.component.SearchHandler
[junit4:junit4]   2> 4566 T901 oasc.RequestHandlers.initHandlersFromConfig created spellCheckWithWordbreak: org.apache.solr.handler.component.SearchHandler
[junit4:junit4]   2> 4567 T901 oasc.RequestHandlers.initHandlersFromConfig created spellCheckWithWordbreak_Direct: org.apache.solr.handler.component.SearchHandler
[junit4:junit4]   2> 4568 T901 oasc.RequestHandlers.initHandlersFromConfig created spellCheckCompRH1: org.apache.solr.handler.component.SearchHandler
[junit4:junit4]   2> 4568 T901 oasc.RequestHandlers.initHandlersFromConfig created tvrh: org.apache.solr.handler.component.SearchHandler
[junit4:junit4]   2> 4569 T901 oasc.RequestHandlers.initHandlersFromConfig created /mlt: solr.MoreLikeThisHandler
[junit4:junit4]   2> 4570 T901 oasc.RequestHandlers.initHandlersFromConfig created /debug/dump: solr.DumpRequestHandler
[junit4:junit4]   2> 4577 T901 oashl.XMLLoader.init xsltCacheLifetimeSeconds=60
[junit4:junit4]   2> 4583 T901 oasc.SolrCore.initDeprecatedSupport WARNING solrconfig.xml uses deprecated <admin/gettableFiles>, Please update your config to use the ShowFileRequestHandler.
[junit4:junit4]   2> 4585 T901 oasc.SolrCore.initDeprecatedSupport WARNING adding ShowFileRequestHandler with hidden files: [SCHEMA.XML, OLD_SYNONYMS.TXT, STOPWORDS.TXT, PROTWORDS.TXT, OPEN-EXCHANGE-RATES.JSON, SYNONYMS.TXT, CURRENCY.XML, MAPPING-ISOLATIN1ACCENT.TXT]
[junit4:junit4]   2> 4589 T901 oass.SolrIndexSearcher.<init> Opening Searcher@6631c03 main
[junit4:junit4]   2> 4591 T901 oasu.CommitTracker.<init> Hard AutoCommit: disabled
[junit4:junit4]   2> 4591 T901 oasu.CommitTracker.<init> Soft AutoCommit: disabled
[junit4:junit4]   2> 4592 T901 oashc.SpellCheckComponent.inform Initializing spell checkers
[junit4:junit4]   2> 4599 T901 oass.DirectSolrSpellChecker.init init: {name=direct,classname=DirectSolrSpellChecker,field=lowerfilt,minQueryLength=3}
[junit4:junit4]   2> 4654 T936 oasc.SolrCore.registerSearcher [collection1] Registered new searcher Searcher@6631c03 main{StandardDirectoryReader(segments_1:1)}
[junit4:junit4]   2> 4861 T922 oascc.ZkStateReader.updateClusterState Updating cloud state from ZooKeeper... 
[junit4:junit4]   2> 4867 T921 oascc.ZkStateReader$2.process A cluster state change has occurred - updating...
[junit4:junit4]   2> 4867 T935 oascc.ZkStateReader$2.process A cluster state change has occurred - updating...
[junit4:junit4]   2> 5163 T901 oasc.CoreContainer.register registering core: collection1
[junit4:junit4]   2> 5163 T901 oasc.ZkController.register Register shard - core:collection1 address:http://127.0.0.1:12862/solr shardId:shard1
[junit4:junit4]   2> 5164 T901 oascc.SolrZkClient.makePath makePath: /collections/collection1/leader_elect/shard1/election
[junit4:junit4]   2> 5185 T906 oazs.PrepRequestProcessor.pRequest Got user-level KeeperException when processing sessionid:0x13a91fb337f0003 type:delete cxid:0x43 zxid:0xfffffffffffffffe txntype:unknown reqpath:n/a Error Path:/solr/collections/collection1/leaders Error:KeeperErrorCode = NoNode for /solr/collections/collection1/leaders
[junit4:junit4]   2> 5187 T901 oasc.ShardLeaderElectionContext.runLeaderProcess Running the leader process.
[junit4:junit4]   2> 5187 T906 oazs.PrepRequestProcessor.pRequest Got user-level KeeperException when processing sessionid:0x13a91fb337f0003 type:create cxid:0x44 zxid:0xfffffffffffffffe txntype:unknown reqpath:n/a Error Path:/solr/overseer Error:KeeperErrorCode = NodeExists for /solr/overseer
[junit4:junit4]   2> 5197 T901 oasc.ShardLeaderElectionContext.waitForReplicasToComeUp Enough replicas found to continue.
[junit4:junit4]   2> 5197 T901 oasc.ShardLeaderElectionContext.runLeaderProcess I may be the new leader - try and sync
[junit4:junit4]   2> 5198 T901 oasc.SyncStrategy.sync Sync replicas to http://127.0.0.1:12862/solr/collection1/
[junit4:junit4]   2> 5198 T901 oasc.SyncStrategy.syncReplicas Sync Success - now sync replicas to me
[junit4:junit4]   2> 5199 T901 oasc.SyncStrategy.syncToMe http://127.0.0.1:12862/solr/collection1/ has no replicas
[junit4:junit4]   2> 5199 T901 oasc.ShardLeaderElectionContext.runLeaderProcess I am the new leader: http://127.0.0.1:12862/solr/collection1/
[junit4:junit4]   2> 5200 T901 oascc.SolrZkClient.makePath makePath: /collections/collection1/leaders/shard1
[junit4:junit4]   2> 5204 T906 oazs.PrepRequestProcessor.pRequest Got user-level KeeperException when processing sessionid:0x13a91fb337f0003 type:create cxid:0x4e zxid:0xfffffffffffffffe txntype:unknown reqpath:n/a Error Path:/solr/overseer Error:KeeperErrorCode = NodeExists for /solr/overseer
[junit4:junit4]   2> 5381 T922 oascc.ZkStateReader.updateClusterState Updating cloud state from ZooKeeper... 
[junit4:junit4]   2> 5397 T935 oascc.ZkStateReader$2.process A cluster state change has occurred - updating...
[junit4:junit4]   2> 5397 T921 oascc.ZkStateReader$2.process A cluster state change has occurred - updating...
[junit4:junit4]   2> 5418 T901 oasc.ZkController.register We are http://127.0.0.1:12862/solr/collection1/ and leader is http://127.0.0.1:12862/solr/collection1/
[junit4:junit4]   2> 5418 T901 oasc.ZkController.register No LogReplay needed for core=collection1 baseURL=http://127.0.0.1:12862/solr
[junit4:junit4]   2> 5419 T901 oasc.ZkController.checkRecovery I am the leader, no recovery necessary
[junit4:junit4]   2> 5421 T901 oascc.ZkStateReader.updateClusterState Updating cloud state from ZooKeeper... 
[junit4:junit4]   2> 5422 T901 oass.SolrDispatchFilter.init user.dir=/usr/home/hudson/hudson-slave/workspace/Lucene-Solr-Tests-trunk-Java6/solr/build/solr-core/test/J1
[junit4:junit4]   2> 5422 T901 oass.SolrDispatchFilter.init SolrDispatchFilter.init() done
[junit4:junit4]   2> 5423 T901 oascsi.HttpClientUtil.createClient Creating new http client, config:maxConnections=128&maxConnectionsPerHost=32&followRedirects=false
[junit4:junit4]   2> 5593 T901 oejs.Server.doStart jetty-8.1.2.v20120308
[junit4:junit4]   2> 5596 T901 oejs.AbstractConnector.doStart Started SocketConnector@0.0.0.0:12865
[junit4:junit4]   2> 5597 T901 oasc.SolrResourceLoader.locateSolrHome JNDI not configured for solr (NoInitialContextEx)
[junit4:junit4]   2> 5597 T901 oasc.SolrResourceLoader.locateSolrHome using system property solr.solr.home: /usr/home/hudson/hudson-slave/workspace/Lucene-Solr-Tests-trunk-Java6/solr/build/solr-core/test/J1/./org.apache.solr.cloud.RecoveryZkTest-jetty2-1351068895412
[junit4:junit4]   2> 5598 T901 oasc.SolrResourceLoader.<init> new SolrResourceLoader for deduced Solr Home: '/usr/home/hudson/hudson-slave/workspace/Lucene-Solr-Tests-trunk-Java6/solr/build/solr-core/test/J1/./org.apache.solr.cloud.RecoveryZkTest-jetty2-1351068895412/'
[junit4:junit4]   2> 5637 T901 oass.SolrDispatchFilter.init SolrDispatchFilter.init()
[junit4:junit4]   2> 5638 T901 oasc.SolrResourceLoader.locateSolrHome JNDI not configured for solr (NoInitialContextEx)
[junit4:junit4]   2> 5638 T901 oasc.SolrResourceLoader.locateSolrHome using system property solr.solr.home: /usr/home/hudson/hudson-slave/workspace/Lucene-Solr-Tests-trunk-Java6/solr/build/solr-core/test/J1/./org.apache.solr.cloud.RecoveryZkTest-jetty2-1351068895412
[junit4:junit4]   2> 5638 T901 oasc.CoreContainer$Initializer.initialize looking for solr.xml: /usr/home/hudson/hudson-slave/workspace/Lucene-Solr-Tests-trunk-Java6/solr/build/solr-core/test/J1/./org.apache.solr.cloud.RecoveryZkTest-jetty2-1351068895412/solr.xml
[junit4:junit4]   2> 5639 T901 oasc.CoreContainer.<init> New CoreContainer 1210196908
[junit4:junit4]   2> 5640 T901 oasc.CoreContainer.load Loading CoreContainer using Solr Home: '/usr/home/hudson/hudson-slave/workspace/Lucene-Solr-Tests-trunk-Java6/solr/build/solr-core/test/J1/./org.apache.solr.cloud.RecoveryZkTest-jetty2-1351068895412/'
[junit4:junit4]   2> 5640 T901 oasc.SolrResourceLoader.<init> new SolrResourceLoader for directory: '/usr/home/hudson/hudson-slave/workspace/Lucene-Solr-Tests-trunk-Java6/solr/build/solr-core/test/J1/./org.apache.solr.cloud.RecoveryZkTest-jetty2-1351068895412/'
[junit4:junit4]   2> 5672 T901 oasc.CoreContainer.load Registering Log Listener
[junit4:junit4]   2> 5694 T901 oasc.CoreContainer.initZooKeeper Zookeeper client=127.0.0.1:12846/solr
[junit4:junit4]   2> 5695 T901 oaz.ZooKeeper.<init> Initiating client connection, connectString=127.0.0.1:12846/solr sessionTimeout=5000 watcher=org.apache.solr.common.cloud.ConnectionManager@3f7d8bac
[junit4:junit4]   2> 5696 T946 oaz.ClientCnxn$SendThread.startConnect Opening socket connection to server /127.0.0.1:12846
[junit4:junit4]   2> 5696 T901 oascc.ConnectionManager.waitForConnected Waiting for client to connect to ZooKeeper
[junit4:junit4]   2> 5698 T946 oaz.ClientCnxn$SendThread.primeConnection Socket connection established to localhost/127.0.0.1:12846, initiating session
[junit4:junit4]   2> 5698 T903 oazs.NIOServerCnxn$Factory.run Accepted socket connection from /140.211.11.196:12866
[junit4:junit4]   2> 5698 T903 oazs.NIOServerCnxn.readConnectRequest Client attempting to establish new session at /140.211.11.196:12866
[junit4:junit4]   2> 5734 T905 oazs.NIOServerCnxn.finishSessionInit Established session 0x13a91fb337f0004 with negotiated timeout 5000 for client /140.211.11.196:12866
[junit4:junit4]   2> 5734 T946 oaz.ClientCnxn$SendThread.readConnectResult Session establishment complete on server localhost/127.0.0.1:12846, sessionid = 0x13a91fb337f0004, negotiated timeout = 5000
[junit4:junit4]   2> 5734 T947 oascc.ConnectionManager.process Watcher org.apache.solr.common.cloud.ConnectionManager@3f7d8bac name:ZooKeeperConnection Watcher:127.0.0.1:12846/solr got event WatchedEvent state:SyncConnected type:None path:null path:null type:None
[junit4:junit4]   2> 5735 T901 oascc.ConnectionManager.waitForConnected Client is connected to ZooKeeper
[junit4:junit4]   2> 5736 T906 oazs.PrepRequestProcessor.pRequest Got user-level KeeperException when processing sessionid:0x13a91fb337f0004 type:create cxid:0x1 zxid:0xfffffffffffffffe txntype:unknown reqpath:n/a Error Path:/solr/overseer Error:KeeperErrorCode = NodeExists for /solr/overseer
[junit4:junit4]   2> 5759 T906 oazs.PrepRequestProcessor.pRequest Got user-level KeeperException when processing sessionid:0x13a91fb337f0004 type:create cxid:0x2 zxid:0xfffffffffffffffe txntype:unknown reqpath:n/a Error Path:/solr/overseer Error:KeeperErrorCode = NodeExists for /solr/overseer
[junit4:junit4]   2> 5791 T901 oasc.ZkController.createEphemeralLiveNode Register node as live in ZooKeeper:/live_nodes/127.0.0.1:12865_solr
[junit4:junit4]   2> 5792 T906 oazs.PrepRequestProcessor.pRequest Got user-level KeeperException when processing sessionid:0x13a91fb337f0004 type:delete cxid:0x4 zxid:0xfffffffffffffffe txntype:unknown reqpath:n/a Error Path:/solr/live_nodes/127.0.0.1:12865_solr Error:KeeperErrorCode = NoNode for /solr/live_nodes/127.0.0.1:12865_solr
[junit4:junit4]   2> 5795 T901 oascc.SolrZkClient.makePath makePath: /live_nodes/127.0.0.1:12865_solr
[junit4:junit4]   2> 5820 T921 oascc.ZkStateReader$3.process Updating live nodes
[junit4:junit4]   2> 5819 T935 oascc.ZkStateReader$3.process Updating live nodes
[junit4:junit4]   2> 5820 T901 oashc.HttpShardHandlerFactory.getParameter Setting socketTimeout to: 0
[junit4:junit4]   2> 5821 T901 oashc.HttpShardHandlerFactory.getParameter Setting urlScheme to: http://
[junit4:junit4]   2> 5822 T901 oashc.HttpShardHandlerFactory.getParameter Setting connTimeout to: 0
[junit4:junit4]   2> 5823 T901 oashc.HttpShardHandlerFactory.getParameter Setting maxConnectionsPerHost to: 20
[junit4:junit4]   2> 5823 T901 oashc.HttpShardHandlerFactory.getParameter Setting corePoolSize to: 0
[junit4:junit4]   2> 5823 T901 oashc.HttpShardHandlerFactory.getParameter Setting maximumPoolSize to: 2147483647
[junit4:junit4]   2> 5824 T901 oashc.HttpShardHandlerFactory.getParameter Setting maxThreadIdleTime to: 5
[junit4:junit4]   2> 5824 T901 oashc.HttpShardHandlerFactory.getParameter Setting sizeOfQueue to: -1
[junit4:junit4]   2> 5825 T901 oashc.HttpShardHandlerFactory.getParameter Setting fairnessPolicy to: false
[junit4:junit4]   2> 5825 T901 oascsi.HttpClientUtil.createClient Creating new http client, config:maxConnectionsPerHost=20&maxConnections=10000&socketTimeout=0&connTimeout=0&retry=false
[junit4:junit4]   2> 5844 T901 oascc.ZkStateReader.createClusterStateWatchersAndUpdate Updating cluster state from ZooKeeper... 
[junit4:junit4]   2> 5855 T901 oasc.CoreContainer.create Creating SolrCore 'collection1' using instanceDir: /usr/home/hudson/hudson-slave/workspace/Lucene-Solr-Tests-trunk-Java6/solr/build/solr-core/test/J1/./org.apache.solr.cloud.RecoveryZkTest-jetty2-1351068895412/collection1
[junit4:junit4]   2> 5856 T901 oasc.ZkController.createCollectionZkNode Check for collection zkNode:collection1
[junit4:junit4]   2> 5857 T901 oasc.ZkController.createCollectionZkNode Collection zkNode exists
[junit4:junit4]   2> 5857 T901 oasc.ZkController.readConfigName Load collection config from:/collections/collection1
[junit4:junit4]   2> 5858 T901 oasc.SolrResourceLoader.<init> new SolrResourceLoader for directory: '/usr/home/hudson/hudson-slave/workspace/Lucene-Solr-Tests-trunk-Java6/solr/build/solr-core/test/J1/./org.apache.solr.cloud.RecoveryZkTest-jetty2-1351068895412/collection1/'
[junit4:junit4]   2> 5860 T901 oasc.SolrResourceLoader.replaceClassLoader Adding 'file:/usr/home/hudson/hudson-slave/workspace/Lucene-Solr-Tests-trunk-Java6/solr/build/solr-core/test/J1/org.apache.solr.cloud.RecoveryZkTest-jetty2-1351068895412/collection1/lib/classes/' to classloader
[junit4:junit4]   2> 5861 T901 oasc.SolrResourceLoader.replaceClassLoader Adding 'file:/usr/home/hudson/hudson-slave/workspace/Lucene-Solr-Tests-trunk-Java6/solr/build/solr-core/test/J1/org.apache.solr.cloud.RecoveryZkTest-jetty2-1351068895412/collection1/lib/README' to classloader
[junit4:junit4]   2> 5911 T922 oascc.ZkStateReader.updateClusterState Updating cloud state from ZooKeeper... 
[junit4:junit4]   2> 5913 T901 oasc.SolrConfig.<init> Using Lucene MatchVersion: LUCENE_50
[junit4:junit4]   2> 5983 T901 oasc.SolrConfig.<init> Loaded SolrConfig: solrconfig.xml
[junit4:junit4]   2> 6028 T947 oascc.ZkStateReader$2.process A cluster state change has occurred - updating...
[junit4:junit4]   2> 6028 T935 oascc.ZkStateReader$2.process A cluster state change has occurred - updating...
[junit4:junit4]   2> 6028 T921 oascc.ZkStateReader$2.process A cluster state change has occurred - updating...
[junit4:junit4]   2> 6029 T901 oass.IndexSchema.readSchema Reading Solr Schema
[junit4:junit4]   2> 6035 T901 oass.IndexSchema.readSchema Schema name=test
[junit4:junit4]   2> 6663 T901 oass.OpenExchangeRatesOrgProvider.init Initialized with rates=open-exchange-rates.json, refreshInterval=1440.
[junit4:junit4]   2> 6675 T901 oass.IndexSchema.readSchema default search field in schema is text
[junit4:junit4]   2> 6679 T901 oass.IndexSchema.readSchema unique key field: id
[junit4:junit4]   2> 6693 T901 oass.FileExchangeRateProvider.reload Reloading exchange rates from file currency.xml
[junit4:junit4]   2> 6698 T901 oass.FileExchangeRateProvider.reload Reloading exchange rates from file currency.xml
[junit4:junit4]   2> 6703 T901 oass.OpenExchangeRatesOrgProvider.reload Reloading exchange rates from open-exchange-rates.json
[junit4:junit4]   2> 6704 T901 oass.OpenExchangeRatesOrgProvider.reload Reloading exchange rates from open-exchange-rates.json
[junit4:junit4]   2> 6706 T901 oasc.SolrCore.<init> [collection1] Opening new SolrCore at /usr/home/hudson/hudson-slave/workspace/Lucene-Solr-Tests-trunk-Java6/solr/build/solr-core/test/J1/./org.apache.solr.cloud.RecoveryZkTest-jetty2-1351068895412/collection1/, dataDir=./org.apache.solr.cloud.RecoveryZkTest-1351068889978/jetty2/
[junit4:junit4]   2> 6706 T901 oasc.JmxMonitoredMap.<init> JMX monitoring is enabled. Adding Solr mbeans to JMX Server: com.sun.jmx.mbeanserver.JmxMBeanServer@27958cc2
[junit4:junit4]   2> 6708 T901 oasc.SolrCore.getNewIndexDir New index directory detected: old=null new=./org.apache.solr.cloud.RecoveryZkTest-1351068889978/jetty2/index/
[junit4:junit4]   2> 6708 T901 oasc.SolrCore.initIndex WARNING [collection1] Solr index directory './org.apache.solr.cloud.RecoveryZkTest-1351068889978/jetty2/index' doesn't exist. Creating new index...
[junit4:junit4]   2> 6709 T901 oasc.CachingDirectoryFactory.get return new directory for /usr/home/hudson/hudson-slave/workspace/Lucene-Solr-Tests-trunk-Java6/solr/build/solr-core/test/J1/./org.apache.solr.cloud.RecoveryZkTest-1351068889978/jetty2/index forceNew:false
[junit4:junit4]   2> 6730 T901 oasc.SolrDeletionPolicy.onCommit SolrDeletionPolicy.onCommit: commits:num=1
[junit4:junit4]   2> 		commit{dir=/usr/home/hudson/hudson-slave/workspace/Lucene-Solr-Tests-trunk-Java6/solr/build/solr-core/test/J1/org.apache.solr.cloud.RecoveryZkTest-1351068889978/jetty2/index,segFN=segments_1,generation=1,filenames=[segments_1]
[junit4:junit4]   2> 6731 T901 oasc.SolrDeletionPolicy.updateCommits newest commit = 1
[junit4:junit4]   2> 6732 T901 oasc.SolrCore.initWriters created xml: solr.XMLResponseWriter
[junit4:junit4]   2> 6734 T901 oasup.UpdateRequestProcessorChain.init inserting DistributedUpdateProcessorFactory into updateRequestProcessorChain "dedupe"
[junit4:junit4]   2> 6735 T901 oasup.UpdateRequestProcessorChain.init inserting DistributedUpdateProcessorFactory into updateRequestProcessorChain "dedupe-allfields"
[junit4:junit4]   2> 6735 T901 oasup.UpdateRequestProcessorChain.init inserting DistributedUpdateProcessorFactory into updateRequestProcessorChain "stored_sig"
[junit4:junit4]   2> 6736 T901 oasup.UpdateRequestProcessorChain.init inserting DistributedUpdateProcessorFactory into updateRequestProcessorChain "uniq-fields"
[junit4:junit4]   2> 6736 T901 oasup.UpdateRequestProcessorChain.init inserting DistributedUpdateProcessorFactory into updateRequestProcessorChain "distrib-dup-test-chain-implicit"
[junit4:junit4]   2> 6737 T901 oasc.RequestHandlers.initHandlersFromConfig adding lazy requestHandler: solr.ReplicationHandler
[junit4:junit4]   2> 6738 T901 oasc.RequestHandlers.initHandlersFromConfig created /replication: solr.ReplicationHandler
[junit4:junit4]   2> 6738 T901 oasc.RequestHandlers.initHandlersFromConfig created standard: solr.StandardRequestHandler
[junit4:junit4]   2> 6739 T901 oasc.RequestHandlers.initHandlersFromConfig created /get: solr.RealTimeGetHandler
[junit4:junit4]   2> 6740 T901 oasc.RequestHandlers.initHandlersFromConfig created dismax: solr.SearchHandler
[junit4:junit4]   2> 6741 T901 oasc.RequestHandlers.initHandlersFromConfig created mock: org.apache.solr.core.MockQuerySenderListenerReqHandler
[junit4:junit4]   2> 6741 T901 oasc.RequestHandlers.initHandlersFromConfig created /admin/: org.apache.solr.handler.admin.AdminHandlers
[junit4:junit4]   2> 6742 T901 oasc.RequestHandlers.initHandlersFromConfig created defaults: solr.StandardRequestHandler
[junit4:junit4]   2> 6742 T901 oasc.RequestHandlers.initHandlersFromConfig adding lazy requestHandler: solr.StandardRequestHandler
[junit4:junit4]   2> 6743 T901 oasc.RequestHandlers.initHandlersFromConfig created lazy: solr.StandardRequestHandler
[junit4:junit4]   2> 6744 T901 oasc.RequestHandlers.initHandlersFromConfig created /update: solr.UpdateRequestHandler
[junit4:junit4]   2> 6744 T901 oasc.RequestHandlers.initHandlersFromConfig created /terms: org.apache.solr.handler.component.SearchHandler
[junit4:junit4]   2> 6745 T901 oasc.RequestHandlers.initHandlersFromConfig created spellCheckCompRH: org.apache.solr.handler.component.SearchHandler
[junit4:junit4]   2> 6746 T901 oasc.RequestHandlers.initHandlersFromConfig created spellCheckCompRH_Direct: org.apache.solr.handler.component.SearchHandler
[junit4:junit4]   2> 6746 T901 oasc.RequestHandlers.initHandlersFromConfig created spellCheckWithWordbreak: org.apache.solr.handler.component.SearchHandler
[junit4:junit4]   2> 6747 T901 oasc.RequestHandlers.initHandlersFromConfig created spellCheckWithWordbreak_Direct: org.apache.solr.handler.component.SearchHandler
[junit4:junit4]   2> 6748 T901 oasc.RequestHandlers.initHandlersFromConfig created spellCheckCompRH1: org.apache.solr.handler.component.SearchHandler
[junit4:junit4]   2> 6749 T901 oasc.RequestHandlers.initHandlersFromConfig created tvrh: org.apache.solr.handler.component.SearchHandler
[junit4:junit4]   2> 6749 T901 oasc.RequestHandlers.initHandlersFromConfig created /mlt: solr.MoreLikeThisHandler
[junit4:junit4]   2> 6750 T901 oasc.RequestHandlers.initHandlersFromConfig created /debug/dump: solr.DumpRequestHandler
[junit4:junit4]   2> 6758 T901 oashl.XMLLoader.init xsltCacheLifetimeSeconds=60
[junit4:junit4]   2> 6763 T901 oasc.SolrCore.initDeprecatedSupport WARNING solrconfig.xml uses deprecated <admin/gettableFiles>, Please update your config to use the ShowFileRequestHandler.
[junit4:junit4]   2> 6765 T901 oasc.SolrCore.initDeprecatedSupport WARNING adding ShowFileRequestHandler with hidden files: [SCHEMA.XML, OLD_SYNONYMS.TXT, STOPWORDS.TXT, PROTWORDS.TXT, OPEN-EXCHANGE-RATES.JSON, SYNONYMS.TXT, CURRENCY.XML, MAPPING-ISOLATIN1ACCENT.TXT]
[junit4:junit4]   2> 6769 T901 oass.SolrIndexSearcher.<init> Opening Searcher@37bbb60d main
[junit4:junit4]   2> 6770 T901 oasu.CommitTracker.<init> Hard AutoCommit: disabled
[junit4:junit4]   2> 6771 T901 oasu.CommitTracker.<init> Soft AutoCommit: disabled
[junit4:junit4]   2> 6772 T901 oashc.SpellCheckComponent.inform Initializing spell checkers
[junit4:junit4]   2> 6780 T901 oass.DirectSolrSpellChecker.init init: {name=direct,classname=DirectSolrSpellChecker,field=lowerfilt,minQueryLength=3}
[junit4:junit4]   2> 6840 T948 oasc.SolrCore.registerSearcher [collection1] Registered new searcher Searcher@37bbb60d main{StandardDirectoryReader(segments_1:1)}
[junit4:junit4]   2> 7054 T922 oascc.ZkStateReader.updateClusterState Updating cloud state from ZooKeeper... 
[junit4:junit4]   2> 7068 T947 oascc.ZkStateReader$2.process A cluster state change has occurred - updating...
[junit4:junit4]   2> 7068 T935 oascc.ZkStateReader$2.process A cluster state change has occurred - updating...
[junit4:junit4]   2> 7068 T921 oascc.ZkStateReader$2.process A cluster state change has occurred - updating...
[junit4:junit4]   2> 7348 T901 oasc.CoreContainer.register registering core: collection1
[junit4:junit4]   2> 7348 T901 oasc.ZkController.register Register shard - core:collection1 address:http://127.0.0.1:12865/solr shardId:shard1
[junit4:junit4]   2> 7352 T901 oasc.ZkController.register We are http://127.0.0.1:12865/solr/collection1/ and leader is http://127.0.0.1:12862/solr/collection1/
[junit4:junit4]   2> 7352 T901 oasc.ZkController.register No LogReplay needed for core=collection1 baseURL=http://127.0.0.1:12865/solr
[junit4:junit4]   2> 7353 T901 oasc.ZkController.checkRecovery Core needs to recover:collection1
[junit4:junit4]   2> 7353 T901 oasu.DefaultSolrCoreState.doRecovery Running recovery - first canceling any ongoing recovery
[junit4:junit4]   2> ASYNC  NEW_CORE C108 name=collection1 org.apache.solr.core.SolrCore@6c5b7ce8 url=http://127.0.0.1:12865/solr/collection1 node=127.0.0.1:12865_solr
[junit4:junit4]   2> 7354 T949 C108 P12865 oasc.RecoveryStrategy.run Starting recovery process.  core=collection1 recoveringAfterStartup=true
[junit4:junit4]   2> 7355 T901 oascc.ZkStateReader.updateClusterState Updating cloud state from ZooKeeper... 
[junit4:junit4]   2> 7355 T949 C108 P12865 oasc.RecoveryStrategy.doRecovery ###### startupVersions=[]
[junit4:junit4]   2> 7356 T901 oass.SolrDispatchFilter.init user.dir=/usr/home/hudson/hudson-slave/workspace/Lucene-Solr-Tests-trunk-Java6/solr/build/solr-core/test/J1
[junit4:junit4]   2> 7356 T901 oass.SolrDispatchFilter.init SolrDispatchFilter.init() done
[junit4:junit4]   2> 7357 T949 C108 P12865 oasc.RecoveryStrategy.doRecovery Attempting to PeerSync from http://127.0.0.1:12862/solr/collection1/ core=collection1 - recoveringAfterStartup=true
[junit4:junit4]   2> 7357 T901 oascsi.HttpClientUtil.createClient Creating new http client, config:maxConnections=128&maxConnectionsPerHost=32&followRedirects=false
[junit4:junit4]   2> 7357 T949 C108 P12865 oasu.PeerSync.sync PeerSync: core=collection1 url=http://127.0.0.1:12865/solr START replicas=[http://127.0.0.1:12862/solr/collection1/] nUpdates=100
[junit4:junit4]   2> 7357 T949 C108 P12865 oasu.PeerSync.sync WARNING no frame of reference to tell of we've missed updates
[junit4:junit4]   2> 7358 T949 C108 P12865 oasc.RecoveryStrategy.doRecovery PeerSync Recovery was not successful - trying replication. core=collection1
[junit4:junit4]   2> 7358 T949 C108 P12865 oasc.RecoveryStrategy.doRecovery Starting Replication Recovery. core=collection1
[junit4:junit4]   2> 7359 T949 C108 P12865 oascsi.HttpClientUtil.createClient Creating new http client, config:maxConnections=128&maxConnectionsPerHost=32&followRedirects=false
[junit4:junit4]   2> ASYNC  NEW_CORE C109 name=collection1 org.apache.solr.core.SolrCore@169eded9 url=http://127.0.0.1:12862/solr/collection1 node=127.0.0.1:12862_solr
[junit4:junit4]   2> 7367 T927 C109 P12862 REQ /get {distrib=false&qt=/get&wt=javabin&version=2&getVersions=100} status=0 QTime=0 
[junit4:junit4]   2> 7377 T901 oaz.ZooKeeper.<init> Initiating client connection, connectString=127.0.0.1:12846/solr sessionTimeout=10000 watcher=org.apache.solr.common.cloud.ConnectionManager@791c61fe
[junit4:junit4]   2> 7378 T951 oaz.ClientCnxn$SendThread.startConnect Opening socket connection to server /127.0.0.1:12846
[junit4:junit4]   2> 7378 T901 oascc.ConnectionManager.waitForConnected Waiting for client to connect to ZooKeeper
[junit4:junit4]   2> 7379 T951 oaz.ClientCnxn$SendThread.primeConnection Socket connection established to localhost/127.0.0.1:12846, initiating session
[junit4:junit4]   2> 7379 T903 oazs.NIOServerCnxn$Factory.run Accepted socket connection from /140.211.11.196:12874
[junit4:junit4]   2> 7380 T903 oazs.NIOServerCnxn.readConnectRequest Client attempting to establish new session at /140.211.11.196:12874
[junit4:junit4]   2> 7381 T905 oazs.NIOServerCnxn.finishSessionInit Established session 0x13a91fb337f0005 with negotiated timeout 10000 for client /140.211.11.196:12874
[junit4:junit4]   2> 7381 T951 oaz.ClientCnxn$SendThread.readConnectResult Session establishment complete on server localhost/127.0.0.1:12846, sessionid = 0x13a91fb337f0005, negotiated timeout = 10000
[junit4:junit4]   2> 7382 T952 oascc.ConnectionManager.process Watcher org.apache.solr.common.cloud.ConnectionManager@791c61fe name:ZooKeeperConnection Watcher:127.0.0.1:12846/solr got event WatchedEvent state:SyncConnected type:None path:null path:null type:None
[junit4:junit4]   2> 7382 T901 oascc.ConnectionManager.waitForConnected Client is connected to ZooKeeper
[junit4:junit4]   2> 7383 T901 oascc.ZkStateReader.createClusterStateWatchersAndUpdate Updating cluster state from ZooKeeper... 
[junit4:junit4]   2> 7384 T901 oasc.ChaosMonkey.monkeyLog monkey: init - expire sessions:true cause connection loss:true
[junit4:junit4]   2> 7385 T901 oascsi.HttpClientUtil.createClient Creating new http client, config:
[junit4:junit4]   2> 7395 T901 oascc.ZkStateReader.updateClusterState Updating cloud state from ZooKeeper... 
[junit4:junit4]   2> ASYNC  NEW_CORE C110 name=collection1 org.apache.solr.core.SolrCore@35d5551e url=http://127.0.0.1:12851/solr/collection1 node=127.0.0.1:12851_solr
[junit4:junit4]   2> 7410 T914 C110 P12851 oasc.SolrDeletionPolicy.onInit SolrDeletionPolicy.onInit: commits:num=1
[junit4:junit4]   2> 		commit{dir=/usr/home/hudson/hudson-slave/workspace/Lucene-Solr-Tests-trunk-Java6/solr/build/solr-core/test/J1/org.apache.solr.cloud.RecoveryZkTest-1351068889978/control/data/index,segFN=segments_1,generation=1,filenames=[segments_1]
[junit4:junit4]   2> 7411 T914 C110 P12851 oasc.SolrDeletionPolicy.updateCommits newest commit = 1
[junit4:junit4]   2> 7416 T914 C110 P12851 /update {wt=javabin&version=2} {add=[10001 (1416698420140179456)]} 0 10
[junit4:junit4]   2> 7416 T913 C110 P12851 /update {wt=javabin&version=2} {add=[1 (1416698420140179457)]} 0 10
[junit4:junit4]   2> 7417 T954 oaz.ZooKeeper.<init> Initiating client connection, connectString=127.0.0.1:12846/solr sessionTimeout=10000 watcher=org.apache.solr.common.cloud.ConnectionManager@78ed841c
[junit4:junit4]   2> 7417 T955 oaz.ClientCnxn$SendThread.startConnect Opening socket connection to server /127.0.0.1:12846
[junit4:junit4]   2> 7417 T954 oascc.ConnectionManager.waitForConnected Waiting for client to connect to ZooKeeper
[junit4:junit4]   2> 7418 T955 oaz.ClientCnxn$SendThread.primeConnection Socket connection established to localhost/127.0.0.1:12846, initiating session
[junit4:junit4]   2> 7418 T903 oazs.NIOServerCnxn$Factory.run Accepted socket connection from /140.211.11.196:12878
[junit4:junit4]   2> 7419 T903 oazs.NIOServerCnxn.readConnectRequest Client attempting to establish new session at /140.211.11.196:12878
[junit4:junit4]   2> 7420 T905 oazs.NIOServerCnxn.finishSessionInit Established session 0x13a91fb337f0006 with negotiated timeout 10000 for client /140.211.11.196:12878
[junit4:junit4]   2> 7420 T955 oaz.ClientCnxn$SendThread.readConnectResult Session establishment complete on server localhost/127.0.0.1:12846, sessionid = 0x13a91fb337f0006, negotiated timeout = 10000
[junit4:junit4]   2> 7421 T956 oascc.ConnectionManager.process Watcher org.apache.solr.common.cloud.ConnectionManager@78ed841c name:ZooKeeperConnection Watcher:127.0.0.1:12846/solr got event WatchedEvent state:SyncConnected type:None path:null path:null type:None
[junit4:junit4]   2> 7421 T954 oascc.ConnectionManager.waitForConnected Client is connected to ZooKeeper
[junit4:junit4]   2> 7422 T954 oascc.ZkStateReader.createClusterStateWatchersAndUpdate Updating cluster state from ZooKeeper... 
[junit4:junit4]   2> 7429 T929 C109 P12862 oasc.SolrDeletionPolicy.onInit SolrDeletionPolicy.onInit: commits:num=1
[junit4:junit4]   2> 		commit{dir=/usr/home/hudson/hudson-slave/workspace/Lucene-Solr-Tests-trunk-Java6/solr/build/solr-core/test/J1/org.apache.solr.cloud.RecoveryZkTest-1351068889978/jetty1/index,segFN=segments_1,generation=1,filenames=[segments_1]
[junit4:junit4]   2> 7430 T929 C109 P12862 oasc.SolrDeletionPolicy.updateCommits newest commit = 1
[junit4:junit4]   2> 7434 T929 C109 P12862 /update {wt=javabin&version=2} {add=[10001 (1416698420160102400)]} 0 9
[junit4:junit4]   2> 7434 T930 C109 P12862 /update {wt=javabin&version=2} {add=[1 (1416698420160102401)]} 0 9
[junit4:junit4]   2> 7437 T913 C110 P12851 /update {wt=javabin&version=2} {add=[10002 (1416698420171636736)]} 0 1
[junit4:junit4]   2> 7437 T914 C110 P12851 /update {wt=javabin&version=2} {add=[2 (1416698420171636737)]} 0 1
[junit4:junit4]   2> 7440 T930 C109 P12862 /update {wt=javabin&version=2} {add=[10002 (1416698420174782464)]} 0 1
[junit4:junit4]   2> 7441 T929 C109 P12862 /update {wt=javabin&version=2} {add=[2 (1416698420175831040)]} 0 1
[junit4:junit4]   2> 7443 T914 C110 P12851 /update {wt=javabin&version=2} {add=[10003 (1416698420177928192)]} 0 1
[junit4:junit4]   2> 7444 T913 C110 P12851 /update {wt=javabin&version=2} {add=[3 (1416698420178976768)]} 0 1
[junit4:junit4]   2> 7446 T929 C109 P12862 /update {wt=javabin&version=2} {add=[10003 (1416698420181073920)]} 0 1
[junit4:junit4]   2> 7446 T930 C109 P12862 /update {wt=javabin&version=2} {add=[3 (1416698420182122496)]} 0 0
[junit4:junit4]   2> 7448 T913 C110 P12851 /update {wt=javabin&version=2} {add=[10004 (1416698420184219648)]} 0 0
[junit4:junit4]   2> 7449 T914 C110 P12851 /update {wt=javabin&version=2} {add=[4 (1416698420185268224)]} 0 0
[junit4:junit4]   2> 7451 T930 C109 P12862 /update {wt=javabin&version=2} {add=[10004 (1416698420187365376)]} 0 0
[junit4:junit4]   2> 7452 T929 C109 P12862 /update {wt=javabin&version=2} {add=[4 (1416698420188413952)]} 0 0
[junit4:junit4]   2> 7454 T914 C110 P12851 /update {wt=javabin&version=2} {add=[10005 (1416698420190511104)]} 0 0
[junit4:junit4]   2> 7455 T913 C110 P12851 /update {wt=javabin&version=2} {add=[5 (1416698420191559680)]} 0 0
[junit4:junit4]   2> 7457 T929 C109 P12862 /update {wt=javabin&version=2} {add=[10005 (1416698420193656832)]} 0 0
[junit4:junit4]   2> 7460 T913 C110 P12851 /update {wt=javabin&version=2} {delete=[10005 (-1416698420196802560)]} 0 0
[junit4:junit4]   2> 7463 T929 C109 P12862 /update {wt=javabin&version=2} {delete=[10005 (-1416698420199948288)]} 0 0
[junit4:junit4]   2> 7467 T913 C110 P12851 /update {wt=javabin&version=2} {add=[10006 (1416698420203094016)]} 0 1
[junit4:junit4]   2> 7472 T929 C109 P12862 /update {wt=javabin&version=2} {add=[10006 (1416698420206239744)]} 0 3
[junit4:junit4]   2> 7476 T913 C110 P12851 /update {wt=javabin&version=2} {add=[10007 (1416698420212531200)]} 0 1
[junit4:junit4]   2> 7477 T930 C109 P12862 /update {wt=javabin&version=2} {add=[5 (1416698420194705408)]} 0 19
[junit4:junit4]   2> 7479 T929 C109 P12862 /update {wt=javabin&version=2} {add=[10007 (1416698420215676928)]} 0 1
[junit4:junit4]   2> 7480 T913 C110 P12851 /update {wt=javabin&version=2} {delete=[5 (-1416698420217774080)]} 0 0
[junit4:junit4]   2> 7483 T914 C110 P12851 /update {wt=javabin&version=2} {delete=[10007 (-1416698420219871232)]} 0 1
[junit4:junit4]   2> 7483 T929 C109 P12862 /update {wt=javabin&version=2} {delete=[5 (-1416698420220919808)]} 0 0
[junit4:junit4]   2> 7486 T930 C109 P12862 /update {wt=javabin&version=2} {delete=[10007 (-1416698420223016960)]} 0 1
[junit4:junit4]   2> 7487 T914 C110 P12851 /update {wt=javabin&version=2} {add=[6 (1416698420224065536)]} 0 1
[junit4:junit4]   2> 7489 T913 C110 P12851 /update {wt=javabin&version=2} {add=[10008 (1416698420226162688)]} 0 1
[junit4:junit4]   2> 7490 T930 C109 P12862 /update {wt=javabin&version=2} {add=[6 (1416698420227211264)]} 0 1
[junit4:junit4]   2> 7492 T929 C109 P12862 /update {wt=javabin&version=2} {add=[10008 (1416698420229308416)]} 0 0
[junit4:junit4]   2> 7493 T913 C110 P12851 /update {wt=javabin&version=2} {add=[7 (1416698420231405568)]} 0 0
[junit4:junit4]   2> 7495 T914 C110 P12851 /update {wt=javabin&version=2} {add=[10009 (1416698420232454144)]} 0 1
[junit4:junit4]   2> 7498 T929 C109 P12862 /update {wt=javabin&version=2} {add=[7 (1416698420235599872)]} 0 1
[junit4:junit4]   2> 7498 T930 C109 P12862 /update {wt=javabin&version=2} {add=[10009 (1416698420235599873)]} 0 1
[junit4:junit4]   2> 7501 T914 C110 P12851 /update {wt=javabin&version=2} {delete=[7 (-1416698420239794176)]} 0 1
[junit4:junit4]   2> 7504 T929 C109 P12862 /update {wt=javabin&version=2} {delete=[7 (-1416698420242939904)]} 0 0
[junit4:junit4]   2> 7508 T914 C110 P12851 /update {wt=javabin&version=2} {add=[8 (1416698420246085632)]} 0 1
[junit4:junit4]   2> 7511 T929 C109 P12862 /update {wt=javabin&version=2} {add=[8 (1416698420249231360)]} 0 1
[junit4:junit4]   2> 7514 T914 C110 P12851 /update {wt=javabin&version=2} {add=[9 (1416698420252377088)]} 0 1
[junit4:junit4]   2> 7517 T929 C109 P12862 /update {wt=javabin&version=2} {add=[9 (1416698420255522816)]} 0 1
[junit4:junit4]   2> 7519 T913 C110 P12851 /update {wt=javabin&version=2} {add=[10010 (1416698420238745600)]} 0 19
[junit4:junit4]   2> 7522 T929 C109 P12862 /update {wt=javabin&version=2} {add=[10010 (1416698420261814272)]} 0 0
[junit4:junit4]   2> 7527 T913 C110 P12851 /update {wt=javabin&version=2} {add=[10011 (1416698420264960000)]} 0 2
[junit4:junit4]   2> 7537 T914 C110 P12851 /update {wt=javabin&version=2} {add=[10 (1416698420259717120)]} 0 17
[junit4:junit4]   2> 7542 T930 C109 P12862 /update {wt=javabin&version=2} {add=[10 (1416698420279640064)]} 0 3
[junit4:junit4]   2> 7547 T914 C110 P12851 /update {wt=javabin&version=2} {add=[11 (1416698420284882944)]} 0 3
[junit4:junit4]   2> 7547 T929 C109 P12862 /update {wt=javabin&version=2} {add=[10011 (1416698420270202880)]} 0 17
[junit4:junit4]   2> 7550 T930 C109 P12862 /update {wt=javabin&version=2} {add=[11 (1416698420290125824)]} 0 1
[junit4:junit4]   2> 7551 T914 C110 P12851 /update {wt=javabin&version=2} {add=[10012 (1416698420291174400)]} 0 1
[junit4:junit4]   2> 7553 T913 C110 P12851 /update {wt=javabin&version=2} {add=[12 (1416698420293271552)]} 0 1
[junit4:junit4]   2> 7554 T930 C109 P12862 /update {wt=javabin&version=2} {add=[10012 (1416698420294320128)]} 0 1
[junit4:junit4]   2> 7556 T929 C109 P12862 /update {wt=javabin&version=2} {add=[12 (1416698420296417280)]} 0 1
[junit4:junit4]   2> 7556 T913 C110 P12851 /update {wt=javabin&version=2} {delete=[10011 (-1416698420297465856)]} 0 0
[junit4:junit4]   2> 7558 T914 C110 P12851 /update {wt=javabin&version=2} {delete=[11 (-1416698420299563008)]} 0 0
[junit4:junit4]   2> 7559 T929 C109 P12862 /update {wt=javabin&version=2} {delete=[10011 (-1416698420300611584)]} 0 0
[junit4:junit4]   2> 7561 T930 C109 P12862 /update {wt=javabin&version=2} {delete=[11 (-1416698420302708736)]} 0 0
[junit4:junit4]   2> 7563 T914 C110 P12851 /update {wt=javabin&version=2} {add=[10013 (1416698420303757312)]} 0 1
[junit4:junit4]   2> 7564 T913 C110 P12851 /update {wt=javabin&version=2} {add=[13 (1416698420305854464)]} 0 0
[junit4:junit4]   2> 7565 T930 C109 P12862 /update {wt=javabin&version=2} {add=[10013 (1416698420306903040)]} 0 0
[junit4:junit4]   2> 7568 T929 C109 P12862 /update {wt=javabin&version=2} {add=[13 (1416698420309000192)]} 0 1
[junit4:junit4]   2> 7568 T913 C110 P12851 /update {wt=javabin&version=2} {add=[10014 (1416698420310048768)]} 0 0
[junit4:junit4]   2> 7572 T914 C110 P12851 /update {wt=javabin&version=2} {add=[14 (1416698420313194496)]} 0 1
[junit4:junit4]   2> 7573 T929 C109 P12862 /update {wt=javabin&version=2} {add=[10014 (1416698420314243072)]} 0 1
[junit4:junit4]   2> 7574 T922 oascc.ZkStateReader.updateClusterState Updating cloud state from ZooKeeper... 
[junit4:junit4]   2> 7575 T930 C109 P12862 /update {wt=javabin&version=2} {add=[14 (1416698420316340224)]} 0 1
[junit4:junit4]   2> 7575 T914 C110 P12851 /update {wt=javabin&version=2} {delete=[10012 (-1416698420317388800)]} 0 0
[junit4:junit4]   2> 7577 T913 C110 P12851 /update {wt=javabin&version=2} {delete=[12 (-1416698420319485952)]} 0 0
[junit4:junit4]   2> 7578 T930 C109 P12862 /update {wt=javabin&version=2} {delete=[10012 (-1416698420320534528)]} 0 0
[junit4:junit4]   2> 7580 T929 C109 P12862 /update {wt=javabin&version=2} {delete=[12 (-1416698420322631680)]} 0 0
[junit4:junit4]   2> 7582 T913 C110 P12851 /update {wt=javabin&version=2} {add=[10015 (1416698420323680256)]} 0 1
[junit4:junit4]   2> 7583 T914 C110 P12851 /update {wt=javabin&version=2} {add=[15 (1416698420325777408)]} 0 0
[junit4:junit4]   2> 7585 T929 C109 P12862 /update {wt=javabin&version=2} {add=[10015 (1416698420326825984)]} 0 1
[junit4:junit4]   2> 7587 T914 C110 P12851 /update {wt=javabin&version=2} {add=[10016 (1416698420329971712)]} 0 0
[junit4:junit4]   2> 7592 T947 oascc.ZkStateReader$2.process A cluster state change has occurred - updating...
[junit4:junit4]   2> 7592 T935 oascc.ZkStateReader$2.process A cluster state change has occurred - updating...
[junit4:junit4]   2> 7592 T952 oascc.ZkStateReader$2.process A cluster state change has occurred - updating...
[junit4:junit4]   2> 7592 T921 oascc.ZkStateReader$2.process A cluster state change has occurred - updating...
[junit4:junit4]   2> 7592 T956 oascc.ZkStateReader$2.process A cluster state change has occurred - updating...
[junit4:junit4]   2> 7593 T929 C109 P12862 /update {wt=javabin&version=2} {add=[10016 (1416698420333117440)]} 0 3
[junit4:junit4]   2> 7597 T914 C110 P12851 /update {wt=javabin&version=2} {add=[10017 (1416698420339408896)]} 0 1
[junit4:junit4]   2> 7606 T930 C109 P12862 /update {wt=javabin&version=2} {add=[15 (1416698420328923136)]} 0 20
[junit4:junit4]   2> 7610 T914 C110 P12851 /update {wt=javabin&version=2} {add=[16 (1416698420353040384)]} 0 1
[junit4:junit4]   2>  C108_STATE=coll:collection1 core:collection1 props:{shard=shard1, roles=null, state=recovering, core=collection1, collection=collection1, node_name=127.0.0.1:12865_solr, base_url=http://127.0.0.1:12865/solr}
[junit4:junit4]   2> 7610 T939 C108 P12865 oasc.SolrDeletionPolicy.onInit SolrDeletionPolicy.onInit: commits:num=1
[junit4:junit4]   2> 		commit{dir=/usr/home/hudson/hudson-slave/workspace/Lucene-Solr-Tests-trunk-Java6/solr/build/solr-core/test/J1/org.apache.solr.cloud.RecoveryZkTest-1351068889978/jetty2/index,segFN=segments_1,generation=1,filenames=[segments_1]
[junit4:junit4]   2> 7610 T939 C108 P12865 oasc.SolrDeletionPolicy.updateCommits newest commit = 1
[junit4:junit4]   2> 7613 T939 C108 P12865 REQ /update {distrib.from=http://127.0.0.1:12862/solr/collection1/&update.distrib=FROMLEADER&wt=javabin&version=2} status=0 QTime=7 
[junit4:junit4]   2> 7614 T929 C109 P12862 /update {wt=javabin&version=2} {add=[10017 (1416698420342554624)]} 0 15
[junit4:junit4]   2> 7616 T940 C108 P12865 REQ /update {distrib.from=http://127.0.0.1:12862/solr/collection1/&update.distrib=FROMLEADER&wt=javabin&version=2} status=0 QTime=1 
[junit4:junit4]   2> 7616 T930 C109 P12862 /update {wt=javabin&version=2} {add=[16 (1416698420356186112)]} 0 4
[junit4:junit4]   2> 7618 T914 C110 P12851 /update {wt=javabin&version=2} {add=[10018 (1416698420361428992)]} 0 1
[junit4:junit4]   2> 7620 T913 C110 P12851 /update {wt=javabin&version=2} {add=[17 (1416698420363526144)]} 0 1
[junit4:junit4]   2> 7625 T940 C108 P12865 REQ /update {distrib.from=http://127.0.0.1:12862/solr/collection1/&update.distrib=FROMLEADER&wt=javabin&version=2} status=0 QTime=1 
[junit4:junit4]   2> 7625 T930 C109 P12862 /update {wt=javabin&version=2} {add=[10018 (1416698420365623296)]} 0 4
[junit4:junit4]   2> 7626 T939 C108 P12865 REQ /update {distrib.from=http://127.0.0.1:12862/solr/collection1/&update.distrib=FROMLEADER&wt=javabin&version=2} status=0 QTime=1 
[junit4:junit4]   2> 7626 T929 C109 P12862 /update {wt=javabin&version=2} {add=[17 (1416698420366671872)]} 0 4
[junit4:junit4]   2> 7629 T913 C110 P12851 /update {wt=javabin&version=2} {add=[10019 (1416698420372963328)]} 0 1
[junit4:junit4]   2> 7634 T939 C108 P12865 REQ /update {distrib.from=http://127.0.0.1:12862/solr/collection1/&update.distrib=FROMLEADER&wt=javabin&version=2} status=0 QTime=0 
[junit4:junit4]   2> 7635 T929 C109 P12862 /update {wt=javabin&version=2} {add=[10019 (1416698420376109056)]} 0 4
[junit4:junit4]   2> 7638 T913 C110 P12851 /update {wt=javabin&version=2} {delete=[10014 (-1416698420383449088)]} 0 0
[junit4:junit4]   2> 7643 T939 C108 P12865 REQ /update {distrib.from=http://127.0.0.1:12862/solr/collection1/&update.distrib=FROMLEADER&wt=javabin&version=2} status=0 QTime=0 
[junit4:junit4]   2> 7644 T929 C109 P12862 /update {wt=javabin&version=2} {delete=[10014 (-1416698420386594816)]} 0 3
[junit4:junit4]   2> 7645 T914 C110 P12851 /update {wt=javabin&version=2} {add=[18 (1416698420374011904)]} 0 16
[junit4:junit4]   2> 7647 T913 C110 P12851 /update {wt=javabin&version=2} {add=[10020 (1416698420391837696)]} 0 1
[junit4:junit4]   2> 7650 T939 C108 P12865 REQ /update {distrib.from=http://127.0.0.1:12862/solr/collection1/&update.distrib=FROMLEADER&wt=javabin&version=2} status=0 QTime=0 
[junit4:junit4]   2> 7651 T929 C109 P12862 /update {wt=javabin&version=2} {add=[18 (1416698420392886272)]} 0 4
[junit4:junit4]   2> 7653 T940 C108 P12865 REQ /update {distrib.from=http://127.0.0.1:12862/solr/collection1/&update.distrib=FROMLEADER&wt=javabin&version=2} status=0 QTime=1 
[junit4:junit4]   2> 7653 T930 C109 P12862 /update {wt=javabin&version=2} {add=[10020 (1416698420394983424)]} 0 4
[junit4:junit4]   2> 7654 T913 C110 P12851 /update {wt=javabin&version=2} {add=[19 (1416698420399177728)]} 0 0
[junit4:junit4]   2> 7658 T914 C110 P12851 /update {wt=javabin&version=2} {add=[10021 (1416698420402323456)]} 0 2
[junit4:junit4]   2> 7660 T940 C108 P12865 REQ /update {distrib.from=http://127.0.0.1:12862/solr/collection1/&update.distrib=FROMLEADER&wt=javabin&version=2} status=0 QTime=1 
[junit4:junit4]   2> 7660 T930 C109 P12862 /update {wt=javabin&version=2} {add=[19 (1416698420402323456)]} 0 4
[junit4:junit4]   2> 7663 T914 C110 P12851 /update {wt=javabin&version=2} {delete=[14 (-1416698420409663488)]} 0 0
[junit4:junit4]   2> 7668 T940 C108 P12865 REQ /update {distrib.from=http://127.0.0.1:12862/solr/collection1/&update.distrib=FROMLEADER&wt=javabin&version=2} status=0 QTime=0 
[junit4:junit4]   2> 7669 T930 C109 P12862 /update {wt=javabin&version=2} {delete=[14 (-1416698420412809216)]} 0 3
[junit4:junit4]   2> 7672 T914 C110 P12851 /update {wt=javabin&version=2} {add=[20 (1416698420418052096)]} 0 1
[junit4:junit4]   2> 7679 T939 C108 P12865 REQ /update {distrib.from=http://127.0.0.1:12862/solr/collection1/&update.distrib=FROMLEADER&wt=javabin&version=2} status=0 QTime=1 
[junit4:junit4]   2> 7679 T929 C109 P12862 /update {wt=javabin&version=2} {add=[10021 (1416698420406517760)]} 0 19
[junit4:junit4]   2> 7683 T914 C110 P12851 /update {wt=javabin&version=2} {add=[10022 (1416698420429586432)]} 0 1
[junit4:junit4]   2> 7690 T939 C108 P12865 REQ /update {distrib.from=http://127.0.0.1:12862/solr/collection1/&update.distrib=FROMLEADER&wt=javabin&version=2} status=0 QTime=2 
[junit4:junit4]   2> 7691 T929 C109 P12862 /update {wt=javabin&version=2} {add=[10022 (1416698420432732160)]} 0 5
[junit4:junit4]   2> 7693 T940 C108 P12865 REQ /update {distrib.from=http://127.0.0.1:12862/solr/collection1/&update.distrib=FROMLEADER&wt=javabin&version=2} status=0 QTime=15 
[junit4:junit4]   2> 7693 T914 C110 P12851 /update {wt=javabin&version=2} {delete=[10016 (-1416698420441120768)]} 0 0
[junit4:junit4]   2> 7694 T930 C109 P12862 /update {wt=javabin&version=2} {add=[20 (1416698420421197824)]} 0 20
[junit4:junit4]   2> 7696 T914 C110 P12851 /update {wt=javabin&version=2} {add=[21 (1416698420444266496)]} 0 0
[junit4:junit4]   2> 7698 T940 C108 P12865 REQ /update {distrib.from=http://127.0.0.1:12862/solr/collection1/&update.distrib=FROMLEADER&wt=javabin&version=2} status=0 QTime=0 
[junit4:junit4]   2> 7699 T929 C109 P12862 /update {wt=javabin&version=2} {delete=[10016 (-1416698420444266496)]} 0 3
[junit4:junit4]   2> 7702 T914 C110 P12851 /update {wt=javabin&version=2} {add=[10023 (1416698420449509376)]} 0 1
[junit4:junit4]   2> 7703 T940 C108 P12865 REQ /update {distrib.from=http://127.0.0.1:12862/solr/collection1/&update.distrib=FROMLEADER&wt=javabin&version=2} status=0 QTime=1 
[junit4:junit4]   2> 7703 T930 C109 P12862 /update {wt=javabin&version=2} {add=[21 (1416698420447412224)]} 0 4
[junit4:junit4]   2> 7706 T914 C110 P12851 /update {wt=javabin&version=2} {add=[22 (1416698420454752256)]} 0 0
[junit4:junit4]   2> 7709 T940 C108 P12865 REQ /update {distrib.from=http://127.0.0.1:12862/solr/collection1/&update.distrib=FROMLEADER&wt=javabin&version=2} status=0 QTime=1 
[junit4:junit4]   2> 7709 T929 C109 P12862 /update {wt=javabin&version=2} {add=[10023 (1416698420453703680)]} 0 4
[junit4:junit4]   2> 7712 T914 C110 P12851 /update {wt=javabin&version=2} {delete=[10017 (-1416698420461043712)]} 0 0
[junit4:junit4]   2> 7712 T940 C108 P12865 REQ /update {distrib.from=http://127.0.0.1:12862/solr/collection1/&update.distrib=FROMLEADER&wt=javabin&version=2} status=0 QTime=0 
[junit4:junit4]   2> 7713 T930 C109 P12862 /update {wt=javabin&version=2} {add=[22 (1416698420457897984)]} 0 4
[junit4:junit4]   2> 7715 T914 C110 P12851 /update {wt=javabin&version=2} {delete=[16 (-1416698420464189440)]} 0 0
[junit4:junit4]   2> 7717 T940 C108 P12865 REQ /update {distrib.from=http://127.0.0.1:12862/solr/collection1/&update.distrib=FROMLEADER&wt=javabin&version=2} status=0 QTime=0 
[junit4:junit4]   2> 7718 T929 C109 P12862 /update {wt=javabin&version=2} {delete=[10017 (-1416698420464189440)]} 0 3
[junit4:junit4]   2> 7720 T940 C108 P12865 REQ /update {distrib.from=http://127.0.0.1:12862/solr/collection1/&update.distrib=FROMLEADER&wt=javabin&version=2} status=0 QTime=0 
[junit4:junit4]   2> 7720 T914 C110 P12851 /update {wt=javabin&version=2} {add=[10024 (1416698420469432320)]} 0 0
[junit4:junit4]   2> 7721 T930 C109 P12862 /update {wt=javabin&version=2} {delete=[16 (-1416698420467335168)]} 0 3
[junit4:junit4]   2> 7723 T914 C110 P12851 /update {wt=javabin&version=2} {add=[23 (1416698420472578048)]} 0 0
[junit4:junit4]   2> 7727 T940 C108 P12865 REQ /update {distrib.from=http://127.0.0.1:12862/solr/collection1/&update.distrib=FROMLEADER&wt=javabin&version=2} status=0 QTime=1 
[junit4:junit4]   2> 7727 T929 C109 P12862 /update {wt=javabin&version=2} {add=[10024 (1416698420472578048)]} 0 4
[junit4:junit4]   2> 7730 T939 C108 P12865 REQ /update {distrib.from=http://127.0.0.1:12862/solr/collection1/&update.distrib=FROMLEADER&wt=javabin&version=2} status=0 QTime=0 
[junit4:junit4]   2> 7730 T930 C109 P12862 /update {wt=javabin&version=2} {add=[23 (1416698420475723776)]} 0 4
[junit4:junit4]   2> 7731 T914 C110 P12851 /update {wt=javabin&version=2} {add=[10025 (1416698420480966656)]} 0 1
[junit4:junit4]   2> 7733 T913 C110 P12851 /update {wt=javabin&version=2} {delete=[17 (-1416698420483063808)]} 0 0
[junit4:junit4]   2> 7738 T939 C108 P12865 REQ /update {distrib.from=http://127.0.0.1:12862/solr/collection1/&update.distrib=FROMLEADER&wt=javabin&version=2} status=0 QTime=1 
[junit4:junit4]   2> 7738 T930 C109 P12862 /update {wt=javabin&version=2} {add=[10025 (1416698420484112384)]} 0 4
[junit4:junit4]   2> 7738 T940 C108 P12865 REQ /update {distrib.from=http://127.0.0.1:12862/solr/collection1/&update.distrib=FROMLEADER&wt=javabin&version=2} status=0 QTime=0 
[junit4:junit4]   2> 7739 T929 C109 P12862 /update {wt=javabin&version=2} {delete=[17 (-1416698420486209536)]} 0 3
[junit4:junit4]   2> 7741 T913 C110 P12851 /update {wt=javabin&version=2} {delete=[10019 (-1416698420491452417)]} 0 0
[junit4:junit4]   2> 7746 T940 C108 P12865 REQ /update {distrib.from=http://127.0.0.1:12862/solr/collection1/&update.distrib=FROMLEADER&wt=javabin&version=2} status=0 QTime=0 
[junit4:junit4]   2> 7747 T929 C109 P12862 /update {wt=javabin&version=2} {delete=[10019 (-1416698420494598144)]} 0 3
[junit4:junit4]   2> 7759 T914 C110 P12851 /update {wt=javabin&version=2} {add=[24 (1416698420491452416)]} 0 18
[junit4:junit4]   2> 7766 T940 C108 P12865 REQ /update {distrib.from=http://127.0.0.1:12862/solr/collection1/&update.distrib=FROMLEADER&wt=javabin&version=2} status=0 QTime=1 
[junit4:junit4]   2> 7766 T929 C109 P12862 /update {wt=javabin&versio

[...truncated too long message...]

ssion: 0x13a91fb337f0003 closed
[junit4:junit4]   2> 33054 T901 oejsh.ContextHandler.doStop stopped o.e.j.s.ServletContextHandler{/solr,null}
[junit4:junit4]   2> 33106 T901 oasc.ChaosMonkey.monkeyLog monkey: stop shard! 12865
[junit4:junit4]   2> 33106 T901 oasc.CoreContainer.shutdown Shutting down CoreContainer instance=28014348
[junit4:junit4]   2> 34156 T1002 oaz.ClientCnxn$SendThread.startConnect Opening socket connection to server localhost/127.0.0.1:12846
[junit4:junit4]   2> 38155 T1003 oaz.ClientCnxn$EventThread.run EventThread shut down
[junit4:junit4]   2> 38155 T901 oaz.ZooKeeper.close Session: 0x13a91fb337f0007 closed
[junit4:junit4]   2> 38156 T901 oejsh.ContextHandler.doStop stopped o.e.j.s.ServletContextHandler{/solr,null}
[junit4:junit4]   2> 38750 T901 oas.SolrTestCaseJ4.tearDown ###Ending testDistribSearch
[junit4:junit4]   2> NOTE: reproduce with: ant test  -Dtestcase=RecoveryZkTest -Dtests.method=testDistribSearch -Dtests.seed=2B01EE39547E9AED -Dtests.multiplier=3 -Dtests.slow=true -Dtests.locale=uk -Dtests.timezone=Indian/Mauritius -Dtests.file.encoding=ISO8859-1
[junit4:junit4] ERROR   38.8s J1 | RecoveryZkTest.testDistribSearch <<<
[junit4:junit4]    > Throwable #1: org.apache.solr.common.SolrException: Server at http://127.0.0.1:12865/solr/collection1 returned non ok status:404, message:Can not find: /solr/collection1/select
[junit4:junit4]    > 	at __randomizedtesting.SeedInfo.seed([2B01EE39547E9AED:AAE760212321FAD1]:0)
[junit4:junit4]    > 	at org.apache.solr.client.solrj.impl.HttpSolrServer.request(HttpSolrServer.java:372)
[junit4:junit4]    > 	at org.apache.solr.client.solrj.impl.HttpSolrServer.request(HttpSolrServer.java:181)
[junit4:junit4]    > 	at org.apache.solr.client.solrj.request.QueryRequest.process(QueryRequest.java:90)
[junit4:junit4]    > 	at org.apache.solr.client.solrj.SolrServer.query(SolrServer.java:301)
[junit4:junit4]    > 	at org.apache.solr.cloud.RecoveryZkTest.doTest(RecoveryZkTest.java:92)
[junit4:junit4]    > 	at org.apache.solr.BaseDistributedSearchTestCase.testDistribSearch(BaseDistributedSearchTestCase.java:695)
[junit4:junit4]    > 	at sun.reflect.NativeMethodAccessorImpl.invoke0(Native Method)
[junit4:junit4]    > 	at sun.reflect.NativeMethodAccessorImpl.invoke(NativeMethodAccessorImpl.java:57)
[junit4:junit4]    > 	at sun.reflect.DelegatingMethodAccessorImpl.invoke(DelegatingMethodAccessorImpl.java:43)
[junit4:junit4]    > 	at java.lang.reflect.Method.invoke(Method.java:616)
[junit4:junit4]    > 	at com.carrotsearch.randomizedtesting.RandomizedRunner.invoke(RandomizedRunner.java:1559)
[junit4:junit4]    > 	at com.carrotsearch.randomizedtesting.RandomizedRunner.access$600(RandomizedRunner.java:79)
[junit4:junit4]    > 	at com.carrotsearch.randomizedtesting.RandomizedRunner$6.evaluate(RandomizedRunner.java:737)
[junit4:junit4]    > 	at com.carrotsearch.randomizedtesting.RandomizedRunner$7.evaluate(RandomizedRunner.java:773)
[junit4:junit4]    > 	at com.carrotsearch.randomizedtesting.RandomizedRunner$8.evaluate(RandomizedRunner.java:787)
[junit4:junit4]    > 	at com.carrotsearch.randomizedtesting.rules.SystemPropertiesRestoreRule$1.evaluate(SystemPropertiesRestoreRule.java:53)
[junit4:junit4]    > 	at org.apache.lucene.util.TestRuleSetupTeardownChained$1.evaluate(TestRuleSetupTeardownChained.java:50)
[junit4:junit4]    > 	at org.apache.lucene.util.TestRuleFieldCacheSanity$1.evaluate(TestRuleFieldCacheSanity.java:51)
[junit4:junit4]    > 	at org.apache.lucene.util.AbstractBeforeAfterRule$1.evaluate(AbstractBeforeAfterRule.java:45)
[junit4:junit4]    > 	at com.carrotsearch.randomizedtesting.rules.SystemPropertiesInvariantRule$1.evaluate(SystemPropertiesInvariantRule.java:55)
[junit4:junit4]    > 	at org.apache.lucene.util.TestRuleThreadAndTestName$1.evaluate(TestRuleThreadAndTestName.java:48)
[junit4:junit4]    > 	at org.apache.lucene.util.TestRuleIgnoreAfterMaxFailures$1.evaluate(TestRuleIgnoreAfterMaxFailures.java:70)
[junit4:junit4]    > 	at org.apache.lucene.util.TestRuleMarkFailure$1.evaluate(TestRuleMarkFailure.java:48)
[junit4:junit4]    > 	at com.carrotsearch.randomizedtesting.rules.StatementAdapter.evaluate(StatementAdapter.java:36)
[junit4:junit4]    > 	at com.carrotsearch.randomizedtesting.ThreadLeakControl$StatementRunner.run(ThreadLeakControl.java:358)
[junit4:junit4]    > 	at com.carrotsearch.randomizedtesting.ThreadLeakControl.forkTimeoutingTask(ThreadLeakControl.java:782)
[junit4:junit4]    > 	at com.carrotsearch.randomizedtesting.ThreadLeakControl$3.evaluate(ThreadLeakControl.java:442)
[junit4:junit4]    > 	at com.carrotsearch.randomizedtesting.RandomizedRunner.runSingleTest(RandomizedRunner.java:746)
[junit4:junit4]    > 	at com.carrotsearch.randomizedtesting.RandomizedRunner$3.evaluate(RandomizedRunner.java:648)
[junit4:junit4]    > 	at com.carrotsearch.randomizedtesting.RandomizedRunner$4.evaluate(RandomizedRunner.java:682)
[junit4:junit4]    > 	at com.carrotsearch.randomizedtesting.RandomizedRunner$5.evaluate(RandomizedRunner.java:693)
[junit4:junit4]    > 	at com.carrotsearch.randomizedtesting.rules.StatementAdapter.evaluate(StatementAdapter.java:36)
[junit4:junit4]    > 	at com.carrotsearch.randomizedtesting.rules.SystemPropertiesRestoreRule$1.evaluate(SystemPropertiesRestoreRule.java:53)
[junit4:junit4]    > 	at org.apache.lucene.util.AbstractBeforeAfterRule$1.evaluate(AbstractBeforeAfterRule.java:45)
[junit4:junit4]    > 	at org.apache.lucene.util.TestRuleStoreClassName$1.evaluate(TestRuleStoreClassName.java:42)
[junit4:junit4]    > 	at com.carrotsearch.randomizedtesting.rules.SystemPropertiesInvariantRule$1.evaluate(SystemPropertiesInvariantRule.java:55)
[junit4:junit4]    > 	at com.carrotsearch.randomizedtesting.rules.NoShadowingOrOverridesOnMethodsRule$1.evaluate(NoShadowingOrOverridesOnMethodsRule.java:39)
[junit4:junit4]    > 	at com.carrotsearch.randomizedtesting.rules.NoShadowingOrOverridesOnMethodsRule$1.evaluate(NoShadowingOrOverridesOnMethodsRule.java:39)
[junit4:junit4]    > 	at com.carrotsearch.randomizedtesting.rules.StatementAdapter.evaluate(StatementAdapter.java:36)
[junit4:junit4]    > 	at org.apache.lucene.util.TestRuleAssertionsRequired$1.evaluate(TestRuleAssertionsRequired.java:43)
[junit4:junit4]    > 	at org.apache.lucene.util.TestRuleMarkFailure$1.evaluate(TestRuleMarkFailure.java:48)
[junit4:junit4]    > 	at org.apache.lucene.util.TestRuleIgnoreAfterMaxFailures$1.evaluate(TestRuleIgnoreAfterMaxFailures.java:70)
[junit4:junit4]    > 	at org.apache.lucene.util.TestRuleIgnoreTestSuites$1.evaluate(TestRuleIgnoreTestSuites.java:55)
[junit4:junit4]    > 	at com.carrotsearch.randomizedtesting.rules.StatementAdapter.evaluate(StatementAdapter.java:36)
[junit4:junit4]    > 	at com.carrotsearch.randomizedtesting.ThreadLeakControl$StatementRunner.run(ThreadLeakControl.java:358)
[junit4:junit4]    > 	at java.lang.Thread.run(Thread.java:679)
[junit4:junit4]   2> 38767 T901 oas.SolrTestCaseJ4.deleteCore ###deleteCore
[junit4:junit4]   2> NOTE: test params are: codec=Lucene41: {range_facet_l=Pulsing41(freqCutoff=20 minBlockSize=67 maxBlockSize=155), text=MockFixedIntBlock(blockSize=942), _version_=Pulsing41(freqCutoff=20 minBlockSize=67 maxBlockSize=155), rnd_b=PostingsFormat(name=NestedPulsing), intDefault=Pulsing41(freqCutoff=20 minBlockSize=67 maxBlockSize=155), id=PostingsFormat(name=NestedPulsing), timestamp=Pulsing41(freqCutoff=20 minBlockSize=67 maxBlockSize=155), a_t=Pulsing41(freqCutoff=20 minBlockSize=67 maxBlockSize=155), range_facet_sl=MockFixedIntBlock(blockSize=942), range_facet_si=PostingsFormat(name=Memory doPackFST= true), other_tl1=Pulsing41(freqCutoff=20 minBlockSize=67 maxBlockSize=155), multiDefault=PostingsFormat(name=Memory doPackFST= true), a_si=PostingsFormat(name=Memory doPackFST= true)}, sim=RandomSimilarityProvider(queryNorm=true,coord=crazy): {}, locale=uk, timezone=Indian/Mauritius
[junit4:junit4]   2> NOTE: FreeBSD 9.0-RELEASE amd64/Sun Microsystems Inc. 1.6.0_32 (64-bit)/cpus=16,threads=1,free=161123552,total=241041408
[junit4:junit4]   2> NOTE: All tests run in this JVM: [SoftAutoCommitTest, DirectUpdateHandlerTest, TestSort, TestPropInjectDefaults, IndexSchemaTest, BadIndexSchemaTest, TestRecovery, ZkSolrClientTest, TestTrie, TestReplicationHandler, XmlUpdateRequestHandlerTest, TestCharFilters, TestReload, TestDistributedGrouping, PingRequestHandlerTest, DOMUtilTest, TestReversedWildcardFilterFactory, ConvertedLegacyTest, DisMaxRequestHandlerTest, StatelessScriptUpdateProcessorFactoryTest, TestSolrCoreProperties, TestSolrXMLSerializer, PrimitiveFieldTypeTest, XsltUpdateRequestHandlerTest, ZkCLITest, TestPropInject, TestUpdate, SyncSliceTest, SolrIndexConfigTest, TestJmxIntegration, FieldMutatingUpdateProcessorTest, TestDistributedSearch, RecoveryZkTest]
[junit4:junit4] Completed on J1 in 38.79s, 1 test, 1 error <<< FAILURES!

[...truncated 486 lines...]
BUILD FAILED
/usr/home/hudson/hudson-slave/workspace/Lucene-Solr-Tests-trunk-Java6/build.xml:335: The following error occurred while executing this line:
/usr/home/hudson/hudson-slave/workspace/Lucene-Solr-Tests-trunk-Java6/build.xml:39: The following error occurred while executing this line:
/usr/home/hudson/hudson-slave/workspace/Lucene-Solr-Tests-trunk-Java6/solr/build.xml:178: The following error occurred while executing this line:
/usr/home/hudson/hudson-slave/workspace/Lucene-Solr-Tests-trunk-Java6/lucene/module-build.xml:61: The following error occurred while executing this line:
/usr/home/hudson/hudson-slave/workspace/Lucene-Solr-Tests-trunk-Java6/lucene/common-build.xml:1170: The following error occurred while executing this line:
/usr/home/hudson/hudson-slave/workspace/Lucene-Solr-Tests-trunk-Java6/lucene/common-build.xml:838: There were test failures: 232 suites, 960 tests, 1 suite-level error, 1 error, 1 failure, 21 ignored (3 assumptions)

Total time: 36 minutes 25 seconds
Build step 'Invoke Ant' marked build as failure
Archiving artifacts
Recording test results
Email was triggered for: Failure
Sending email for trigger: Failure



Mime
View raw message