lucene-dev mailing list archives

Site index · List index
Message view « Date » · « Thread »
Top « Date » · « Thread »
From Apache Jenkins Server <jenk...@builds.apache.org>
Subject [JENKINS] Lucene-Solr-NightlyTests-4.x - Build # 71 - Failure
Date Sun, 21 Oct 2012 23:20:38 GMT
Build: https://builds.apache.org/job/Lucene-Solr-NightlyTests-4.x/71/

1 tests failed.
REGRESSION:  org.apache.solr.update.SoftAutoCommitTest.testSoftAndHardCommitMaxTimeRapidAdds

Error Message:
1: soft occured too fast: 1350860495756 + (500 * 1) !<= 1350860496244

Stack Trace:
java.lang.AssertionError: 1: soft occured too fast: 1350860495756 + (500 * 1) !<= 1350860496244
	at __randomizedtesting.SeedInfo.seed([A873BBF3C1E6F330:F46615CA2A64B248]:0)
	at org.junit.Assert.fail(Assert.java:93)
	at org.junit.Assert.assertTrue(Assert.java:43)
	at org.apache.solr.update.SoftAutoCommitTest.testSoftAndHardCommitMaxTimeRapidAdds(SoftAutoCommitTest.java:312)
	at sun.reflect.NativeMethodAccessorImpl.invoke0(Native Method)
	at sun.reflect.NativeMethodAccessorImpl.invoke(NativeMethodAccessorImpl.java:57)
	at sun.reflect.DelegatingMethodAccessorImpl.invoke(DelegatingMethodAccessorImpl.java:43)
	at java.lang.reflect.Method.invoke(Method.java:616)
	at com.carrotsearch.randomizedtesting.RandomizedRunner.invoke(RandomizedRunner.java:1559)
	at com.carrotsearch.randomizedtesting.RandomizedRunner.access$600(RandomizedRunner.java:79)
	at com.carrotsearch.randomizedtesting.RandomizedRunner$6.evaluate(RandomizedRunner.java:737)
	at com.carrotsearch.randomizedtesting.RandomizedRunner$7.evaluate(RandomizedRunner.java:773)
	at com.carrotsearch.randomizedtesting.RandomizedRunner$8.evaluate(RandomizedRunner.java:787)
	at com.carrotsearch.randomizedtesting.rules.SystemPropertiesRestoreRule$1.evaluate(SystemPropertiesRestoreRule.java:53)
	at org.apache.lucene.util.TestRuleSetupTeardownChained$1.evaluate(TestRuleSetupTeardownChained.java:50)
	at org.apache.lucene.util.TestRuleFieldCacheSanity$1.evaluate(TestRuleFieldCacheSanity.java:51)
	at org.apache.lucene.util.AbstractBeforeAfterRule$1.evaluate(AbstractBeforeAfterRule.java:45)
	at com.carrotsearch.randomizedtesting.rules.SystemPropertiesInvariantRule$1.evaluate(SystemPropertiesInvariantRule.java:55)
	at org.apache.lucene.util.TestRuleThreadAndTestName$1.evaluate(TestRuleThreadAndTestName.java:48)
	at org.apache.lucene.util.TestRuleIgnoreAfterMaxFailures$1.evaluate(TestRuleIgnoreAfterMaxFailures.java:70)
	at org.apache.lucene.util.TestRuleMarkFailure$1.evaluate(TestRuleMarkFailure.java:48)
	at com.carrotsearch.randomizedtesting.rules.StatementAdapter.evaluate(StatementAdapter.java:36)
	at com.carrotsearch.randomizedtesting.ThreadLeakControl$StatementRunner.run(ThreadLeakControl.java:358)
	at com.carrotsearch.randomizedtesting.ThreadLeakControl.forkTimeoutingTask(ThreadLeakControl.java:782)
	at com.carrotsearch.randomizedtesting.ThreadLeakControl$3.evaluate(ThreadLeakControl.java:442)
	at com.carrotsearch.randomizedtesting.RandomizedRunner.runSingleTest(RandomizedRunner.java:746)
	at com.carrotsearch.randomizedtesting.RandomizedRunner$3.evaluate(RandomizedRunner.java:648)
	at com.carrotsearch.randomizedtesting.RandomizedRunner$4.evaluate(RandomizedRunner.java:682)
	at com.carrotsearch.randomizedtesting.RandomizedRunner$5.evaluate(RandomizedRunner.java:693)
	at com.carrotsearch.randomizedtesting.rules.StatementAdapter.evaluate(StatementAdapter.java:36)
	at com.carrotsearch.randomizedtesting.rules.SystemPropertiesRestoreRule$1.evaluate(SystemPropertiesRestoreRule.java:53)
	at org.apache.lucene.util.AbstractBeforeAfterRule$1.evaluate(AbstractBeforeAfterRule.java:45)
	at org.apache.lucene.util.TestRuleStoreClassName$1.evaluate(TestRuleStoreClassName.java:42)
	at com.carrotsearch.randomizedtesting.rules.SystemPropertiesInvariantRule$1.evaluate(SystemPropertiesInvariantRule.java:55)
	at com.carrotsearch.randomizedtesting.rules.NoShadowingOrOverridesOnMethodsRule$1.evaluate(NoShadowingOrOverridesOnMethodsRule.java:39)
	at com.carrotsearch.randomizedtesting.rules.NoShadowingOrOverridesOnMethodsRule$1.evaluate(NoShadowingOrOverridesOnMethodsRule.java:39)
	at com.carrotsearch.randomizedtesting.rules.StatementAdapter.evaluate(StatementAdapter.java:36)
	at org.apache.lucene.util.TestRuleAssertionsRequired$1.evaluate(TestRuleAssertionsRequired.java:43)
	at org.apache.lucene.util.TestRuleMarkFailure$1.evaluate(TestRuleMarkFailure.java:48)
	at org.apache.lucene.util.TestRuleIgnoreAfterMaxFailures$1.evaluate(TestRuleIgnoreAfterMaxFailures.java:70)
	at org.apache.lucene.util.TestRuleIgnoreTestSuites$1.evaluate(TestRuleIgnoreTestSuites.java:55)
	at com.carrotsearch.randomizedtesting.rules.StatementAdapter.evaluate(StatementAdapter.java:36)
	at com.carrotsearch.randomizedtesting.ThreadLeakControl$StatementRunner.run(ThreadLeakControl.java:358)
	at java.lang.Thread.run(Thread.java:679)




Build Log:
[...truncated 7662 lines...]
[junit4:junit4] Suite: org.apache.solr.update.SoftAutoCommitTest
[junit4:junit4]   2> -20 T10 oasu.AbstractSolrTestCase.setUp ####SETUP_START testSoftAndHardCommitMaxTimeRapidAdds
[junit4:junit4]   2> 109 T10 oasc.SolrResourceLoader.<init> new SolrResourceLoader for directory: '/usr/home/hudson/hudson-slave/workspace/Lucene-Solr-NightlyTests-4.x/solr/build/solr-core/test-files/solr/collection1/'
[junit4:junit4]   2> 116 T10 oasc.SolrResourceLoader.replaceClassLoader Adding 'file:/usr/home/hudson/hudson-slave/workspace/Lucene-Solr-NightlyTests-4.x/solr/build/solr-core/test-files/solr/collection1/lib/README' to classloader
[junit4:junit4]   2> 117 T10 oasc.SolrResourceLoader.replaceClassLoader Adding 'file:/usr/home/hudson/hudson-slave/workspace/Lucene-Solr-NightlyTests-4.x/solr/build/solr-core/test-files/solr/collection1/lib/classes/' to classloader
[junit4:junit4]   2> 806 T10 oasc.SolrConfig.<init> Using Lucene MatchVersion: LUCENE_41
[junit4:junit4]   2> 993 T10 oasc.SolrConfig.<init> Loaded SolrConfig: solrconfig.xml
[junit4:junit4]   2> 1022 T10 oass.IndexSchema.readSchema Reading Solr Schema
[junit4:junit4]   2> 1079 T10 oass.IndexSchema.readSchema Schema name=test
[junit4:junit4]   2> 3124 T10 oass.OpenExchangeRatesOrgProvider.init Initialized with rates=open-exchange-rates.json, refreshInterval=1440.
[junit4:junit4]   2> 3154 T10 oass.IndexSchema.readSchema default search field in schema is text
[junit4:junit4]   2> 3158 T10 oass.IndexSchema.readSchema unique key field: id
[junit4:junit4]   2> 3543 T10 oass.FileExchangeRateProvider.reload Reloading exchange rates from file currency.xml
[junit4:junit4]   2> 3559 T10 oass.FileExchangeRateProvider.reload Reloading exchange rates from file currency.xml
[junit4:junit4]   2> 3564 T10 oass.OpenExchangeRatesOrgProvider.reload Reloading exchange rates from open-exchange-rates.json
[junit4:junit4]   2> 3585 T10 oass.OpenExchangeRatesOrgProvider.reload Reloading exchange rates from open-exchange-rates.json
[junit4:junit4]   2> 3638 T10 oasc.SolrResourceLoader.locateSolrHome JNDI not configured for solr (NoInitialContextEx)
[junit4:junit4]   2> 3639 T10 oasc.SolrResourceLoader.locateSolrHome using system property solr.solr.home: /usr/home/hudson/hudson-slave/workspace/Lucene-Solr-NightlyTests-4.x/solr/build/solr-core/test-files/solr
[junit4:junit4]   2> 3639 T10 oasc.SolrResourceLoader.<init> new SolrResourceLoader for directory: '/usr/home/hudson/hudson-slave/workspace/Lucene-Solr-NightlyTests-4.x/solr/build/solr-core/test-files/solr/'
[junit4:junit4]   2> 3665 T10 oasc.CoreContainer.<init> New CoreContainer 1358138608
[junit4:junit4]   2> 3779 T10 oasc.SolrCore.<init> [collection1] Opening new SolrCore at /usr/home/hudson/hudson-slave/workspace/Lucene-Solr-NightlyTests-4.x/solr/build/solr-core/test-files/solr/collection1/, dataDir=/usr/home/hudson/hudson-slave/workspace/Lucene-Solr-NightlyTests-4.x/solr/build/solr-core/test/J1/./org.apache.solr.update.SoftAutoCommitTest-1350860487687/
[junit4:junit4]   2> 3784 T10 oasc.JmxMonitoredMap.<init> JMX monitoring is enabled. Adding Solr mbeans to JMX Server: com.sun.jmx.mbeanserver.JmxMBeanServer@109b2a51
[junit4:junit4]   2> 3962 T10 oasc.SolrCore.getNewIndexDir New index directory detected: old=null new=/usr/home/hudson/hudson-slave/workspace/Lucene-Solr-NightlyTests-4.x/solr/build/solr-core/test/J1/./org.apache.solr.update.SoftAutoCommitTest-1350860487687/index/
[junit4:junit4]   2> 3963 T10 oasc.SolrCore.initIndex WARNING [collection1] Solr index directory '/usr/home/hudson/hudson-slave/workspace/Lucene-Solr-NightlyTests-4.x/solr/build/solr-core/test/J1/./org.apache.solr.update.SoftAutoCommitTest-1350860487687/index' doesn't exist. Creating new index...
[junit4:junit4]   2> 4047 T10 oasc.CachingDirectoryFactory.get return new directory for /usr/home/hudson/hudson-slave/workspace/Lucene-Solr-NightlyTests-4.x/solr/build/solr-core/test/J1/./org.apache.solr.update.SoftAutoCommitTest-1350860487687/index forceNew:false
[junit4:junit4]   2> 4413 T10 oasc.SolrDeletionPolicy.onCommit SolrDeletionPolicy.onCommit: commits:num=1
[junit4:junit4]   2> 		commit{dir=MockDirWrapper(org.apache.lucene.store.RAMDirectory@5aaefcbb lockFactory=org.apache.lucene.store.NativeFSLockFactory@798baf36),segFN=segments_1,generation=1,filenames=[segments_1]
[junit4:junit4]   2> 4414 T10 oasc.SolrDeletionPolicy.updateCommits newest commit = 1
[junit4:junit4]   2> 4459 T10 oasc.SolrCore.initWriters created xml: solr.XMLResponseWriter
[junit4:junit4]   2> 5650 T10 oasup.UpdateRequestProcessorChain.init inserting DistributedUpdateProcessorFactory into updateRequestProcessorChain "dedupe"
[junit4:junit4]   2> 5651 T10 oasup.UpdateRequestProcessorChain.init inserting DistributedUpdateProcessorFactory into updateRequestProcessorChain "dedupe-allfields"
[junit4:junit4]   2> 5651 T10 oasup.UpdateRequestProcessorChain.init inserting DistributedUpdateProcessorFactory into updateRequestProcessorChain "stored_sig"
[junit4:junit4]   2> 5661 T10 oasup.UpdateRequestProcessorChain.init inserting DistributedUpdateProcessorFactory into updateRequestProcessorChain "uniq-fields"
[junit4:junit4]   2> 5784 T10 oasup.UpdateRequestProcessorChain.init inserting DistributedUpdateProcessorFactory into updateRequestProcessorChain "distrib-dup-test-chain-implicit"
[junit4:junit4]   2> 5794 T10 oasc.RequestHandlers.initHandlersFromConfig adding lazy requestHandler: solr.ReplicationHandler
[junit4:junit4]   2> 5798 T10 oasc.RequestHandlers.initHandlersFromConfig created /replication: solr.ReplicationHandler
[junit4:junit4]   2> 5829 T10 oasc.RequestHandlers.initHandlersFromConfig created standard: solr.StandardRequestHandler
[junit4:junit4]   2> 5847 T10 oasc.RequestHandlers.initHandlersFromConfig created /get: solr.RealTimeGetHandler
[junit4:junit4]   2> 5901 T10 oasc.RequestHandlers.initHandlersFromConfig created dismax: solr.SearchHandler
[junit4:junit4]   2> 5903 T10 oasc.RequestHandlers.initHandlersFromConfig created mock: org.apache.solr.core.MockQuerySenderListenerReqHandler
[junit4:junit4]   2> 5908 T10 oasc.RequestHandlers.initHandlersFromConfig created /admin/: org.apache.solr.handler.admin.AdminHandlers
[junit4:junit4]   2> 5909 T10 oasc.RequestHandlers.initHandlersFromConfig created defaults: solr.StandardRequestHandler
[junit4:junit4]   2> 5909 T10 oasc.RequestHandlers.initHandlersFromConfig adding lazy requestHandler: solr.StandardRequestHandler
[junit4:junit4]   2> 5910 T10 oasc.RequestHandlers.initHandlersFromConfig created lazy: solr.StandardRequestHandler
[junit4:junit4]   2> 5946 T10 oasc.RequestHandlers.initHandlersFromConfig created /update: solr.UpdateRequestHandler
[junit4:junit4]   2> 5947 T10 oasc.RequestHandlers.initHandlersFromConfig created /terms: org.apache.solr.handler.component.SearchHandler
[junit4:junit4]   2> 5948 T10 oasc.RequestHandlers.initHandlersFromConfig created spellCheckCompRH: org.apache.solr.handler.component.SearchHandler
[junit4:junit4]   2> 5950 T10 oasc.RequestHandlers.initHandlersFromConfig created spellCheckCompRH_Direct: org.apache.solr.handler.component.SearchHandler
[junit4:junit4]   2> 5951 T10 oasc.RequestHandlers.initHandlersFromConfig created spellCheckWithWordbreak: org.apache.solr.handler.component.SearchHandler
[junit4:junit4]   2> 5952 T10 oasc.RequestHandlers.initHandlersFromConfig created spellCheckWithWordbreak_Direct: org.apache.solr.handler.component.SearchHandler
[junit4:junit4]   2> 5953 T10 oasc.RequestHandlers.initHandlersFromConfig created spellCheckCompRH1: org.apache.solr.handler.component.SearchHandler
[junit4:junit4]   2> 5954 T10 oasc.RequestHandlers.initHandlersFromConfig created tvrh: org.apache.solr.handler.component.SearchHandler
[junit4:junit4]   2> 5975 T10 oasc.RequestHandlers.initHandlersFromConfig created /mlt: solr.MoreLikeThisHandler
[junit4:junit4]   2> 5994 T10 oasc.RequestHandlers.initHandlersFromConfig created /debug/dump: solr.DumpRequestHandler
[junit4:junit4]   2> 6121 T10 oashl.XMLLoader.init xsltCacheLifetimeSeconds=60
[junit4:junit4]   2> 6147 T10 oasc.SolrCore.initDeprecatedSupport WARNING solrconfig.xml uses deprecated <admin/gettableFiles>, Please update your config to use the ShowFileRequestHandler.
[junit4:junit4]   2> 6168 T10 oasc.SolrCore.initDeprecatedSupport WARNING adding ShowFileRequestHandler with hidden files: [THROW.ERROR.ON.ADD.UPDATEPROCESSOR.JS, SOLRCONFIG-HIGHLIGHT.XML, SCHEMA-REQUIRED-FIELDS.XML, SCHEMA-MINIMAL.XML, SCHEMA-REPLICATION2.XML, TRIVIAL.UPDATEPROCESSOR1.JS, BAD-SCHEMA-DUP-DYNAMICFIELD.XML, SOLRCONFIG-CACHING.XML, SOLRCONFIG-REPEATER.XML, BAD-SCHEMA-NONTEXT-ANALYZER.XML, SOLRCONFIG-MERGEPOLICY.XML, CURRENCY.XML, SOLRCONFIG-TLOG.XML, SOLRCONFIG-MASTER.XML, BAD-SCHEMA-UNIQUEKEY-MULTIVALUED.XML, SCHEMA11.XML, SOLRCONFIG-BASIC.XML, DA_COMPOUNDDICTIONARY.TXT, MISSLEADING.EXTENSION.UPDATEPROCESSOR.JS.TXT, SCHEMA-COPYFIELD-TEST.XML, SOLRCONFIG-SLAVE.XML, ELEVATE.XML, SOLRCONFIG-PROPINJECT-INDEXDEFAULT.XML, TRIVIAL.UPDATEPROCESSOR0.JS, BAD-SOLRCONFIG-BOGUS-SCRIPTENGINE-NAME.XML, SCHEMA-CHARFILTERS.XML, SCHEMA-IB.XML, SOLRCONFIG-QUERYSENDER.XML, SCHEMA-REPLICATION1.XML, SOLRCONFIG-SNIPPET-PROCESSOR.XML, DA_UTF8.XML, CONDITIONAL.UPDATEPROCESSOR.JS, MISSING.FUNCTIONS.UPDATEPROCESSOR.JS, SOLRCONFIG-ENABLEPLUGIN.XML, HYPHENATION.DTD, STEMDICT.TXT, SCHEMA-PHRASESUGGEST.XML, HUNSPELL-TEST.AFF, SCHEMA-SNIPPET-TYPE.XML, STOPTYPES-1.TXT, STOPWORDSWRONGENCODING.TXT, SCHEMA-NUMERIC.XML, SOLRCONFIG-TRANSFORMERS.XML, SOLRCONFIG-PROPINJECT.XML, BAD-SCHEMA-NOT-INDEXED-BUT-TF.XML, SOLRCONFIG-SIMPLELOCK.XML, WDFTYPES.TXT, STOPTYPES-2.TXT, SCHEMA-REVERSED.XML, BAD-SCHEMA-CURRENCY-FT-MULTIVALUED.XML, SOLRCONFIG-SPELLCHECKCOMPONENT.XML, SOLRCONFIG-PHRASESUGGEST.XML, SCHEMA-DFR.XML, BAD-SCHEMA-CURRENCY-MULTIVALUED.XML, BAD-SCHEMA-NOT-INDEXED-BUT-POS.XML, KEEP-1.TXT, OPEN-EXCHANGE-RATES.JSON, SCHEMA-SPATIAL.XML, STOPWITHBOM.TXT, SCHEMA-BINARYFIELD.XML, SOLRCONFIG-SPELLCHECKER.XML, SOLRCONFIG-UPDATE-PROCESSOR-CHAINS.XML, BAD-SCHEMA-OMIT-TF-BUT-NOT-POS.XML, BAD-SCHEMA-DUP-FIELDTYPE.XML, SCHEMA-XINCLUDE.XML, SOLRCONFIG-MASTER1.XML, SYNONYMS.TXT, BAD-SCHEMA-CURRENCY-DYNAMIC-MULTIVALUED.XML, SCHEMA_CODEC.XML, SCHEMA.XML, SOLRCONFIG-SOLR-749.XML, SOLRCONFIG-MASTER1-KEEPONEBACKUP.XML, SOLRCONFIG-FUNCTIONQUERY.XML, STOP-2.TXT, SOLRCONFIG-TERMINDEX.XML, SCHEMA-LMDIRICHLET.XML, SOLRCONFIG-ELEVATE.XML, STOPWORDS.TXT, SCHEMA-FOLDING.XML, SCHEMA-STOP-KEEP.XML, BAD-SCHEMA-NOT-INDEXED-BUT-NORMS.XML, SOLRCONFIG-SOLCOREPROPERTIES.XML, STOP-1.TXT, SOLRCONFIG-MASTER2.XML, SCHEMA-SPELLCHECKER.XML, SOLRCONFIG-RESPONSE-LOG-COMPONENT.XML, SOLRCONFIG-LAZYWRITER.XML, SCHEMA-LUCENEMATCHVERSION.XML, FRENCHARTICLES.TXT, BAD-MP-SOLRCONFIG.XML, SCHEMA15.XML, SOLRCONFIG-REQHANDLER.INCL, SCHEMASURROUND.XML, SCHEMA-COLLATEFILTER.XML, SOLRCONFIG-MASTER3.XML, HUNSPELL-TEST.DIC, BAD-SCHEMA-CODEC-GLOBAL-VS-FT-MISMATCH.XML, SOLRCONFIG-XINCLUDE.XML, SOLRCONFIG-DELPOLICY1.XML, SOLRCONFIG-SLAVE1.XML, SCHEMA-SIM.XML, SCHEMA-SNIPPET-FIELD.XML, SCHEMA-COLLATE.XML, STOP-SNOWBALL.TXT, BAD-SCHEMA-SIM-GLOBAL-VS-FT-MISMATCH.XML, PROTWORDS.TXT, SCHEMA-TRIE.XML, SOLRCONFIG_CODEC.XML, BAD-SOLRCONFIG-INVALID-SCRIPTFILE.XML, JASUGGEST.TXT, SCHEMA-TFIDF.XML, SOLRCONFIG-SCRIPT-UPDATEPROCESSOR.XML, SCHEMA-LMJELINEKMERCER.XML, PHRASESUGGEST.TXT, BAD-SOLRCONFIG-MISSING-SCRIPTFILE.XML, SOLRCONFIG-BASIC-LUCENEVERSION31.XML, BAD-SCHEMA-UNIQUEKEY-USES-DEFAULT.XML, OLD_SYNONYMS.TXT, SOLRCONFIG-DELPOLICY2.XML, SOLRCONFIG-NATIVELOCK.XML, XSLT, BAD-SCHEMA-DUP-FIELD.XML, SOLRCONFIG-NOCACHE.XML, SCHEMA-BM25.XML, ADDFIELDS.UPDATEPROCESSOR.JS, SOLRCONFIG-ALTDIRECTORY.XML, SOLRCONFIG-QUERYSENDER-NOQUERY.XML, COMPOUNDDICTIONARY.TXT, SOLRCONFIG-INDEXCONFIG.XML, SOLRCONFIG_PERF.XML, BAD-SCHEMA-ANALYZER-CLASS-AND-NESTED.XML, SCHEMA-NOT-REQUIRED-UNIQUE-KEY.XML, KEEP-2.TXT, BAD-SCHEMA-UNIQUEKEY-IS-COPYFIELD-DEST.XML, SCHEMA12.XML, MAPPING-ISOLATIN1ACCENT.TXT, BAD_SOLRCONFIG.XML, BAD-SCHEMA-EXTERNAL-FILEFIELD.XML]
[junit4:junit4]   2> 6230 T10 oass.SolrIndexSearcher.<init> Opening Searcher@3951f910 main
[junit4:junit4]   2> 6231 T10 oass.SolrIndexSearcher.getIndexDir WARNING WARNING: Directory impl does not support setting indexDir: org.apache.lucene.store.MockDirectoryWrapper
[junit4:junit4]   2> 6303 T10 oasu.CommitTracker.<init> Hard AutoCommit: disabled
[junit4:junit4]   2> 6304 T10 oasu.CommitTracker.<init> Soft AutoCommit: disabled
[junit4:junit4]   2> 6305 T10 oashc.SpellCheckComponent.inform Initializing spell checkers
[junit4:junit4]   2> 6512 T10 oass.DirectSolrSpellChecker.init init: {name=direct,classname=DirectSolrSpellChecker,field=lowerfilt,minQueryLength=3}
[junit4:junit4]   2> 6850 T10 oashc.HttpShardHandlerFactory.getParameter Setting socketTimeout to: 0
[junit4:junit4]   2> 6851 T10 oashc.HttpShardHandlerFactory.getParameter Setting urlScheme to: http://
[junit4:junit4]   2> 6851 T10 oashc.HttpShardHandlerFactory.getParameter Setting connTimeout to: 0
[junit4:junit4]   2> 6852 T10 oashc.HttpShardHandlerFactory.getParameter Setting maxConnectionsPerHost to: 20
[junit4:junit4]   2> 6853 T10 oashc.HttpShardHandlerFactory.getParameter Setting corePoolSize to: 0
[junit4:junit4]   2> 6854 T10 oashc.HttpShardHandlerFactory.getParameter Setting maximumPoolSize to: 2147483647
[junit4:junit4]   2> 6854 T10 oashc.HttpShardHandlerFactory.getParameter Setting maxThreadIdleTime to: 5
[junit4:junit4]   2> 6855 T10 oashc.HttpShardHandlerFactory.getParameter Setting sizeOfQueue to: -1
[junit4:junit4]   2> 6856 T10 oashc.HttpShardHandlerFactory.getParameter Setting fairnessPolicy to: false
[junit4:junit4]   2> 6892 T10 oascsi.HttpClientUtil.createClient Creating new http client, config:maxConnectionsPerHost=20&maxConnections=10000&socketTimeout=0&connTimeout=0&retry=false
[junit4:junit4]   2> 7351 T11 oasc.SolrCore.registerSearcher [collection1] Registered new searcher Searcher@3951f910 main{StandardDirectoryReader(segments_1:1)}
[junit4:junit4]   2> 7361 T10 oasc.CoreContainer.register registering core: collection1
[junit4:junit4]   2> 7367 T10 oasu.AbstractSolrTestCase.setUp ####SETUP_END testSoftAndHardCommitMaxTimeRapidAdds
[junit4:junit4]   2> ASYNC  NEW_CORE C0 name=collection1 org.apache.solr.core.SolrCore@1864160e
[junit4:junit4]   2> 7706 T10 C0 oasc.SolrDeletionPolicy.onInit SolrDeletionPolicy.onInit: commits:num=1
[junit4:junit4]   2> 		commit{dir=MockDirWrapper(org.apache.lucene.store.RAMDirectory@5aaefcbb lockFactory=org.apache.lucene.store.NativeFSLockFactory@798baf36),segFN=segments_1,generation=1,filenames=[segments_1]
[junit4:junit4]   2> 7710 T10 C0 oasc.SolrDeletionPolicy.updateCommits newest commit = 1
[junit4:junit4]   2> 8055 T10 C0 UPDATE [collection1] webapp=null path=null params={} {add=[5000]} 0 634
[junit4:junit4]   2> 8113 T10 C0 UPDATE [collection1] webapp=null path=null params={} {add=[5001]} 0 2
[junit4:junit4]   2> 8134 T10 C0 UPDATE [collection1] webapp=null path=null params={} {add=[5002]} 0 1
[junit4:junit4]   2> 8153 T10 C0 UPDATE [collection1] webapp=null path=null params={} {add=[5003]} 0 2
[junit4:junit4]   2> 8171 T10 C0 UPDATE [collection1] webapp=null path=null params={} {add=[5004]} 0 1
[junit4:junit4]   2> 8561 T13 oasu.DirectUpdateHandler2.commit start commit{flags=0,_version_=0,optimize=false,openSearcher=true,waitSearcher=true,expungeDeletes=false,softCommit=true}
[junit4:junit4]   2> 8563 T10 oasu.AbstractSolrTestCase.tearDown ####TEARDOWN_START testSoftAndHardCommitMaxTimeRapidAdds
[junit4:junit4]   2> 8578 T10 oasc.CoreContainer.shutdown Shutting down CoreContainer instance=1358138608
[junit4:junit4]   2> 8578 T10 oasc.SolrCore.close [collection1]  CLOSING SolrCore org.apache.solr.core.SolrCore@1864160e
[junit4:junit4]   2> 8608 T10 oasu.DirectUpdateHandler2.close closing DirectUpdateHandler2{commits=1,autocommit maxTime=1200ms,autocommits=0,soft autocommit maxTime=500ms,soft autocommits=1,optimizes=0,rollbacks=0,expungeDeletes=0,docsPending=5,adds=5,deletesById=0,deletesByQuery=0,errors=0,cumulative_adds=5,cumulative_deletesById=0,cumulative_deletesByQuery=0,cumulative_errors=0}
[junit4:junit4]   2> 8609 T10 oasc.SolrCore.decrefSolrCoreState Closing SolrCoreState
[junit4:junit4]   2> 8610 T10 oasu.DefaultSolrCoreState.closeIndexWriter SolrCoreState ref count has reached 0 - closing IndexWriter
[junit4:junit4]   2> 8610 T10 oasu.DefaultSolrCoreState.closeIndexWriter closing IndexWriter with IndexWriterCloser
[junit4:junit4]   2> 9612 T13 oass.SolrIndexSearcher.<init> Opening Searcher@654f5021 main
[junit4:junit4]   2> 9613 T13 oass.SolrIndexSearcher.getIndexDir WARNING WARNING: Directory impl does not support setting indexDir: org.apache.lucene.store.MockDirectoryWrapper
[junit4:junit4]   2> 9630 T13 oasu.DirectUpdateHandler2.commit end_commit_flush
[junit4:junit4]   2> 9631 T10 C0 oasc.SolrDeletionPolicy.onCommit SolrDeletionPolicy.onCommit: commits:num=2
[junit4:junit4]   2> 		commit{dir=MockDirWrapper(org.apache.lucene.store.RAMDirectory@5aaefcbb lockFactory=org.apache.lucene.store.NativeFSLockFactory@798baf36),segFN=segments_1,generation=1,filenames=[segments_1]
[junit4:junit4]   2> 		commit{dir=MockDirWrapper(org.apache.lucene.store.RAMDirectory@5aaefcbb lockFactory=org.apache.lucene.store.NativeFSLockFactory@798baf36),segFN=segments_2,generation=2,filenames=[_0.fnm, _0.pos, _0.tim, _0_nrm.cfe, segments_2, _0.fdx, _0_nrm.cfs, _0.si, _0.doc, _0.tip, _0.fdt]
[junit4:junit4]   2> 9631 T10 C0 oasc.SolrDeletionPolicy.updateCommits newest commit = 2
[junit4:junit4]   2> 9631 T13 oasc.SolrException.log SEVERE java.lang.InterruptedException
[junit4:junit4]   2> 		at java.util.concurrent.locks.AbstractQueuedSynchronizer.acquireSharedInterruptibly(AbstractQueuedSynchronizer.java:1302)
[junit4:junit4]   2> 		at java.util.concurrent.FutureTask$Sync.innerGet(FutureTask.java:248)
[junit4:junit4]   2> 		at java.util.concurrent.FutureTask.get(FutureTask.java:111)
[junit4:junit4]   2> 		at org.apache.solr.update.DirectUpdateHandler2.commit(DirectUpdateHandler2.java:593)
[junit4:junit4]   2> 		at org.apache.solr.update.CommitTracker.run(CommitTracker.java:215)
[junit4:junit4]   2> 		at java.util.concurrent.Executors$RunnableAdapter.call(Executors.java:471)
[junit4:junit4]   2> 		at java.util.concurrent.FutureTask$Sync.innerRun(FutureTask.java:334)
[junit4:junit4]   2> 		at java.util.concurrent.FutureTask.run(FutureTask.java:166)
[junit4:junit4]   2> 		at java.util.concurrent.ScheduledThreadPoolExecutor$ScheduledFutureTask.access$101(ScheduledThreadPoolExecutor.java:165)
[junit4:junit4]   2> 		at java.util.concurrent.ScheduledThreadPoolExecutor$ScheduledFutureTask.run(ScheduledThreadPoolExecutor.java:266)
[junit4:junit4]   2> 		at java.util.concurrent.ThreadPoolExecutor.runWorker(ThreadPoolExecutor.java:1110)
[junit4:junit4]   2> 		at java.util.concurrent.ThreadPoolExecutor$Worker.run(ThreadPoolExecutor.java:603)
[junit4:junit4]   2> 		at java.lang.Thread.run(Thread.java:679)
[junit4:junit4]   2> 	
[junit4:junit4]   2> 9633 T11 oasc.SolrCore.registerSearcher [collection1] Registered new searcher Searcher@654f5021 main{StandardDirectoryReader(segments_1:3:nrt _0(4.1):C5)}
[junit4:junit4]   2> 9634 T10 oasc.SolrCore.closeSearcher [collection1] Closing main searcher on request.
[junit4:junit4]   2> NOTE: download the large Jenkins line-docs file by running 'ant get-jenkins-line-docs' in the lucene directory.
[junit4:junit4]   2> NOTE: reproduce with: ant test  -Dtestcase=SoftAutoCommitTest -Dtests.method=testSoftAndHardCommitMaxTimeRapidAdds -Dtests.seed=A873BBF3C1E6F330 -Dtests.multiplier=3 -Dtests.nightly=true -Dtests.slow=true -Dtests.linedocsfile=/home/hudson/lucene-data/enwiki.random.lines.txt -Dtests.locale=mk -Dtests.timezone=Europe/Minsk -Dtests.file.encoding=ISO-8859-1
[junit4:junit4] FAILURE 10.1s J1 | SoftAutoCommitTest.testSoftAndHardCommitMaxTimeRapidAdds <<<
[junit4:junit4]    > Throwable #1: java.lang.AssertionError: 1: soft occured too fast: 1350860495756 + (500 * 1) !<= 1350860496244
[junit4:junit4]    > 	at __randomizedtesting.SeedInfo.seed([A873BBF3C1E6F330:F46615CA2A64B248]:0)
[junit4:junit4]    > 	at org.junit.Assert.fail(Assert.java:93)
[junit4:junit4]    > 	at org.junit.Assert.assertTrue(Assert.java:43)
[junit4:junit4]    > 	at org.apache.solr.update.SoftAutoCommitTest.testSoftAndHardCommitMaxTimeRapidAdds(SoftAutoCommitTest.java:312)
[junit4:junit4]    > 	at sun.reflect.NativeMethodAccessorImpl.invoke0(Native Method)
[junit4:junit4]    > 	at sun.reflect.NativeMethodAccessorImpl.invoke(NativeMethodAccessorImpl.java:57)
[junit4:junit4]    > 	at sun.reflect.DelegatingMethodAccessorImpl.invoke(DelegatingMethodAccessorImpl.java:43)
[junit4:junit4]    > 	at java.lang.reflect.Method.invoke(Method.java:616)
[junit4:junit4]    > 	at com.carrotsearch.randomizedtesting.RandomizedRunner.invoke(RandomizedRunner.java:1559)
[junit4:junit4]    > 	at com.carrotsearch.randomizedtesting.RandomizedRunner.access$600(RandomizedRunner.java:79)
[junit4:junit4]    > 	at com.carrotsearch.randomizedtesting.RandomizedRunner$6.evaluate(RandomizedRunner.java:737)
[junit4:junit4]    > 	at com.carrotsearch.randomizedtesting.RandomizedRunner$7.evaluate(RandomizedRunner.java:773)
[junit4:junit4]    > 	at com.carrotsearch.randomizedtesting.RandomizedRunner$8.evaluate(RandomizedRunner.java:787)
[junit4:junit4]    > 	at com.carrotsearch.randomizedtesting.rules.SystemPropertiesRestoreRule$1.evaluate(SystemPropertiesRestoreRule.java:53)
[junit4:junit4]    > 	at org.apache.lucene.util.TestRuleSetupTeardownChained$1.evaluate(TestRuleSetupTeardownChained.java:50)
[junit4:junit4]    > 	at org.apache.lucene.util.TestRuleFieldCacheSanity$1.evaluate(TestRuleFieldCacheSanity.java:51)
[junit4:junit4]    > 	at org.apache.lucene.util.AbstractBeforeAfterRule$1.evaluate(AbstractBeforeAfterRule.java:45)
[junit4:junit4]    > 	at com.carrotsearch.randomizedtesting.rules.SystemPropertiesInvariantRule$1.evaluate(SystemPropertiesInvariantRule.java:55)
[junit4:junit4]    > 	at org.apache.lucene.util.TestRuleThreadAndTestName$1.evaluate(TestRuleThreadAndTestName.java:48)
[junit4:junit4]    > 	at org.apache.lucene.util.TestRuleIgnoreAfterMaxFailures$1.evaluate(TestRuleIgnoreAfterMaxFailures.java:70)
[junit4:junit4]    > 	at org.apache.lucene.util.TestRuleMarkFailure$1.evaluate(TestRuleMarkFailure.java:48)
[junit4:junit4]    > 	at com.carrotsearch.randomizedtesting.rules.StatementAdapter.evaluate(StatementAdapter.java:36)
[junit4:junit4]    > 	at com.carrotsearch.randomizedtesting.ThreadLeakControl$StatementRunner.run(ThreadLeakControl.java:358)
[junit4:junit4]    > 	at com.carrotsearch.randomizedtesting.ThreadLeakControl.forkTimeoutingTask(ThreadLeakControl.java:782)
[junit4:junit4]    > 	at com.carrotsearch.randomizedtesting.ThreadLeakControl$3.evaluate(ThreadLeakControl.java:442)
[junit4:junit4]    > 	at com.carrotsearch.randomizedtesting.RandomizedRunner.runSingleTest(RandomizedRunner.java:746)
[junit4:junit4]    > 	at com.carrotsearch.randomizedtesting.RandomizedRunner$3.evaluate(RandomizedRunner.java:648)
[junit4:junit4]    > 	at com.carrotsearch.randomizedtesting.RandomizedRunner$4.evaluate(RandomizedRunner.java:682)
[junit4:junit4]    > 	at com.carrotsearch.randomizedtesting.RandomizedRunner$5.evaluate(RandomizedRunner.java:693)
[junit4:junit4]    > 	at com.carrotsearch.randomizedtesting.rules.StatementAdapter.evaluate(StatementAdapter.java:36)
[junit4:junit4]    > 	at com.carrotsearch.randomizedtesting.rules.SystemPropertiesRestoreRule$1.evaluate(SystemPropertiesRestoreRule.java:53)
[junit4:junit4]    > 	at org.apache.lucene.util.AbstractBeforeAfterRule$1.evaluate(AbstractBeforeAfterRule.java:45)
[junit4:junit4]    > 	at org.apache.lucene.util.TestRuleStoreClassName$1.evaluate(TestRuleStoreClassName.java:42)
[junit4:junit4]    > 	at com.carrotsearch.randomizedtesting.rules.SystemPropertiesInvariantRule$1.evaluate(SystemPropertiesInvariantRule.java:55)
[junit4:junit4]    > 	at com.carrotsearch.randomizedtesting.rules.NoShadowingOrOverridesOnMethodsRule$1.evaluate(NoShadowingOrOverridesOnMethodsRule.java:39)
[junit4:junit4]    > 	at com.carrotsearch.randomizedtesting.rules.NoShadowingOrOverridesOnMethodsRule$1.evaluate(NoShadowingOrOverridesOnMethodsRule.java:39)
[junit4:junit4]    > 	at com.carrotsearch.randomizedtesting.rules.StatementAdapter.evaluate(StatementAdapter.java:36)
[junit4:junit4]    > 	at org.apache.lucene.util.TestRuleAssertionsRequired$1.evaluate(TestRuleAssertionsRequired.java:43)
[junit4:junit4]    > 	at org.apache.lucene.util.TestRuleMarkFailure$1.evaluate(TestRuleMarkFailure.java:48)
[junit4:junit4]    > 	at org.apache.lucene.util.TestRuleIgnoreAfterMaxFailures$1.evaluate(TestRuleIgnoreAfterMaxFailures.java:70)
[junit4:junit4]    > 	at org.apache.lucene.util.TestRuleIgnoreTestSuites$1.evaluate(TestRuleIgnoreTestSuites.java:55)
[junit4:junit4]    > 	at com.carrotsearch.randomizedtesting.rules.StatementAdapter.evaluate(StatementAdapter.java:36)
[junit4:junit4]    > 	at com.carrotsearch.randomizedtesting.ThreadLeakControl$StatementRunner.run(ThreadLeakControl.java:358)
[junit4:junit4]    > 	at java.lang.Thread.run(Thread.java:679)
[junit4:junit4]   2> 10002 T10 oasu.AbstractSolrTestCase.setUp ####SETUP_START testSoftAndHardCommitMaxTimeDelete
[junit4:junit4]   2> 10004 T10 oasc.SolrResourceLoader.<init> new SolrResourceLoader for directory: '/usr/home/hudson/hudson-slave/workspace/Lucene-Solr-NightlyTests-4.x/solr/build/solr-core/test-files/solr/collection1/'
[junit4:junit4]   2> 10005 T10 oasc.SolrResourceLoader.replaceClassLoader Adding 'file:/usr/home/hudson/hudson-slave/workspace/Lucene-Solr-NightlyTests-4.x/solr/build/solr-core/test-files/solr/collection1/lib/README' to classloader
[junit4:junit4]   2> 10006 T10 oasc.SolrResourceLoader.replaceClassLoader Adding 'file:/usr/home/hudson/hudson-slave/workspace/Lucene-Solr-NightlyTests-4.x/solr/build/solr-core/test-files/solr/collection1/lib/classes/' to classloader
[junit4:junit4]   2> 10090 T10 oasc.SolrConfig.<init> Using Lucene MatchVersion: LUCENE_41
[junit4:junit4]   2> 10154 T10 oasc.SolrConfig.<init> Loaded SolrConfig: solrconfig.xml
[junit4:junit4]   2> 10155 T10 oass.IndexSchema.readSchema Reading Solr Schema
[junit4:junit4]   2> 10190 T10 oass.IndexSchema.readSchema Schema name=test
[junit4:junit4]   2> 10709 T10 oass.OpenExchangeRatesOrgProvider.init Initialized with rates=open-exchange-rates.json, refreshInterval=1440.
[junit4:junit4]   2> 10723 T10 oass.IndexSchema.readSchema default search field in schema is text
[junit4:junit4]   2> 10726 T10 oass.IndexSchema.readSchema unique key field: id
[junit4:junit4]   2> 10745 T10 oass.FileExchangeRateProvider.reload Reloading exchange rates from file currency.xml
[junit4:junit4]   2> 10750 T10 oass.FileExchangeRateProvider.reload Reloading exchange rates from file currency.xml
[junit4:junit4]   2> 10754 T10 oass.OpenExchangeRatesOrgProvider.reload Reloading exchange rates from open-exchange-rates.json
[junit4:junit4]   2> 10757 T10 oass.OpenExchangeRatesOrgProvider.reload Reloading exchange rates from open-exchange-rates.json
[junit4:junit4]   2> 10759 T10 oasc.SolrResourceLoader.locateSolrHome JNDI not configured for solr (NoInitialContextEx)
[junit4:junit4]   2> 10760 T10 oasc.SolrResourceLoader.locateSolrHome using system property solr.solr.home: /usr/home/hudson/hudson-slave/workspace/Lucene-Solr-NightlyTests-4.x/solr/build/solr-core/test-files/solr
[junit4:junit4]   2> 10760 T10 oasc.SolrResourceLoader.<init> new SolrResourceLoader for directory: '/usr/home/hudson/hudson-slave/workspace/Lucene-Solr-NightlyTests-4.x/solr/build/solr-core/test-files/solr/'
[junit4:junit4]   2> 10769 T10 oasc.CoreContainer.<init> New CoreContainer 138126577
[junit4:junit4]   2> 10770 T10 oasc.SolrCore.<init> [collection1] Opening new SolrCore at /usr/home/hudson/hudson-slave/workspace/Lucene-Solr-NightlyTests-4.x/solr/build/solr-core/test-files/solr/collection1/, dataDir=/usr/home/hudson/hudson-slave/workspace/Lucene-Solr-NightlyTests-4.x/solr/build/solr-core/test/J1/./org.apache.solr.update.SoftAutoCommitTest-1350860497684/
[junit4:junit4]   2> 10771 T10 oasc.JmxMonitoredMap.<init> JMX monitoring is enabled. Adding Solr mbeans to JMX Server: com.sun.jmx.mbeanserver.JmxMBeanServer@109b2a51
[junit4:junit4]   2> 10772 T10 oasc.SolrCore.getNewIndexDir New index directory detected: old=null new=/usr/home/hudson/hudson-slave/workspace/Lucene-Solr-NightlyTests-4.x/solr/build/solr-core/test/J1/./org.apache.solr.update.SoftAutoCommitTest-1350860497684/index/
[junit4:junit4]   2> 10772 T10 oasc.SolrCore.initIndex WARNING [collection1] Solr index directory '/usr/home/hudson/hudson-slave/workspace/Lucene-Solr-NightlyTests-4.x/solr/build/solr-core/test/J1/./org.apache.solr.update.SoftAutoCommitTest-1350860497684/index' doesn't exist. Creating new index...
[junit4:junit4]   2> 10774 T10 oasc.CachingDirectoryFactory.get return new directory for /usr/home/hudson/hudson-slave/workspace/Lucene-Solr-NightlyTests-4.x/solr/build/solr-core/test/J1/./org.apache.solr.update.SoftAutoCommitTest-1350860497684/index forceNew:false
[junit4:junit4]   2> 10776 T10 oasc.SolrDeletionPolicy.onCommit SolrDeletionPolicy.onCommit: commits:num=1
[junit4:junit4]   2> 		commit{dir=MockDirWrapper(NRTCachingDirectory(org.apache.lucene.store.RAMDirectory@36101d01 lockFactory=org.apache.lucene.store.NativeFSLockFactory@7481933a; maxCacheMB=0.599609375 maxMergeSizeMB=0.0322265625)),segFN=segments_1,generation=1,filenames=[segments_1]
[junit4:junit4]   2> 10777 T10 oasc.SolrDeletionPolicy.updateCommits newest commit = 1
[junit4:junit4]   2> 10777 T10 oasc.SolrCore.initWriters created xml: solr.XMLResponseWriter
[junit4:junit4]   2> 10780 T10 oasup.UpdateRequestProcessorChain.init inserting DistributedUpdateProcessorFactory into updateRequestProcessorChain "dedupe"
[junit4:junit4]   2> 10780 T10 oasup.UpdateRequestProcessorChain.init inserting DistributedUpdateProcessorFactory into updateRequestProcessorChain "dedupe-allfields"
[junit4:junit4]   2> 10781 T10 oasup.UpdateRequestProcessorChain.init inserting DistributedUpdateProcessorFactory into updateRequestProcessorChain "stored_sig"
[junit4:junit4]   2> 10782 T10 oasup.UpdateRequestProcessorChain.init inserting DistributedUpdateProcessorFactory into updateRequestProcessorChain "uniq-fields"
[junit4:junit4]   2> 10783 T10 oasup.UpdateRequestProcessorChain.init inserting DistributedUpdateProcessorFactory into updateRequestProcessorChain "distrib-dup-test-chain-implicit"
[junit4:junit4]   2> 10783 T10 oasc.RequestHandlers.initHandlersFromConfig adding lazy requestHandler: solr.ReplicationHandler
[junit4:junit4]   2> 10784 T10 oasc.RequestHandlers.initHandlersFromConfig created /replication: solr.ReplicationHandler
[junit4:junit4]   2> 10785 T10 oasc.RequestHandlers.initHandlersFromConfig created standard: solr.StandardRequestHandler
[junit4:junit4]   2> 10785 T10 oasc.RequestHandlers.initHandlersFromConfig created /get: solr.RealTimeGetHandler
[junit4:junit4]   2> 10786 T10 oasc.RequestHandlers.initHandlersFromConfig created dismax: solr.SearchHandler
[junit4:junit4]   2> 10787 T10 oasc.RequestHandlers.initHandlersFromConfig created mock: org.apache.solr.core.MockQuerySenderListenerReqHandler
[junit4:junit4]   2> 10788 T10 oasc.RequestHandlers.initHandlersFromConfig created /admin/: org.apache.solr.handler.admin.AdminHandlers
[junit4:junit4]   2> 10789 T10 oasc.RequestHandlers.initHandlersFromConfig created defaults: solr.StandardRequestHandler
[junit4:junit4]   2> 10789 T10 oasc.RequestHandlers.initHandlersFromConfig adding lazy requestHandler: solr.StandardRequestHandler
[junit4:junit4]   2> 10790 T10 oasc.RequestHandlers.initHandlersFromConfig created lazy: solr.StandardRequestHandler
[junit4:junit4]   2> 10791 T10 oasc.RequestHandlers.initHandlersFromConfig created /update: solr.UpdateRequestHandler
[junit4:junit4]   2> 10792 T10 oasc.RequestHandlers.initHandlersFromConfig created /terms: org.apache.solr.handler.component.SearchHandler
[junit4:junit4]   2> 10792 T10 oasc.RequestHandlers.initHandlersFromConfig created spellCheckCompRH: org.apache.solr.handler.component.SearchHandler
[junit4:junit4]   2> 10793 T10 oasc.RequestHandlers.initHandlersFromConfig created spellCheckCompRH_Direct: org.apache.solr.handler.component.SearchHandler
[junit4:junit4]   2> 10794 T10 oasc.RequestHandlers.initHandlersFromConfig created spellCheckWithWordbreak: org.apache.solr.handler.component.SearchHandler
[junit4:junit4]   2> 10795 T10 oasc.RequestHandlers.initHandlersFromConfig created spellCheckWithWordbreak_Direct: org.apache.solr.handler.component.SearchHandler
[junit4:junit4]   2> 10796 T10 oasc.RequestHandlers.initHandlersFromConfig created spellCheckCompRH1: org.apache.solr.handler.component.SearchHandler
[junit4:junit4]   2> 10797 T10 oasc.RequestHandlers.initHandlersFromConfig created tvrh: org.apache.solr.handler.component.SearchHandler
[junit4:junit4]   2> 10798 T10 oasc.RequestHandlers.initHandlersFromConfig created /mlt: solr.MoreLikeThisHandler
[junit4:junit4]   2> 10799 T10 oasc.RequestHandlers.initHandlersFromConfig created /debug/dump: solr.DumpRequestHandler
[junit4:junit4]   2> 10805 T10 oashl.XMLLoader.init xsltCacheLifetimeSeconds=60
[junit4:junit4]   2> 10808 T10 oasc.SolrCore.initDeprecatedSupport WARNING solrconfig.xml uses deprecated <admin/gettableFiles>, Please update your config to use the ShowFileRequestHandler.
[junit4:junit4]   2> 10810 T10 oasc.SolrCore.initDeprecatedSupport WARNING adding ShowFileRequestHandler with hidden files: [THROW.ERROR.ON.ADD.UPDATEPROCESSOR.JS, SOLRCONFIG-HIGHLIGHT.XML, SCHEMA-REQUIRED-FIELDS.XML, SCHEMA-MINIMAL.XML, SCHEMA-REPLICATION2.XML, TRIVIAL.UPDATEPROCESSOR1.JS, BAD-SCHEMA-DUP-DYNAMICFIELD.XML, SOLRCONFIG-CACHING.XML, SOLRCONFIG-REPEATER.XML, BAD-SCHEMA-NONTEXT-ANALYZER.XML, SOLRCONFIG-MERGEPOLICY.XML, CURRENCY.XML, SOLRCONFIG-TLOG.XML, SOLRCONFIG-MASTER.XML, BAD-SCHEMA-UNIQUEKEY-MULTIVALUED.XML, SCHEMA11.XML, SOLRCONFIG-BASIC.XML, DA_COMPOUNDDICTIONARY.TXT, MISSLEADING.EXTENSION.UPDATEPROCESSOR.JS.TXT, SCHEMA-COPYFIELD-TEST.XML, SOLRCONFIG-SLAVE.XML, ELEVATE.XML, SOLRCONFIG-PROPINJECT-INDEXDEFAULT.XML, TRIVIAL.UPDATEPROCESSOR0.JS, BAD-SOLRCONFIG-BOGUS-SCRIPTENGINE-NAME.XML, SCHEMA-CHARFILTERS.XML, SCHEMA-IB.XML, SOLRCONFIG-QUERYSENDER.XML, SCHEMA-REPLICATION1.XML, SOLRCONFIG-SNIPPET-PROCESSOR.XML, DA_UTF8.XML, CONDITIONAL.UPDATEPROCESSOR.JS, MISSING.FUNCTIONS.UPDATEPROCESSOR.JS, SOLRCONFIG-ENABLEPLUGIN.XML, HYPHENATION.DTD, STEMDICT.TXT, SCHEMA-PHRASESUGGEST.XML, HUNSPELL-TEST.AFF, SCHEMA-SNIPPET-TYPE.XML, STOPTYPES-1.TXT, STOPWORDSWRONGENCODING.TXT, SCHEMA-NUMERIC.XML, SOLRCONFIG-TRANSFORMERS.XML, SOLRCONFIG-PROPINJECT.XML, BAD-SCHEMA-NOT-INDEXED-BUT-TF.XML, SOLRCONFIG-SIMPLELOCK.XML, WDFTYPES.TXT, STOPTYPES-2.TXT, SCHEMA-REVERSED.XML, BAD-SCHEMA-CURRENCY-FT-MULTIVALUED.XML, SOLRCONFIG-SPELLCHECKCOMPONENT.XML, SOLRCONFIG-PHRASESUGGEST.XML, SCHEMA-DFR.XML, BAD-SCHEMA-CURRENCY-MULTIVALUED.XML, BAD-SCHEMA-NOT-INDEXED-BUT-POS.XML, KEEP-1.TXT, OPEN-EXCHANGE-RATES.JSON, SCHEMA-SPATIAL.XML, STOPWITHBOM.TXT, SCHEMA-BINARYFIELD.XML, SOLRCONFIG-SPELLCHECKER.XML, SOLRCONFIG-UPDATE-PROCESSOR-CHAINS.XML, BAD-SCHEMA-OMIT-TF-BUT-NOT-POS.XML, BAD-SCHEMA-DUP-FIELDTYPE.XML, SCHEMA-XINCLUDE.XML, SOLRCONFIG-MASTER1.XML, SYNONYMS.TXT, BAD-SCHEMA-CURRENCY-DYNAMIC-MULTIVALUED.XML, SCHEMA_CODEC.XML, SCHEMA.XML, SOLRCONFIG-SOLR-749.XML, SOLRCONFIG-MASTER1-KEEPONEBACKUP.XML, SOLRCONFIG-FUNCTIONQUERY.XML, STOP-2.TXT, SOLRCONFIG-TERMINDEX.XML, SCHEMA-LMDIRICHLET.XML, SOLRCONFIG-ELEVATE.XML, STOPWORDS.TXT, SCHEMA-FOLDING.XML, SCHEMA-STOP-KEEP.XML, BAD-SCHEMA-NOT-INDEXED-BUT-NORMS.XML, SOLRCONFIG-SOLCOREPROPERTIES.XML, STOP-1.TXT, SOLRCONFIG-MASTER2.XML, SCHEMA-SPELLCHECKER.XML, SOLRCONFIG-RESPONSE-LOG-COMPONENT.XML, SOLRCONFIG-LAZYWRITER.XML, SCHEMA-LUCENEMATCHVERSION.XML, FRENCHARTICLES.TXT, BAD-MP-SOLRCONFIG.XML, SCHEMA15.XML, SOLRCONFIG-REQHANDLER.INCL, SCHEMASURROUND.XML, SCHEMA-COLLATEFILTER.XML, SOLRCONFIG-MASTER3.XML, HUNSPELL-TEST.DIC, BAD-SCHEMA-CODEC-GLOBAL-VS-FT-MISMATCH.XML, SOLRCONFIG-XINCLUDE.XML, SOLRCONFIG-DELPOLICY1.XML, SOLRCONFIG-SLAVE1.XML, SCHEMA-SIM.XML, SCHEMA-SNIPPET-FIELD.XML, SCHEMA-COLLATE.XML, STOP-SNOWBALL.TXT, BAD-SCHEMA-SIM-GLOBAL-VS-FT-MISMATCH.XML, PROTWORDS.TXT, SCHEMA-TRIE.XML, SOLRCONFIG_CODEC.XML, BAD-SOLRCONFIG-INVALID-SCRIPTFILE.XML, JASUGGEST.TXT, SCHEMA-TFIDF.XML, SOLRCONFIG-SCRIPT-UPDATEPROCESSOR.XML, SCHEMA-LMJELINEKMERCER.XML, PHRASESUGGEST.TXT, BAD-SOLRCONFIG-MISSING-SCRIPTFILE.XML, SOLRCONFIG-BASIC-LUCENEVERSION31.XML, BAD-SCHEMA-UNIQUEKEY-USES-DEFAULT.XML, OLD_SYNONYMS.TXT, SOLRCONFIG-DELPOLICY2.XML, SOLRCONFIG-NATIVELOCK.XML, XSLT, BAD-SCHEMA-DUP-FIELD.XML, SOLRCONFIG-NOCACHE.XML, SCHEMA-BM25.XML, ADDFIELDS.UPDATEPROCESSOR.JS, SOLRCONFIG-ALTDIRECTORY.XML, SOLRCONFIG-QUERYSENDER-NOQUERY.XML, COMPOUNDDICTIONARY.TXT, SOLRCONFIG-INDEXCONFIG.XML, SOLRCONFIG_PERF.XML, BAD-SCHEMA-ANALYZER-CLASS-AND-NESTED.XML, SCHEMA-NOT-REQUIRED-UNIQUE-KEY.XML, KEEP-2.TXT, BAD-SCHEMA-UNIQUEKEY-IS-COPYFIELD-DEST.XML, SCHEMA12.XML, MAPPING-ISOLATIN1ACCENT.TXT, BAD_SOLRCONFIG.XML, BAD-SCHEMA-EXTERNAL-FILEFIELD.XML]
[junit4:junit4]   2> 10814 T10 oass.SolrIndexSearcher.<init> Opening Searcher@1d9dbdc4 main
[junit4:junit4]   2> 10814 T10 oass.SolrIndexSearcher.getIndexDir WARNING WARNING: Directory impl does not support setting indexDir: org.apache.lucene.store.MockDirectoryWrapper
[junit4:junit4]   2> 10815 T10 oasu.CommitTracker.<init> Hard AutoCommit: disabled
[junit4:junit4]   2> 10815 T10 oasu.CommitTracker.<init> Soft AutoCommit: disabled
[junit4:junit4]   2> 10816 T10 oashc.SpellCheckComponent.inform Initializing spell checkers
[junit4:junit4]   2> 10823 T10 oass.DirectSolrSpellChecker.init init: {name=direct,classname=DirectSolrSpellChecker,field=lowerfilt,minQueryLength=3}
[junit4:junit4]   2> 10863 T10 oashc.HttpShardHandlerFactory.getParameter Setting socketTimeout to: 0
[junit4:junit4]   2> 10864 T10 oashc.HttpShardHandlerFactory.getParameter Setting urlScheme to: http://
[junit4:junit4]   2> 10864 T10 oashc.HttpShardHandlerFactory.getParameter Setting connTimeout to: 0
[junit4:junit4]   2> 10865 T10 oashc.HttpShardHandlerFactory.getParameter Setting maxConnectionsPerHost to: 20
[junit4:junit4]   2> 10865 T10 oashc.HttpShardHandlerFactory.getParameter Setting corePoolSize to: 0
[junit4:junit4]   2> 10866 T10 oashc.HttpShardHandlerFactory.getParameter Setting maximumPoolSize to: 2147483647
[junit4:junit4]   2> 10866 T10 oashc.HttpShardHandlerFactory.getParameter Setting maxThreadIdleTime to: 5
[junit4:junit4]   2> 10866 T10 oashc.HttpShardHandlerFactory.getParameter Setting sizeOfQueue to: -1
[junit4:junit4]   2> 10867 T10 oashc.HttpShardHandlerFactory.getParameter Setting fairnessPolicy to: false
[junit4:junit4]   2> 10867 T10 oascsi.HttpClientUtil.createClient Creating new http client, config:maxConnectionsPerHost=20&maxConnections=10000&socketTimeout=0&connTimeout=0&retry=false
[junit4:junit4]   2> 10887 T14 oasc.JmxMonitoredMap$SolrDynamicMBean.getMBeanInfo WARNING Could not getStatistics on info bean org.apache.solr.search.SolrIndexSearcher org.apache.lucene.store.AlreadyClosedException: this IndexReader is closed
[junit4:junit4]   2> 	at org.apache.lucene.index.IndexReader.ensureOpen(IndexReader.java:252)
[junit4:junit4]   2> 	at org.apache.lucene.index.StandardDirectoryReader.getVersion(StandardDirectoryReader.java:312)
[junit4:junit4]   2> 	at org.apache.solr.search.SolrIndexSearcher.getStatistics(SolrIndexSearcher.java:1991)
[junit4:junit4]   2> 	at org.apache.solr.core.JmxMonitoredMap$SolrDynamicMBean.getMBeanInfo(JmxMonitoredMap.java:231)
[junit4:junit4]   2> 	at com.sun.jmx.interceptor.DefaultMBeanServerInterceptor.getClassName(DefaultMBeanServerInterceptor.java:1824)
[junit4:junit4]   2> 	at com.sun.jmx.interceptor.DefaultMBeanServerInterceptor.safeGetClassName(DefaultMBeanServerInterceptor.java:1661)
[junit4:junit4]   2> 	at com.sun.jmx.interceptor.DefaultMBeanServerInterceptor.checkMBeanPermission(DefaultMBeanServerInterceptor.java:1833)
[junit4:junit4]   2> 	at com.sun.jmx.interceptor.DefaultMBeanServerInterceptor.exclusiveUnregisterMBean(DefaultMBeanServerInterceptor.java:436)
[junit4:junit4]   2> 	at com.sun.jmx.interceptor.DefaultMBeanServerInterceptor.unregisterMBean(DefaultMBeanServerInterceptor.java:421)
[junit4:junit4]   2> 	at com.sun.jmx.mbeanserver.JmxMBeanServer.unregisterMBean(JmxMBeanServer.java:540)
[junit4:junit4]   2> 	at org.apache.solr.core.JmxMonitoredMap.put(JmxMonitoredMap.java:138)
[junit4:junit4]   2> 	at org.apache.solr.core.JmxMonitoredMap.put(JmxMonitoredMap.java:51)
[junit4:junit4]   2> 	at org.apache.solr.search.SolrIndexSearcher.register(SolrIndexSearcher.java:242)
[junit4:junit4]   2> 	at org.apache.solr.core.SolrCore.registerSearcher(SolrCore.java:1691)
[junit4:junit4]   2> 	at org.apache.solr.core.SolrCore.access$000(SolrCore.java:124)
[junit4:junit4]   2> 	at org.apache.solr.core.SolrCore$7.call(SolrCore.java:1568)
[junit4:junit4]   2> 	at java.util.concurrent.FutureTask$Sync.innerRun(FutureTask.java:334)
[junit4:junit4]   2> 	at java.util.concurrent.FutureTask.run(FutureTask.java:166)
[junit4:junit4]   2> 	at java.util.concurrent.ThreadPoolExecutor.runWorker(ThreadPoolExecutor.java:1110)
[junit4:junit4]   2> 	at java.util.concurrent.ThreadPoolExecutor$Worker.run(ThreadPoolExecutor.java:603)
[junit4:junit4]   2> 	at java.lang.Thread.run(Thread.java:679)
[junit4:junit4]   2> 
[junit4:junit4]   2> 10899 T14 oasc.SolrCore.registerSearcher [collection1] Registered new searcher Searcher@1d9dbdc4 main{StandardDirectoryReader(segments_1:1)}
[junit4:junit4]   2> 10899 T10 oasc.CoreContainer.register registering core: collection1
[junit4:junit4]   2> 10907 T10 oasu.AbstractSolrTestCase.setUp ####SETUP_END testSoftAndHardCommitMaxTimeDelete
[junit4:junit4]   2> ASYNC  NEW_CORE C1 name=collection1 org.apache.solr.core.SolrCore@3c9ce70
[junit4:junit4]   2> 10918 T10 C1 oasc.SolrDeletionPolicy.onInit SolrDeletionPolicy.onInit: commits:num=1
[junit4:junit4]   2> 		commit{dir=MockDirWrapper(NRTCachingDirectory(org.apache.lucene.store.RAMDirectory@36101d01 lockFactory=org.apache.lucene.store.NativeFSLockFactory@7481933a; maxCacheMB=0.599609375 maxMergeSizeMB=0.0322265625)),segFN=segments_1,generation=1,filenames=[segments_1]
[junit4:junit4]   2> 10919 T10 C1 oasc.SolrDeletionPolicy.updateCommits newest commit = 1
[junit4:junit4]   2> 10922 T10 C1 UPDATE [collection1] webapp=null path=null params={} {add=[529]} 0 7
[junit4:junit4]   2> 10936 T10 C1 oasu.DirectUpdateHandler2.commit start commit{flags=0,_version_=0,optimize=false,openSearcher=true,waitSearcher=true,expungeDeletes=false,softCommit=false}
[junit4:junit4]   2> 10942 T10 C1 oasc.SolrDeletionPolicy.onCommit SolrDeletionPolicy.onCommit: commits:num=2
[junit4:junit4]   2> 		commit{dir=MockDirWrapper(NRTCachingDirectory(org.apache.lucene.store.RAMDirectory@36101d01 lockFactory=org.apache.lucene.store.NativeFSLockFactory@7481933a; maxCacheMB=0.599609375 maxMergeSizeMB=0.0322265625)),segFN=segments_1,generation=1,filenames=[segments_1]
[junit4:junit4]   2> 		commit{dir=MockDirWrapper(NRTCachingDirectory(org.apache.lucene.store.RAMDirectory@36101d01 lockFactory=org.apache.lucene.store.NativeFSLockFactory@7481933a; maxCacheMB=0.599609375 maxMergeSizeMB=0.0322265625)),segFN=segments_2,generation=2,filenames=[_0.fnm, _0.pos, _0.tim, _0_nrm.cfe, segments_2, _0.fdx, _0_nrm.cfs, _0.si, _0.doc, _0.tip, _0.fdt]
[junit4:junit4]   2> 10942 T10 C1 oasc.SolrDeletionPolicy.updateCommits newest commit = 2
[junit4:junit4]   2> 10950 T10 C1 oass.SolrIndexSearcher.<init> Opening Searcher@9dd1752 main
[junit4:junit4]   2> 10950 T10 C1 oass.SolrIndexSearcher.getIndexDir WARNING WARNING: Directory impl does not support setting indexDir: org.apache.lucene.store.MockDirectoryWrapper
[junit4:junit4]   2> 10951 T10 C1 oasu.DirectUpdateHandler2.commit end_commit_flush
[junit4:junit4]   2> 10956 T14 oasc.SolrCore.registerSearcher [collection1] Registered new searcher Searcher@9dd1752 main{StandardDirectoryReader(segments_2:3 _0(4.1):C1)}
[junit4:junit4]   2> 10958 T10 C1 UPDATE [collection1] webapp=null path=null params={} {commit=} 0 22
[junit4:junit4]   2> 10967 T10 C1 UPDATE [collection1] webapp=null path=null params={} {delete=[529]} 0 3
[junit4:junit4]   2> 11469 T16 oasu.DirectUpdateHandler2.commit start commit{flags=0,_version_=0,optimize=false,openSearcher=true,waitSearcher=true,expungeDeletes=false,softCommit=true}
[junit4:junit4]   2> 11534 T16 oass.SolrIndexSearcher.<init> Opening Searcher@4332b67c main
[junit4:junit4]   2> 11535 T16 oass.SolrIndexSearcher.getIndexDir WARNING WARNING: Directory impl does not support setting indexDir: org.apache.lucene.store.MockDirectoryWrapper
[junit4:junit4]   2> 11535 T16 oasu.DirectUpdateHandler2.commit end_commit_flush
[junit4:junit4]   2> 11541 T14 oasc.SolrCore.registerSearcher [collection1] Registered new searcher Searcher@4332b67c main{StandardDirectoryReader(segments_2:5:nrt)}
[junit4:junit4]   2> 11545 T10 C1 UPDATE [collection1] webapp=null path=null params={} {add=[550]} 0 4
[junit4:junit4]   2> 12046 T16 oasu.DirectUpdateHandler2.commit start commit{flags=0,_version_=0,optimize=false,openSearcher=true,waitSearcher=true,expungeDeletes=false,softCommit=true}
[junit4:junit4]   2> 12055 T16 oass.SolrIndexSearcher.<init> Opening Searcher@2143ed74 main
[junit4:junit4]   2> 12056 T16 oass.SolrIndexSearcher.getIndexDir WARNING WARNING: Directory impl does not support setting indexDir: org.apache.lucene.store.MockDirectoryWrapper
[junit4:junit4]   2> 12057 T16 oasu.DirectUpdateHandler2.commit end_commit_flush
[junit4:junit4]   2> 12061 T14 oasc.SolrCore.registerSearcher [collection1] Registered new searcher Searcher@2143ed74 main{StandardDirectoryReader(segments_2:7:nrt _1(4.1):C1)}
[junit4:junit4]   2> 12169 T15 oasu.DirectUpdateHandler2.commit start commit{flags=0,_version_=0,optimize=false,openSearcher=true,waitSearcher=true,expungeDeletes=false,softCommit=false}
[junit4:junit4]   2> 12171 T15 oasc.SolrDeletionPolicy.onCommit SolrDeletionPolicy.onCommit: commits:num=2
[junit4:junit4]   2> 		commit{dir=MockDirWrapper(NRTCachingDirectory(org.apache.lucene.store.RAMDirectory@36101d01 lockFactory=org.apache.lucene.store.NativeFSLockFactory@7481933a; maxCacheMB=0.599609375 maxMergeSizeMB=0.0322265625)),segFN=segments_2,generation=2,filenames=[_0.fnm, _0.pos, _0.tim, _0_nrm.cfe, segments_2, _0.fdx, _0_nrm.cfs, _0.si, _0.doc, _0.tip, _0.fdt]
[junit4:junit4]   2> 		commit{dir=MockDirWrapper(NRTCachingDirectory(org.apache.lucene.store.RAMDirectory@36101d01 lockFactory=org.apache.lucene.store.NativeFSLockFactory@7481933a; maxCacheMB=0.599609375 maxMergeSizeMB=0.0322265625)),segFN=segments_3,generation=3,filenames=[_1.doc, _1.fdx, _1_nrm.cfs, _1.fdt, _1.pos, _1.si, _1.tip, _1.fnm, _1.tim, segments_3, _1_nrm.cfe]
[junit4:junit4]   2> 12172 T15 oasc.SolrDeletionPolicy.updateCommits newest commit = 3
[junit4:junit4]   2> 12173 T15 oass.SolrIndexSearcher.<init> Opening Searcher@29565e9d main
[junit4:junit4]   2> 12174 T15 oass.SolrIndexSearcher.getIndexDir WARNING WARNING: Directory impl does not support setting indexDir: org.apache.lucene.store.MockDirectoryWrapper
[junit4:junit4]   2> 12175 T15 oasu.DirectUpdateHandler2.commit end_commit_flush
[junit4:junit4]   2> 12182 T14 oasc.SolrCore.registerSearcher [collection1] Registered new searcher Searcher@29565e9d main{StandardDirectoryReader(segments_2:7:nrt _1(4.1):C1)}
[junit4:junit4]   2> 14174 T10 oasu.AbstractSolrTestCase.tearDown ####TEARDOWN_START testSoftAndHardCommitMaxTimeDelete
[junit4:junit4]   2> 14175 T10 oasc.CoreContainer.shutdown Shutting down CoreContainer instance=138126577
[junit4:junit4]   2> 14175 T10 oasc.SolrCore.close [collection1]  CLOSING SolrCore org.apache.solr.core.SolrCore@3c9ce70
[junit4:junit4]   2> 14203 T10 oasu.DirectUpdateHandler2.close closing DirectUpdateHandler2{commits=4,autocommit maxTime=1200ms,autocommits=1,soft autocommit maxTime=500ms,soft autocommits=2,optimizes=0,rollbacks=0,expungeDeletes=0,docsPending=0,adds=0,deletesById=0,deletesByQuery=0,errors=0,cumulative_adds=2,cumulative_deletesById=1,cumulative_deletesByQuery=0,cumulative_errors=0}
[junit4:junit4]   2> 14204 T10 oasc.SolrCore.decrefSolrCoreState Closing SolrCoreState
[junit4:junit4]   2> 14205 T10 oasu.DefaultSolrCoreState.closeIndexWriter SolrCoreState ref count has reached 0 - closing IndexWriter
[junit4:junit4]   2> 14205 T10 oasu.DefaultSolrCoreState.closeIndexWriter closing IndexWriter with IndexWriterCloser
[junit4:junit4]   2> 14207 T10 oasc.SolrCore.closeSearcher [collection1] Closing main searcher on request.
[junit4:junit4]   2> 14236 T10 oasu.AbstractSolrTestCase.setUp ####SETUP_START testSoftAndHardCommitMaxTimeMixedAdds
[junit4:junit4]   2> 14238 T10 oasc.SolrResourceLoader.<init> new SolrResourceLoader for directory: '/usr/home/hudson/hudson-slave/workspace/Lucene-Solr-NightlyTests-4.x/solr/build/solr-core/test-files/solr/collection1/'
[junit4:junit4]   2> 14240 T10 oasc.SolrResourceLoader.replaceClassLoader Adding 'file:/usr/home/hudson/hudson-slave/workspace/Lucene-Solr-NightlyTests-4.x/solr/build/solr-core/test-files/solr/collection1/lib/README' to classloader
[junit4:junit4]   2> 14241 T10 oasc.SolrResourceLoader.replaceClassLoader Adding 'file:/usr/home/hudson/hudson-slave/workspace/Lucene-Solr-NightlyTests-4.x/solr/build/solr-core/test-files/solr/collection1/lib/classes/' to classloader
[junit4:junit4]   2> 14379 T10 oasc.SolrConfig.<init> Using Lucene MatchVersion: LUCENE_41
[junit4:junit4]   2> 14469 T10 oasc.SolrConfig.<init> Loaded SolrConfig: solrconfig.xml
[junit4:junit4]   2> 14470 T10 oass.IndexSchema.readSchema Reading Solr Schema
[junit4:junit4]   2> 14524 T10 oass.IndexSchema.readSchema Schema name=test
[junit4:junit4]   2> 15155 T10 oass.OpenExchangeRatesOrgProvider.init Initialized with rates=open-exchange-rates.json, refreshInterval=1440.
[junit4:junit4]   2> 15166 T10 oass.IndexSchema.readSchema default search field in schema is text
[junit4:junit4]   2> 15170 T10 oass.IndexSchema.readSchema unique key field: id
[junit4:junit4]   2> 15187 T10 oass.FileExchangeRateProvider.reload Reloading exchange rates from file currency.xml
[junit4:junit4]   2> 15192 T10 oass.FileExchangeRateProvider.reload Reloading exchange rates from file currency.xml
[junit4:junit4]   2> 15196 T10 oass.OpenExchangeRatesOrgProvider.reload Reloading exchange rates from open-exchange-rates.json
[junit4:junit4]   2> 15198 T10 oass.OpenExchangeRatesOrgProvider.reload Reloading exchange rates from open-exchange-rates.json
[junit4:junit4]   2> 15200 T10 oasc.SolrResourceLoader.locateSolrHome JNDI not configured for solr (NoInitialContextEx)
[junit4:junit4]   2> 15201 T10 oasc.SolrResourceLoader.locateSolrHome using system property solr.solr.home: /usr/home/hudson/hudson-slave/workspace/Lucene-Solr-NightlyTests-4.x/solr/build/solr-core/test-files/solr
[junit4:junit4]   2> 15201 T10 oasc.SolrResourceLoader.<init> new SolrResourceLoader for directory: '/usr/home/hudson/hudson-slave/workspace/Lucene-Solr-NightlyTests-4.x/solr/build/solr-core/test-files/solr/'
[junit4:junit4]   2> 15210 T10 oasc.CoreContainer.<init> New CoreContainer 254773892
[junit4:junit4]   2> 15211 T10 oasc.SolrCore.<init> [collection1] Opening new SolrCore at /usr/home/hudson/hudson-slave/workspace/Lucene-Solr-NightlyTests-4.x/solr/build/solr-core/test-files/solr/collection1/, dataDir=/usr/home/hudson/hudson-slave/workspace/Lucene-Solr-NightlyTests-4.x/solr/build/solr-core/test/J1/./org.apache.solr.update.SoftAutoCommitTest-1350860501918/
[junit4:junit4]   2> 15211 T10 oasc.JmxMonitoredMap.<init> JMX monitoring is enabled. Adding Solr mbeans to JMX Server: com.sun.jmx.mbeanserver.JmxMBeanServer@109b2a51
[junit4:junit4]   2> 15212 T10 oasc.SolrCore.getNewIndexDir New index directory detected: old=null new=/usr/home/hudson/hudson-slave/workspace/Lucene-Solr-NightlyTests-4.x/solr/build/solr-core/test/J1/./org.apache.solr.update.SoftAutoCommitTest-1350860501918/index/
[junit4:junit4]   2> 15213 T10 oasc.SolrCore.initIndex WARNING [collection1] Solr index directory '/usr/home/hudson/hudson-slave/workspace/Lucene-Solr-NightlyTests-4.x/solr/build/solr-core/test/J1/./org.apache.solr.update.SoftAutoCommitTest-1350860501918/index' doesn't exist. Creating new index...
[junit4:junit4]   2> 15213 T10 oasc.CachingDirectoryFactory.get return new directory for /usr/home/hudson/hudson-slave/workspace/Lucene-Solr-NightlyTests-4.x/solr/build/solr-core/test/J1/./org.apache.solr.update.SoftAutoCommitTest-1350860501918/index forceNew:false
[junit4:junit4]   2> 15215 T10 oasc.SolrDeletionPolicy.onCommit SolrDeletionPolicy.onCommit: commits:num=1
[junit4:junit4]   2> 		commit{dir=BaseDirectoryWrapper(org.apache.lucene.store.RAMDirectory@1d7aaa0e lockFactory=org.apache.lucene.store.NativeFSLockFactory@1695ef17),segFN=segments_1,generation=1,filenames=[segments_1]
[junit4:junit4]   2> 15216 T10 oasc.SolrDeletionPolicy.updateCommits newest commit = 1
[junit4:junit4]   2> 15216 T10 oasc.SolrCore.initWriters created xml: solr.XMLResponseWriter
[junit4:junit4]   2> 15218 T10 oasup.UpdateRequestProcessorChain.init inserting DistributedUpdateProcessorFactory into updateRequestProcessorChain "dedupe"
[junit4:junit4]   2> 15219 T10 oasup.UpdateRequestProcessorChain.init inserting DistributedUpdateProcessorFactory into updateRequestProcessorChain "dedupe-allfields"
[junit4:junit4]   2> 15219 T10 oasup.UpdateRequestProcessorChain.init inserting DistributedUpdateProcessorFactory into updateRequestProcessorChain "stored_sig"
[junit4:junit4]   2> 15221 T10 oasup.UpdateRequestProcessorChain.init inserting DistributedUpdateProcessorFactory into updateRequestProcessorChain "uniq-fields"
[junit4:junit4]   2> 15222 T10 oasup.UpdateRequestProcessorChain.init inserting DistributedUpdateProcessorFactory into updateRequestProcessorChain "distrib-dup-test-chain-implicit"
[junit4:junit4]   2> 15222 T10 oasc.RequestHandlers.initHandlersFromConfig adding lazy requestHandler: solr.ReplicationHandler
[junit4:junit4]   2> 15223 T10 oasc.RequestHandlers.initHandlersFromConfig created /replication: solr.ReplicationHandler
[junit4:junit4]   2> 15223 T10 oasc.RequestHandlers.initHandlersFromConfig created standard: solr.StandardRequestHandler
[junit4:junit4]   2> 15224 T10 oasc.RequestHandlers.initHandlersFromConfig created /get: solr.RealTimeGetHandler
[junit4:junit4]   2> 15225 T10 oasc.RequestHandlers.initHandlersFromConfig created dismax: solr.SearchHandler
[junit4:junit4]   2> 15225 T10 oasc.RequestHandlers.initHandlersFromConfig created mock: org.apache.solr.core.MockQuerySenderListenerReqHandler
[junit4:junit4]   2> 15226 T10 oasc.RequestHandlers.initHandlersFromConfig created /admin/: org.apache.solr.handler.admin.AdminHandlers
[junit4:junit4]   2> 15227 T10 oasc.RequestHandlers.initHandlersFromConfig created defaults: solr.StandardRequestHandler
[junit4:junit4]   2> 15227 T10 oasc.RequestHandlers.initHandlersFromConfig adding lazy requestHandler: solr.StandardRequestHandler
[junit4:junit4]   2> 15228 T10 oasc.RequestHandlers.initHandlersFromConfig created lazy: solr.StandardRequestHandler
[junit4:junit4]   2> 15228 T10 oasc.RequestHandlers.initHandlersFromConfig created /update: solr.UpdateRequestHandler
[junit4:junit4]   2> 15229 T10 oasc.RequestHandlers.initHandlersFromConfig created /terms: org.apache.solr.handler.component.SearchHandler
[junit4:junit4]   2> 15229 T10 oasc.RequestHandlers.initHandlersFromConfig created spellCheckCompRH: org.apache.solr.handler.component.SearchHandler
[junit4:junit4]   2> 15230 T10 oasc.RequestHandlers.initHandlersFromConfig created spellCheckCompRH_Direct: org.apache.solr.handler.component.SearchHandler
[junit4:junit4]   2> 15231 T10 oasc.RequestHandlers.initHandlersFromConfig created spellCheckWithWordbreak: org.apache.solr.handler.component.SearchHandler
[junit4:junit4]   2> 15232 T10 oasc.RequestHandlers.initHandlersFromConfig created spellCheckWithWordbreak_Direct: org.apache.solr.handler.component.SearchHandler
[junit4:junit4]   2> 15232 T10 oasc.RequestHandlers.initHandlersFromConfig created spellCheckCompRH1: org.apache.solr.handler.component.SearchHandler
[junit4:junit4]   2> 15233 T10 oasc.RequestHandlers.initHandlersFromConfig created tvrh: org.apache.solr.handler.component.SearchHandler
[junit4:junit4]   2> 15233 T10 oasc.RequestHandlers.initHandlersFromConfig created /mlt: solr.MoreLikeThisHandler
[junit4:junit4]   2> 15234 T10 oasc.RequestHandlers.initHandlersFromConfig created /debug/dump: solr.DumpRequestHandler
[junit4:junit4]   2> 15240 T10 oashl.XMLLoader.init xsltCacheLifetimeSeconds=60
[junit4:junit4]   2> 15244 T10 oasc.SolrCore.initDeprecatedSupport WARNING solrconfig.xml uses deprecated <admin/gettableFiles>, Please update your config to use the ShowFileRequestHandler.
[junit4:junit4]   2> 15245 T10 oasc.SolrCore.initDeprecatedSupport WARNING adding ShowFileRequestHandler with hidden files: [THROW.ERROR.ON.ADD.UPDATEPROCESSOR.JS, SOLRCONFIG-HIGHLIGHT.XML, SCHEMA-REQUIRED-FIELDS.XML, SCHEMA-MINIMAL.XML, SCHEMA-REPLICATION2.XML, TRIVIAL.UPDATEPROCESSOR1.JS, BAD-SCHEMA-DUP-DYNAMICFIELD.XML, SOLRCONFIG-CACHING.XML, SOLRCONFIG-REPEATER.XML, BAD-SCHEMA-NONTEXT-ANALYZER.XML, SOLRCONFIG-MERGEPOLICY.XML, CURRENCY.XML, SOLRCONFIG-TLOG.XML, SOLRCONFIG-MASTER.XML, BAD-SCHEMA-UNIQUEKEY-MULTIVALUED.XML, SCHEMA11.XML, SOLRCONFIG-BASIC.XML, DA_COMPOUNDDICTIONARY.TXT, MISSLEADING.EXTENSION.UPDATEPROCESSOR.JS.TXT, SCHEMA-COPYFIELD-TEST.XML, SOLRCONFIG-SLAVE.XML, ELEVATE.XML, SOLRCONFIG-PROPINJECT-INDEXDEFAULT.XML, TRIVIAL.UPDATEPROCESSOR0.JS, BAD-SOLRCONFIG-BOGUS-SCRIPTENGINE-NAME.XML, SCHEMA-CHARFILTERS.XML, SCHEMA-IB.XML, SOLRCONFIG-QUERYSENDER.XML, SCHEMA-REPLICATION1.XML, SOLRCONFIG-SNIPPET-PROCESSOR.XML, DA_UTF8.XML, CONDITIONAL.UPDATEPROCESSOR.JS, MISSING.FUNCTIONS.UPDATEPROCESSOR.JS, SOLRCONFIG-ENABLEPLUGIN.XML, HYPHENATION.DTD, STEMDICT.TXT, SCHEMA-PHRASESUGGEST.XML, HUNSPELL-TEST.AFF, SCHEMA-SNIPPET-TYPE.XML, STOPTYPES-1.TXT, STOPWORDSWRONGENCODING.TXT, SCHEMA-NUMERIC.XML, SOLRCONFIG-TRANSFORMERS.XML, SOLRCONFIG-PROPINJECT.XML, BAD-SCHEMA-NOT-INDEXED-BUT-TF.XML, SOLRCONFIG-SIMPLELOCK.XML, WDFTYPES.TXT, STOPTYPES-2.TXT, SCHEMA-REVERSED.XML, BAD-SCHEMA-CURRENCY-FT-MULTIVALUED.XML, SOLRCONFIG-SPELLCHECKCOMPONENT.XML, SOLRCONFIG-PHRASESUGGEST.XML, SCHEMA-DFR.XML, BAD-SCHEMA-CURRENCY-MULTIVALUED.XML, BAD-SCHEMA-NOT-INDEXED-BUT-POS.XML, KEEP-1.TXT, OPEN-EXCHANGE-RATES.JSON, SCHEMA-SPATIAL.XML, STOPWITHBOM.TXT, SCHEMA-BINARYFIELD.XML, SOLRCONFIG-SPELLCHECKER.XML, SOLRCONFIG-UPDATE-PROCESSOR-CHAINS.XML, BAD-SCHEMA-OMIT-TF-BUT-NOT-POS.XML, BAD-SCHEMA-DUP-FIELDTYPE.XML, SCHEMA-XINCLUDE.XML, SOLRCONFIG-MASTER1.XML, SYNONYMS.TXT, BAD-SCHEMA-CURRENCY-DYNAMIC-MULTIVALUED.XML, SCHEMA_CODEC.XML, SCHEMA.XML, SOLRCONFIG-SOLR-749.XML, SOLRCONFIG-MASTER1-KEEPONEBACKUP.XML, SOLRCONFIG-FUNCTIONQUERY.XML, STOP-2.TXT, SOLRCONFIG-TERMINDEX.XML, SCHEMA-LMDIRICHLET.XML, SOLRCONFIG-ELEVATE.XML, STOPWORDS.TXT, SCHEMA-FOLDING.XML, SCHEMA-STOP-KEEP.XML, BAD-SCHEMA-NOT-INDEXED-BUT-NORMS.XML, SOLRCONFIG-SOLCOREPROPERTIES.XML, STOP-1.TXT, SOLRCONFIG-MASTER2.XML, SCHEMA-SPELLCHECKER.XML, SOLRCONFIG-RESPONSE-LOG-COMPONENT.XML, SOLRCONFIG-LAZYWRITER.XML, SCHEMA-LUCENEMATCHVERSION.XML, FRENCHARTICLES.TXT, BAD-MP-SOLRCONFIG.XML, SCHEMA15.XML, SOLRCONFIG-REQHANDLER.INCL, SCHEMASURROUND.XML, SCHEMA-COLLATEFILTER.XML, SOLRCONFIG-MASTER3.XML, HUNSPELL-TEST.DIC, BAD-SCHEMA-CODEC-GLOBAL-VS-FT-MISMATCH.XML, SOLRCONFIG-XINCLUDE.XML, SOLRCONFIG-DELPOLICY1.XML, SOLRCONFIG-SLAVE1.XML, SCHEMA-SIM.XML, SCHEMA-SNIPPET-FIELD.XML, SCHEMA-COLLATE.XML, STOP-SNOWBALL.TXT, BAD-SCHEMA-SIM-GLOBAL-VS-FT-MISMATCH.XML, PROTWORDS.TXT, SCHEMA-TRIE.XML, SOLRCONFIG_CODEC.XML, BAD-SOLRCONFIG-INVALID-SCRIPTFILE.XML, JASUGGEST.TXT, SCHEMA-TFIDF.XML, SOLRCONFIG-SCRIPT-UPDATEPROCESSOR.XML, SCHEMA-LMJELINEKMERCER.XML, PHRASESUGGEST.TXT, BAD-SOLRCONFIG-MISSING-SCRIPTFILE.XML, SOLRCONFIG-BASIC-LUCENEVERSION31.XML, BAD-SCHEMA-UNIQUEKEY-USES-DEFAULT.XML, OLD_SYNONYMS.TXT, SOLRCONFIG-DELPOLICY2.XML, SOLRCONFIG-NATIVELOCK.XML, XSLT, BAD-SCHEMA-DUP-FIELD.XML, SOLRCONFIG-NOCACHE.XML, SCHEMA-BM25.XML, ADDFIELDS.UPDATEPROCESSOR.JS, SOLRCONFIG-ALTDIRECTORY.XML, SOLRCONFIG-QUERYSENDER-NOQUERY.XML, COMPOUNDDICTIONARY.TXT, SOLRCONFIG-INDEXCONFIG.XML, SOLRCONFIG_PERF.XML, BAD-SCHEMA-ANALYZER-CLASS-AND-NESTED.XML, SCHEMA-NOT-REQUIRED-UNIQUE-KEY.XML, KEEP-2.TXT, BAD-SCHEMA-UNIQUEKEY-IS-COPYFIELD-DEST.XML, SCHEMA12.XML, MAPPING-ISOLATIN1ACCENT.TXT, BAD_SOLRCONFIG.XML, BAD-SCHEMA-EXTERNAL-FILEFIELD.XML]
[junit4:junit4]   2> 15248 T10 oass.SolrIndexSearcher.<init> Opening Searcher@71d0e17a main
[junit4:junit4]   2> 15249 T10 oass.SolrIndexSearcher.getIndexDir WARNING WARNING: Directory impl does not support setting indexDir: org.apache.lucene.store.BaseDirectoryWrapper
[junit4:junit4]   2> 15250 T10 oasu.CommitTracker.<init> Hard AutoCommit: disabled
[junit4:junit4]   2> 15250 T10 oasu.CommitTracker.<init> Soft AutoCommit: disabled
[junit4:junit4]   2> 15251 T10 oashc.SpellCheckComponent.inform Initializing spell checkers
[junit4:junit4]   2> 15258 T10 oass.DirectSolrSpellChecker.init init: {name=direct,classname=DirectSolrSpellChecker,field=lowerfilt,minQueryLength=3}
[junit4:junit4]   2> 15313 T10 oashc.HttpShardHandlerFactory.getParameter Setting socketTimeout to: 0
[junit4:junit4]   2> 15314 T10 oashc.HttpShardHandlerFactory.getParameter Setting urlScheme to: http://
[junit4:junit4]   2> 15314 T10 oashc.HttpShardHandlerFactory.getParameter Setting connTimeout to: 0
[junit4:junit4]   2> 15315 T10 oashc.HttpShardHandlerFactory.getParameter Setting maxConnectionsPerHost to: 20
[junit4:junit4]   2> 15315 T10 oashc.HttpShardHandlerFactory.getParameter Setting corePoolSize to: 0
[junit4:junit4]   2> 15316 T10 oashc.HttpShardHandlerFactory.getParameter Setting maximumPoolSize to: 2147483647
[junit4:junit4]   2> 15316 T10 oashc.HttpShardHandlerFactory.getParameter Setting maxThreadIdleTime to: 5
[junit4:junit4]   2> 15316 T10 oashc.HttpShardHandlerFactory.getParameter Setting sizeOfQueue to: -1
[junit4:junit4]   2> 15317 T10 oashc.HttpShardHandlerFactory.getParameter Setting fairnessPolicy to: false
[junit4:junit4]   2> 15317 T10 oascsi.HttpClientUtil.createClient Creating new http client, config:maxConnectionsPerHost=20&maxConnections=10000&socketTimeout=0&connTimeout=0&retry=false
[junit4:junit4]   2> 15331 T17 oasc.SolrCore.registerSearcher [collection1] Registered new searcher Searcher@71d0e17a main{StandardDirectoryReader(segments_1:1)}
[junit4:junit4]   2> 15338 T10 oasc.CoreContainer.register registering core: collection1
[junit4:junit4]   2> 15342 T10 oasu.AbstractSolrTestCase.setUp ####SETUP_END testSoftAndHardCommitMaxTimeMixedAdds
[junit4:junit4]   2> ASYNC  NEW_CORE C2 name=collection1 org.apache.solr.core.SolrCore@7a2ee7e5
[junit4:junit4]   2> 15351 T10 C2 oasc.SolrDeletionPolicy.onInit SolrDeletionPolicy.onInit: commits:num=1
[junit4:junit4]   2> 		commit{dir=BaseDirectoryWrapper(org.apache.lucene.store.RAMDirectory@1d7aaa0e lockFactory=org.apache.lucene.store.NativeFSLockFactory@1695ef17),segFN=segments_1,generation=1,filenames=[segments_1]
[junit4:junit4]   2> 15352 T10 C2 oasc.SolrDeletionPolicy.updateCommits newest commit = 1
[junit4:junit4]   2> 15355 T10 C2 UPDATE [collection1] webapp=null path=null params={} {add=[529]} 0 5
[junit4:junit4]   2> 15856 T19 oasu.DirectUpdateHandler2.commit start commit{flags=0,_version_=0,optimize=false,openSearcher=true,waitSearcher=true,expungeDeletes=false,softCommit=true}
[junit4:junit4]   2> 15861 T19 oass.SolrIndexSearcher.<init> Opening Searcher@448be1c9 main
[junit4:junit4]   2> 15861 T19 oass.SolrIndexSearcher.getIndexDir WARNING WARNING: Directory impl does not support setting indexDir: org.apache.lucene.store.BaseDirectoryWrapper
[junit4:junit4]   2> 15862 T19 oasu.DirectUpdateHandler2.commit end_commit_flush
[junit4:junit4]   2> 15865 T17 oasc.SolrCore.registerSearcher [collection1] Registered new searcher Searcher@448be1c9 main{StandardDirectoryReader(segments_1:3:nrt _0(4.1):C1)}
[junit4:junit4]   2> 15868 T10 C2 UPDATE [collection1] webapp=null path=null params={} {add=[530]} 0 2
[junit4:junit4]   2> 16369 T19 oasu.DirectUpdateHandler2.commit start commit{flags=0,_version_=0,optimize=false,openSearcher=true,waitSearcher=true,expungeDeletes=false,softCommit=true}
[junit4:junit4]   2> 16381 T19 oass.SolrIndexSearcher.<init> Opening Searcher@5efcc13d main
[junit4:junit4]   2> 16381 T19 oass.SolrIndexSearcher.getIndexDir WARNING WARNING: Directory impl does not support setting indexDir: org.apache.lucene.store.BaseDirectoryWrapper
[junit4:junit4]   2> 16382 T19 oasu.DirectUpdateHandler2.commit end_commit_flush
[junit4:junit4]   2> 16385 T17 oasc.SolrCore.registerSearcher [collection1] Registered new searcher Searcher@5efcc13d main{StandardDirectoryReader(segments_1:5:nrt _0(4.1):C1 _1(4.1):C1)}
[junit4:junit4]   2> 16556 T18 oasu.DirectUpdateHandler2.commit start commit{flags=0,_version_=0,optimize=false,openSearcher=true,waitSearcher=true,expungeDeletes=false,softCommit=false}
[junit4:junit4]   2> 16557 T18 oasc.SolrDeletionPolicy.onCommit SolrDeletionPolicy.onCommit: commits:num=2
[junit4:junit4]   2> 		commit{dir=BaseDirectoryWrapper(org.apache.lucene.store.RAMDirectory@1d7aaa0e lockFactory=org.apache.lucene.store.NativeFSLockFactory@1695ef17),segFN=segments_1,generation=1,filenames=[segments_1]
[junit4:junit4]   2> 		commit{dir=BaseDirectoryWrapper(org.apache.lucene.store.RAMDirectory@1d7aaa0e lockFactory=org.apache.lucene.store.NativeFSLockFactory@1695ef17),segFN=segments_2,generation=2,filenames=[_1.doc, _1_nrm.cfs, _0.fnm, _0_nrm.cfs, _1.fnm, _1_nrm.cfe, _1.fdx, _1.fdt, _1.pos, _0.pos, _1.si, _0_nrm.cfe, _0.tim, segments_2, _0.fdx, _0.si, _1.tip, _0.tip, _0.doc, _1.tim, _0.fdt]
[junit4:junit4]   2> 16557 T18 oasc.SolrDeletionPolicy.updateCommits newest commit = 2
[junit4:junit4]   2> 16558 T18 oass.SolrIndexSearcher.<init> Opening Searcher@11767553 main
[junit4:junit4]   2> 16558 T18 oass.SolrIndexSearcher.getIndexDir WARNING WARNING: Directory impl does not support setting indexDir: org.apache.lucene.store.BaseDirectoryWrapper
[junit4:junit4]   2> 16559 T18 oasu.DirectUpdateHandler2.commit end_commit_flush
[junit4:junit4]   2> 16561 T17 oasc.SolrCore.registerSearcher [collection1] Registered new searcher Searcher@11767553 main{StandardDirectoryReader(segments_1:5:nrt _0(4.1):C1 _1(4.1):C1)}
[junit4:junit4]   2> 19760 T10 oasu.AbstractSolrTestCase.tearDown ####TEARDOWN_START testSoftAndHardCommitMaxTimeMixedAdds
[junit4:junit4]   2> 19761 T10 oasc.CoreContainer.shutdown Shutting down CoreContainer instance=254773892
[junit4:junit4]   2> 19761 T10 oasc.SolrCore.close [collection1]  CLOSING SolrCore org.apache.solr.core.SolrCore@7a2ee7e5
[junit4:junit4]   2> 19786 T10 oasu.DirectUpdateHandler2.close closing DirectUpdateHandler2{commits=3,autocommit maxTime=1200ms,autocommits=1,soft autocommit maxTime=500ms,soft autocommits=2,optimizes=0,rollbacks=0,expungeDeletes=0,docsPending=0,adds=0,deletesById=0,deletesByQuery=0,errors=0,cumulative_adds=2,cumulative_deletesById=0,cumulative_deletesByQuery=0,cumulative_errors=0}
[junit4:junit4]   2> 19787 T10 oasc.SolrCore.decrefSolrCoreState Closing SolrCoreState
[junit4:junit4]   2> 19787 T10 oasu.DefaultSolrCoreState.closeIndexWriter SolrCoreState ref count has reached 0 - closing IndexWriter
[junit4:junit4]   2> 19788 T10 oasu.DefaultSolrCoreState.closeIndexWriter closing IndexWriter with IndexWriterCloser
[junit4:junit4]   2> 19789 T10 oasc.SolrCore.closeSearcher [collection1] Closing main searcher on request.
[junit4:junit4]   2> NOTE: test params are: codec=Asserting, sim=RandomSimilarityProvider(queryNorm=true,coord=no): {}, locale=mk, timezone=Europe/Minsk
[junit4:junit4]   2> NOTE: FreeBSD 9.0-RELEASE amd64/Sun Microsystems Inc. 1.6.0_32 (64-bit)/cpus=16,threads=1,free=118854304,total=138149888
[junit4:junit4]   2> NOTE: All tests run in this JVM: [SoftAutoCommitTest]
[junit4:junit4] Completed on J1 in 21.97s, 3 tests, 1 failure <<< FAILURES!

[...truncated 730 lines...]
BUILD FAILED
/usr/home/hudson/hudson-slave/workspace/Lucene-Solr-NightlyTests-4.x/build.xml:335: The following error occurred while executing this line:
/usr/home/hudson/hudson-slave/workspace/Lucene-Solr-NightlyTests-4.x/build.xml:39: The following error occurred while executing this line:
/usr/home/hudson/hudson-slave/workspace/Lucene-Solr-NightlyTests-4.x/solr/build.xml:178: The following error occurred while executing this line:
/usr/home/hudson/hudson-slave/workspace/Lucene-Solr-NightlyTests-4.x/lucene/module-build.xml:61: The following error occurred while executing this line:
/usr/home/hudson/hudson-slave/workspace/Lucene-Solr-NightlyTests-4.x/lucene/common-build.xml:1170: The following error occurred while executing this line:
/usr/home/hudson/hudson-slave/workspace/Lucene-Solr-NightlyTests-4.x/lucene/common-build.xml:838: There were test failures: 233 suites, 964 tests, 1 failure, 21 ignored (3 assumptions)

Total time: 66 minutes 33 seconds
Build step 'Invoke Ant' marked build as failure
Archiving artifacts
Recording test results
Email was triggered for: Failure
Sending email for trigger: Failure



Mime
View raw message