lucene-dev mailing list archives

Site index · List index
Message view « Date » · « Thread »
Top « Date » · « Thread »
From Policeman Jenkins Server <jenk...@sd-datasolutions.de>
Subject [JENKINS] Lucene-Solr-4.x-Windows (64bit/jdk1.6.0_35) - Build # 1352 - Failure!
Date Mon, 29 Oct 2012 15:41:31 GMT
Build: http://jenkins.sd-datasolutions.de/job/Lucene-Solr-4.x-Windows/1352/
Java: 64bit/jdk1.6.0_35 -XX:+UseSerialGC

3 tests failed.
FAILED:  junit.framework.TestSuite.org.apache.solr.cloud.ClusterStateUpdateTest

Error Message:
ERROR: SolrIndexSearcher opens=5 closes=4

Stack Trace:
java.lang.AssertionError: ERROR: SolrIndexSearcher opens=5 closes=4
	at __randomizedtesting.SeedInfo.seed([6E49186C5E68A6F9]:0)
	at org.junit.Assert.fail(Assert.java:93)
	at org.apache.solr.SolrTestCaseJ4.endTrackingSearchers(SolrTestCaseJ4.java:242)
	at org.apache.solr.SolrTestCaseJ4.afterClass(SolrTestCaseJ4.java:97)
	at sun.reflect.GeneratedMethodAccessor19.invoke(Unknown Source)
	at sun.reflect.DelegatingMethodAccessorImpl.invoke(DelegatingMethodAccessorImpl.java:25)
	at java.lang.reflect.Method.invoke(Method.java:597)
	at com.carrotsearch.randomizedtesting.RandomizedRunner.invoke(RandomizedRunner.java:1559)
	at com.carrotsearch.randomizedtesting.RandomizedRunner.access$600(RandomizedRunner.java:79)
	at com.carrotsearch.randomizedtesting.RandomizedRunner$5.evaluate(RandomizedRunner.java:700)
	at com.carrotsearch.randomizedtesting.rules.StatementAdapter.evaluate(StatementAdapter.java:36)
	at com.carrotsearch.randomizedtesting.rules.SystemPropertiesRestoreRule$1.evaluate(SystemPropertiesRestoreRule.java:53)
	at org.apache.lucene.util.AbstractBeforeAfterRule$1.evaluate(AbstractBeforeAfterRule.java:45)
	at org.apache.lucene.util.TestRuleStoreClassName$1.evaluate(TestRuleStoreClassName.java:42)
	at com.carrotsearch.randomizedtesting.rules.SystemPropertiesInvariantRule$1.evaluate(SystemPropertiesInvariantRule.java:55)
	at com.carrotsearch.randomizedtesting.rules.NoShadowingOrOverridesOnMethodsRule$1.evaluate(NoShadowingOrOverridesOnMethodsRule.java:39)
	at com.carrotsearch.randomizedtesting.rules.NoShadowingOrOverridesOnMethodsRule$1.evaluate(NoShadowingOrOverridesOnMethodsRule.java:39)
	at com.carrotsearch.randomizedtesting.rules.StatementAdapter.evaluate(StatementAdapter.java:36)
	at org.apache.lucene.util.TestRuleAssertionsRequired$1.evaluate(TestRuleAssertionsRequired.java:43)
	at org.apache.lucene.util.TestRuleMarkFailure$1.evaluate(TestRuleMarkFailure.java:48)
	at org.apache.lucene.util.TestRuleIgnoreAfterMaxFailures$1.evaluate(TestRuleIgnoreAfterMaxFailures.java:70)
	at org.apache.lucene.util.TestRuleIgnoreTestSuites$1.evaluate(TestRuleIgnoreTestSuites.java:55)
	at com.carrotsearch.randomizedtesting.rules.StatementAdapter.evaluate(StatementAdapter.java:36)
	at com.carrotsearch.randomizedtesting.ThreadLeakControl$StatementRunner.run(ThreadLeakControl.java:358)
	at java.lang.Thread.run(Thread.java:662)


FAILED:  junit.framework.TestSuite.org.apache.solr.cloud.ClusterStateUpdateTest

Error Message:
1 thread leaked from SUITE scope at org.apache.solr.cloud.ClusterStateUpdateTest:     1) Thread[id=1333, name=searcherExecutor-759-thread-1, state=WAITING, group=TGRP-ClusterStateUpdateTest]         at sun.misc.Unsafe.park(Native Method)         at java.util.concurrent.locks.LockSupport.park(LockSupport.java:156)         at java.util.concurrent.locks.AbstractQueuedSynchronizer$ConditionObject.await(AbstractQueuedSynchronizer.java:1987)         at java.util.concurrent.LinkedBlockingQueue.take(LinkedBlockingQueue.java:399)         at java.util.concurrent.ThreadPoolExecutor.getTask(ThreadPoolExecutor.java:947)         at java.util.concurrent.ThreadPoolExecutor$Worker.run(ThreadPoolExecutor.java:907)         at java.lang.Thread.run(Thread.java:662)

Stack Trace:
com.carrotsearch.randomizedtesting.ThreadLeakError: 1 thread leaked from SUITE scope at org.apache.solr.cloud.ClusterStateUpdateTest: 
   1) Thread[id=1333, name=searcherExecutor-759-thread-1, state=WAITING, group=TGRP-ClusterStateUpdateTest]
        at sun.misc.Unsafe.park(Native Method)
        at java.util.concurrent.locks.LockSupport.park(LockSupport.java:156)
        at java.util.concurrent.locks.AbstractQueuedSynchronizer$ConditionObject.await(AbstractQueuedSynchronizer.java:1987)
        at java.util.concurrent.LinkedBlockingQueue.take(LinkedBlockingQueue.java:399)
        at java.util.concurrent.ThreadPoolExecutor.getTask(ThreadPoolExecutor.java:947)
        at java.util.concurrent.ThreadPoolExecutor$Worker.run(ThreadPoolExecutor.java:907)
        at java.lang.Thread.run(Thread.java:662)
	at __randomizedtesting.SeedInfo.seed([6E49186C5E68A6F9]:0)


FAILED:  junit.framework.TestSuite.org.apache.solr.cloud.ClusterStateUpdateTest

Error Message:
There are still zombie threads that couldn't be terminated:    1) Thread[id=1333, name=searcherExecutor-759-thread-1, state=WAITING, group=TGRP-ClusterStateUpdateTest]         at sun.misc.Unsafe.park(Native Method)         at java.util.concurrent.locks.LockSupport.park(LockSupport.java:156)         at java.util.concurrent.locks.AbstractQueuedSynchronizer$ConditionObject.await(AbstractQueuedSynchronizer.java:1987)         at java.util.concurrent.LinkedBlockingQueue.take(LinkedBlockingQueue.java:399)         at java.util.concurrent.ThreadPoolExecutor.getTask(ThreadPoolExecutor.java:947)         at java.util.concurrent.ThreadPoolExecutor$Worker.run(ThreadPoolExecutor.java:907)         at java.lang.Thread.run(Thread.java:662)

Stack Trace:
com.carrotsearch.randomizedtesting.ThreadLeakError: There are still zombie threads that couldn't be terminated:
   1) Thread[id=1333, name=searcherExecutor-759-thread-1, state=WAITING, group=TGRP-ClusterStateUpdateTest]
        at sun.misc.Unsafe.park(Native Method)
        at java.util.concurrent.locks.LockSupport.park(LockSupport.java:156)
        at java.util.concurrent.locks.AbstractQueuedSynchronizer$ConditionObject.await(AbstractQueuedSynchronizer.java:1987)
        at java.util.concurrent.LinkedBlockingQueue.take(LinkedBlockingQueue.java:399)
        at java.util.concurrent.ThreadPoolExecutor.getTask(ThreadPoolExecutor.java:947)
        at java.util.concurrent.ThreadPoolExecutor$Worker.run(ThreadPoolExecutor.java:907)
        at java.lang.Thread.run(Thread.java:662)
	at __randomizedtesting.SeedInfo.seed([6E49186C5E68A6F9]:0)




Build Log:
[...truncated 7928 lines...]
[junit4:junit4] Suite: org.apache.solr.cloud.ClusterStateUpdateTest
[junit4:junit4]   2> 2 T1313 oas.SolrTestCaseJ4.setUp ###Starting testCoreRegistration
[junit4:junit4]   2> Creating dataDir: C:\Users\JenkinsSlave\workspace\Lucene-Solr-4.x-Windows\solr\build\solr-core\test\J0\.\solrtest-ClusterStateUpdateTest-1351525033833
[junit4:junit4]   2> 4 T1313 oasc.ZkTestServer.run STARTING ZK TEST SERVER
[junit4:junit4]   2> 8 T1314 oazs.ZooKeeperServer.setTickTime tickTime set to 1000
[junit4:junit4]   2> 9 T1314 oazs.NIOServerCnxn$Factory.<init> binding to port 0.0.0.0/0.0.0.0:0
[junit4:junit4]   2> 11 T1314 oazsp.FileTxnSnapLog.save Snapshotting: 0
[junit4:junit4]   2> 114 T1313 oasc.ZkTestServer.run start zk server on port:53543
[junit4:junit4]   2> 114 T1313 oaz.ZooKeeper.<init> Initiating client connection, connectString=127.0.0.1:53543 sessionTimeout=10000 watcher=org.apache.solr.common.cloud.ConnectionManager@763c80e8
[junit4:junit4]   2> 115 T1319 oaz.ClientCnxn$SendThread.startConnect Opening socket connection to server /127.0.0.1:53543
[junit4:junit4]   2> 115 T1313 oascc.ConnectionManager.waitForConnected Waiting for client to connect to ZooKeeper
[junit4:junit4]   2> 117 T1319 oaz.ClientCnxn$SendThread.primeConnection Socket connection established to 127.0.0.1/127.0.0.1:53543, initiating session
[junit4:junit4]   2> 118 T1315 oazs.NIOServerCnxn$Factory.run Accepted socket connection from /127.0.0.1:53546
[junit4:junit4]   2> 118 T1315 oazs.NIOServerCnxn.readConnectRequest Client attempting to establish new session at /127.0.0.1:53546
[junit4:junit4]   2> 119 T1317 oazsp.FileTxnLog.append Creating new log file: log.1
[junit4:junit4]   2> 131 T1319 oaz.ClientCnxn$SendThread.readConnectResult Session establishment complete on server 127.0.0.1/127.0.0.1:53543, sessionid = 0x13aad2b67730000, negotiated timeout = 10000
[junit4:junit4]   2> 131 T1317 oazs.NIOServerCnxn.finishSessionInit Established session 0x13aad2b67730000 with negotiated timeout 10000 for client /127.0.0.1:53546
[junit4:junit4]   2> 132 T1320 oascc.ConnectionManager.process Watcher org.apache.solr.common.cloud.ConnectionManager@763c80e8 name:ZooKeeperConnection Watcher:127.0.0.1:53543 got event WatchedEvent state:SyncConnected type:None path:null path:null type:None
[junit4:junit4]   2> 132 T1313 oascc.ConnectionManager.waitForConnected Client is connected to ZooKeeper
[junit4:junit4]   2> 132 T1313 oascc.SolrZkClient.makePath makePath: /solr
[junit4:junit4]   2> 138 T1318 oazs.PrepRequestProcessor.pRequest Processed session termination for sessionid: 0x13aad2b67730000
[junit4:junit4]   2> 139 T1320 oaz.ClientCnxn$EventThread.run EventThread shut down
[junit4:junit4]   2> 139 T1313 oaz.ZooKeeper.close Session: 0x13aad2b67730000 closed
[junit4:junit4]   2> 140 T1315 oazs.NIOServerCnxn.doIO WARNING EndOfStreamException: Unable to read additional data from client sessionid 0x13aad2b67730000, likely client has closed socket
[junit4:junit4]   2> 140 T1313 oaz.ZooKeeper.<init> Initiating client connection, connectString=127.0.0.1:53543/solr sessionTimeout=10000 watcher=org.apache.solr.common.cloud.ConnectionManager@49be5273
[junit4:junit4]   2> 146 T1315 oazs.NIOServerCnxn.closeSock Closed socket connection for client /127.0.0.1:53546 which had sessionid 0x13aad2b67730000
[junit4:junit4]   2> 147 T1313 oascc.ConnectionManager.waitForConnected Waiting for client to connect to ZooKeeper
[junit4:junit4]   2> 147 T1321 oaz.ClientCnxn$SendThread.startConnect Opening socket connection to server /127.0.0.1:53543
[junit4:junit4]   2> 148 T1321 oaz.ClientCnxn$SendThread.primeConnection Socket connection established to 127.0.0.1/127.0.0.1:53543, initiating session
[junit4:junit4]   2> 148 T1315 oazs.NIOServerCnxn$Factory.run Accepted socket connection from /127.0.0.1:53549
[junit4:junit4]   2> 149 T1315 oazs.NIOServerCnxn.readConnectRequest Client attempting to establish new session at /127.0.0.1:53549
[junit4:junit4]   2> 151 T1317 oazs.NIOServerCnxn.finishSessionInit Established session 0x13aad2b67730001 with negotiated timeout 10000 for client /127.0.0.1:53549
[junit4:junit4]   2> 151 T1321 oaz.ClientCnxn$SendThread.readConnectResult Session establishment complete on server 127.0.0.1/127.0.0.1:53543, sessionid = 0x13aad2b67730001, negotiated timeout = 10000
[junit4:junit4]   2> 151 T1322 oascc.ConnectionManager.process Watcher org.apache.solr.common.cloud.ConnectionManager@49be5273 name:ZooKeeperConnection Watcher:127.0.0.1:53543/solr got event WatchedEvent state:SyncConnected type:None path:null path:null type:None
[junit4:junit4]   2> 151 T1313 oascc.ConnectionManager.waitForConnected Client is connected to ZooKeeper
[junit4:junit4]   2> 152 T1313 oascc.SolrZkClient.makePath makePath: /collections/collection1
[junit4:junit4]   2> 158 T1313 oascc.SolrZkClient.makePath makePath: /collections/collection1/shards
[junit4:junit4]   2> 163 T1313 oascc.SolrZkClient.makePath makePath: /collections/control_collection
[junit4:junit4]   2> 168 T1313 oascc.SolrZkClient.makePath makePath: /collections/control_collection/shards
[junit4:junit4]   2> 172 T1313 oasc.AbstractZkTestCase.putConfig put C:\Users\JenkinsSlave\workspace\Lucene-Solr-4.x-Windows\solr\build\solr-core\test-files\solr\collection1\conf\solrconfig.xml to /configs/conf1/solrconfig.xml
[junit4:junit4]   2> 173 T1313 oascc.SolrZkClient.makePath makePath: /configs/conf1/solrconfig.xml
[junit4:junit4]   2> 181 T1313 oasc.AbstractZkTestCase.putConfig put C:\Users\JenkinsSlave\workspace\Lucene-Solr-4.x-Windows\solr\build\solr-core\test-files\solr\collection1\conf\schema.xml to /configs/conf1/schema.xml
[junit4:junit4]   2> 183 T1313 oascc.SolrZkClient.makePath makePath: /configs/conf1/schema.xml
[junit4:junit4]   2> 190 T1313 oasc.AbstractZkTestCase.putConfig put C:\Users\JenkinsSlave\workspace\Lucene-Solr-4.x-Windows\solr\build\solr-core\test-files\solr\collection1\conf\solrconfig.xml to /configs/conf1/solrconfig.xml
[junit4:junit4]   2> 190 T1313 oascc.SolrZkClient.makePath makePath: /configs/conf1/solrconfig.xml
[junit4:junit4]   2> 196 T1313 oasc.AbstractZkTestCase.putConfig put C:\Users\JenkinsSlave\workspace\Lucene-Solr-4.x-Windows\solr\build\solr-core\test-files\solr\collection1\conf\stopwords.txt to /configs/conf1/stopwords.txt
[junit4:junit4]   2> 197 T1313 oascc.SolrZkClient.makePath makePath: /configs/conf1/stopwords.txt
[junit4:junit4]   2> 201 T1313 oasc.AbstractZkTestCase.putConfig put C:\Users\JenkinsSlave\workspace\Lucene-Solr-4.x-Windows\solr\build\solr-core\test-files\solr\collection1\conf\protwords.txt to /configs/conf1/protwords.txt
[junit4:junit4]   2> 202 T1313 oascc.SolrZkClient.makePath makePath: /configs/conf1/protwords.txt
[junit4:junit4]   2> 207 T1313 oasc.AbstractZkTestCase.putConfig put C:\Users\JenkinsSlave\workspace\Lucene-Solr-4.x-Windows\solr\build\solr-core\test-files\solr\collection1\conf\currency.xml to /configs/conf1/currency.xml
[junit4:junit4]   2> 207 T1313 oascc.SolrZkClient.makePath makePath: /configs/conf1/currency.xml
[junit4:junit4]   2> 213 T1313 oasc.AbstractZkTestCase.putConfig put C:\Users\JenkinsSlave\workspace\Lucene-Solr-4.x-Windows\solr\build\solr-core\test-files\solr\collection1\conf\open-exchange-rates.json to /configs/conf1/open-exchange-rates.json
[junit4:junit4]   2> 214 T1313 oascc.SolrZkClient.makePath makePath: /configs/conf1/open-exchange-rates.json
[junit4:junit4]   2> 218 T1313 oasc.AbstractZkTestCase.putConfig put C:\Users\JenkinsSlave\workspace\Lucene-Solr-4.x-Windows\solr\build\solr-core\test-files\solr\collection1\conf\mapping-ISOLatin1Accent.txt to /configs/conf1/mapping-ISOLatin1Accent.txt
[junit4:junit4]   2> 218 T1313 oascc.SolrZkClient.makePath makePath: /configs/conf1/mapping-ISOLatin1Accent.txt
[junit4:junit4]   2> 223 T1313 oasc.AbstractZkTestCase.putConfig put C:\Users\JenkinsSlave\workspace\Lucene-Solr-4.x-Windows\solr\build\solr-core\test-files\solr\collection1\conf\old_synonyms.txt to /configs/conf1/old_synonyms.txt
[junit4:junit4]   2> 223 T1313 oascc.SolrZkClient.makePath makePath: /configs/conf1/old_synonyms.txt
[junit4:junit4]   2> 228 T1313 oasc.AbstractZkTestCase.putConfig put C:\Users\JenkinsSlave\workspace\Lucene-Solr-4.x-Windows\solr\build\solr-core\test-files\solr\collection1\conf\synonyms.txt to /configs/conf1/synonyms.txt
[junit4:junit4]   2> 228 T1313 oascc.SolrZkClient.makePath makePath: /configs/conf1/synonyms.txt
[junit4:junit4]   2> 233 T1318 oazs.PrepRequestProcessor.pRequest Processed session termination for sessionid: 0x13aad2b67730001
[junit4:junit4]   2> 234 T1322 oaz.ClientCnxn$EventThread.run EventThread shut down
[junit4:junit4]   2> 234 T1313 oaz.ZooKeeper.close Session: 0x13aad2b67730001 closed
[junit4:junit4]   2> 235 T1315 oazs.NIOServerCnxn.doIO WARNING EndOfStreamException: Unable to read additional data from client sessionid 0x13aad2b67730001, likely client has closed socket
[junit4:junit4]   2> 235 T1313 oasc.ClusterStateUpdateTest.setUp ####SETUP_START testCoreRegistration
[junit4:junit4]   2> 235 T1315 oazs.NIOServerCnxn.closeSock Closed socket connection for client /127.0.0.1:53549 which had sessionid 0x13aad2b67730001
[junit4:junit4]   2> 241 T1313 oasc.SolrResourceLoader.locateSolrHome JNDI not configured for solr (NoInitialContextEx)
[junit4:junit4]   2> 242 T1313 oasc.SolrResourceLoader.locateSolrHome using system property solr.solr.home: C:\Users\JenkinsSlave\workspace\Lucene-Solr-4.x-Windows\solr\build\solr-core\test-files\solr
[junit4:junit4]   2> 242 T1313 oasc.CoreContainer$Initializer.initialize looking for solr.xml: C:\Users\JenkinsSlave\workspace\Lucene-Solr-4.x-Windows\solr\build\solr-core\test-files\solr\solr.xml
[junit4:junit4]   2> 242 T1313 oasc.CoreContainer.<init> New CoreContainer 2141047751
[junit4:junit4]   2> 243 T1313 oasc.CoreContainer.load Loading CoreContainer using Solr Home: 'C:\Users\JenkinsSlave\workspace\Lucene-Solr-4.x-Windows\solr\build\solr-core\test-files\solr\'
[junit4:junit4]   2> 244 T1313 oasc.SolrResourceLoader.<init> new SolrResourceLoader for directory: 'C:\Users\JenkinsSlave\workspace\Lucene-Solr-4.x-Windows\solr\build\solr-core\test-files\solr\'
[junit4:junit4]   2> 295 T1313 oasc.CoreContainer.load Registering Log Listener
[junit4:junit4]   2> 326 T1313 oasc.CoreContainer.initZooKeeper Zookeeper client=127.0.0.1:53543/solr
[junit4:junit4]   2> 326 T1313 oaz.ZooKeeper.<init> Initiating client connection, connectString=127.0.0.1:53543/solr sessionTimeout=3000 watcher=org.apache.solr.common.cloud.ConnectionManager@39abc43f
[junit4:junit4]   2> 328 T1313 oascc.ConnectionManager.waitForConnected Waiting for client to connect to ZooKeeper
[junit4:junit4]   2> 328 T1323 oaz.ClientCnxn$SendThread.startConnect Opening socket connection to server /127.0.0.1:53543
[junit4:junit4]   2> 330 T1323 oaz.ClientCnxn$SendThread.primeConnection Socket connection established to 127.0.0.1/127.0.0.1:53543, initiating session
[junit4:junit4]   2> 330 T1315 oazs.NIOServerCnxn$Factory.run Accepted socket connection from /127.0.0.1:53552
[junit4:junit4]   2> 330 T1315 oazs.NIOServerCnxn.readConnectRequest Client attempting to establish new session at /127.0.0.1:53552
[junit4:junit4]   2> 336 T1317 oazs.NIOServerCnxn.finishSessionInit Established session 0x13aad2b67730002 with negotiated timeout 3000 for client /127.0.0.1:53552
[junit4:junit4]   2> 336 T1323 oaz.ClientCnxn$SendThread.readConnectResult Session establishment complete on server 127.0.0.1/127.0.0.1:53543, sessionid = 0x13aad2b67730002, negotiated timeout = 3000
[junit4:junit4]   2> 336 T1324 oascc.ConnectionManager.process Watcher org.apache.solr.common.cloud.ConnectionManager@39abc43f name:ZooKeeperConnection Watcher:127.0.0.1:53543/solr got event WatchedEvent state:SyncConnected type:None path:null path:null type:None
[junit4:junit4]   2> 337 T1313 oascc.ConnectionManager.waitForConnected Client is connected to ZooKeeper
[junit4:junit4]   2> 340 T1318 oazs.PrepRequestProcessor.pRequest Got user-level KeeperException when processing sessionid:0x13aad2b67730002 type:create cxid:0x2 zxid:0xfffffffffffffffe txntype:unknown reqpath:n/a Error Path:/solr/overseer Error:KeeperErrorCode = NodeExists for /solr/overseer
[junit4:junit4]   2> 342 T1313 oascc.SolrZkClient.makePath makePath: /live_nodes
[junit4:junit4]   2> 347 T1313 oasc.ZkController.createEphemeralLiveNode Register node as live in ZooKeeper:/live_nodes/127.0.0.1:1661_solr
[junit4:junit4]   2> 350 T1318 oazs.PrepRequestProcessor.pRequest Got user-level KeeperException when processing sessionid:0x13aad2b67730002 type:delete cxid:0x7 zxid:0xfffffffffffffffe txntype:unknown reqpath:n/a Error Path:/solr/live_nodes/127.0.0.1:1661_solr Error:KeeperErrorCode = NoNode for /solr/live_nodes/127.0.0.1:1661_solr
[junit4:junit4]   2> 353 T1313 oascc.SolrZkClient.makePath makePath: /live_nodes/127.0.0.1:1661_solr
[junit4:junit4]   2> 358 T1313 oashc.HttpShardHandlerFactory.getParameter Setting socketTimeout to: 0
[junit4:junit4]   2> 359 T1313 oashc.HttpShardHandlerFactory.getParameter Setting urlScheme to: http://
[junit4:junit4]   2> 359 T1313 oashc.HttpShardHandlerFactory.getParameter Setting connTimeout to: 0
[junit4:junit4]   2> 359 T1313 oashc.HttpShardHandlerFactory.getParameter Setting maxConnectionsPerHost to: 20
[junit4:junit4]   2> 359 T1313 oashc.HttpShardHandlerFactory.getParameter Setting corePoolSize to: 0
[junit4:junit4]   2> 361 T1313 oashc.HttpShardHandlerFactory.getParameter Setting maximumPoolSize to: 2147483647
[junit4:junit4]   2> 361 T1313 oashc.HttpShardHandlerFactory.getParameter Setting maxThreadIdleTime to: 5
[junit4:junit4]   2> 361 T1313 oashc.HttpShardHandlerFactory.getParameter Setting sizeOfQueue to: -1
[junit4:junit4]   2> 361 T1313 oashc.HttpShardHandlerFactory.getParameter Setting fairnessPolicy to: false
[junit4:junit4]   2> 362 T1313 oascsi.HttpClientUtil.createClient Creating new http client, config:maxConnectionsPerHost=20&maxConnections=10000&socketTimeout=0&connTimeout=0&retry=false
[junit4:junit4]   2> 374 T1313 oascc.SolrZkClient.makePath makePath: /overseer_elect/election
[junit4:junit4]   2> 402 T1318 oazs.PrepRequestProcessor.pRequest Got user-level KeeperException when processing sessionid:0x13aad2b67730002 type:delete cxid:0x15 zxid:0xfffffffffffffffe txntype:unknown reqpath:n/a Error Path:/solr/overseer_elect/leader Error:KeeperErrorCode = NoNode for /solr/overseer_elect/leader
[junit4:junit4]   2> 403 T1313 oascc.SolrZkClient.makePath makePath: /overseer_elect/leader
[junit4:junit4]   2> 408 T1313 oasc.Overseer.start Overseer (id=88573544617934850-127.0.0.1:1661_solr-n_0000000000) starting
[junit4:junit4]   2> 409 T1318 oazs.PrepRequestProcessor.pRequest Got user-level KeeperException when processing sessionid:0x13aad2b67730002 type:create cxid:0x1a zxid:0xfffffffffffffffe txntype:unknown reqpath:n/a Error Path:/solr/overseer Error:KeeperErrorCode = NodeExists for /solr/overseer
[junit4:junit4]   2> 411 T1318 oazs.PrepRequestProcessor.pRequest Got user-level KeeperException when processing sessionid:0x13aad2b67730002 type:create cxid:0x1b zxid:0xfffffffffffffffe txntype:unknown reqpath:n/a Error Path:/solr/overseer Error:KeeperErrorCode = NodeExists for /solr/overseer
[junit4:junit4]   2> 413 T1318 oazs.PrepRequestProcessor.pRequest Got user-level KeeperException when processing sessionid:0x13aad2b67730002 type:create cxid:0x1c zxid:0xfffffffffffffffe txntype:unknown reqpath:n/a Error Path:/solr/overseer Error:KeeperErrorCode = NodeExists for /solr/overseer
[junit4:junit4]   2> 415 T1318 oazs.PrepRequestProcessor.pRequest Got user-level KeeperException when processing sessionid:0x13aad2b67730002 type:create cxid:0x1d zxid:0xfffffffffffffffe txntype:unknown reqpath:n/a Error Path:/solr/overseer Error:KeeperErrorCode = NodeExists for /solr/overseer
[junit4:junit4]   2> 417 T1326 oasc.OverseerCollectionProcessor.run Process current queue of collection creations
[junit4:junit4]   2> 417 T1313 oascc.SolrZkClient.makePath makePath: /clusterstate.json
[junit4:junit4]   2> 421 T1313 oascc.ZkStateReader.createClusterStateWatchersAndUpdate Updating cluster state from ZooKeeper... 
[junit4:junit4]   2> 424 T1325 oasc.Overseer$ClusterStateUpdater.run Starting to work on the main queue
[junit4:junit4]   2> 432 T1313 oasc.CoreContainer.create Creating SolrCore 'collection1' using instanceDir: C:\Users\JenkinsSlave\workspace\Lucene-Solr-4.x-Windows\solr\build\solr-core\test-files\solr\collection1
[junit4:junit4]   2> 432 T1313 oasc.ZkController.createCollectionZkNode Check for collection zkNode:collection1
[junit4:junit4]   2> 433 T1313 oasc.ZkController.createCollectionZkNode Collection zkNode exists
[junit4:junit4]   2> 433 T1313 oasc.ZkController.readConfigName Load collection config from:/collections/collection1
[junit4:junit4]   2> 436 T1313 oasc.SolrResourceLoader.<init> new SolrResourceLoader for directory: 'C:\Users\JenkinsSlave\workspace\Lucene-Solr-4.x-Windows\solr\build\solr-core\test-files\solr\collection1\'
[junit4:junit4]   2> 438 T1313 oasc.SolrResourceLoader.replaceClassLoader Adding 'file:/C:/Users/JenkinsSlave/workspace/Lucene-Solr-4.x-Windows/solr/build/solr-core/test-files/solr/collection1/lib/classes/' to classloader
[junit4:junit4]   2> 440 T1313 oasc.SolrResourceLoader.replaceClassLoader Adding 'file:/C:/Users/JenkinsSlave/workspace/Lucene-Solr-4.x-Windows/solr/build/solr-core/test-files/solr/collection1/lib/README' to classloader
[junit4:junit4]   2> 509 T1313 oasc.SolrConfig.<init> Using Lucene MatchVersion: LUCENE_41
[junit4:junit4]   2> 612 T1313 oasc.SolrConfig.<init> Loaded SolrConfig: solrconfig.xml
[junit4:junit4]   2> 614 T1313 oass.IndexSchema.readSchema Reading Solr Schema
[junit4:junit4]   2> 619 T1313 oass.IndexSchema.readSchema Schema name=test
[junit4:junit4]   2> 1458 T1313 oass.OpenExchangeRatesOrgProvider.init Initialized with rates=open-exchange-rates.json, refreshInterval=1440.
[junit4:junit4]   2> 1472 T1313 oass.IndexSchema.readSchema default search field in schema is text
[junit4:junit4]   2> 1476 T1313 oass.IndexSchema.readSchema unique key field: id
[junit4:junit4]   2> 1492 T1313 oass.FileExchangeRateProvider.reload Reloading exchange rates from file currency.xml
[junit4:junit4]   2> 1496 T1313 oass.FileExchangeRateProvider.reload Reloading exchange rates from file currency.xml
[junit4:junit4]   2> 1500 T1313 oass.OpenExchangeRatesOrgProvider.reload Reloading exchange rates from open-exchange-rates.json
[junit4:junit4]   2> 1503 T1313 oass.OpenExchangeRatesOrgProvider.reload Reloading exchange rates from open-exchange-rates.json
[junit4:junit4]   2> 1504 T1313 oasc.SolrCore.<init> [collection1] Opening new SolrCore at C:\Users\JenkinsSlave\workspace\Lucene-Solr-4.x-Windows\solr\build\solr-core\test-files\solr\collection1\, dataDir=C:\Users\JenkinsSlave\workspace\Lucene-Solr-4.x-Windows\solr\build\solr-core\test\J0\.\solrtest-ClusterStateUpdateTest-1351525033833\data1\
[junit4:junit4]   2> 1504 T1313 oasc.JmxMonitoredMap.<init> JMX monitoring is enabled. Adding Solr mbeans to JMX Server: com.sun.jmx.mbeanserver.JmxMBeanServer@1766bfd8
[junit4:junit4]   2> 1505 T1313 oasc.SolrCore.getNewIndexDir New index directory detected: old=null new=C:\Users\JenkinsSlave\workspace\Lucene-Solr-4.x-Windows\solr\build\solr-core\test\J0\.\solrtest-ClusterStateUpdateTest-1351525033833\data1\index/
[junit4:junit4]   2> 1507 T1313 oasc.SolrCore.initIndex WARNING [collection1] Solr index directory 'C:\Users\JenkinsSlave\workspace\Lucene-Solr-4.x-Windows\solr\build\solr-core\test\J0\.\solrtest-ClusterStateUpdateTest-1351525033833\data1\index' doesn't exist. Creating new index...
[junit4:junit4]   2> 1512 T1313 oasc.CachingDirectoryFactory.get return new directory for C:\Users\JenkinsSlave\workspace\Lucene-Solr-4.x-Windows\solr\build\solr-core\test\J0\.\solrtest-ClusterStateUpdateTest-1351525033833\data1\index forceNew:false
[junit4:junit4]   2> 1515 T1313 oasc.SolrDeletionPolicy.onCommit SolrDeletionPolicy.onCommit: commits:num=1
[junit4:junit4]   2> 		commit{dir=MockDirWrapper(org.apache.lucene.store.RAMDirectory@1bbbfb71 lockFactory=org.apache.lucene.store.NativeFSLockFactory@770b39dc),segFN=segments_1,generation=1,filenames=[segments_1]
[junit4:junit4]   2> 1516 T1313 oasc.SolrDeletionPolicy.updateCommits newest commit = 1
[junit4:junit4]   2> 1516 T1313 oasc.SolrCore.initWriters created xml: solr.XMLResponseWriter
[junit4:junit4]   2> 1518 T1313 oasup.UpdateRequestProcessorChain.init inserting DistributedUpdateProcessorFactory into updateRequestProcessorChain "dedupe"
[junit4:junit4]   2> 1518 T1313 oasup.UpdateRequestProcessorChain.init inserting DistributedUpdateProcessorFactory into updateRequestProcessorChain "dedupe-allfields"
[junit4:junit4]   2> 1520 T1313 oasup.UpdateRequestProcessorChain.init inserting DistributedUpdateProcessorFactory into updateRequestProcessorChain "stored_sig"
[junit4:junit4]   2> 1520 T1313 oasup.UpdateRequestProcessorChain.init inserting DistributedUpdateProcessorFactory into updateRequestProcessorChain "uniq-fields"
[junit4:junit4]   2> 1521 T1313 oasup.UpdateRequestProcessorChain.init inserting DistributedUpdateProcessorFactory into updateRequestProcessorChain "distrib-dup-test-chain-implicit"
[junit4:junit4]   2> 1522 T1313 oasc.RequestHandlers.initHandlersFromConfig adding lazy requestHandler: solr.ReplicationHandler
[junit4:junit4]   2> 1522 T1313 oasc.RequestHandlers.initHandlersFromConfig created /replication: solr.ReplicationHandler
[junit4:junit4]   2> 1522 T1313 oasc.RequestHandlers.initHandlersFromConfig created standard: solr.StandardRequestHandler
[junit4:junit4]   2> 1523 T1313 oasc.RequestHandlers.initHandlersFromConfig created /get: solr.RealTimeGetHandler
[junit4:junit4]   2> 1523 T1313 oasc.RequestHandlers.initHandlersFromConfig created dismax: solr.SearchHandler
[junit4:junit4]   2> 1524 T1313 oasc.RequestHandlers.initHandlersFromConfig created mock: org.apache.solr.core.MockQuerySenderListenerReqHandler
[junit4:junit4]   2> 1524 T1313 oasc.RequestHandlers.initHandlersFromConfig created /admin/: org.apache.solr.handler.admin.AdminHandlers
[junit4:junit4]   2> 1525 T1313 oasc.RequestHandlers.initHandlersFromConfig created defaults: solr.StandardRequestHandler
[junit4:junit4]   2> 1525 T1313 oasc.RequestHandlers.initHandlersFromConfig adding lazy requestHandler: solr.StandardRequestHandler
[junit4:junit4]   2> 1525 T1313 oasc.RequestHandlers.initHandlersFromConfig created lazy: solr.StandardRequestHandler
[junit4:junit4]   2> 1526 T1313 oasc.RequestHandlers.initHandlersFromConfig created /update: solr.UpdateRequestHandler
[junit4:junit4]   2> 1526 T1313 oasc.RequestHandlers.initHandlersFromConfig created /terms: org.apache.solr.handler.component.SearchHandler
[junit4:junit4]   2> 1526 T1313 oasc.RequestHandlers.initHandlersFromConfig created spellCheckCompRH: org.apache.solr.handler.component.SearchHandler
[junit4:junit4]   2> 1527 T1313 oasc.RequestHandlers.initHandlersFromConfig created spellCheckCompRH_Direct: org.apache.solr.handler.component.SearchHandler
[junit4:junit4]   2> 1527 T1313 oasc.RequestHandlers.initHandlersFromConfig created spellCheckWithWordbreak: org.apache.solr.handler.component.SearchHandler
[junit4:junit4]   2> 1529 T1313 oasc.RequestHandlers.initHandlersFromConfig created spellCheckWithWordbreak_Direct: org.apache.solr.handler.component.SearchHandler
[junit4:junit4]   2> 1529 T1313 oasc.RequestHandlers.initHandlersFromConfig created spellCheckCompRH1: org.apache.solr.handler.component.SearchHandler
[junit4:junit4]   2> 1529 T1313 oasc.RequestHandlers.initHandlersFromConfig created tvrh: org.apache.solr.handler.component.SearchHandler
[junit4:junit4]   2> 1530 T1313 oasc.RequestHandlers.initHandlersFromConfig created /mlt: solr.MoreLikeThisHandler
[junit4:junit4]   2> 1530 T1313 oasc.RequestHandlers.initHandlersFromConfig created /debug/dump: solr.DumpRequestHandler
[junit4:junit4]   2> 1539 T1313 oashl.XMLLoader.init xsltCacheLifetimeSeconds=60
[junit4:junit4]   2> 1543 T1313 oasc.SolrCore.initDeprecatedSupport WARNING solrconfig.xml uses deprecated <admin/gettableFiles>, Please update your config to use the ShowFileRequestHandler.
[junit4:junit4]   2> 1544 T1313 oasc.SolrCore.initDeprecatedSupport WARNING adding ShowFileRequestHandler with hidden files: [SCHEMA.XML, OLD_SYNONYMS.TXT, STOPWORDS.TXT, PROTWORDS.TXT, OPEN-EXCHANGE-RATES.JSON, SYNONYMS.TXT, CURRENCY.XML, MAPPING-ISOLATIN1ACCENT.TXT]
[junit4:junit4]   2> 1549 T1313 oass.SolrIndexSearcher.<init> Opening Searcher@7085ad86 main
[junit4:junit4]   2> 1550 T1313 oass.SolrIndexSearcher.getIndexDir WARNING WARNING: Directory impl does not support setting indexDir: org.apache.lucene.store.MockDirectoryWrapper
[junit4:junit4]   2> 1551 T1313 oasu.CommitTracker.<init> Hard AutoCommit: disabled
[junit4:junit4]   2> 1551 T1313 oasu.CommitTracker.<init> Soft AutoCommit: disabled
[junit4:junit4]   2> 1552 T1313 oashc.SpellCheckComponent.inform Initializing spell checkers
[junit4:junit4]   2> 1567 T1313 oass.DirectSolrSpellChecker.init init: {name=direct,classname=DirectSolrSpellChecker,field=lowerfilt,minQueryLength=3}
[junit4:junit4]   2> 1639 T1313 oasc.ZkController.publish numShards not found on descriptor - reading it from system property
[junit4:junit4]   2> 1641 T1327 oasc.SolrCore.registerSearcher [collection1] Registered new searcher Searcher@7085ad86 main{StandardDirectoryReader(segments_1:1)}
[junit4:junit4]   2> 1641 T1318 oazs.PrepRequestProcessor.pRequest Got user-level KeeperException when processing sessionid:0x13aad2b67730002 type:create cxid:0x56 zxid:0xfffffffffffffffe txntype:unknown reqpath:n/a Error Path:/solr/overseer/queue Error:KeeperErrorCode = NoNode for /solr/overseer/queue
[junit4:junit4]   2> 2047 T1325 oascc.ZkStateReader.updateClusterState Updating cloud state from ZooKeeper... 
[junit4:junit4]   2> 2048 T1325 oasc.Overseer$ClusterStateUpdater.updateState Update state numShards=null message={
[junit4:junit4]   2> 	  "operation":"state",
[junit4:junit4]   2> 	  "numShards":null,
[junit4:junit4]   2> 	  "shard":null,
[junit4:junit4]   2> 	  "roles":null,
[junit4:junit4]   2> 	  "state":"down",
[junit4:junit4]   2> 	  "core":"collection1",
[junit4:junit4]   2> 	  "collection":"collection1",
[junit4:junit4]   2> 	  "node_name":"127.0.0.1:1661_solr",
[junit4:junit4]   2> 	  "base_url":"http://127.0.0.1:1661/solr"}
[junit4:junit4]   2> 2048 T1318 oazs.PrepRequestProcessor.pRequest Got user-level KeeperException when processing sessionid:0x13aad2b67730002 type:create cxid:0x5e zxid:0xfffffffffffffffe txntype:unknown reqpath:n/a Error Path:/solr/overseer/queue-work Error:KeeperErrorCode = NoNode for /solr/overseer/queue-work
[junit4:junit4]   2> 2059 T1324 oascc.ZkStateReader$2.process A cluster state change has occurred - updating... (1)
[junit4:junit4]   2> 2186 T1313 oasc.CoreContainer.register registering core: collection1
[junit4:junit4]   2> 2186 T1313 oasc.ZkController.register Register shard - core:collection1 address:http://127.0.0.1:1661/solr shardId:shard1
[junit4:junit4]   2> 2187 T1313 oascc.SolrZkClient.makePath makePath: /collections/collection1/leader_elect/shard1/election
[junit4:junit4]   2> 2201 T1318 oazs.PrepRequestProcessor.pRequest Got user-level KeeperException when processing sessionid:0x13aad2b67730002 type:delete cxid:0x77 zxid:0xfffffffffffffffe txntype:unknown reqpath:n/a Error Path:/solr/collections/collection1/leaders Error:KeeperErrorCode = NoNode for /solr/collections/collection1/leaders
[junit4:junit4]   2> 2203 T1313 oasc.ShardLeaderElectionContext.runLeaderProcess Running the leader process.
[junit4:junit4]   2> 2204 T1318 oazs.PrepRequestProcessor.pRequest Got user-level KeeperException when processing sessionid:0x13aad2b67730002 type:create cxid:0x78 zxid:0xfffffffffffffffe txntype:unknown reqpath:n/a Error Path:/solr/overseer Error:KeeperErrorCode = NodeExists for /solr/overseer
[junit4:junit4]   2> 2208 T1313 oasc.ShardLeaderElectionContext.waitForReplicasToComeUp Enough replicas found to continue.
[junit4:junit4]   2> 2209 T1313 oasc.ShardLeaderElectionContext.runLeaderProcess I may be the new leader - try and sync
[junit4:junit4]   2> 2209 T1313 oasc.ShardLeaderElectionContext.runLeaderProcess I am the new leader: http://127.0.0.1:1661/solr/collection1/
[junit4:junit4]   2> 2209 T1313 oascc.SolrZkClient.makePath makePath: /collections/collection1/leaders/shard1
[junit4:junit4]   2> 2226 T1318 oazs.PrepRequestProcessor.pRequest Got user-level KeeperException when processing sessionid:0x13aad2b67730002 type:create cxid:0x82 zxid:0xfffffffffffffffe txntype:unknown reqpath:n/a Error Path:/solr/overseer Error:KeeperErrorCode = NodeExists for /solr/overseer
[junit4:junit4]   2> 2606 T1325 oascc.ZkStateReader.updateClusterState Updating cloud state from ZooKeeper... 
[junit4:junit4]   2> 2621 T1324 oascc.ZkStateReader$2.process A cluster state change has occurred - updating... (1)
[junit4:junit4]   2> 2675 T1313 oasc.ZkController.register We are http://127.0.0.1:1661/solr/collection1/ and leader is http://127.0.0.1:1661/solr/collection1/
[junit4:junit4]   2> 2675 T1313 oasc.ZkController.checkRecovery WARNING Skipping recovery according to sys prop solrcloud.skip.autorecovery
[junit4:junit4]   2> 2676 T1313 oasc.ZkController.publish numShards not found on descriptor - reading it from system property
[junit4:junit4]   2> 2680 T1313 oascc.ZkStateReader.updateClusterState Updating cloud state from ZooKeeper... 
[junit4:junit4]   2> 2681 T1313 oasc.SolrResourceLoader.locateSolrHome JNDI not configured for solr (NoInitialContextEx)
[junit4:junit4]   2> 2681 T1313 oasc.SolrResourceLoader.locateSolrHome using system property solr.solr.home: C:\Users\JenkinsSlave\workspace\Lucene-Solr-4.x-Windows\solr\build\solr-core\test-files\solr
[junit4:junit4]   2> 2681 T1313 oasc.CoreContainer$Initializer.initialize looking for solr.xml: C:\Users\JenkinsSlave\workspace\Lucene-Solr-4.x-Windows\solr\build\solr-core\test-files\solr\solr.xml
[junit4:junit4]   2> 2682 T1313 oasc.CoreContainer.<init> New CoreContainer 443749218
[junit4:junit4]   2> 2682 T1313 oasc.CoreContainer.load Loading CoreContainer using Solr Home: 'C:\Users\JenkinsSlave\workspace\Lucene-Solr-4.x-Windows\solr\build\solr-core\test-files\solr\'
[junit4:junit4]   2> 2682 T1313 oasc.SolrResourceLoader.<init> new SolrResourceLoader for directory: 'C:\Users\JenkinsSlave\workspace\Lucene-Solr-4.x-Windows\solr\build\solr-core\test-files\solr\'
[junit4:junit4]   2> 2729 T1313 oasc.CoreContainer.load Registering Log Listener
[junit4:junit4]   2> 2762 T1313 oasc.CoreContainer.initZooKeeper Zookeeper client=127.0.0.1:53543/solr
[junit4:junit4]   2> 2763 T1313 oaz.ZooKeeper.<init> Initiating client connection, connectString=127.0.0.1:53543/solr sessionTimeout=3000 watcher=org.apache.solr.common.cloud.ConnectionManager@6b9b88d8
[junit4:junit4]   2> 2764 T1328 oaz.ClientCnxn$SendThread.startConnect Opening socket connection to server /127.0.0.1:53543
[junit4:junit4]   2> 2764 T1313 oascc.ConnectionManager.waitForConnected Waiting for client to connect to ZooKeeper
[junit4:junit4]   2> 2766 T1328 oaz.ClientCnxn$SendThread.primeConnection Socket connection established to 127.0.0.1/127.0.0.1:53543, initiating session
[junit4:junit4]   2> 2766 T1315 oazs.NIOServerCnxn$Factory.run Accepted socket connection from /127.0.0.1:53555
[junit4:junit4]   2> 2767 T1315 oazs.NIOServerCnxn.readConnectRequest Client attempting to establish new session at /127.0.0.1:53555
[junit4:junit4]   2> 2769 T1317 oazs.NIOServerCnxn.finishSessionInit Established session 0x13aad2b67730003 with negotiated timeout 3000 for client /127.0.0.1:53555
[junit4:junit4]   2> 2769 T1328 oaz.ClientCnxn$SendThread.readConnectResult Session establishment complete on server 127.0.0.1/127.0.0.1:53543, sessionid = 0x13aad2b67730003, negotiated timeout = 3000
[junit4:junit4]   2> 2769 T1329 oascc.ConnectionManager.process Watcher org.apache.solr.common.cloud.ConnectionManager@6b9b88d8 name:ZooKeeperConnection Watcher:127.0.0.1:53543/solr got event WatchedEvent state:SyncConnected type:None path:null path:null type:None
[junit4:junit4]   2> 2770 T1313 oascc.ConnectionManager.waitForConnected Client is connected to ZooKeeper
[junit4:junit4]   2> 2772 T1318 oazs.PrepRequestProcessor.pRequest Got user-level KeeperException when processing sessionid:0x13aad2b67730003 type:create cxid:0x1 zxid:0xfffffffffffffffe txntype:unknown reqpath:n/a Error Path:/solr/overseer Error:KeeperErrorCode = NodeExists for /solr/overseer
[junit4:junit4]   2> 2774 T1318 oazs.PrepRequestProcessor.pRequest Got user-level KeeperException when processing sessionid:0x13aad2b67730003 type:create cxid:0x2 zxid:0xfffffffffffffffe txntype:unknown reqpath:n/a Error Path:/solr/overseer Error:KeeperErrorCode = NodeExists for /solr/overseer
[junit4:junit4]   2> 2776 T1313 oasc.ZkController.createEphemeralLiveNode Register node as live in ZooKeeper:/live_nodes/127.0.0.1:1662_solr
[junit4:junit4]   2> 2777 T1318 oazs.PrepRequestProcessor.pRequest Got user-level KeeperException when processing sessionid:0x13aad2b67730003 type:delete cxid:0x4 zxid:0xfffffffffffffffe txntype:unknown reqpath:n/a Error Path:/solr/live_nodes/127.0.0.1:1662_solr Error:KeeperErrorCode = NoNode for /solr/live_nodes/127.0.0.1:1662_solr
[junit4:junit4]   2> 2779 T1313 oascc.SolrZkClient.makePath makePath: /live_nodes/127.0.0.1:1662_solr
[junit4:junit4]   2> 2784 T1324 oascc.ZkStateReader$3.process Updating live nodes... (2)
[junit4:junit4]   2> 2784 T1313 oashc.HttpShardHandlerFactory.getParameter Setting socketTimeout to: 0
[junit4:junit4]   2> 2784 T1313 oashc.HttpShardHandlerFactory.getParameter Setting urlScheme to: http://
[junit4:junit4]   2> 2785 T1313 oashc.HttpShardHandlerFactory.getParameter Setting connTimeout to: 0
[junit4:junit4]   2> 2785 T1313 oashc.HttpShardHandlerFactory.getParameter Setting maxConnectionsPerHost to: 20
[junit4:junit4]   2> 2785 T1313 oashc.HttpShardHandlerFactory.getParameter Setting corePoolSize to: 0
[junit4:junit4]   2> 2785 T1313 oashc.HttpShardHandlerFactory.getParameter Setting maximumPoolSize to: 2147483647
[junit4:junit4]   2> 2786 T1313 oashc.HttpShardHandlerFactory.getParameter Setting maxThreadIdleTime to: 5
[junit4:junit4]   2> 2786 T1313 oashc.HttpShardHandlerFactory.getParameter Setting sizeOfQueue to: -1
[junit4:junit4]   2> 2786 T1313 oashc.HttpShardHandlerFactory.getParameter Setting fairnessPolicy to: false
[junit4:junit4]   2> 2788 T1313 oascsi.HttpClientUtil.createClient Creating new http client, config:maxConnectionsPerHost=20&maxConnections=10000&socketTimeout=0&connTimeout=0&retry=false
[junit4:junit4]   2> 2804 T1313 oascc.ZkStateReader.createClusterStateWatchersAndUpdate Updating cluster state from ZooKeeper... 
[junit4:junit4]   2> 2812 T1313 oasc.CoreContainer.create Creating SolrCore 'collection1' using instanceDir: C:\Users\JenkinsSlave\workspace\Lucene-Solr-4.x-Windows\solr\build\solr-core\test-files\solr\collection1
[junit4:junit4]   2> 2813 T1313 oasc.ZkController.createCollectionZkNode Check for collection zkNode:collection1
[junit4:junit4]   2> 2814 T1313 oasc.ZkController.createCollectionZkNode Collection zkNode exists
[junit4:junit4]   2> 2814 T1313 oasc.ZkController.readConfigName Load collection config from:/collections/collection1
[junit4:junit4]   2> 2816 T1313 oasc.SolrResourceLoader.<init> new SolrResourceLoader for directory: 'C:\Users\JenkinsSlave\workspace\Lucene-Solr-4.x-Windows\solr\build\solr-core\test-files\solr\collection1\'
[junit4:junit4]   2> 2819 T1313 oasc.SolrResourceLoader.replaceClassLoader Adding 'file:/C:/Users/JenkinsSlave/workspace/Lucene-Solr-4.x-Windows/solr/build/solr-core/test-files/solr/collection1/lib/classes/' to classloader
[junit4:junit4]   2> 2820 T1313 oasc.SolrResourceLoader.replaceClassLoader Adding 'file:/C:/Users/JenkinsSlave/workspace/Lucene-Solr-4.x-Windows/solr/build/solr-core/test-files/solr/collection1/lib/README' to classloader
[junit4:junit4]   2> 2874 T1313 oasc.SolrConfig.<init> Using Lucene MatchVersion: LUCENE_41
[junit4:junit4]   2> 2951 T1313 oasc.SolrConfig.<init> Loaded SolrConfig: solrconfig.xml
[junit4:junit4]   2> 2953 T1313 oass.IndexSchema.readSchema Reading Solr Schema
[junit4:junit4]   2> 2959 T1313 oass.IndexSchema.readSchema Schema name=test
[junit4:junit4]   2> 3167 T1325 oascc.ZkStateReader.updateClusterState Updating cloud state from ZooKeeper... 
[junit4:junit4]   2> 3168 T1325 oasc.Overseer$ClusterStateUpdater.updateState Update state numShards=null message={
[junit4:junit4]   2> 	  "operation":"state",
[junit4:junit4]   2> 	  "numShards":null,
[junit4:junit4]   2> 	  "shard":"shard1",
[junit4:junit4]   2> 	  "roles":null,
[junit4:junit4]   2> 	  "state":"active",
[junit4:junit4]   2> 	  "core":"collection1",
[junit4:junit4]   2> 	  "collection":"collection1",
[junit4:junit4]   2> 	  "node_name":"127.0.0.1:1661_solr",
[junit4:junit4]   2> 	  "base_url":"http://127.0.0.1:1661/solr"}
[junit4:junit4]   2> 3224 T1329 oascc.ZkStateReader$2.process A cluster state change has occurred - updating... (2)
[junit4:junit4]   2> 3225 T1324 oascc.ZkStateReader$2.process A cluster state change has occurred - updating... (2)
[junit4:junit4]   2> 3726 T1313 oass.OpenExchangeRatesOrgProvider.init Initialized with rates=open-exchange-rates.json, refreshInterval=1440.
[junit4:junit4]   2> 3743 T1313 oass.IndexSchema.readSchema default search field in schema is text
[junit4:junit4]   2> 3749 T1313 oass.IndexSchema.readSchema unique key field: id
[junit4:junit4]   2> 3769 T1313 oass.FileExchangeRateProvider.reload Reloading exchange rates from file currency.xml
[junit4:junit4]   2> 3773 T1313 oass.FileExchangeRateProvider.reload Reloading exchange rates from file currency.xml
[junit4:junit4]   2> 3779 T1313 oass.OpenExchangeRatesOrgProvider.reload Reloading exchange rates from open-exchange-rates.json
[junit4:junit4]   2> 3782 T1313 oass.OpenExchangeRatesOrgProvider.reload Reloading exchange rates from open-exchange-rates.json
[junit4:junit4]   2> 3784 T1313 oasc.SolrCore.<init> [collection1] Opening new SolrCore at C:\Users\JenkinsSlave\workspace\Lucene-Solr-4.x-Windows\solr\build\solr-core\test-files\solr\collection1\, dataDir=C:\Users\JenkinsSlave\workspace\Lucene-Solr-4.x-Windows\solr\build\solr-core\test\J0\.\solrtest-ClusterStateUpdateTest-1351525033833\data2\
[junit4:junit4]   2> 3784 T1313 oasc.JmxMonitoredMap.<init> JMX monitoring is enabled. Adding Solr mbeans to JMX Server: com.sun.jmx.mbeanserver.JmxMBeanServer@1766bfd8
[junit4:junit4]   2> 3785 T1313 oasc.SolrCore.getNewIndexDir New index directory detected: old=null new=C:\Users\JenkinsSlave\workspace\Lucene-Solr-4.x-Windows\solr\build\solr-core\test\J0\.\solrtest-ClusterStateUpdateTest-1351525033833\data2\index/
[junit4:junit4]   2> 3786 T1313 oasc.SolrCore.initIndex WARNING [collection1] Solr index directory 'C:\Users\JenkinsSlave\workspace\Lucene-Solr-4.x-Windows\solr\build\solr-core\test\J0\.\solrtest-ClusterStateUpdateTest-1351525033833\data2\index' doesn't exist. Creating new index...
[junit4:junit4]   2> 3787 T1313 oasc.CachingDirectoryFactory.get return new directory for C:\Users\JenkinsSlave\workspace\Lucene-Solr-4.x-Windows\solr\build\solr-core\test\J0\.\solrtest-ClusterStateUpdateTest-1351525033833\data2\index forceNew:false
[junit4:junit4]   2> 3790 T1313 oasc.SolrDeletionPolicy.onCommit SolrDeletionPolicy.onCommit: commits:num=1
[junit4:junit4]   2> 		commit{dir=MockDirWrapper(org.apache.lucene.store.RAMDirectory@59a1485e lockFactory=org.apache.lucene.store.NativeFSLockFactory@55989874),segFN=segments_1,generation=1,filenames=[segments_1]
[junit4:junit4]   2> 3790 T1313 oasc.SolrDeletionPolicy.updateCommits newest commit = 1
[junit4:junit4]   2> 3791 T1313 oasc.SolrCore.initWriters created xml: solr.XMLResponseWriter
[junit4:junit4]   2> 3792 T1313 oasup.UpdateRequestProcessorChain.init inserting DistributedUpdateProcessorFactory into updateRequestProcessorChain "dedupe"
[junit4:junit4]   2> 3792 T1313 oasup.UpdateRequestProcessorChain.init inserting DistributedUpdateProcessorFactory into updateRequestProcessorChain "dedupe-allfields"
[junit4:junit4]   2> 3792 T1313 oasup.UpdateRequestProcessorChain.init inserting DistributedUpdateProcessorFactory into updateRequestProcessorChain "stored_sig"
[junit4:junit4]   2> 3792 T1313 oasup.UpdateRequestProcessorChain.init inserting DistributedUpdateProcessorFactory into updateRequestProcessorChain "uniq-fields"
[junit4:junit4]   2> 3793 T1313 oasup.UpdateRequestProcessorChain.init inserting DistributedUpdateProcessorFactory into updateRequestProcessorChain "distrib-dup-test-chain-implicit"
[junit4:junit4]   2> 3793 T1313 oasc.RequestHandlers.initHandlersFromConfig adding lazy requestHandler: solr.ReplicationHandler
[junit4:junit4]   2> 3795 T1313 oasc.RequestHandlers.initHandlersFromConfig created /replication: solr.ReplicationHandler
[junit4:junit4]   2> 3795 T1313 oasc.RequestHandlers.initHandlersFromConfig created standard: solr.StandardRequestHandler
[junit4:junit4]   2> 3795 T1313 oasc.RequestHandlers.initHandlersFromConfig created /get: solr.RealTimeGetHandler
[junit4:junit4]   2> 3797 T1313 oasc.RequestHandlers.initHandlersFromConfig created dismax: solr.SearchHandler
[junit4:junit4]   2> 3797 T1313 oasc.RequestHandlers.initHandlersFromConfig created mock: org.apache.solr.core.MockQuerySenderListenerReqHandler
[junit4:junit4]   2> 3797 T1313 oasc.RequestHandlers.initHandlersFromConfig created /admin/: org.apache.solr.handler.admin.AdminHandlers
[junit4:junit4]   2> 3798 T1313 oasc.RequestHandlers.initHandlersFromConfig created defaults: solr.StandardRequestHandler
[junit4:junit4]   2> 3798 T1313 oasc.RequestHandlers.initHandlersFromConfig adding lazy requestHandler: solr.StandardRequestHandler
[junit4:junit4]   2> 3798 T1313 oasc.RequestHandlers.initHandlersFromConfig created lazy: solr.StandardRequestHandler
[junit4:junit4]   2> 3799 T1313 oasc.RequestHandlers.initHandlersFromConfig created /update: solr.UpdateRequestHandler
[junit4:junit4]   2> 3799 T1313 oasc.RequestHandlers.initHandlersFromConfig created /terms: org.apache.solr.handler.component.SearchHandler
[junit4:junit4]   2> 3799 T1313 oasc.RequestHandlers.initHandlersFromConfig created spellCheckCompRH: org.apache.solr.handler.component.SearchHandler
[junit4:junit4]   2> 3799 T1313 oasc.RequestHandlers.initHandlersFromConfig created spellCheckCompRH_Direct: org.apache.solr.handler.component.SearchHandler
[junit4:junit4]   2> 3800 T1313 oasc.RequestHandlers.initHandlersFromConfig created spellCheckWithWordbreak: org.apache.solr.handler.component.SearchHandler
[junit4:junit4]   2> 3800 T1313 oasc.RequestHandlers.initHandlersFromConfig created spellCheckWithWordbreak_Direct: org.apache.solr.handler.component.SearchHandler
[junit4:junit4]   2> 3801 T1313 oasc.RequestHandlers.initHandlersFromConfig created spellCheckCompRH1: org.apache.solr.handler.component.SearchHandler
[junit4:junit4]   2> 3801 T1313 oasc.RequestHandlers.initHandlersFromConfig created tvrh: org.apache.solr.handler.component.SearchHandler
[junit4:junit4]   2> 3801 T1313 oasc.RequestHandlers.initHandlersFromConfig created /mlt: solr.MoreLikeThisHandler
[junit4:junit4]   2> 3802 T1313 oasc.RequestHandlers.initHandlersFromConfig created /debug/dump: solr.DumpRequestHandler
[junit4:junit4]   2> 3810 T1313 oashl.XMLLoader.init xsltCacheLifetimeSeconds=60
[junit4:junit4]   2> 3816 T1313 oasc.SolrCore.initDeprecatedSupport WARNING solrconfig.xml uses deprecated <admin/gettableFiles>, Please update your config to use the ShowFileRequestHandler.
[junit4:junit4]   2> 3817 T1313 oasc.SolrCore.initDeprecatedSupport WARNING adding ShowFileRequestHandler with hidden files: [SCHEMA.XML, OLD_SYNONYMS.TXT, STOPWORDS.TXT, PROTWORDS.TXT, OPEN-EXCHANGE-RATES.JSON, SYNONYMS.TXT, CURRENCY.XML, MAPPING-ISOLATIN1ACCENT.TXT]
[junit4:junit4]   2> 3820 T1313 oass.SolrIndexSearcher.<init> Opening Searcher@53b03713 main
[junit4:junit4]   2> 3821 T1313 oass.SolrIndexSearcher.getIndexDir WARNING WARNING: Directory impl does not support setting indexDir: org.apache.lucene.store.MockDirectoryWrapper
[junit4:junit4]   2> 3822 T1313 oasu.CommitTracker.<init> Hard AutoCommit: disabled
[junit4:junit4]   2> 3822 T1313 oasu.CommitTracker.<init> Soft AutoCommit: disabled
[junit4:junit4]   2> 3823 T1313 oashc.SpellCheckComponent.inform Initializing spell checkers
[junit4:junit4]   2> 3864 T1313 oass.DirectSolrSpellChecker.init init: {name=direct,classname=DirectSolrSpellChecker,field=lowerfilt,minQueryLength=3}
[junit4:junit4]   2> 4146 T1330 oasc.SolrCore.registerSearcher [collection1] Registered new searcher Searcher@53b03713 main{StandardDirectoryReader(segments_1:1)}
[junit4:junit4]   2> 4150 T1313 oasc.ZkController.publish numShards not found on descriptor - reading it from system property
[junit4:junit4]   2> 4332 T1325 oascc.ZkStateReader.updateClusterState Updating cloud state from ZooKeeper... 
[junit4:junit4]   2> 4333 T1325 oasc.Overseer$ClusterStateUpdater.updateState Update state numShards=null message={
[junit4:junit4]   2> 	  "operation":"state",
[junit4:junit4]   2> 	  "numShards":null,
[junit4:junit4]   2> 	  "shard":null,
[junit4:junit4]   2> 	  "roles":null,
[junit4:junit4]   2> 	  "state":"down",
[junit4:junit4]   2> 	  "core":"collection1",
[junit4:junit4]   2> 	  "collection":"collection1",
[junit4:junit4]   2> 	  "node_name":"127.0.0.1:1662_solr",
[junit4:junit4]   2> 	  "base_url":"http://127.0.0.1:1662/solr"}
[junit4:junit4]   2> 4403 T1324 oascc.ZkStateReader$2.process A cluster state change has occurred - updating... (2)
[junit4:junit4]   2> 4403 T1329 oascc.ZkStateReader$2.process A cluster state change has occurred - updating... (2)
[junit4:junit4]   2> 4708 T1313 oasc.CoreContainer.register registering core: collection1
[junit4:junit4]   2> 4708 T1313 oasc.ZkController.register Register shard - core:collection1 address:http://127.0.0.1:1662/solr shardId:shard1
[junit4:junit4]   2> 4717 T1313 oasc.ZkController.register We are http://127.0.0.1:1662/solr/collection1/ and leader is http://127.0.0.1:1661/solr/collection1/
[junit4:junit4]   2> 4718 T1313 oasc.ZkController.checkRecovery WARNING Skipping recovery according to sys prop solrcloud.skip.autorecovery
[junit4:junit4]   2> 4718 T1313 oasc.ZkController.publish numShards not found on descriptor - reading it from system property
[junit4:junit4]   2> 4746 T1313 oascc.ZkStateReader.updateClusterState Updating cloud state from ZooKeeper... 
[junit4:junit4]   2> 4747 T1313 oasc.SolrResourceLoader.locateSolrHome JNDI not configured for solr (NoInitialContextEx)
[junit4:junit4]   2> 4747 T1313 oasc.SolrResourceLoader.locateSolrHome using system property solr.solr.home: C:\Users\JenkinsSlave\workspace\Lucene-Solr-4.x-Windows\solr\build\solr-core\test-files\solr
[junit4:junit4]   2> 4747 T1313 oasc.CoreContainer$Initializer.initialize looking for solr.xml: C:\Users\JenkinsSlave\workspace\Lucene-Solr-4.x-Windows\solr\build\solr-core\test-files\solr\solr.xml
[junit4:junit4]   2> 4747 T1313 oasc.CoreContainer.<init> New CoreContainer 537946423
[junit4:junit4]   2> 4749 T1313 oasc.CoreContainer.load Loading CoreContainer using Solr Home: 'C:\Users\JenkinsSlave\workspace\Lucene-Solr-4.x-Windows\solr\build\solr-core\test-files\solr\'
[junit4:junit4]   2> 4749 T1313 oasc.SolrResourceLoader.<init> new SolrResourceLoader for directory: 'C:\Users\JenkinsSlave\workspace\Lucene-Solr-4.x-Windows\solr\build\solr-core\test-files\solr\'
[junit4:junit4]   2> 4789 T1313 oasc.CoreContainer.load Registering Log Listener
[junit4:junit4]   2> 4808 T1313 oasc.CoreContainer.initZooKeeper Zookeeper client=127.0.0.1:53543/solr
[junit4:junit4]   2> 4808 T1313 oaz.ZooKeeper.<init> Initiating client connection, connectString=127.0.0.1:53543/solr sessionTimeout=3000 watcher=org.apache.solr.common.cloud.ConnectionManager@4f7b3a21
[junit4:junit4]   2> 4811 T1331 oaz.ClientCnxn$SendThread.startConnect Opening socket connection to server /127.0.0.1:53543
[junit4:junit4]   2> 4811 T1313 oascc.ConnectionManager.waitForConnected Waiting for client to connect to ZooKeeper
[junit4:junit4]   2> 4813 T1331 oaz.ClientCnxn$SendThread.primeConnection Socket connection established to 127.0.0.1/127.0.0.1:53543, initiating session
[junit4:junit4]   2> 4813 T1315 oazs.NIOServerCnxn$Factory.run Accepted socket connection from /127.0.0.1:53558
[junit4:junit4]   2> 4814 T1315 oazs.NIOServerCnxn.readConnectRequest Client attempting to establish new session at /127.0.0.1:53558
[junit4:junit4]   2> 4845 T1317 oazs.NIOServerCnxn.finishSessionInit Established session 0x13aad2b67730004 with negotiated timeout 3000 for client /127.0.0.1:53558
[junit4:junit4]   2> 4845 T1331 oaz.ClientCnxn$SendThread.readConnectResult Session establishment complete on server 127.0.0.1/127.0.0.1:53543, sessionid = 0x13aad2b67730004, negotiated timeout = 3000
[junit4:junit4]   2> 4845 T1332 oascc.ConnectionManager.process Watcher org.apache.solr.common.cloud.ConnectionManager@4f7b3a21 name:ZooKeeperConnection Watcher:127.0.0.1:53543/solr got event WatchedEvent state:SyncConnected type:None path:null path:null type:None
[junit4:junit4]   2> 4846 T1313 oascc.ConnectionManager.waitForConnected Client is connected to ZooKeeper
[junit4:junit4]   2> 4847 T1318 oazs.PrepRequestProcessor.pRequest Got user-level KeeperException when processing sessionid:0x13aad2b67730004 type:create cxid:0x1 zxid:0xfffffffffffffffe txntype:unknown reqpath:n/a Error Path:/solr/overseer Error:KeeperErrorCode = NodeExists for /solr/overseer
[junit4:junit4]   2> 4878 T1318 oazs.PrepRequestProcessor.pRequest Got user-level KeeperException when processing sessionid:0x13aad2b67730004 type:create cxid:0x2 zxid:0xfffffffffffffffe txntype:unknown reqpath:n/a Error Path:/solr/overseer Error:KeeperErrorCode = NodeExists for /solr/overseer
[junit4:junit4]   2> 4900 T1313 oasc.ZkController.createEphemeralLiveNode Register node as live in ZooKeeper:/live_nodes/127.0.0.1:1663_solr
[junit4:junit4]   2> 4900 T1318 oazs.PrepRequestProcessor.pRequest Got user-level KeeperException when processing sessionid:0x13aad2b67730004 type:delete cxid:0x4 zxid:0xfffffffffffffffe txntype:unknown reqpath:n/a Error Path:/solr/live_nodes/127.0.0.1:1663_solr Error:KeeperErrorCode = NoNode for /solr/live_nodes/127.0.0.1:1663_solr
[junit4:junit4]   2> 4931 T1313 oascc.SolrZkClient.makePath makePath: /live_nodes/127.0.0.1:1663_solr
[junit4:junit4]   2> 4964 T1329 oascc.ZkStateReader$3.process Updating live nodes... (3)
[junit4:junit4]   2> 4964 T1324 oascc.ZkStateReader$3.process Updating live nodes... (3)
[junit4:junit4]   2> 4964 T1313 oashc.HttpShardHandlerFactory.getParameter Setting socketTimeout to: 0
[junit4:junit4]   2> 4965 T1313 oashc.HttpShardHandlerFactory.getParameter Setting urlScheme to: http://
[junit4:junit4]   2> 4965 T1313 oashc.HttpShardHandlerFactory.getParameter Setting connTimeout to: 0
[junit4:junit4]   2> 4965 T1313 oashc.HttpShardHandlerFactory.getParameter Setting maxConnectionsPerHost to: 20
[junit4:junit4]   2> 4965 T1313 oashc.HttpShardHandlerFactory.getParameter Setting corePoolSize to: 0
[junit4:junit4]   2> 4966 T1313 oashc.HttpShardHandlerFactory.getParameter Setting maximumPoolSize to: 2147483647
[junit4:junit4]   2> 4966 T1313 oashc.HttpShardHandlerFactory.getParameter Setting maxThreadIdleTime to: 5
[junit4:junit4]   2> 4966 T1313 oashc.HttpShardHandlerFactory.getParameter Setting sizeOfQueue to: -1
[junit4:junit4]   2> 4967 T1313 oashc.HttpShardHandlerFactory.getParameter Setting fairnessPolicy to: false
[junit4:junit4]   2> 4967 T1313 oascsi.HttpClientUtil.createClient Creating new http client, config:maxConnectionsPerHost=20&maxConnections=10000&socketTimeout=0&connTimeout=0&retry=false
[junit4:junit4]   2> 4978 T1325 oascc.ZkStateReader.updateClusterState Updating cloud state from ZooKeeper... 
[junit4:junit4]   2> 4979 T1325 oasc.Overseer$ClusterStateUpdater.updateState Update state numShards=null message={
[junit4:junit4]   2> 	  "operation":"state",
[junit4:junit4]   2> 	  "numShards":null,
[junit4:junit4]   2> 	  "shard":"shard1",
[junit4:junit4]   2> 	  "roles":null,
[junit4:junit4]   2> 	  "state":"active",
[junit4:junit4]   2> 	  "core":"collection1",
[junit4:junit4]   2> 	  "collection":"collection1",
[junit4:junit4]   2> 	  "node_name":"127.0.0.1:1662_solr",
[junit4:junit4]   2> 	  "base_url":"http://127.0.0.1:1662/solr"}
[junit4:junit4]   2> 5039 T1313 oascc.ZkStateReader.createClusterStateWatchersAndUpdate Updating cluster state from ZooKeeper... 
[junit4:junit4]   2> 5092 T1329 oascc.ZkStateReader$2.process A cluster state change has occurred - updating... (3)
[junit4:junit4]   2> 5093 T1332 oaz.ClientCnxn$EventThread.processEvent SEVERE Error while calling watcher  java.lang.NullPointerException
[junit4:junit4]   2> 	at org.apache.solr.common.cloud.ZkStateReader$2.process(ZkStateReader.java:189)
[junit4:junit4]   2> 	at org.apache.zookeeper.ClientCnxn$EventThread.processEvent(ClientCnxn.java:526)
[junit4:junit4]   2> 	at org.apache.zookeeper.ClientCnxn$EventThread.run(ClientCnxn.java:502)
[junit4:junit4]   2> 
[junit4:junit4]   2> 5094 T1324 oascc.ZkStateReader$2.process A cluster state change has occurred - updating... (3)
[junit4:junit4]   2> 5107 T1313 oasc.CoreContainer.create Creating SolrCore 'collection1' using instanceDir: C:\Users\JenkinsSlave\workspace\Lucene-Solr-4.x-Windows\solr\build\solr-core\test-files\solr\collection1
[junit4:junit4]   2> 5107 T1313 oasc.ZkController.createCollectionZkNode Check for collection zkNode:collection1
[junit4:junit4]   2> 5124 T1313 oasc.ZkController.createCollectionZkNode Collection zkNode exists
[junit4:junit4]   2> 5125 T1313 oasc.ZkController.readConfigName Load collection config from:/collections/collection1
[junit4:junit4]   2> 5127 T1313 oasc.SolrResourceLoader.<init> new SolrResourceLoader for directory: 'C:\Users\JenkinsSlave\workspace\Lucene-Solr-4.x-Windows\solr\build\solr-core\test-files\solr\collection1\'
[junit4:junit4]   2> 5131 T1313 oasc.SolrResourceLoader.replaceClassLoader Adding 'file:/C:/Users/JenkinsSlave/workspace/Lucene-Solr-4.x-Windows/solr/build/solr-core/test-files/solr/collection1/lib/classes/' to classloader
[junit4:junit4]   2> 5133 T1313 oasc.SolrResourceLoader.replaceClassLoader Adding 'file:/C:/Users/JenkinsSlave/workspace/Lucene-Solr-4.x-Windows/solr/build/solr-core/test-files/solr/collection1/lib/README' to classloader
[junit4:junit4]   2> 5180 T1313 oasc.SolrConfig.<init> Using Lucene MatchVersion: LUCENE_41
[junit4:junit4]   2> 5265 T1313 oasc.SolrConfig.<init> Loaded SolrConfig: solrconfig.xml
[junit4:junit4]   2> 5266 T1313 oass.IndexSchema.readSchema Reading Solr Schema
[junit4:junit4]   2> 5273 T1313 oass.IndexSchema.readSchema Schema name=test
[junit4:junit4]   2> 6018 T1313 oass.OpenExchangeRatesOrgProvider.init Initialized with rates=open-exchange-rates.json, refreshInterval=1440.
[junit4:junit4]   2> 6031 T1313 oass.IndexSchema.readSchema default search field in schema is text
[junit4:junit4]   2> 6035 T1313 oass.IndexSchema.readSchema unique key field: id
[junit4:junit4]   2> 6058 T1313 oass.FileExchangeRateProvider.reload Reloading exchange rates from file currency.xml
[junit4:junit4]   2> 6064 T1313 oass.FileExchangeRateProvider.reload Reloading exchange rates from file currency.xml
[junit4:junit4]   2> 6068 T1313 oass.OpenExchangeRatesOrgProvider.reload Reloading exchange rates from open-exchange-rates.json
[junit4:junit4]   2> 6070 T1313 oass.OpenExchangeRatesOrgProvider.reload Reloading exchange rates from open-exchange-rates.json
[junit4:junit4]   2> 6071 T1313 oasc.SolrCore.<init> [collection1] Opening new SolrCore at C:\Users\JenkinsSlave\workspace\Lucene-Solr-4.x-Windows\solr\build\solr-core\test-files\solr\collection1\, dataDir=C:\Users\JenkinsSlave\workspace\Lucene-Solr-4.x-Windows\solr\build\solr-core\test\J0\.\solrtest-ClusterStateUpdateTest-1351525033833\data3\
[junit4:junit4]   2> 6071 T1313 oasc.JmxMonitoredMap.<init> JMX monitoring is enabled. Adding Solr mbeans to JMX Server: com.sun.jmx.mbeanserver.JmxMBeanServer@1766bfd8
[junit4:junit4]   2> 6073 T1313 oasc.SolrCore.getNewIndexDir New index directory detected: old=null new=C:\Users\JenkinsSlave\workspace\Lucene-Solr-4.x-Windows\solr\build\solr-core\test\J0\.\solrtest-ClusterStateUpdateTest-1351525033833\data3\index/
[junit4:junit4]   2> 6073 T1313 oasc.SolrCore.initIndex WARNING [collection1] Solr index directory 'C:\Users\JenkinsSlave\workspace\Lucene-Solr-4.x-Windows\solr\build\solr-core\test\J0\.\solrtest-ClusterStateUpdateTest-1351525033833\data3\index' doesn't exist. Creating new index...
[junit4:junit4]   2> 6075 T1313 oasc.CachingDirectoryFactory.get return new directory for C:\Users\JenkinsSlave\workspace\Lucene-Solr-4.x-Windows\solr\build\solr-core\test\J0\.\solrtest-ClusterStateUpdateTest-1351525033833\data3\index forceNew:false
[junit4:junit4]   2> 6077 T1313 oasc.SolrDeletionPolicy.onCommit SolrDeletionPolicy.onCommit: commits:num=1
[junit4:junit4]   2> 		commit{dir=MockDirWrapper(org.apache.lucene.store.RAMDirectory@fb5449d lockFactory=org.apache.lucene.store.NativeFSLockFactory@8801cab),segFN=segments_1,generation=1,filenames=[segments_1]
[junit4:junit4]   2> 6077 T1313 oasc.SolrDeletionPolicy.updateCommits newest commit = 1
[junit4:junit4]   2> 6078 T1313 oasc.SolrCore.initWriters created xml: solr.XMLResponseWriter
[junit4:junit4]   2> 6080 T1313 oasup.UpdateRequestProcessorChain.init inserting DistributedUpdateProcessorFactory into updateRequestProcessorChain "dedupe"
[junit4:junit4]   2> 6080 T1313 oasup.UpdateRequestProcessorChain.init inserting DistributedUpdateProcessorFactory into updateRequestProcessorChain "dedupe-allfields"
[junit4:junit4]   2> 6080 T1313 oasup.UpdateRequestProcessorChain.init inserting DistributedUpdateProcessorFactory into updateRequestProcessorChain "stored_sig"
[junit4:junit4]   2> 6080 T1313 oasup.UpdateRequestProcessorChain.init inserting DistributedUpdateProcessorFactory into updateRequestProcessorChain "uniq-fields"
[junit4:junit4]   2> 6081 T1313 oasup.UpdateRequestProcessorChain.init inserting DistributedUpdateProcessorFactory into updateRequestProcessorChain "distrib-dup-test-chain-implicit"
[junit4:junit4]   2> 6081 T1313 oasc.RequestHandlers.initHandlersFromConfig adding lazy requestHandler: solr.ReplicationHandler
[junit4:junit4]   2> 6081 T1313 oasc.RequestHandlers.initHandlersFromConfig created /replication: solr.ReplicationHandler
[junit4:junit4]   2> 6082 T1313 oasc.RequestHandlers.initHandlersFromConfig created standard: solr.StandardRequestHandler
[junit4:junit4]   2> 6082 T1313 oasc.RequestHandlers.initHandlersFromConfig created /get: solr.RealTimeGetHandler
[junit4:junit4]   2> 6082 T1313 oasc.RequestHandlers.initHandlersFromConfig created dismax: solr.SearchHandler
[junit4:junit4]   2> 6084 T1313 oasc.RequestHandlers.initHandlersFromConfig created mock: org.apache.solr.core.MockQuerySenderListenerReqHandler
[junit4:junit4]   2> 6084 T1313 oasc.RequestHandlers.initHandlersFromConfig created /admin/: org.apache.solr.handler.admin.AdminHandlers
[junit4:junit4]   2> 6084 T1313 oasc.RequestHandlers.initHandlersFromConfig created defaults: solr.StandardRequestHandler
[junit4:junit4]   2> 6085 T1313 oasc.RequestHandlers.initHandlersFromConfig adding lazy requestHandler: solr.StandardRequestHandler
[junit4:junit4]   2> 6085 T1313 oasc.RequestHandlers.initHandlersFromConfig created lazy: solr.StandardRequestHandler
[junit4:junit4]   2> 6085 T1313 oasc.RequestHandlers.initHandlersFromConfig created /update: solr.UpdateRequestHandler
[junit4:junit4]   2> 6086 T1313 oasc.RequestHandlers.initHandlersFromConfig created /terms: org.apache.solr.handler.component.SearchHandler
[junit4:junit4]   2> 6086 T1313 oasc.RequestHandlers.initHandlersFromConfig created spellCheckCompRH: org.apache.solr.handler.component.SearchHandler
[junit4:junit4]   2> 6087 T1313 oasc.RequestHandlers.initHandlersFromConfig created spellCheckCompRH_Direct: org.apache.solr.handler.component.SearchHandler
[junit4:junit4]   2> 6087 T1313 oasc.RequestHandlers.initHandlersFromConfig created spellCheckWithWordbreak: org.apache.solr.handler.component.SearchHandler
[junit4:junit4]   2> 6087 T1313 oasc.RequestHandlers.initHandlersFromConfig created spellCheckWithWordbreak_Direct: org.apache.solr.handler.component.SearchHandler
[junit4:junit4]   2> 6087 T1313 oasc.RequestHandlers.initHandlersFromConfig created spellCheckCompRH1: org.apache.solr.handler.component.SearchHandler
[junit4:junit4]   2> 6089 T1313 oasc.RequestHandlers.initHandlersFromConfig created tvrh: org.apache.solr.handler.component.SearchHandler
[junit4:junit4]   2> 6089 T1313 oasc.RequestHandlers.initHandlersFromConfig created /mlt: solr.MoreLikeThisHandler
[junit4:junit4]   2> 6089 T1313 oasc.RequestHandlers.initHandlersFromConfig created /debug/dump: solr.DumpRequestHandler
[junit4:junit4]   2> 6097 T1313 oashl.XMLLoader.init xsltCacheLifetimeSeconds=60
[junit4:junit4]   2> 6106 T1313 oasc.SolrCore.initDeprecatedSupport WARNING solrconfig.xml uses deprecated <admin/gettableFiles>, Please update your config to use the ShowFileRequestHandler.
[junit4:junit4]   2> 6107 T1313 oasc.SolrCore.initDeprecatedSupport WARNING adding ShowFileRequestHandler with hidden files: [SCHEMA.XML, OLD_SYNONYMS.TXT, STOPWORDS.TXT, PROTWORDS.TXT, OPEN-EXCHANGE-RATES.JSON, SYNONYMS.TXT, CURRENCY.XML, MAPPING-ISOLATIN1ACCENT.TXT]
[junit4:junit4]   2> 6111 T1313 oass.SolrIndexSearcher.<init> Opening Searcher@a00fab5 main
[junit4:junit4]   2> 6111 T1313 oass.SolrIndexSearcher.getIndexDir WARNING WARNING: Directory impl does not support setting indexDir: org.apache.lucene.store.MockDirectoryWrapper
[junit4:junit4]   2> 6112 T1313 oasu.CommitTracker.<init> Hard AutoCommit: disabled
[junit4:junit4]   2> 6112 T1313 oasu.CommitTracker.<init> Soft AutoCommit: disabled
[junit4:junit4]   2> 6113 T1313 oashc.SpellCheckComponent.inform Initializing spell checkers
[junit4:junit4]   2> 6127 T1313 oass.DirectSolrSpellChecker.init init: {name=direct,classname=DirectSolrSpellChecker,field=lowerfilt,minQueryLength=3}
[junit4:junit4]   2> 6189 T1333 oasc.SolrCore.registerSearcher [collection1] Registered new searcher Searcher@a00fab5 main{StandardDirectoryReader(segments_1:1)}
[junit4:junit4]   2> 6195 T1313 oasc.ZkController.publish numShards not found on descriptor - reading it from system property
[junit4:junit4]   2> 6207 T1325 oascc.ZkStateReader.updateClusterState Updating cloud state from ZooKeeper... 
[junit4:junit4]   2> 6208 T1325 oasc.Overseer$ClusterStateUpdater.updateState Update state numShards=null message={
[junit4:junit4]   2> 	  "operation":"state",
[junit4:junit4]   2> 	  "numShards":null,
[junit4:junit4]   2> 	  "shard":null,
[junit4:junit4]   2> 	  "roles":null,
[junit4:junit4]   2> 	  "state":"down",
[junit4:junit4]   2> 	  "core":"collection1",
[junit4:junit4]   2> 	  "collection":"collection1",
[junit4:junit4]   2> 	  "node_name":"127.0.0.1:1663_solr",
[junit4:junit4]   2> 	  "base_url":"http://127.0.0.1:1663/solr"}
[junit4:junit4]   2> 6215 T1324 oascc.ZkStateReader$2.process A cluster state change has occurred - updating... (3)
[junit4:junit4]   2> 6216 T1329 oascc.ZkStateReader$2.process A cluster state change has occurred - updating... (3)
[junit4:junit4]   2> 61141 T1313 oasc.SolrException.log SEVERE null:org.apache.solr.common.SolrException: Could not get shard_id for core: collection1
[junit4:junit4]   2> 		at org.apache.solr.cloud.ZkController.doGetShardIdProcess(ZkController.java:996)
[junit4:junit4]   2> 		at org.apache.solr.cloud.ZkController.preRegister(ZkController.java:1054)
[junit4:junit4]   2> 		at org.apache.solr.core.CoreContainer.register(CoreContainer.java:657)
[junit4:junit4]   2> 		at org.apache.solr.core.CoreContainer.load(CoreContainer.java:530)
[junit4:junit4]   2> 		at org.apache.solr.core.CoreContainer.load(CoreContainer.java:351)
[junit4:junit4]   2> 		at org.apache.solr.core.CoreContainer$Initializer.initialize(CoreContainer.java:303)
[junit4:junit4]   2> 		at org.apache.solr.cloud.ClusterStateUpdateTest.setUp(ClusterStateUpdateTest.java:129)
[junit4:junit4]   2> 		at sun.reflect.GeneratedMethodAccessor5.invoke(Unknown Source)
[junit4:junit4]   2> 		at sun.reflect.DelegatingMethodAccessorImpl.invoke(DelegatingMethodAccessorImpl.java:25)
[junit4:junit4]   2> 		at java.lang.reflect.Method.invoke(Method.java:597)
[junit4:junit4]   2> 		at com.carrotsearch.randomizedtesting.RandomizedRunner.invoke(RandomizedRunner.java:1559)
[junit4:junit4]   2> 		at com.carrotsearch.randomizedtesting.RandomizedRunner.access$600(RandomizedRunner.java:79)
[junit4:junit4]   2> 		at com.carrotsearch.randomizedtesting.RandomizedRunner$7.evaluate(RandomizedRunner.java:771)
[junit4:junit4]   2> 		at com.carrotsearch.randomizedtesting.RandomizedRunner$8.evaluate(RandomizedRunner.java:787)
[junit4:junit4]   2> 		at com.carrotsearch.randomizedtesting.rules.SystemPropertiesRestoreRule$1.evaluate(SystemPropertiesRestoreRule.java:53)
[junit4:junit4]   2> 		at org.apache.lucene.util.TestRuleSetupTeardownChained$1.evaluate(TestRuleSetupTeardownChained.java:50)
[junit4:junit4]   2> 		at org.apache.lucene.util.TestRuleFieldCacheSanity$1.evaluate(TestRuleFieldCacheSanity.java:51)
[junit4:junit4]   2> 		at org.apache.lucene.util.AbstractBeforeAfterRule$1.evaluate(AbstractBeforeAfterRule.java:45)
[junit4:junit4]   2> 		at com.carrotsearch.randomizedtesting.rules.SystemPropertiesInvariantRule$1.evaluate(SystemPropertiesInvariantRule.java:55)
[junit4:junit4]   2> 		at org.apache.lucene.util.TestRuleThreadAndTestName$1.evaluate(TestRuleThreadAndTestName.java:48)
[junit4:junit4]   2> 		at org.apache.lucene.util.TestRuleIgnoreAfterMaxFailures$1.evaluate(TestRuleIgnoreAfterMaxFailures.java:70)
[junit4:junit4]   2> 		at org.apache.lucene.util.TestRuleMarkFailure$1.evaluate(TestRuleMarkFailure.java:48)
[junit4:junit4]   2> 		at com.carrotsearch.randomizedtesting.rules.StatementAdapter.evaluate(StatementAdapter.java:36)
[junit4:junit4]   2> 		at com.carrotsearch.randomizedtesting.ThreadLeakControl$StatementRunner.run(ThreadLeakControl.java:358)
[junit4:junit4]   2> 		at com.carrotsearch.randomizedtesting.ThreadLeakControl.forkTimeoutingTask(ThreadLeakControl.java:782)
[junit4:junit4]   2> 		at com.carrotsearch.randomizedtesting.ThreadLeakControl$3.evaluate(ThreadLeakControl.java:442)
[junit4:junit4]   2> 		at com.carrotsearch.randomizedtesting.RandomizedRunner.runSingleTest(RandomizedRunner.java:746)
[junit4:junit4]   2> 		at com.carrotsearch.randomizedtesting.RandomizedRunner$3.evaluate(RandomizedRunner.java:648)
[junit4:junit4]   2> 		at com.carrotsearch.randomizedtesting.RandomizedRunner$4.evaluate(RandomizedRunner.java:682)
[junit4:junit4]   2> 		at com.carrotsearch.randomizedtesting.RandomizedRunner$5.evaluate(RandomizedRunner.java:693)
[junit4:junit4]   2> 		at com.carrotsearch.randomizedtesting.rules.StatementAdapter.evaluate(StatementAdapter.java:36)
[junit4:junit4]   2> 		at com.carrotsearch.randomizedtesting.rules.SystemPropertiesRestoreRule$1.evaluate(SystemPropertiesRestoreRule.java:53)
[junit4:junit4]   2> 		at org.apache.lucene.util.AbstractBeforeAfterRule$1.evaluate(AbstractBeforeAfterRule.java:45)
[junit4:junit4]   2> 		at org.apache.lucene.util.TestRuleStoreClassName$1.evaluate(TestRuleStoreClassName.java:42)
[junit4:junit4]   2> 		at com.carrotsearch.randomizedtesting.rules.SystemPropertiesInvariantRule$1.evaluate(SystemPropertiesInvariantRule.java:55)
[junit4:junit4]   2> 		at com.carrotsearch.randomizedtesting.rules.NoShadowingOrOverridesOnMethodsRule$1.evaluate(NoShadowingOrOverridesOnMethodsRule.java:39)
[junit4:junit4]   2> 		at com.carrotsearch.randomizedtesting.rules.NoShadowingOrOverridesOnMethodsRule$1.evaluate(NoShadowingOrOverridesOnMethodsRule.java:39)
[junit4:junit4]   2> 		at com.carrotsearch.randomizedtesting.rules.StatementAdapter.evaluate(StatementAdapter.java:36)
[junit4:junit4]   2> 		at org.apache.lucene.util.TestRuleAssertionsRequired$1.evaluate(TestRuleAssertionsRequired.java:43)
[junit4:junit4]   2> 		at org.apache.lucene.util.TestRuleMarkFailure$1.evaluate(TestRuleMarkFailure.java:48)
[junit4:junit4]   2> 		at org.apache.lucene.util.TestRuleIgnoreAfterMaxFailures$1.evaluate(TestRuleIgnoreAfterMaxFailures.java:70)
[junit4:junit4]   2> 		at org.apache.lucene.util.TestRuleIgnoreTestSuites$1.evaluate(TestRuleIgnoreTestSuites.java:55)
[junit4:junit4]   2> 		at com.carrotsearch.randomizedtesting.rules.StatementAdapter.evaluate(StatementAdapter.java:36)
[junit4:junit4]   2> 		at com.carrotsearch.randomizedtesting.ThreadLeakControl$StatementRunner.run(ThreadLeakControl.java:358)
[junit4:junit4]   2> 		at java.lang.Thread.run(Thread.java:662)
[junit4:junit4]   2> 	
[junit4:junit4]   2> 61142 T1313 oasc.ClusterStateUpdateTest.setUp ####SETUP_END testCoreRegistration
[junit4:junit4]   2> 61142 T1313 oaz.ZooKeeper.<init> Initiating client connection, connectString=127.0.0.1:53543/solr sessionTimeout=10000 watcher=org.apache.solr.common.cloud.ConnectionManager@4a86dd77
[junit4:junit4]   2> 61144 T1334 oaz.ClientCnxn$SendThread.startConnect Opening socket connection to server /127.0.0.1:53543
[junit4:junit4]   2> 61144 T1313 oascc.ConnectionManager.waitForConnected Waiting for client to connect to ZooKeeper
[junit4:junit4]   2> 61145 T1334 oaz.ClientCnxn$SendThread.primeConnection Socket connection established to 127.0.0.1/127.0.0.1:53543, initiating session
[junit4:junit4]   2> 61146 T1315 oazs.NIOServerCnxn$Factory.run Accepted socket connection from /127.0.0.1:53561
[junit4:junit4]   2> 61146 T1315 oazs.NIOServerCnxn.readConnectRequest Client attempting to establish new session at /127.0.0.1:53561
[junit4:junit4]   2> 61149 T1317 oazs.NIOServerCnxn.finishSessionInit Established session 0x13aad2b67730005 with negotiated timeout 10000 for client /127.0.0.1:53561
[junit4:junit4]   2> 61149 T1334 oaz.ClientCnxn$SendThread.readConnectResult Session establishment complete on server 127.0.0.1/127.0.0.1:53543, sessionid = 0x13aad2b67730005, negotiated timeout = 10000
[junit4:junit4]   2> 61150 T1335 oascc.ConnectionManager.process Watcher org.apache.solr.common.cloud.ConnectionManager@4a86dd77 name:ZooKeeperConnection Watcher:127.0.0.1:53543/solr got event WatchedEvent state:SyncConnected type:None path:null path:null type:None
[junit4:junit4]   2> 61150 T1313 oascc.ConnectionManager.waitForConnected Client is connected to ZooKeeper
[junit4:junit4]   2> 61150 T1313 oascc.SolrZkClient.makePath makePath: /collections/testcore
[junit4:junit4]   2> 61154 T1313 oascc.SolrZkClient.makePath makePath: /collections/testcore/shards
[junit4:junit4]   2> 61158 T1318 oazs.PrepRequestProcessor.pRequest Processed session termination for sessionid: 0x13aad2b67730005
[junit4:junit4]   2> 61159 T1315 oazs.NIOServerCnxn.doIO WARNING EndOfStreamException: Unable to read additional data from client sessionid 0x13aad2b67730005, likely client has closed socket
[junit4:junit4]   2> 61159 T1335 oaz.ClientCnxn$EventThread.run EventThread shut down
[junit4:junit4]   2> 61159 T1313 oaz.ZooKeeper.close Session: 0x13aad2b67730005 closed
[junit4:junit4]   2> 61159 T1315 oazs.NIOServerCnxn.closeSock Closed socket connection for client /127.0.0.1:53561 which had sessionid 0x13aad2b67730005
[junit4:junit4]   2> 61159 T1313 oasc.CoreContainer.create Creating SolrCore 'testcore' using instanceDir: C:\Users\JenkinsSlave\workspace\Lucene-Solr-4.x-Windows\solr\build\solr-core\test-files\solr\testcore
[junit4:junit4]   2> 61160 T1313 oasc.ZkController.createCollectionZkNode Check for collection zkNode:testcore
[junit4:junit4]   2> 61161 T1313 oasc.ZkController.createCollectionZkNode Collection zkNode exists
[junit4:junit4]   2> 61161 T1313 oasc.ZkController.readConfigName Load collection config from:/collections/testcore
[junit4:junit4]   2> 61163 T1313 oasc.SolrResourceLoader.<init> new SolrResourceLoader for directory: 'C:\Users\JenkinsSlave\workspace\Lucene-Solr-4.x-Windows\solr\build\solr-core\test-files\solr\testcore\'
[junit4:junit4]   2> 61225 T1313 oasc.SolrConfig.<init> Using Lucene MatchVersion: LUCENE_41
[junit4:junit4]   2> 61289 T1313 oasc.SolrConfig.<init> Loaded SolrConfig: solrconfig.xml
[junit4:junit4]   2> 61291 T1313 oass.IndexSchema.readSchema Reading Solr Schema
[junit4:junit4]   2> 61297 T1313 oass.IndexSchema.readSchema Schema name=test
[junit4:junit4]   2> 61943 T1313 oass.OpenExchangeRatesOrgProvider.init Initialized with rates=open-exchange-rates.json, refreshInterval=1440.
[junit4:junit4]   2> 61952 T1313 oass.IndexSchema.readSchema default search field in schema is text
[junit4:junit4]   2> 61956 T1313 oass.IndexSchema.readSchema unique key field: id
[junit4:junit4]   2> 61974 T1313 oass.FileExchangeRateProvider.reload Reloading exchange rates from file currency.xml
[junit4:junit4]   2> 61979 T1313 oass.FileExchangeRateProvider.reload Reloading exchange rates from file currency.xml
[junit4:junit4]   2> 61983 T1313 oass.OpenExchangeRatesOrgProvider.reload Reloading exchange rates from open-exchange-rates.json
[junit4:junit4]   2> 61986 T1313 oass.OpenExchangeRatesOrgProvider.reload Reloading exchange rates from open-exchange-rates.json
[junit4:junit4]   2> 61987 T1313 oasc.SolrCore.<init> [testcore] Opening new SolrCore at C:\Users\JenkinsSlave\workspace\Lucene-Solr-4.x-Windows\solr\build\solr-core\test-files\solr\testcore\, dataDir=C:\Users\JenkinsSlave\workspace\Lucene-Solr-4.x-Windows\solr\build\solr-core\test\J0\.\solrtest-ClusterStateUpdateTest-1351525033833\data4\
[junit4:junit4]   2> 61987 T1313 oasc.JmxMonitoredMap.<init> JMX monitoring is enabled. Adding Solr mbeans to JMX Server: com.sun.jmx.mbeanserver.JmxMBeanServer@1766bfd8
[junit4:junit4]   2> 61989 T1313 oasc.SolrCore.getNewIndexDir New index directory detected: old=null new=C:\Users\JenkinsSlave\workspace\Lucene-Solr-4.x-Windows\solr\build\solr-core\test\J0\.\solrtest-ClusterStateUpdateTest-1351525033833\data4\index/
[junit4:junit4]   2> 61989 T1313 oasc.SolrCore.initIndex WARNING [testcore] Solr index directory 'C:\Users\JenkinsSlave\workspace\Lucene-Solr-4.x-Windows\solr\build\solr-core\test\J0\.\solrtest-ClusterStateUpdateTest-1351525033833\data4\index' doesn't exist. Creating new index...
[junit4:junit4]   2> 61991 T1313 oasc.CachingDirectoryFactory.get return new directory for C:\Users\JenkinsSlave\workspace\Lucene-Solr-4.x-Windows\solr\build\solr-core\test\J0\.\solrtest-ClusterStateUpdateTest-1351525033833\data4\index forceNew:false
[junit4:junit4]   2> 61993 T1313 oasc.SolrDeletionPolicy.onCommit SolrDeletionPolicy.onCommit: commits:num=1
[junit4:junit4]   2> 		commit{dir=MockDirWrapper(org.apache.lucene.store.RAMDirectory@722e89f2 lockFactory=org.apache.lucene.store.NativeFSLockFactory@8619c73),segFN=segments_1,generation=1,filenames=[segments_1]
[junit4:junit4]   2> 61993 T1313 oasc.SolrDeletionPolicy.updateCommits newest commit = 1
[junit4:junit4]   2> 61995 T1313 oasc.SolrCore.initWriters created xml: solr.XMLResponseWriter
[junit4:junit4]   2> 61996 T1313 oasup.UpdateRequestProcessorChain.init inserting DistributedUpdateProcessorFactory into updateRequestProcessorChain "dedupe"
[junit4:junit4]   2> 61996 T1313 oasup.UpdateRequestProcessorChain.init inserting DistributedUpdateProcessorFactory into updateRequestProcessorChain "dedupe-allfields"
[junit4:junit4]   2> 61996 T1313 oasup.UpdateRequestProcessorChain.init inserting DistributedUpdateProcessorFactory into updateRequestProcessorChain "stored_sig"
[junit4:junit4]   2> 61997 T1313 oasup.UpdateRequestProcessorChain.init inserting DistributedUpdateProcessorFactory into updateRequestProcessorChain "uniq-fields"
[junit4:junit4]   2> 61997 T1313 oasup.UpdateRequestProcessorChain.init inserting DistributedUpdateProcessorFactory into updateRequestProcessorChain "distrib-dup-test-chain-implicit"
[junit4:junit4]   2> 61998 T1313 oasc.RequestHandlers.initHandlersFromConfig adding lazy requestHandler: solr.ReplicationHandler
[junit4:junit4]   2> 61998 T1313 oasc.RequestHandlers.initHandlersFromConfig created /replication: solr.ReplicationHandler
[junit4:junit4]   2> 61998 T1313 oasc.RequestHandlers.initHandlersFromConfig created standard: solr.StandardRequestHandler
[junit4:junit4]   2> 61999 T1313 oasc.RequestHandlers.initHandlersFromConfig created /get: solr.RealTimeGetHandler
[junit4:junit4]   2> 61999 T1313 oasc.RequestHandlers.initHandlersFromConfig created dismax: solr.SearchHandler
[junit4:junit4]   2> 62000 T1313 oasc.RequestHandlers.initHandlersFromConfig created mock: org.apache.solr.core.MockQuerySenderListenerReqHandler
[junit4:junit4]   2> 62000 T1313 oasc.RequestHandlers.initHandlersFromConfig created /admin/: org.apache.solr.handler.admin.AdminHandlers
[junit4:junit4]   2> 62000 T1313 oasc.RequestHandlers.initHandlersFromConfig created defaults: solr.StandardRequestHandler
[junit4:junit4]   2> 62001 T1313 oasc.RequestHandlers.initHandlersFromConfig adding lazy requestHandler: solr.StandardRequestHandler
[junit4:junit4]   2> 62001 T1313 oasc.RequestHandlers.initHandlersFromConfig created lazy: solr.StandardRequestHandler
[junit4:junit4]   2> 62001 T1313 oasc.RequestHandlers.initHandlersFromConfig created /update: solr.UpdateRequestHandler
[junit4:junit4]   2> 62001 T1313 oasc.RequestHandlers.initHandlersFromConfig created /terms: org.apache.solr.handler.component.SearchHandler
[junit4:junit4]   2> 62002 T1313 oasc.RequestHandlers.initHandlersFromConfig created spellCheckCompRH: org.apache.solr.handler.component.SearchHandler
[junit4:junit4]   2> 62002 T1313 oasc.RequestHandlers.initHandlersFromConfig created spellCheckCompRH_Direct: org.apache.solr.handler.component.SearchHandler
[junit4:junit4]   2> 62002 T1313 oasc.RequestHandlers.initHandlersFromConfig created spellCheckWithWordbreak: org.apache.solr.handler.component.SearchHandler
[junit4:junit4]   2> 62003 T1313 oasc.RequestHandlers.initHandlersFromConfig created spellCheckWithWordbreak_Direct: org.apache.solr.handler.component.SearchHandler
[junit4:junit4]   2> 62003 T1313 oasc.RequestHandlers.initHandlersFromConfig created spellCheckCompRH1: org.apache.solr.handler.component.SearchHandler
[junit4:junit4]   2> 62004 T1313 oasc.RequestHandlers.initHandlersFromConfig created tvrh: org.apache.solr.handler.component.SearchHandler
[junit4:junit4]   2> 62004 T1313 oasc.RequestHandlers.initHandlersFromConfig created /mlt: solr.MoreLikeThisHandler
[junit4:junit4]   2> 62004 T1313 oasc.RequestHandlers.initHandlersFromConfig created /debug/dump: solr.DumpRequestHandler
[junit4:junit4]   2> 62012 T1313 oashl.XMLLoader.init xsltCacheLifetimeSeconds=60
[junit4:junit4]   2> 62017 T1313 oasc.SolrCore.initDeprecatedSupport WARNING solrconfig.xml uses deprecated <admin/gettableFiles>, Please update your config to use the ShowFileRequestHandler.
[junit4:junit4]   2> 62018 T1313 oasc.SolrCore.initDeprecatedSupport WARNING adding ShowFileRequestHandler with hidden files: [SCHEMA.XML, OLD_SYNONYMS.TXT, STOPWORDS.TXT, PROTWORDS.TXT, OPEN-EXCHANGE-RATES.JSON, SYNONYMS.TXT, CURRENCY.XML, MAPPING-ISOLATIN1ACCENT.TXT]
[junit4:junit4]   2> 62023 T1313 oass.SolrIndexSearcher.<init> Opening Searcher@265e24be main
[junit4:junit4]   2> 62023 T1313 oass.SolrIndexSearcher.getIndexDir WARNING WARNING: Directory impl does not support setting indexDir: org.apache.lucene.store.MockDirectoryWrapper
[junit4:junit4]   2> 62023 T1313 oasu.CommitTracker.<init> Hard AutoCommit: disabled
[junit4:junit4]   2> 62025 T1313 oasu.CommitTracker.<init> Soft AutoCommit: disabled
[junit4:junit4]   2> 62025 T1313 oashc.SpellCheckComponent.inform Initializing spell checkers
[junit4:junit4]   2> 62035 T1313 oass.DirectSolrSpellChecker.init init: {name=direct,classname=DirectSolrSpellChecker,field=lowerfilt,minQueryLength=3}
[junit4:junit4]   2> 62089 T1336 oasc.SolrCore.registerSearcher [testcore] Registered new searcher Searcher@265e24be main{StandardDirectoryReader(segments_1:1)}
[junit4:junit4]   2> 62092 T1313 oasc.ZkController.publish numShards not found on descriptor - reading it from system property
[junit4:junit4]   2> 62427 T1325 oascc.ZkStateReader.updateClusterState Updating cloud state from ZooKeeper... 
[junit4:junit4]   2> 62428 T1325 oasc.Overseer$ClusterStateUpdater.updateState Update state numShards=null message={
[junit4:junit4]   2> 	  "operation":"state",
[junit4:junit4]   2> 	  "numShards":null,
[junit4:junit4]   2> 	  "shard":null,
[junit4:junit4]   2> 	  "roles":null,
[junit4:junit4]   2> 	  "state":"down",
[junit4:junit4]   2> 	  "core":"testcore",
[junit4:junit4]   2> 	  "collection":"testcore",
[junit4:junit4]   2> 	  "node_name":"127.0.0.1:1661_solr",
[junit4:junit4]   2> 	  "base_url":"http://127.0.0.1:1661/solr"}
[junit4:junit4]   2> 62434 T1324 oascc.ZkStateReader$2.process A cluster state change has occurred - updating... (3)
[junit4:junit4]   2> 62434 T1329 oascc.ZkStateReader$2.process A cluster state change has occurred - updating... (3)
[junit4:junit4]   2> 62618 T1313 oasc.CoreContainer.register registering core: testcore
[junit4:junit4]   2> 62619 T1313 oasc.ZkController.register Register shard - core:testcore address:http://127.0.0.1:1661/solr shardId:shard1
[junit4:junit4]   2> 62620 T1313 oascc.SolrZkClient.makePath makePath: /collections/testcore/leader_elect/shard1/election
[junit4:junit4]   2> 62632 T1318 oazs.PrepRequestProcessor.pRequest Got user-level KeeperException when processing sessionid:0x13aad2b67730002 type:delete cxid:0x293 zxid:0xfffffffffffffffe txntype:unknown reqpath:n/a Error Path:/solr/collections/testcore/leaders Error:KeeperErrorCode = NoNode for /solr/collections/testcore/leaders
[junit4:junit4]   2> 62634 T1313 oasc.ShardLeaderElectionContext.runLeaderProcess Running the leader process.
[junit4:junit4]   2> 62634 T1318 oazs.PrepRequestProcessor.pRequest Got user-level KeeperException when processing sessionid:0x13aad2b67730002 type:create cxid:0x294 zxid:0xfffffffffffffffe txntype:unknown reqpath:n/a Error Path:/solr/overseer Error:KeeperErrorCode = NodeExists for /solr/overseer
[junit4:junit4]   2> 62638 T1313 oasc.ShardLeaderElectionContext.waitForReplicasToComeUp Enough replicas found to continue.
[junit4:junit4]   2> 62638 T1313 oasc.ShardLeaderElectionContext.runLeaderProcess I may be the new leader - try and sync
[junit4:junit4]   2> 62638 T1313 oasc.ShardLeaderElectionContext.runLeaderProcess I am the new leader: http://127.0.0.1:1661/solr/testcore/
[junit4:junit4]   2> 62638 T1313 oascc.SolrZkClient.makePath makePath: /collections/testcore/leaders/shard1
[junit4:junit4]   2> 62645 T1318 oazs.PrepRequestProcessor.pRequest Got user-level KeeperException when processing sessionid:0x13aad2b67730002 type:create cxid:0x29e zxid:0xfffffffffffffffe txntype:unknown reqpath:n/a Error Path:/solr/overseer Error:KeeperErrorCode = NodeExists for /solr/overseer
[junit4:junit4]   2> 62990 T1325 oascc.ZkStateReader.updateClusterState Updating cloud state from ZooKeeper... 
[junit4:junit4]   2> 63003 T1329 oascc.ZkStateReader$2.process A cluster state change has occurred - updating... (3)
[junit4:junit4]   2> 63003 T1324 oascc.ZkStateReader$2.process A cluster state change has occurred - updating... (3)
[junit4:junit4]   2> 63054 T1313 oasc.ZkController.register We are http://127.0.0.1:1661/solr/testcore/ and leader is http://127.0.0.1:1661/solr/testcore/
[junit4:junit4]   2> 63054 T1313 oasc.ZkController.checkRecovery WARNING Skipping recovery according to sys prop solrcloud.skip.autorecovery
[junit4:junit4]   2> 63054 T1313 oasc.ZkController.publish numShards not found on descriptor - reading it from system property
[junit4:junit4]   2> 63058 T1313 oascc.ZkStateReader.updateClusterState Updating cloud state from ZooKeeper... 
[junit4:junit4]   2> 63059 T1313 oasc.CoreContainer.shutdown Shutting down CoreContainer instance=537946423
[junit4:junit4]   2> 63060 T1318 oazs.PrepRequestProcessor.pRequest Processed session termination for sessionid: 0x13aad2b67730004
[junit4:junit4]   2> 63061 T1315 oazs.NIOServerCnxn.closeSock Closed socket connection for client /127.0.0.1:53558 which had sessionid 0x13aad2b67730004
[junit4:junit4]   2> 63062 T1313 oaz.ZooKeeper.close Session: 0x13aad2b67730004 closed
[junit4:junit4]   2> 63062 T1324 oascc.ZkStateReader$3.process Updating live nodes... (2)
[junit4:junit4]   2> 63062 T1329 oascc.ZkStateReader$3.process Updating live nodes... (2)
[junit4:junit4]   2> 63292 T1329 oaz.ClientCnxn$EventThread.run EventThread shut down
[junit4:junit4]   2> 63292 T1313 oasc.CoreContainer.shutdown Shutting down CoreContainer instance=443749218
[junit4:junit4]   2> 63292 T1315 oazs.NIOServerCnxn.doIO WARNING EndOfStreamException: Unable to read additional data from client sessionid 0x13aad2b67730003, likely client has closed socket
[junit4:junit4]   2> 63294 T1313 oasc.SolrCore.close [collection1]  CLOSING SolrCore org.apache.solr.core.SolrCore@928dc74
[junit4:junit4]   2> 63294 T1315 oazs.NIOServerCnxn.closeSock Closed socket connection for client /127.0.0.1:53555 which had sessionid 0x13aad2b67730003
[junit4:junit4]   2> 63297 T1313 oasu.DirectUpdateHandler2.close closing DirectUpdateHandler2{commits=0,autocommits=0,soft autocommits=0,optimizes=0,rollbacks=0,expungeDeletes=0,docsPending=0,adds=0,deletesById=0,deletesByQuery=0,errors=0,cumulative_adds=0,cumulative_deletesById=0,cumulative_deletesByQuery=0,cumulative_errors=0}
[junit4:junit4]   2> 63297 T1313 oasc.SolrCore.decrefSolrCoreState Closing SolrCoreState
[junit4:junit4]   2> 63297 T1313 oasu.DefaultSolrCoreState.closeIndexWriter SolrCoreState ref count has reached 0 - closing IndexWriter
[junit4:junit4]   2> 63299 T1313 oasu.DefaultSolrCoreState.closeIndexWriter closing IndexWriter with IndexWriterCloser
[junit4:junit4]   2> 63299 T1313 oasc.SolrCore.closeSearcher [collection1] Closing main searcher on request.
[junit4:junit4]   2> 63300 T1313 oasc.SolrResourceLoader.locateSolrHome JNDI not configured for solr (NoInitialContextEx)
[junit4:junit4]   2> 63300 T1313 oasc.SolrResourceLoader.locateSolrHome solr home defaulted to 'solr/' (could not find system property or JNDI)
[junit4:junit4]   2> 63300 T1313 oasc.CoreContainer$Initializer.initialize looking for solr.xml: C:\Users\JenkinsSlave\workspace\Lucene-Solr-4.x-Windows\solr\build\solr-core\test\J0\solr\solr.xml
[junit4:junit4]   2> 63300 T1313 oasc.CoreContainer.<init> New CoreContainer 2083254944
[junit4:junit4]   2> 63301 T1313 oasc.CoreContainer$Initializer.initialize no solr.xml file found - using default
[junit4:junit4]   2> 63301 T1313 oasc.CoreContainer.load Loading CoreContainer using Solr Home: 'solr/'
[junit4:junit4]   2> 63301 T1313 oasc.SolrResourceLoader.<init> new SolrResourceLoader for directory: 'solr/'
[junit4:junit4]   2> 63343 T1313 oasc.CoreContainer.load Registering Log Listener
[junit4:junit4]   2> 63359 T1313 oasc.CoreContainer.initZooKeeper Zookeeper client=127.0.0.1:53543/solr
[junit4:junit4]   2> 63360 T1313 oaz.ZooKeeper.<init> Initiating client connection, connectString=127.0.0.1:53543/solr sessionTimeout=3000 watcher=org.apache.solr.common.cloud.ConnectionManager@16774e1b
[junit4:junit4]   2> 63362 T1337 oaz.ClientCnxn$SendThread.startConnect Opening socket connection to server /127.0.0.1:53543
[junit4:junit4]   2> 63362 T1313 oascc.ConnectionManager.waitForConnected Waiting for client to connect to ZooKeeper
[junit4:junit4]   2> 63363 T1337 oaz.ClientCnxn$SendThread.primeConnection Socket connection established to 127.0.0.1/127.0.0.1:53543, initiating session
[junit4:junit4]   2> 63363 T1315 oazs.NIOServerCnxn$Factory.run Accepted socket connection from /127.0.0.1:53564
[junit4:junit4]   2> 63364 T1315 oazs.NIOServerCnxn.readConnectRequest Client attempting to establish new session at /127.0.0.1:53564
[junit4:junit4]   2> 63367 T1317 oazs.NIOServerCnxn.finishSessionInit Established session 0x13aad2b67730006 with negotiated timeout 3000 for client /127.0.0.1:53564
[junit4:junit4]   2> 63367 T1337 oaz.ClientCnxn$SendThread.readConnectResult Session establishment complete on server 127.0.0.1/127.0.0.1:53543, sessionid = 0x13aad2b67730006, negotiated timeout = 3000
[junit4:junit4]   2> 63367 T1338 oascc.ConnectionManager.process Watcher org.apache.solr.common.cloud.ConnectionManager@16774e1b name:ZooKeeperConnection Watcher:127.0.0.1:53543/solr got event WatchedEvent state:SyncConnected type:None path:null path:null type:None
[junit4:junit4]   2> 63367 T1313 oascc.ConnectionManager.waitForConnected Client is connected to ZooKeeper
[junit4:junit4]   2> 63368 T1318 oazs.PrepRequestProcessor.pRequest Got user-level KeeperException when processing sessionid:0x13aad2b67730006 type:create cxid:0x1 zxid:0xfffffffffffffffe txntype:unknown reqpath:n/a Error Path:/solr/overseer Error:KeeperErrorCode = NodeExists for /solr/overseer
[junit4:junit4]   2> 63370 T1318 oazs.PrepRequestProcessor.pRequest Got user-level KeeperException when processing sessionid:0x13aad2b67730006 type:create cxid:0x2 zxid:0xfffffffffffffffe txntype:unknown reqpath:n/a Error Path:/solr/overseer Error:KeeperErrorCode = NodeExists for /solr/overseer
[junit4:junit4]   2> 63372 T1313 oasc.ZkController.createEphemeralLiveNode Register node as live in ZooKeeper:/live_nodes/JenkinsSlave-PC:8983_solr
[junit4:junit4]   2> 63372 T1318 oazs.PrepRequestProcessor.pRequest Got user-level KeeperException when processing sessionid:0x13aad2b67730006 type:delete cxid:0x4 zxid:0xfffffffffffffffe txntype:unknown reqpath:n/a Error Path:/solr/live_nodes/JenkinsSlave-PC:8983_solr Error:KeeperErrorCode = NoNode for /solr/live_nodes/JenkinsSlave-PC:8983_solr
[junit4:junit4]   2> 63374 T1313 oascc.SolrZkClient.makePath makePath: /live_nodes/JenkinsSlave-PC:8983_solr
[junit4:junit4]   2> 63377 T1324 oascc.ZkStateReader$3.process Updating live nodes... (3)
[junit4:junit4]   2> 63378 T1313 oashc.HttpShardHandlerFactory.getParameter Setting socketTimeout to: 0
[junit4:junit4]   2> 63378 T1313 oashc.HttpShardHandlerFactory.getParameter Setting urlScheme to: http://
[junit4:junit4]   2> 63379 T1313 oashc.HttpShardHandlerFactory.getParameter Setting connTimeout to: 0
[junit4:junit4]   2> 63379 T1313 oashc.HttpShardHandlerFactory.getParameter Setting maxConnectionsPerHost to: 20
[junit4:junit4]   2> 63379 T1313 oashc.HttpShardHandlerFactory.getParameter Setting corePoolSize to: 0
[junit4:junit4]   2> 63380 T1313 oashc.HttpShardHandlerFactory.getParameter Setting maximumPoolSize to: 2147483647
[junit4:junit4]   2> 63380 T1313 oashc.HttpShardHandlerFactory.getParameter Setting maxThreadIdleTime to: 5
[junit4:junit4]   2> 63380 T1313 oashc.HttpShardHandlerFactory.getParameter Setting sizeOfQueue to: -1
[junit4:junit4]   2> 63380 T1313 oashc.HttpShardHandlerFactory.getParameter Setting fairnessPolicy to: false
[junit4:junit4]   2> 63381 T1313 oascsi.HttpClientUtil.createClient Creating new http client, config:maxConnectionsPerHost=20&maxConnections=10000&socketTimeout=0&connTimeout=0&retry=false
[junit4:junit4]   2> 63393 T1313 oascc.ZkStateReader.createClusterStateWatchersAndUpdate Updating cluster state from ZooKeeper... 
[junit4:junit4]   2> 63401 T1313 oasc.CoreContainer.create Creating SolrCore 'collection1' using instanceDir: solr\collection1
[junit4:junit4]   2> 63401 T1313 oasc.ZkController.createCollectionZkNode Check for collection zkNode:collection1
[junit4:junit4]   2> 63402 T1313 oasc.ZkController.createCollectionZkNode Collection zkNode exists
[junit4:junit4]   2> 63404 T1313 oasc.ZkController.readConfigName Load collection config from:/collections/collection1
[junit4:junit4]   2> 63405 T1313 oasc.SolrResourceLoader.<init> new SolrResourceLoader for directory: 'solr\collection1\'
[junit4:junit4]   2> 63452 T1313 oasc.SolrConfig.<init> Using Lucene MatchVersion: LUCENE_41
[junit4:junit4]   2> 63541 T1313 oasc.SolrConfig.<init> Loaded SolrConfig: solrconfig.xml
[junit4:junit4]   2> 63542 T1313 oass.IndexSchema.readSchema Reading Solr Schema
[junit4:junit4]   2> 63547 T1313 oass.IndexSchema.readSchema Schema name=test
[junit4:junit4]   2> 63584 T1325 oascc.ZkStateReader.updateClusterState Updating cloud state from ZooKeeper... 
[junit4:junit4]   2> 63586 T1325 oasc.Overseer$ClusterStateUpdater.updateState Update state numShards=null message={
[junit4:junit4]   2> 	  "operation":"state",
[junit4:junit4]   2> 	  "numShards":null,
[junit4:junit4]   2> 	  "shard":"shard1",
[junit4:junit4]   2> 	  "roles":null,
[junit4:junit4]   2> 	  "state":"active",
[junit4:junit4]   2> 	  "core":"testcore",
[junit4:junit4]   2> 	  "collection":"testcore",
[junit4:junit4]   2> 	  "node_name":"127.0.0.1:1661_solr",
[junit4:junit4]   2> 	  "base_url":"http://127.0.0.1:1661/solr"}
[junit4:junit4]   2> 63595 T1338 oascc.ZkStateReader$2.process A cluster state change has occurred - updating... (3)
[junit4:junit4]   2> 63595 T1324 oascc.ZkStateReader$2.process A cluster state change has occurred - updating... (3)
[junit4:junit4]   2> 64211 T1332 oascc.ZkStateReader$3.process WARNING ZooKeeper watch triggered, but Solr cannot talk to ZK
[junit4:junit4]   2> 64210 T1313 oass.OpenExchangeRatesOrgProvider.init Initialized with rates=open-exchange-rates.json, refreshInterval=1440.
[junit4:junit4]   2> 64211 T1332 oaz.ClientCnxn$EventThread.run EventThread shut down
[junit4:junit4]   2> 64219 T1313 oass.IndexSchema.readSchema default search field in schema is text
[junit4:junit4]   2> 64224 T1313 oass.IndexSchema.readSchema unique key field: id
[junit4:junit4]   2> 64238 T1313 oass.FileExchangeRateProvider.reload Reloading exchange rates from file currency.xml
[junit4:junit4]   2> 64243 T1313 oass.FileExchangeRateProvider.reload Reloading exchange rates from file currency.xml
[junit4:junit4]   2> 64249 T1313 oass.OpenExchangeRatesOrgProvider.reload Reloading exchange rates from open-exchange-rates.json
[junit4:junit4]   2> 64251 T1313 oass.OpenExchangeRatesOrgProvider.reload Reloading exchange rates from open-exchange-rates.json
[junit4:junit4]   2> 64252 T1313 oasc.SolrCore.<init> [collection1] Opening new SolrCore at solr\collection1\, dataDir=C:\Users\JenkinsSlave\workspace\Lucene-Solr-4.x-Windows\solr\build\solr-core\test\J0\.\solrtest-ClusterStateUpdateTest-1351525033833\data3\
[junit4:junit4]   2> 64253 T1313 oasc.JmxMonitoredMap.<init> JMX monitoring is enabled. Adding Solr mbeans to JMX Server: com.sun.jmx.mbeanserver.JmxMBeanServer@1766bfd8
[junit4:junit4]   2> 64254 T1313 oasc.SolrCore.getNewIndexDir New index directory detected: old=null new=C:\Users\JenkinsSlave\workspace\Lucene-Solr-4.x-Windows\solr\build\solr-core\test\J0\.\solrtest-ClusterStateUpdateTest-1351525033833\data3\index/
[junit4:junit4]   2> 64255 T1313 oasc.SolrCore.initIndex WARNING [collection1] Solr index directory 'C:\Users\JenkinsSlave\workspace\Lucene-Solr-4.x-Windows\solr\build\solr-core\test\J0\.\solrtest-ClusterStateUpdateTest-1351525033833\data3\index' doesn't exist. Creating new index...
[junit4:junit4]   2> 64256 T1313 oasc.CachingDirectoryFactory.get return new directory for C:\Users\JenkinsSlave\workspace\Lucene-Solr-4.x-Windows\solr\build\solr-core\test\J0\.\solrtest-ClusterStateUpdateTest-1351525033833\data3\index forceNew:false
[junit4:junit4]   2> 64257 T1313 oasc.SolrDeletionPolicy.onCommit SolrDeletionPolicy.onCommit: commits:num=1
[junit4:junit4]   2> 		commit{dir=MockDirWrapper(org.apache.lucene.store.RAMDirectory@179bafa7 lockFactory=org.apache.lucene.store.NativeFSLockFactory@48112b54),segFN=segments_1,generation=1,filenames=[segments_1]
[junit4:junit4]   2> 64258 T1313 oasc.SolrDeletionPolicy.updateCommits newest commit = 1
[junit4:junit4]   2> 64258 T1313 oasc.SolrCore.initWriters created xml: solr.XMLResponseWriter
[junit4:junit4]   2> 64261 T1313 oasup.UpdateRequestProcessorChain.init inserting DistributedUpdateProcessorFactory into updateRequestProcessorChain "dedupe"
[junit4:junit4]   2> 64261 T1313 oasup.UpdateRequestProcessorChain.init inserting DistributedUpdateProcessorFactory into updateRequestProcessorChain "dedupe-allfields"
[junit4:junit4]   2> 64262 T1313 oasup.UpdateRequestProcessorChain.init inserting DistributedUpdateProcessorFactory into updateRequestProcessorChain "stored_sig"
[junit4:junit4]   2> 64262 T1313 oasup.UpdateRequestProcessorChain.init inserting DistributedUpdateProcessorFactory into updateRequestProcessorChain "uniq-fields"
[junit4:junit4]   2> 64263 T1313 oasup.UpdateRequestProcessorChain.init inserting DistributedUpdateProcessorFactory into updateRequestProcessorChain "distrib-dup-test-chain-implicit"
[junit4:junit4]   2> 64263 T1313 oasc.RequestHandlers.initHandlersFromConfig adding lazy requestHandler: solr.ReplicationHandler
[junit4:junit4]   2> 64264 T1313 oasc.RequestHandlers.initHandlersFromConfig created /replication: solr.ReplicationHandler
[junit4:junit4]   2> 64264 T1313 oasc.RequestHandlers.initHandlersFromConfig created standard: solr.StandardRequestHandler
[junit4:junit4]   2> 64264 T1313 oasc.RequestHandlers.initHandlersFromConfig created /get: solr.RealTimeGetHandler
[junit4:junit4]   2> 64266 T1313 oasc.RequestHandlers.initHandlersFromConfig created dismax: solr.SearchHandler
[junit4:junit4]   2> 64266 T1313 oasc.RequestHandlers.initHandlersFromConfig created mock: org.apache.solr.core.MockQuerySenderListenerReqHandler
[junit4:junit4]   2> 64266 T1313 oasc.RequestHandlers.initHandlersFromConfig created /admin/: org.apache.solr.handler.admin.AdminHandlers
[junit4:junit4]   2> 64267 T1313 oasc.RequestHandlers.initHandlersFromConfig created defaults: solr.StandardRequestHandler
[junit4:junit4]   2> 64267 T1313 oasc.RequestHandlers.initHandlersFromConfig adding lazy requestHandler: solr.StandardRequestHandler
[junit4:junit4]   2> 64267 T1313 oasc.RequestHandlers.initHandlersFromConfig created lazy: solr.StandardRequestHandler
[junit4:junit4]   2> 64267 T1313 oasc.RequestHandlers.initHandlersFromConfig created /update: solr.UpdateRequestHandler
[junit4:junit4]   2> 64269 T1313 oasc.RequestHandlers.initHandlersFromConfig created /terms: org.apache.solr.handler.component.SearchHandler
[junit4:junit4]   2> 64269 T1313 oasc.RequestHandlers.initHandlersFromConfig created spellCheckCompRH: org.apache.solr.handler.component.SearchHandler
[junit4:junit4]   2> 64269 T1313 oasc.RequestHandlers.initHandlersFromConfig created spellCheckCompRH_Direct: org.apache.solr.handler.component.SearchHandler
[junit4:junit4]   2> 64269 T1313 oasc.RequestHandlers.initHandlersFromConfig created spellCheckWithWordbreak: org.apache.solr.handler.component.SearchHandler
[junit4:junit4]   2> 64270 T1313 oasc.RequestHandlers.initHandlersFromConfig created spellCheckWithWordbreak_Direct: org.apache.solr.handler.component.SearchHandler
[junit4:junit4]   2> 64270 T1313 oasc.RequestHandlers.initHandlersFromConfig created spellCheckCompRH1: org.apache.solr.handler.component.SearchHandler
[junit4:junit4]   2> 64270 T1313 oasc.RequestHandlers.initHandlersFromConfig created tvrh: org.apache.solr.handler.component.SearchHandler
[junit4:junit4]   2> 64272 T1313 oasc.RequestHandlers.initHandlersFromConfig created /mlt: solr.MoreLikeThisHandler
[junit4:junit4]   2> 64272 T1313 oasc.RequestHandlers.initHandlersFromConfig created /debug/dump: solr.DumpRequestHandler
[junit4:junit4]   2> 64280 T1313 oashl.XMLLoader.init xsltCacheLifetimeSeconds=60
[junit4:junit4]   2> 64284 T1313 oasc.SolrCore.initDeprecatedSupport WARNING solrconfig.xml uses deprecated <admin/gettableFiles>, Please update your config to use the ShowFileRequestHandler.
[junit4:junit4]   2> 64285 T1313 oasc.SolrCore.initDeprecatedSupport WARNING adding ShowFileRequestHandler with hidden files: [SCHEMA.XML, OLD_SYNONYMS.TXT, STOPWORDS.TXT, PROTWORDS.TXT, OPEN-EXCHANGE-RATES.JSON, SYNONYMS.TXT, CURRENCY.XML, MAPPING-ISOLATIN1ACCENT.TXT]
[junit4:junit4]   2> 64289 T1313 oass.SolrIndexSearcher.<init> Opening Searcher@6fe9e850 main
[junit4:junit4]   2> 64289 T1313 oass.SolrIndexSearcher.getIndexDir WARNING WARNING: Directory impl does not support setting indexDir: org.apache.lucene.store.MockDirectoryWrapper
[junit4:junit4]   2> 64289 T1313 oasu.CommitTracker.<init> Hard AutoCommit: disabled
[junit4:junit4]   2> 64290 T1313 oasu.CommitTracker.<init> Soft AutoCommit: disabled
[junit4:junit4]   2> 64290 T1313 oashc.SpellCheckComponent.inform Initializing spell checkers
[junit4:junit4]   2> 64294 T1313 oass.DirectSolrSpellChecker.init init: {name=direct,classname=DirectSolrSpellChecker,field=lowerfilt,minQueryLength=3}
[junit4:junit4]   2> 64316 T1339 oasc.SolrCore.registerSearcher [collection1] Registered new searcher Searcher@6fe9e850 main{StandardDirectoryReader(segments_1:1)}
[junit4:junit4]   2> 64319 T1313 oasc.ZkController.publish numShards not found on descriptor - reading it from system property
[junit4:junit4]   2> 64750 T1325 oascc.ZkStateReader.updateClusterState Updating cloud state from ZooKeeper... 
[junit4:junit4]   2> 64752 T1325 oasc.Overseer$ClusterStateUpdater.updateState Update state numShards=null message={
[junit4:junit4]   2> 	  "operation":"state",
[junit4:junit4]   2> 	  "numShards":null,
[junit4:junit4]   2> 	  "shard":null,
[junit4:junit4]   2> 	  "roles":null,
[junit4:junit4]   2> 	  "state":"down",
[junit4:junit4]   2> 	  "core":"collection1",
[junit4:junit4]   2> 	  "collection":"collection1",
[junit4:junit4]   2> 	  "node_name":"JenkinsSlave-PC:8983_solr",
[junit4:junit4]   2> 	  "base_url":"http://JenkinsSlave-PC:8983/solr"}
[junit4:junit4]   2> 64759 T1324 oascc.ZkStateReader$2.process A cluster state change has occurred - updating... (3)
[junit4:junit4]   2> 64759 T1338 oascc.ZkStateReader$2.process A cluster state change has occurred - updating... (3)
[junit4:junit4]   2> 64896 T1313 oasc.CoreContainer.register registering core: collection1
[junit4:junit4]   2> 64896 T1313 oasc.ZkController.register Register shard - core:collection1 address:http://JenkinsSlave-PC:8983/solr shardId:shard1
[junit4:junit4]   2> 64902 T1313 oasc.ZkController.register We are http://JenkinsSlave-PC:8983/solr/collection1/ and leader is http://127.0.0.1:1661/solr/collection1/
[junit4:junit4]   2> 64902 T1313 oasc.ZkController.checkRecovery WARNING Skipping recovery according to sys prop solrcloud.skip.autorecovery
[junit4:junit4]   2> 64903 T1313 oasc.ZkController.publish numShards not found on descriptor - reading it from system property
[junit4:junit4]   2> 64905 T1313 oascc.ZkStateReader.updateClusterState Updating cloud state from ZooKeeper... 
[junit4:junit4]   2> 64907 T1313 oasc.CoreContainer.shutdown Shutting down CoreContainer instance=2141047751
[junit4:junit4]   2> 64907 T1313 oasc.SolrCore.close [collection1]  CLOSING SolrCore org.apache.solr.core.SolrCore@21055e62
[junit4:junit4]   2> 64911 T1313 oasu.DirectUpdateHandler2.close closing DirectUpdateHandler2{commits=0,autocommits=0,soft autocommits=0,optimizes=0,rollbacks=0,expungeDeletes=0,docsPending=0,adds=0,deletesById=0,deletesByQuery=0,errors=0,cumulative_adds=0,cumulative_deletesById=0,cumulative_deletesByQuery=0,cumulative_errors=0}
[junit4:junit4]   2> 64911 T1313 oasc.SolrCore.decrefSolrCoreState Closing SolrCoreState
[junit4:junit4]   2> 64911 T1313 oasu.DefaultSolrCoreState.closeIndexWriter SolrCoreState ref count has reached 0 - closing IndexWriter
[junit4:junit4]   2> 64911 T1313 oasu.DefaultSolrCoreState.closeIndexWriter closing IndexWriter with IndexWriterCloser
[junit4:junit4]   2> 64913 T1313 oasc.SolrCore.closeSearcher [collection1] Closing main searcher on request.
[junit4:junit4]   2> 64913 T1313 oasc.SolrCore.close [testcore]  CLOSING SolrCore org.apache.solr.core.SolrCore@10bb3372
[junit4:junit4]   2> 64919 T1313 oasu.DirectUpdateHandler2.close closing DirectUpdateHandler2{commits=0,autocommits=0,soft autocommits=0,optimizes=0,rollbacks=0,expungeDeletes=0,docsPending=0,adds=0,deletesById=0,deletesByQuery=0,errors=0,cumulative_adds=0,cumulative_deletesById=0,cumulative_deletesByQuery=0,cumulative_errors=0}
[junit4:junit4]   2> 64919 T1313 oasc.SolrCore.decrefSolrCoreState Closing SolrCoreState
[junit4:junit4]   2> 64919 T1313 oasu.DefaultSolrCoreState.closeIndexWriter SolrCoreState ref count has reached 0 - closing IndexWriter
[junit4:junit4]   2> 64919 T1313 oasu.DefaultSolrCoreState.closeIndexWriter closing IndexWriter with IndexWriterCloser
[junit4:junit4]   2> 64920 T1313 oasc.SolrCore.closeSearcher [testcore] Closing main searcher on request.
[junit4:junit4]   2> 64922 T1325 oasc.Overseer$ClusterStateUpdater.amILeader According to ZK I (id=88573544617934850-127.0.0.1:1661_solr-n_0000000000) am no longer a leader.
[junit4:junit4]   2> 64923 T1318 oazs.PrepRequestProcessor.pRequest Processed session termination for sessionid: 0x13aad2b67730002
[junit4:junit4]   2> 64926 T1313 oaz.ZooKeeper.close Session: 0x13aad2b67730002 closed
[junit4:junit4]   2> 64926 T1315 oazs.NIOServerCnxn.doIO WARNING EndOfStreamException: Unable to read additional data from client sessionid 0x13aad2b67730002, likely client has closed socket
[junit4:junit4]   2> 64926 T1338 oascc.ZkStateReader$3.process Updating live nodes... (2)
[junit4:junit4]   2> 64927 T1315 oazs.NIOServerCnxn.closeSock Closed socket connection for client /127.0.0.1:53552 which had sessionid 0x13aad2b67730002
[junit4:junit4]   2> 64926 T1313 oasc.CoreContainer.shutdown Shutting down CoreContainer instance=2083254944
[junit4:junit4]   2> 64927 T1313 oasc.SolrCore.close [collection1]  CLOSING SolrCore org.apache.solr.core.SolrCore@568ef25
[junit4:junit4]   2> 64934 T1313 oasu.DirectUpdateHandler2.close closing DirectUpdateHandler2{commits=0,autocommits=0,soft autocommits=0,optimizes=0,rollbacks=0,expungeDeletes=0,docsPending=0,adds=0,deletesById=0,deletesByQuery=0,errors=0,cumulative_adds=0,cumulative_deletesById=0,cumulative_deletesByQuery=0,cumulative_errors=0}
[junit4:junit4]   2> 64934 T1313 oasc.SolrCore.decrefSolrCoreState Closing SolrCoreState
[junit4:junit4]   2> 64935 T1313 oasu.DefaultSolrCoreState.closeIndexWriter SolrCoreState ref count has reached 0 - closing IndexWriter
[junit4:junit4]   2> 64935 T1313 oasu.DefaultSolrCoreState.closeIndexWriter closing IndexWriter with IndexWriterCloser
[junit4:junit4]   2> 64936 T1313 oasc.SolrCore.closeSearcher [collection1] Closing main searcher on request.
[junit4:junit4]   2> 64941 T1318 oazs.PrepRequestProcessor.pRequest Processed session termination for sessionid: 0x13aad2b67730006
[junit4:junit4]   2> 64944 T1315 oazs.NIOServerCnxn.closeSock Closed socket connection for client /127.0.0.1:53564 which had sessionid 0x13aad2b67730006
[junit4:junit4]   2> 64944 T1313 oaz.ZooKeeper.close Session: 0x13aad2b67730006 closed
[junit4:junit4]   2> 64944 T1313 oasc.CoreContainer.shutdown Shutting down CoreContainer instance=537946423
[junit4:junit4]   2> 64945 T1318 oazs.PrepRequestProcessor.run PrepRequestProcessor exited loop!
[junit4:junit4]   2> 64945 T1317 oazs.SyncRequestProcessor.run SyncRequestProcessor exited!
[junit4:junit4]   2> 64945 T1313 oazs.FinalRequestProcessor.shutdown shutdown of request processor complete
[junit4:junit4]   2> 65300 T1316 oazs.SessionTrackerImpl.run SessionTrackerImpl exited loop!
[junit4:junit4]   2> 66093 T1338 oascc.ZkStateReader$3.process WARNING ZooKeeper watch triggered, but Solr cannot talk to ZK
[junit4:junit4]   2> 66076 T1324 oascc.ZkStateReader$3.process WARNING ZooKeeper watch triggered, but Solr cannot talk to ZK
[junit4:junit4]   2> 67535 T1324 oaz.ClientCnxn$EventThread.run EventThread shut down
[junit4:junit4]   2> 67535 T1338 oaz.ClientCnxn$EventThread.run EventThread shut down
[junit4:junit4]   2> 67535 T1315 oazs.NIOServerCnxn$Factory.run NIOServerCnxn factory exited run method
[junit4:junit4]   2> 67537 T1313 oazs.FinalRequestProcessor.shutdown shutdown of request processor complete
[junit4:junit4]   2> 67537 T1313 oas.SolrTestCaseJ4.tearDown ###Ending testCoreRegistration
[junit4:junit4]   2> 67538 T1313 oas.SolrTestCaseJ4.deleteCore ###deleteCore
[junit4:junit4]   2> 195716 T1313 oas.SolrTestCaseJ4.endTrackingSearchers SEVERE ERROR: SolrIndexSearcher opens=5 closes=4
[junit4:junit4]   2> 195719 T1312 ccr.ThreadLeakControl.checkThreadLeaks WARNING Will linger awaiting termination of 1 leaked thread(s).
[junit4:junit4]   2> 215828 T1312 ccr.ThreadLeakControl.checkThreadLeaks SEVERE 1 thread leaked from SUITE scope at org.apache.solr.cloud.ClusterStateUpdateTest: 
[junit4:junit4]   2> 	   1) Thread[id=1333, name=searcherExecutor-759-thread-1, state=WAITING, group=TGRP-ClusterStateUpdateTest]
[junit4:junit4]   2> 	        at sun.misc.Unsafe.park(Native Method)
[junit4:junit4]   2> 	        at java.util.concurrent.locks.LockSupport.park(LockSupport.java:156)
[junit4:junit4]   2> 	        at java.util.concurrent.locks.AbstractQueuedSynchronizer$ConditionObject.await(AbstractQueuedSynchronizer.java:1987)
[junit4:junit4]   2> 	        at java.util.concurrent.LinkedBlockingQueue.take(LinkedBlockingQueue.java:399)
[junit4:junit4]   2> 	        at java.util.concurrent.ThreadPoolExecutor.getTask(ThreadPoolExecutor.java:947)
[junit4:junit4]   2> 	        at java.util.concurrent.ThreadPoolExecutor$Worker.run(ThreadPoolExecutor.java:907)
[junit4:junit4]   2> 	        at java.lang.Thread.run(Thread.java:662)
[junit4:junit4]   2> 215828 T1312 ccr.ThreadLeakControl.tryToInterruptAll Starting to interrupt leaked threads:
[junit4:junit4]   2> 	   1) Thread[id=1333, name=searcherExecutor-759-thread-1, state=WAITING, group=TGRP-ClusterStateUpdateTest]
[junit4:junit4]   2> 218831 T1312 ccr.ThreadLeakControl.tryToInterruptAll SEVERE There are still zombie threads that couldn't be terminated:
[junit4:junit4]   2> 	   1) Thread[id=1333, name=searcherExecutor-759-thread-1, state=WAITING, group=TGRP-ClusterStateUpdateTest]
[junit4:junit4]   2> 	        at sun.misc.Unsafe.park(Native Method)
[junit4:junit4]   2> 	        at java.util.concurrent.locks.LockSupport.park(LockSupport.java:156)
[junit4:junit4]   2> 	        at java.util.concurrent.locks.AbstractQueuedSynchronizer$ConditionObject.await(AbstractQueuedSynchronizer.java:1987)
[junit4:junit4]   2> 	        at java.util.concurrent.LinkedBlockingQueue.take(LinkedBlockingQueue.java:399)
[junit4:junit4]   2> 	        at java.util.concurrent.ThreadPoolExecutor.getTask(ThreadPoolExecutor.java:947)
[junit4:junit4]   2> 	        at java.util.concurrent.ThreadPoolExecutor$Worker.run(ThreadPoolExecutor.java:907)
[junit4:junit4]   2> 	        at java.lang.Thread.run(Thread.java:662)
[junit4:junit4]   2> NOTE: test params are: codec=Lucene40, sim=RandomSimilarityProvider(queryNorm=false,coord=yes): {}, locale=pt, timezone=America/Santiago
[junit4:junit4]   2> NOTE: Windows 7 6.1 amd64/Sun Microsystems Inc. 1.6.0_35 (64-bit)/cpus=2,threads=2,free=28468080,total=101269504
[junit4:junit4]   2> NOTE: All tests run in this JVM: [DefaultValueUpdateProcessorTest, TestReversedWildcardFilterFactory, UniqFieldsUpdateProcessorFactoryTest, DateMathParserTest, AnalysisAfterCoreReloadTest, TestFastWriter, TestNumberUtils, SignatureUpdateProcessorFactoryTest, SampleTest, UpdateRequestProcessorFactoryTest, UpdateParamsTest, FileUtilsTest, TestFunctionQuery, LoggingHandlerTest, TestBinaryField, IndexSchemaTest, TestFastOutputStream, StandardRequestHandlerTest, TestConfig, PreAnalyzedFieldTest, URLClassifyProcessorTest, TestGroupingSearch, AutoCommitTest, LukeRequestHandlerTest, FieldAnalysisRequestHandlerTest, XsltUpdateRequestHandlerTest, TestStressReorder, SpellCheckComponentTest, SyncSliceTest, NoCacheHeaderTest, TestJmxIntegration, TestStressRecovery, TestDocumentBuilder, FullSolrCloudDistribCmdsTest, TestUpdate, IndexSchemaRuntimeFieldTest, OverseerTest, TestRemoteStreaming, TestCollationField, SpellingQueryConverterTest, SolrCoreTest, ZkControllerTest, TestSolrDeletionPolicy1, DocumentAnalysisRequestHandlerTest, TestArbitraryIndexDir, IndexReaderFactoryTest, SuggesterWFSTTest, MBeansHandlerTest, EchoParamsTest, TermVectorComponentDistributedTest, RequestHandlersTest, PrimitiveFieldTypeTest, SolrIndexConfigTest, TestXIncludeConfig, TestBM25SimilarityFactory, TestDistributedSearch, CoreAdminHandlerTest, DirectUpdateHandlerOptimizeTest, SoftAutoCommitTest, PingRequestHandlerTest, PeerSyncTest, OutputWriterTest, ZkNodePropsTest, IndexBasedSpellCheckerTest, SolrRequestParserTest, ScriptEngineTest, TestHashPartitioner, TestCharFilters, PathHierarchyTokenizerFactoryTest, ShowFileRequestHandlerTest, TestRTGBase, TestIBSimilarityFactory, TestWriterPerf, TestSolr4Spatial, TestSort, DirectSolrConnectionTest, TestDocSet, TestCollationKeyRangeQueries, ReturnFieldsTest, TestSearchPerf, TestPropInject, OpenExchangeRatesOrgProviderTest, FastVectorHighlighterTest, SuggesterTSTTest, JSONWriterTest, TestLFUCache, MultiTermTest, TestSolrXMLSerializer, ClusterStateUpdateTest]
[junit4:junit4]   2> NOTE: reproduce with: ant test  -Dtestcase=ClusterStateUpdateTest -Dtests.seed=6E49186C5E68A6F9 -Dtests.slow=true -Dtests.locale=pt -Dtests.timezone=America/Santiago -Dtests.file.encoding=UTF-8
[junit4:junit4] ERROR   0.00s | ClusterStateUpdateTest (suite) <<<
[junit4:junit4]    > Throwable #1: java.lang.AssertionError: ERROR: SolrIndexSearcher opens=5 closes=4
[junit4:junit4]    > 	at __randomizedtesting.SeedInfo.seed([6E49186C5E68A6F9]:0)
[junit4:junit4]    > 	at org.junit.Assert.fail(Assert.java:93)
[junit4:junit4]    > 	at org.apache.solr.SolrTestCaseJ4.endTrackingSearchers(SolrTestCaseJ4.java:242)
[junit4:junit4]    > 	at org.apache.solr.SolrTestCaseJ4.afterClass(SolrTestCaseJ4.java:97)
[junit4:junit4]    > 	at sun.reflect.GeneratedMethodAccessor19.invoke(Unknown Source)
[junit4:junit4]    > 	at sun.reflect.DelegatingMethodAccessorImpl.invoke(DelegatingMethodAccessorImpl.java:25)
[junit4:junit4]    > 	at java.lang.reflect.Method.invoke(Method.java:597)
[junit4:junit4]    > 	at com.carrotsearch.randomizedtesting.RandomizedRunner.invoke(RandomizedRunner.java:1559)
[junit4:junit4]    > 	at com.carrotsearch.randomizedtesting.RandomizedRunner.access$600(RandomizedRunner.java:79)
[junit4:junit4]    > 	at com.carrotsearch.randomizedtesting.RandomizedRunner$5.evaluate(RandomizedRunner.java:700)
[junit4:junit4]    > 	at com.carrotsearch.randomizedtesting.rules.StatementAdapter.evaluate(StatementAdapter.java:36)
[junit4:junit4]    > 	at com.carrotsearch.randomizedtesting.rules.SystemPropertiesRestoreRule$1.evaluate(SystemPropertiesRestoreRule.java:53)
[junit4:junit4]    > 	at org.apache.lucene.util.AbstractBeforeAfterRule$1.evaluate(AbstractBeforeAfterRule.java:45)
[junit4:junit4]    > 	at org.apache.lucene.util.TestRuleStoreClassName$1.evaluate(TestRuleStoreClassName.java:42)
[junit4:junit4]    > 	at com.carrotsearch.randomizedtesting.rules.SystemPropertiesInvariantRule$1.evaluate(SystemPropertiesInvariantRule.java:55)
[junit4:junit4]    > 	at com.carrotsearch.randomizedtesting.rules.NoShadowingOrOverridesOnMethodsRule$1.evaluate(NoShadowingOrOverridesOnMethodsRule.java:39)
[junit4:junit4]    > 	at com.carrotsearch.randomizedtesting.rules.NoShadowingOrOverridesOnMethodsRule$1.evaluate(NoShadowingOrOverridesOnMethodsRule.java:39)
[junit4:junit4]    > 	at com.carrotsearch.randomizedtesting.rules.StatementAdapter.evaluate(StatementAdapter.java:36)
[junit4:junit4]    > 	at org.apache.lucene.util.TestRuleAssertionsRequired$1.evaluate(TestRuleAssertionsRequired.java:43)
[junit4:junit4]    > 	at org.apache.lucene.util.TestRuleMarkFailure$1.evaluate(TestRuleMarkFailure.java:48)
[junit4:junit4]    > 	at org.apache.lucene.util.TestRuleIgnoreAfterMaxFailures$1.evaluate(TestRuleIgnoreAfterMaxFailures.java:70)
[junit4:junit4]    > 	at org.apache.lucene.util.TestRuleIgnoreTestSuites$1.evaluate(TestRuleIgnoreTestSuites.java:55)
[junit4:junit4]    > 	at com.carrotsearch.randomizedtesting.rules.StatementAdapter.evaluate(StatementAdapter.java:36)
[junit4:junit4]    > 	at com.carrotsearch.randomizedtesting.ThreadLeakControl$StatementRunner.run(ThreadLeakControl.java:358)
[junit4:junit4]    > 	at java.lang.Thread.run(Thread.java:662)
[junit4:junit4]    > Throwable #2: com.carrotsearch.randomizedtesting.ThreadLeakError: 1 thread leaked from SUITE scope at org.apache.solr.cloud.ClusterStateUpdateTest: 
[junit4:junit4]    >    1) Thread[id=1333, name=searcherExecutor-759-thread-1, state=WAITING, group=TGRP-ClusterStateUpdateTest]
[junit4:junit4]    >         at sun.misc.Unsafe.park(Native Method)
[junit4:junit4]    >         at java.util.concurrent.locks.LockSupport.park(LockSupport.java:156)
[junit4:junit4]    >         at java.util.concurrent.locks.AbstractQueuedSynchronizer$ConditionObject.await(AbstractQueuedSynchronizer.java:1987)
[junit4:junit4]    >         at java.util.concurrent.LinkedBlockingQueue.take(LinkedBlockingQueue.java:399)
[junit4:junit4]    >         at java.util.concurrent.ThreadPoolExecutor.getTask(ThreadPoolExecutor.java:947)
[junit4:junit4]    >         at java.util.concurrent.ThreadPoolExecutor$Worker.run(ThreadPoolExecutor.java:907)
[junit4:junit4]    >         at java.lang.Thread.run(Thread.java:662)
[junit4:junit4]    > 	at __randomizedtesting.SeedInfo.seed([6E49186C5E68A6F9]:0)
[junit4:junit4]    > Throwable #3: com.carrotsearch.randomizedtesting.ThreadLeakError: There are still zombie threads that couldn't be terminated:
[junit4:junit4]    >    1) Thread[id=1333, name=searcherExecutor-759-thread-1, state=WAITING, group=TGRP-ClusterStateUpdateTest]
[junit4:junit4]    >         at sun.misc.Unsafe.park(Native Method)
[junit4:junit4]    >         at java.util.concurrent.locks.LockSupport.park(LockSupport.java:156)
[junit4:junit4]    >         at java.util.concurrent.locks.AbstractQueuedSynchronizer$ConditionObject.await(AbstractQueuedSynchronizer.java:1987)
[junit4:junit4]    >         at java.util.concurrent.LinkedBlockingQueue.take(LinkedBlockingQueue.java:399)
[junit4:junit4]    >         at java.util.concurrent.ThreadPoolExecutor.getTask(ThreadPoolExecutor.java:947)
[junit4:junit4]    >         at java.util.concurrent.ThreadPoolExecutor$Worker.run(ThreadPoolExecutor.java:907)
[junit4:junit4]    >         at java.lang.Thread.run(Thread.java:662)
[junit4:junit4]    > 	at __randomizedtesting.SeedInfo.seed([6E49186C5E68A6F9]:0)
[junit4:junit4] Completed in 218.87s, 1 test, 1 failure, 2 errors <<< FAILURES!

[...truncated 426 lines...]
BUILD FAILED
C:\Users\JenkinsSlave\workspace\Lucene-Solr-4.x-Windows\build.xml:335: The following error occurred while executing this line:
C:\Users\JenkinsSlave\workspace\Lucene-Solr-4.x-Windows\build.xml:39: The following error occurred while executing this line:
C:\Users\JenkinsSlave\workspace\Lucene-Solr-4.x-Windows\solr\build.xml:178: The following error occurred while executing this line:
C:\Users\JenkinsSlave\workspace\Lucene-Solr-4.x-Windows\lucene\module-build.xml:61: The following error occurred while executing this line:
C:\Users\JenkinsSlave\workspace\Lucene-Solr-4.x-Windows\lucene\common-build.xml:1159: The following error occurred while executing this line:
C:\Users\JenkinsSlave\workspace\Lucene-Solr-4.x-Windows\lucene\common-build.xml:827: There were test failures: 233 suites, 965 tests, 3 suite-level errors, 603 ignored (7 assumptions)

Total time: 30 minutes 11 seconds
Build step 'Invoke Ant' marked build as failure
Archiving artifacts
Recording test results
Description set: Java: 64bit/jdk1.6.0_35 -XX:+UseSerialGC
Email was triggered for: Failure
Sending email for trigger: Failure



Mime
View raw message