lucene-dev mailing list archives

Site index · List index
Message view « Date » · « Thread »
Top « Date » · « Thread »
From Charlie Cron <hudsonsevilt...@gmail.com>
Subject Build failed in Jenkins: slow-io-beasting #4908
Date Sat, 27 Oct 2012 06:16:20 GMT
See <http://sierranevada.servebeer.com:8080/job/slow-io-beasting/4908/>

------------------------------------------
[...truncated 15281 lines...]
[junit4:junit4]   2> 		at org.apache.solr.cloud.ZkController.joinElection(ZkController.java:733)
[junit4:junit4]   2> 		at org.apache.solr.cloud.ZkController.register(ZkController.java:566)
[junit4:junit4]   2> 		... 46 more
[junit4:junit4]   2> 	
[junit4:junit4]   2> 7221357 T72 oaz.ClientCnxn$EventThread.run EventThread shut down
[junit4:junit4]   2> 7221357 T22 oaz.ZooKeeper.<init> Initiating client connection,
connectString=127.0.0.1:50639/solr sessionTimeout=10000 watcher=org.apache.solr.common.cloud.ConnectionManager@18c14b3
[junit4:junit4]   2> 7221357 T22 oasc.CoreContainer.shutdown Shutting down CoreContainer
instance=14952429
[junit4:junit4]   2> 7221357 T22 oasc.SolrCore.close [collection1]  CLOSING SolrCore org.apache.solr.core.SolrCore@c20893
[junit4:junit4]   2> 7221357 T22 oasu.DirectUpdateHandler2.close closing DirectUpdateHandler2{commits=0,autocommits=0,soft
autocommits=0,optimizes=0,rollbacks=0,expungeDeletes=0,docsPending=0,adds=0,deletesById=0,deletesByQuery=0,errors=0,cumulative_adds=0,cumulative_deletesById=0,cumulative_deletesByQuery=0,cumulative_errors=0}
[junit4:junit4]   2> 7221357 T22 oasc.SolrCore.decrefSolrCoreState Closing SolrCoreState
[junit4:junit4]   2> 7221357 T22 oasu.DefaultSolrCoreState.closeIndexWriter SolrCoreState
ref count has reached 0 - closing IndexWriter
[junit4:junit4]   2> 7221357 T22 oasu.DefaultSolrCoreState.closeIndexWriter closing IndexWriter
with IndexWriterCloser
[junit4:junit4]   2> 7221357 T22 oasc.SolrCore.closeSearcher [collection1] Closing main
searcher on request.
[junit4:junit4]   2> 7221357 T63 oazs.NIOServerCnxn.doIO WARNING Exception causing close
of session 0x13aa06f29530004 due to java.nio.channels.ClosedByInterruptException
[junit4:junit4]   2> 7221357 T22 oaz.ZooKeeper.close Session: 0x13aa06f29530004 closed
[junit4:junit4]   2> 7221357 T63 oazs.NIOServerCnxn.closeSock Closed socket connection
for client /127.0.0.1:50708 which had sessionid 0x13aa06f29530004
[junit4:junit4]   2> 7221357 T22 oasc.CoreContainer.shutdown Shutting down CoreContainer
instance=470748
[junit4:junit4]   2> 7221357 T22 oasc.SolrCore.close [collection1]  CLOSING SolrCore org.apache.solr.core.SolrCore@1dc4cd9
[junit4:junit4]   2> 7221358 T22 oasu.DirectUpdateHandler2.close closing DirectUpdateHandler2{commits=0,autocommits=0,soft
autocommits=0,optimizes=0,rollbacks=0,expungeDeletes=0,docsPending=0,adds=0,deletesById=0,deletesByQuery=0,errors=0,cumulative_adds=0,cumulative_deletesById=0,cumulative_deletesByQuery=0,cumulative_errors=0}
[junit4:junit4]   2> 7221358 T22 oasc.SolrCore.decrefSolrCoreState Closing SolrCoreState
[junit4:junit4]   2> 7221358 T22 oasu.DefaultSolrCoreState.closeIndexWriter SolrCoreState
ref count has reached 0 - closing IndexWriter
[junit4:junit4]   2> 7221358 T22 oasu.DefaultSolrCoreState.closeIndexWriter closing IndexWriter
with IndexWriterCloser
[junit4:junit4]   2> 7221358 T22 oasc.SolrCore.closeSearcher [collection1] Closing main
searcher on request.
[junit4:junit4]   2> 7221358 T63 oazs.NIOServerCnxn.doIO WARNING Exception causing close
of session 0x13aa06f29530005 due to java.nio.channels.ClosedByInterruptException
[junit4:junit4]   2> 7221358 T22 oaz.ZooKeeper.close Session: 0x13aa06f29530005 closed
[junit4:junit4]   2> 7221358 T63 oazs.NIOServerCnxn.closeSock Closed socket connection
for client /127.0.0.1:50715 which had sessionid 0x13aa06f29530005
[junit4:junit4]   2> 7221358 T22 oasc.CoreContainer.shutdown Shutting down CoreContainer
instance=11438836
[junit4:junit4]   2> 7221358 T22 oasc.SolrCore.close [collection1]  CLOSING SolrCore org.apache.solr.core.SolrCore@1be3bb2
[junit4:junit4]   2> 7221358 T22 oasu.DirectUpdateHandler2.close closing DirectUpdateHandler2{commits=0,autocommits=0,soft
autocommits=0,optimizes=0,rollbacks=0,expungeDeletes=0,docsPending=0,adds=0,deletesById=0,deletesByQuery=0,errors=0,cumulative_adds=0,cumulative_deletesById=0,cumulative_deletesByQuery=0,cumulative_errors=0}
[junit4:junit4]   2> 7221358 T22 oasc.SolrCore.decrefSolrCoreState Closing SolrCoreState
[junit4:junit4]   2> 7221358 T22 oasu.DefaultSolrCoreState.closeIndexWriter SolrCoreState
ref count has reached 0 - closing IndexWriter
[junit4:junit4]   2> 7221358 T22 oasu.DefaultSolrCoreState.closeIndexWriter closing IndexWriter
with IndexWriterCloser
[junit4:junit4]   2> 7221358 T22 oasc.SolrCore.closeSearcher [collection1] Closing main
searcher on request.
[junit4:junit4]   2> 7221938 T76 oaz.ClientCnxn$SendThread.run WARNING Session 0x13aa06f29530003
for server 127.0.0.1/127.0.0.1:50639, unexpected error, closing socket connection and attempting
reconnect java.nio.channels.ClosedByInterruptException
[junit4:junit4]   2> 	at java.nio.channels.spi.AbstractInterruptibleChannel.end(AbstractInterruptibleChannel.java:184)
[junit4:junit4]   2> 	at sun.nio.ch.SocketChannelImpl.write(SocketChannelImpl.java:341)
[junit4:junit4]   2> 	at org.apache.zookeeper.ClientCnxn$SendThread.doIO(ClientCnxn.java:890)
[junit4:junit4]   2> 	at org.apache.zookeeper.ClientCnxn$SendThread.run(ClientCnxn.java:1154)
[junit4:junit4]   2> 
[junit4:junit4]   2> 7221938 T63 oazs.NIOServerCnxn.doIO WARNING Exception causing close
of session 0x13aa06f29530003 due to java.nio.channels.ClosedByInterruptException
[junit4:junit4]   2> 7221938 T63 oazs.NIOServerCnxn.closeSock Closed socket connection
for client /127.0.0.1:50692 which had sessionid 0x13aa06f29530003
[junit4:junit4]   2> 7221953 T88 oaz.ClientCnxn$SendThread.startConnect WARNING Unexpected
exception java.lang.InterruptedException: sleep interrupted
[junit4:junit4]   2> 	at java.lang.Thread.sleep(Native Method)
[junit4:junit4]   2> 	at org.apache.zookeeper.ClientCnxn$SendThread.startConnect(ClientCnxn.java:1045)
[junit4:junit4]   2> 	at org.apache.zookeeper.ClientCnxn$SendThread.run(ClientCnxn.java:1101)
[junit4:junit4]   2> 
[junit4:junit4]   2> 7221953 T88 oaz.ClientCnxn$SendThread.startConnect Opening socket
connection to server 127.0.0.1/127.0.0.1:50639
[junit4:junit4]   2> 7221953 T71 oaz.ClientCnxn$SendThread.startConnect WARNING Unexpected
exception java.lang.InterruptedException: sleep interrupted
[junit4:junit4]   2> 	at java.lang.Thread.sleep(Native Method)
[junit4:junit4]   2> 	at org.apache.zookeeper.ClientCnxn$SendThread.startConnect(ClientCnxn.java:1045)
[junit4:junit4]   2> 	at org.apache.zookeeper.ClientCnxn$SendThread.run(ClientCnxn.java:1101)
[junit4:junit4]   2> 
[junit4:junit4]   2> 7221953 T76 oaz.ClientCnxn$SendThread.startConnect WARNING Unexpected
exception java.lang.InterruptedException: sleep interrupted
[junit4:junit4]   2> 	at java.lang.Thread.sleep(Native Method)
[junit4:junit4]   2> 	at org.apache.zookeeper.ClientCnxn$SendThread.startConnect(ClientCnxn.java:1038)
[junit4:junit4]   2> 	at org.apache.zookeeper.ClientCnxn$SendThread.run(ClientCnxn.java:1101)
[junit4:junit4]   2> 
[junit4:junit4]   2> 7221953 T22 oaz.ZooKeeper.close Session: 0x13aa06f29530002 closed
[junit4:junit4]   2> 7221953 T71 oaz.ClientCnxn$SendThread.startConnect Opening socket
connection to server 127.0.0.1/127.0.0.1:50639
[junit4:junit4]   2> 7221953 T22 oasc.CoreContainer.shutdown Shutting down CoreContainer
instance=7663968
[junit4:junit4]   2> 7221953 T63 oazs.NIOServerCnxn$Factory.run WARNING Ignoring exception
java.nio.channels.ClosedByInterruptException
[junit4:junit4]   2> 	at java.nio.channels.spi.AbstractInterruptibleChannel.end(AbstractInterruptibleChannel.java:184)
[junit4:junit4]   2> 	at sun.nio.ch.ServerSocketChannelImpl.accept(ServerSocketChannelImpl.java:159)
[junit4:junit4]   2> 	at org.apache.zookeeper.server.NIOServerCnxn$Factory.run(NIOServerCnxn.java:242)
[junit4:junit4]   2> 
[junit4:junit4]   2> 7221953 T88 oaz.ClientCnxn$SendThread.primeConnection Socket connection
established to 127.0.0.1/127.0.0.1:50639, initiating session
[junit4:junit4]   2> 7221953 T63 oazs.NIOServerCnxn.closeSock Closed socket connection
for client /127.0.0.1:50727 which had sessionid 0x13aa06f29530006
[junit4:junit4]   2> 7221953 T63 oazs.NIOServerCnxn$Factory.run NIOServerCnxn factory exited
run method
[junit4:junit4]   2> 7221953 T85 oaz.ClientCnxn$SendThread.run WARNING Session 0x13aa06f29530006
for server 127.0.0.1/127.0.0.1:50639, unexpected error, closing socket connection and attempting
reconnect java.nio.channels.ClosedByInterruptException
[junit4:junit4]   2> 	at java.nio.channels.spi.AbstractInterruptibleChannel.end(AbstractInterruptibleChannel.java:184)
[junit4:junit4]   2> 	at sun.nio.ch.SocketChannelImpl.read(SocketChannelImpl.java:270)
[junit4:junit4]   2> 	at org.apache.zookeeper.ClientCnxn$SendThread.doIO(ClientCnxn.java:856)
[junit4:junit4]   2> 	at org.apache.zookeeper.ClientCnxn$SendThread.run(ClientCnxn.java:1154)
[junit4:junit4]   2> 
[junit4:junit4]   2> 7221953 T22 oasc.SolrCore.close [collection1]  CLOSING SolrCore org.apache.solr.core.SolrCore@1e9d0cc
[junit4:junit4]   2> 7221953 T22 oasu.DirectUpdateHandler2.close closing DirectUpdateHandler2{commits=0,autocommits=0,soft
autocommits=0,optimizes=0,rollbacks=0,expungeDeletes=0,docsPending=0,adds=0,deletesById=0,deletesByQuery=0,errors=0,cumulative_adds=0,cumulative_deletesById=0,cumulative_deletesByQuery=0,cumulative_errors=0}
[junit4:junit4]   2> 7221953 T22 oasc.SolrCore.decrefSolrCoreState Closing SolrCoreState
[junit4:junit4]   2> 7221953 T22 oasu.DefaultSolrCoreState.closeIndexWriter SolrCoreState
ref count has reached 0 - closing IndexWriter
[junit4:junit4]   2> 7221953 T22 oasu.DefaultSolrCoreState.closeIndexWriter closing IndexWriter
with IndexWriterCloser
[junit4:junit4]   2> 7221953 T22 oasc.SolrCore.closeSearcher [collection1] Closing main
searcher on request.
[junit4:junit4]   2> 7222008 T88 oaz.ClientCnxn$SendThread.run WARNING Session 0x13aa06f29530007
for server 127.0.0.1/127.0.0.1:50639, unexpected error, closing socket connection and attempting
reconnect java.io.IOException: An existing connection was forcibly closed by the remote host
[junit4:junit4]   2> 	at sun.nio.ch.SocketDispatcher.read0(Native Method)
[junit4:junit4]   2> 	at sun.nio.ch.SocketDispatcher.read(SocketDispatcher.java:25)
[junit4:junit4]   2> 	at sun.nio.ch.IOUtil.readIntoNativeBuffer(IOUtil.java:202)
[junit4:junit4]   2> 	at sun.nio.ch.IOUtil.read(IOUtil.java:169)
[junit4:junit4]   2> 	at sun.nio.ch.SocketChannelImpl.read(SocketChannelImpl.java:243)
[junit4:junit4]   2> 	at org.apache.zookeeper.ClientCnxn$SendThread.doIO(ClientCnxn.java:856)
[junit4:junit4]   2> 	at org.apache.zookeeper.ClientCnxn$SendThread.run(ClientCnxn.java:1154)
[junit4:junit4]   2> 
[junit4:junit4]   2> 7222551 T88 oaz.ClientCnxn$SendThread.startConnect WARNING Unexpected
exception java.lang.InterruptedException: sleep interrupted
[junit4:junit4]   2> 	at java.lang.Thread.sleep(Native Method)
[junit4:junit4]   2> 	at org.apache.zookeeper.ClientCnxn$SendThread.startConnect(ClientCnxn.java:1045)
[junit4:junit4]   2> 	at org.apache.zookeeper.ClientCnxn$SendThread.run(ClientCnxn.java:1101)
[junit4:junit4]   2> 
[junit4:junit4]   2> 7222551 T85 oaz.ClientCnxn$SendThread.startConnect WARNING Unexpected
exception java.lang.InterruptedException: sleep interrupted
[junit4:junit4]   2> 	at java.lang.Thread.sleep(Native Method)
[junit4:junit4]   2> 	at org.apache.zookeeper.ClientCnxn$SendThread.startConnect(ClientCnxn.java:1045)
[junit4:junit4]   2> 	at org.apache.zookeeper.ClientCnxn$SendThread.run(ClientCnxn.java:1101)
[junit4:junit4]   2> 
[junit4:junit4]   2> 7222551 T22 oaz.ZooKeeper.close Session: 0x13aa06f29530003 closed
[junit4:junit4]   2> 7222551 T85 oaz.ClientCnxn$SendThread.startConnect Opening socket
connection to server 127.0.0.1/127.0.0.1:50639
[junit4:junit4]   2> 7222551 T22 oasc.CoreContainer.shutdown Shutting down CoreContainer
instance=10144386
[junit4:junit4]   2> 7222551 T76 oaz.ClientCnxn$SendThread.startConnect WARNING Unexpected
exception java.lang.InterruptedException: sleep interrupted
[junit4:junit4]   2> 	at java.lang.Thread.sleep(Native Method)
[junit4:junit4]   2> 	at org.apache.zookeeper.ClientCnxn$SendThread.startConnect(ClientCnxn.java:1045)
[junit4:junit4]   2> 	at org.apache.zookeeper.ClientCnxn$SendThread.run(ClientCnxn.java:1101)
[junit4:junit4]   2> 
[junit4:junit4]   2> 7222551 T88 oaz.ClientCnxn$SendThread.startConnect Opening socket
connection to server 127.0.0.1/127.0.0.1:50639
[junit4:junit4]   2> 7222551 T22 oasc.SolrCore.close [collection1]  CLOSING SolrCore org.apache.solr.core.SolrCore@633b88
[junit4:junit4]   2> 7222551 T76 oaz.ClientCnxn$SendThread.startConnect Opening socket
connection to server 127.0.0.1/127.0.0.1:50639
[junit4:junit4]   2> 7222551 T22 oasu.DirectUpdateHandler2.close closing DirectUpdateHandler2{commits=0,autocommits=0,soft
autocommits=0,optimizes=0,rollbacks=0,expungeDeletes=0,docsPending=0,adds=0,deletesById=0,deletesByQuery=0,errors=0,cumulative_adds=0,cumulative_deletesById=0,cumulative_deletesByQuery=0,cumulative_errors=0}
[junit4:junit4]   2> 7222551 T22 oasc.SolrCore.decrefSolrCoreState Closing SolrCoreState
[junit4:junit4]   2> 7222551 T22 oasu.DefaultSolrCoreState.closeIndexWriter SolrCoreState
ref count has reached 0 - closing IndexWriter
[junit4:junit4]   2> 7222551 T22 oasu.DefaultSolrCoreState.closeIndexWriter closing IndexWriter
with IndexWriterCloser
[junit4:junit4]   2> 7222551 T22 oasc.SolrCore.closeSearcher [collection1] Closing main
searcher on request.
[junit4:junit4]   2> 7223128 T22 oaz.ZooKeeper.close Session: 0x13aa06f29530006 closed
[junit4:junit4]   2> 7223128 T22 oasc.CoreContainer.shutdown Shutting down CoreContainer
instance=27350423
[junit4:junit4]   2> 7223128 T22 oasc.SolrCore.close [collection1]  CLOSING SolrCore org.apache.solr.core.SolrCore@2e9c76
[junit4:junit4]   2> 7223128 T22 oasu.DirectUpdateHandler2.close closing DirectUpdateHandler2{commits=0,autocommits=0,soft
autocommits=0,optimizes=0,rollbacks=0,expungeDeletes=0,docsPending=0,adds=0,deletesById=0,deletesByQuery=0,errors=0,cumulative_adds=0,cumulative_deletesById=0,cumulative_deletesByQuery=0,cumulative_errors=0}
[junit4:junit4]   2> 7223128 T22 oasc.SolrCore.decrefSolrCoreState Closing SolrCoreState
[junit4:junit4]   2> 7223128 T22 oasu.DefaultSolrCoreState.closeIndexWriter SolrCoreState
ref count has reached 0 - closing IndexWriter
[junit4:junit4]   2> 7223128 T22 oasu.DefaultSolrCoreState.closeIndexWriter closing IndexWriter
with IndexWriterCloser
[junit4:junit4]   2> 7223128 T22 oasc.SolrCore.closeSearcher [collection1] Closing main
searcher on request.
[junit4:junit4]   2> 7223549 T22 oaz.ZooKeeper.close Session: 0x13aa06f29530007 closed
[junit4:junit4]   2> 7223549 T65 oazs.SyncRequestProcessor.run SyncRequestProcessor exited!
[junit4:junit4]   2> 7223549 T22 oazs.FinalRequestProcessor.shutdown shutdown of request
processor complete
[junit4:junit4]   2> 7225858 T21 ccr.ThreadLeakControl.tryToInterruptAll SEVERE There are
still zombie threads that couldn't be terminated:
[junit4:junit4]   2> 	   1) Thread[id=22, name=TEST-LeaderElectionIntegrationTest.testLeaderElectionAfterClientTimeout-seed#[6744C72D107BD963],
state=RUNNABLE, group=TGRP-LeaderElectionIntegrationTest]
[junit4:junit4]   2> 	        at java.net.PlainSocketImpl.socketCreate(Native Method)
[junit4:junit4]   2> 	        at java.net.PlainSocketImpl.create(PlainSocketImpl.java:107)
[junit4:junit4]   2> 	        at java.net.Socket.createImpl(Socket.java:394)
[junit4:junit4]   2> 	        at java.net.Socket.<init>(Socket.java:371)
[junit4:junit4]   2> 	        at java.net.Socket.<init>(Socket.java:189)
[junit4:junit4]   2> 	        at org.apache.solr.cloud.ZkTestServer.send4LetterWord(ZkTestServer.java:296)
[junit4:junit4]   2> 	        at org.apache.solr.cloud.ZkTestServer.waitForServerDown(ZkTestServer.java:258)
[junit4:junit4]   2> 	        at org.apache.solr.cloud.ZkTestServer$ZKServerMain.shutdown(ZkTestServer.java:122)
[junit4:junit4]   2> 	        at org.apache.solr.cloud.ZkTestServer.shutdown(ZkTestServer.java:249)
[junit4:junit4]   2> 	        at org.apache.solr.cloud.LeaderElectionIntegrationTest.tearDown(LeaderElectionIntegrationTest.java:292)
[junit4:junit4]   2> 	        at sun.reflect.GeneratedMethodAccessor5.invoke(Unknown Source)
[junit4:junit4]   2> 	        at sun.reflect.DelegatingMethodAccessorImpl.invoke(DelegatingMethodAccessorImpl.java:25)
[junit4:junit4]   2> 	        at java.lang.reflect.Method.invoke(Method.java:597)
[junit4:junit4]   2> 	        at com.carrotsearch.randomizedtesting.RandomizedRunner.invoke(RandomizedRunner.java:1559)
[junit4:junit4]   2> 	        at com.carrotsearch.randomizedtesting.RandomizedRunner.access$600(RandomizedRunner.java:79)
[junit4:junit4]   2> 	        at com.carrotsearch.randomizedtesting.RandomizedRunner$8.evaluate(RandomizedRunner.java:795)
[junit4:junit4]   2> 	        at com.carrotsearch.randomizedtesting.rules.SystemPropertiesRestoreRule$1.evaluate(SystemPropertiesRestoreRule.java:53)
[junit4:junit4]   2> 	        at org.apache.lucene.util.TestRuleSetupTeardownChained$1.evaluate(TestRuleSetupTeardownChained.java:50)
[junit4:junit4]   2> 	        at org.apache.lucene.util.TestRuleFieldCacheSanity$1.evaluate(TestRuleFieldCacheSanity.java:51)
[junit4:junit4]   2> 	        at org.apache.lucene.util.AbstractBeforeAfterRule$1.evaluate(AbstractBeforeAfterRule.java:45)
[junit4:junit4]   2> 	        at com.carrotsearch.randomizedtesting.rules.SystemPropertiesInvariantRule$1.evaluate(SystemPropertiesInvariantRule.java:55)
[junit4:junit4]   2> 	        at org.apache.lucene.util.TestRuleThreadAndTestName$1.evaluate(TestRuleThreadAndTestName.java:48)
[junit4:junit4]   2> 	        at org.apache.lucene.util.TestRuleIgnoreAfterMaxFailures$1.evaluate(TestRuleIgnoreAfterMaxFailures.java:70)
[junit4:junit4]   2> 	        at org.apache.lucene.util.TestRuleMarkFailure$1.evaluate(TestRuleMarkFailure.java:48)
[junit4:junit4]   2> 	        at com.carrotsearch.randomizedtesting.rules.StatementAdapter.evaluate(StatementAdapter.java:36)
[junit4:junit4]   2> 	        at com.carrotsearch.randomizedtesting.ThreadLeakControl$StatementRunner.run(ThreadLeakControl.java:358)
[junit4:junit4]   2> 	        at com.carrotsearch.randomizedtesting.ThreadLeakControl.forkTimeoutingTask(ThreadLeakControl.java:782)
[junit4:junit4]   2> 	        at com.carrotsearch.randomizedtesting.ThreadLeakControl$3.evaluate(ThreadLeakControl.java:442)
[junit4:junit4]   2> 	        at com.carrotsearch.randomizedtesting.RandomizedRunner.runSingleTest(RandomizedRunner.java:746)
[junit4:junit4]   2> 	        at com.carrotsearch.randomizedtesting.RandomizedRunner$3.evaluate(RandomizedRunner.java:648)
[junit4:junit4]   2> 	        at com.carrotsearch.randomizedtesting.RandomizedRunner$4.evaluate(RandomizedRunner.java:682)
[junit4:junit4]   2> 	        at com.carrotsearch.randomizedtesting.RandomizedRunner$5.evaluate(RandomizedRunner.java:693)
[junit4:junit4]   2> 	        at com.carrotsearch.randomizedtesting.rules.StatementAdapter.evaluate(StatementAdapter.java:36)
[junit4:junit4]   2> 	        at com.carrotsearch.randomizedtesting.rules.SystemPropertiesRestoreRule$1.evaluate(SystemPropertiesRestoreRule.java:53)
[junit4:junit4]   2> 	        at org.apache.lucene.util.AbstractBeforeAfterRule$1.evaluate(AbstractBeforeAfterRule.java:45)
[junit4:junit4]   2> 	        at org.apache.lucene.util.TestRuleStoreClassName$1.evaluate(TestRuleStoreClassName.java:42)
[junit4:junit4]   2> 	        at com.carrotsearch.randomizedtesting.rules.SystemPropertiesInvariantRule$1.evaluate(SystemPropertiesInvariantRule.java:55)
[junit4:junit4]   2> 	        at com.carrotsearch.randomizedtesting.rules.NoShadowingOrOverridesOnMethodsRule$1.evaluate(NoShadowingOrOverridesOnMethodsRule.java:39)
[junit4:junit4]   2> 	        at com.carrotsearch.randomizedtesting.rules.NoShadowingOrOverridesOnMethodsRule$1.evaluate(NoShadowingOrOverridesOnMethodsRule.java:39)
[junit4:junit4]   2> 	        at com.carrotsearch.randomizedtesting.rules.StatementAdapter.evaluate(StatementAdapter.java:36)
[junit4:junit4]   2> 	        at org.apache.lucene.util.TestRuleAssertionsRequired$1.evaluate(TestRuleAssertionsRequired.java:43)
[junit4:junit4]   2> 	        at org.apache.lucene.util.TestRuleMarkFailure$1.evaluate(TestRuleMarkFailure.java:48)
[junit4:junit4]   2> 	        at org.apache.lucene.util.TestRuleIgnoreAfterMaxFailures$1.evaluate(TestRuleIgnoreAfterMaxFailures.java:70)
[junit4:junit4]   2> 	        at org.apache.lucene.util.TestRuleIgnoreTestSuites$1.evaluate(TestRuleIgnoreTestSuites.java:55)
[junit4:junit4]   2> 	        at com.carrotsearch.randomizedtesting.rules.StatementAdapter.evaluate(StatementAdapter.java:36)
[junit4:junit4]   2> 	        at com.carrotsearch.randomizedtesting.ThreadLeakControl$StatementRunner.run(ThreadLeakControl.java:358)
[junit4:junit4]   2> 	        at java.lang.Thread.run(Thread.java:662)
[junit4:junit4]   2> 7225858 T22 oazs.FinalRequestProcessor.shutdown shutdown of request
processor complete
[junit4:junit4]   2> 7225858 T22 oas.SolrTestCaseJ4.tearDown ###Ending testLeaderElectionAfterClientTimeout
[junit4:junit4]   2> 7225858 T22 oas.SolrTestCaseJ4.deleteCore ###deleteCore
[junit4:junit4]   2> NOTE: test params are: codec=Lucene40, sim=DefaultSimilarity, locale=ar_LY,
timezone=Pacific/Noumea
[junit4:junit4]   2> NOTE: Windows Vista 6.0 x86/Sun Microsystems Inc. 1.6.0_23 (32-bit)/cpus=4,threads=2,free=8369952,total=19316736
[junit4:junit4]   2> NOTE: All tests run in this JVM: [TestXIncludeConfig, MinimalSchemaTest,
HighlighterConfigTest, TermsComponentTest, LeaderElectionIntegrationTest]
[junit4:junit4]   2> NOTE: reproduce with: ant test  -Dtestcase=LeaderElectionIntegrationTest
-Dtests.seed=6744C72D107BD963 -Dtests.slow=true -Dtests.locale=ar_LY -Dtests.timezone=Pacific/Noumea
-Dtests.file.encoding=US-ASCII
[junit4:junit4] ERROR   0.00s J6 | LeaderElectionIntegrationTest (suite) <<<
[junit4:junit4]    > Throwable #1: java.lang.Exception: Suite timeout exceeded (>= 7200000
msec).
[junit4:junit4]    > 	at __randomizedtesting.SeedInfo.seed([6744C72D107BD963]:0)
[junit4:junit4] Completed on J6 in 7226.01s, 2 tests, 2 errors <<< FAILURES!
[junit4:junit4] 
[junit4:junit4] Suite: org.apache.solr.schema.PolyFieldTest
[junit4:junit4] Completed on J6 in 0.09s, 4 tests, 4 skipped
[junit4:junit4] 
[junit4:junit4] Suite: org.apache.solr.update.SoftAutoCommitTest
[junit4:junit4] Completed on J6 in 0.02s, 3 tests, 3 skipped
[junit4:junit4] 
[junit4:junit4] Suite: org.apache.solr.util.FileUtilsTest
[junit4:junit4] Completed on J6 in 0.02s, 1 test, 1 skipped
[junit4:junit4] 
[junit4:junit4] Suite: org.apache.solr.cloud.TestHashPartitioner
[junit4:junit4] Completed on J6 in 0.00s, 1 test, 1 skipped
[junit4:junit4] 
[junit4:junit4] Suite: org.apache.solr.search.TestRealTimeGet
[junit4:junit4] Completed on J6 in 0.02s, 4 tests, 4 skipped
[junit4:junit4] 
[junit4:junit4] Suite: org.apache.solr.handler.component.SearchHandlerTest
[junit4:junit4] Completed on J6 in 0.00s, 1 test, 1 skipped
[junit4:junit4] 
[junit4:junit4] Suite: org.apache.solr.util.TestNumberUtils
[junit4:junit4] Completed on J6 in 0.02s, 1 test, 1 skipped
[junit4:junit4] 
[junit4:junit4] Suite: org.apache.solr.cloud.ClusterStateUpdateTest
[junit4:junit4] Completed on J6 in 0.05s, 1 test, 1 skipped
[junit4:junit4] 
[junit4:junit4] Suite: org.apache.solr.search.TestStressLucene
[junit4:junit4] Completed on J6 in 0.02s, 1 test, 1 skipped
[junit4:junit4] 
[junit4:junit4] Suite: org.apache.solr.search.similarities.TestBM25SimilarityFactory
[junit4:junit4] Completed on J6 in 0.02s, 2 tests, 2 skipped
[junit4:junit4] 
[junit4:junit4] Suite: org.apache.solr.request.TestWriterPerf
[junit4:junit4] Completed on J6 in 0.00s, 1 test, 1 skipped
[junit4:junit4] 
[junit4:junit4] Suite: org.apache.solr.util.TimeZoneUtilsTest
[junit4:junit4] Completed on J6 in 0.00s, 5 tests, 5 skipped
[junit4:junit4] 
[junit4:junit4] 
[junit4:junit4] Tests with failures:
[junit4:junit4]   - org.apache.solr.cloud.LeaderElectionIntegrationTest.testLeaderElectionAfterClientTimeout
[junit4:junit4]   - org.apache.solr.cloud.LeaderElectionIntegrationTest (suite)
[junit4:junit4] 
[junit4:junit4] 
[junit4:junit4] JVM J0:     3.46 ..   253.77 =   250.31s
[junit4:junit4] JVM J1:     2.62 ..   242.02 =   239.40s
[junit4:junit4] JVM J2:     2.65 ..   249.56 =   246.91s
[junit4:junit4] JVM J3:     2.40 ..   255.41 =   253.01s
[junit4:junit4] JVM J4:     2.67 ..   263.14 =   260.47s
[junit4:junit4] JVM J5:     2.62 ..   235.33 =   232.71s
[junit4:junit4] JVM J6:     2.62 ..  7264.13 =  7261.51s
[junit4:junit4] JVM J7:     2.67 ..   236.08 =   233.41s
[junit4:junit4] Execution time total: 2 hours 1 minute 4 seconds
[junit4:junit4] Tests summary: 233 suites, 965 tests, 1 suite-level error, 1 error, 34 ignored
(4 assumptions)

BUILD FAILED
<http://sierranevada.servebeer.com:8080/job/slow-io-beasting/ws/build.xml>:39: The following
error occurred while executing this line:
<http://sierranevada.servebeer.com:8080/job/slow-io-beasting/ws/solr/build.xml>:178:
The following error occurred while executing this line:
<http://sierranevada.servebeer.com:8080/job/slow-io-beasting/ws/lucene/module-build.xml>:61:
The following error occurred while executing this line:
<http://sierranevada.servebeer.com:8080/job/slow-io-beasting/ws/lucene/common-build.xml>:1159:
The following error occurred while executing this line:
<http://sierranevada.servebeer.com:8080/job/slow-io-beasting/ws/lucene/common-build.xml>:827:
There were test failures: 233 suites, 965 tests, 1 suite-level error, 1 error, 34 ignored
(4 assumptions)

Total time: 130 minutes 43 seconds
Build step 'Invoke Ant' marked build as failure

---------------------------------------------------------------------
To unsubscribe, e-mail: dev-unsubscribe@lucene.apache.org
For additional commands, e-mail: dev-help@lucene.apache.org


Mime
View raw message