lucene-dev mailing list archives

Site index · List index
Message view « Date » · « Thread »
Top « Date » · « Thread »
From Policeman Jenkins Server <jenk...@sd-datasolutions.de>
Subject [JENKINS] Lucene-Solr-trunk-Windows (64bit/jdk1.6.0_35) - Build # 1359 - Failure!
Date Mon, 29 Oct 2012 21:58:04 GMT
Build: http://jenkins.sd-datasolutions.de/job/Lucene-Solr-trunk-Windows/1359/
Java: 64bit/jdk1.6.0_35 -XX:+UseSerialGC

4 tests failed.
REGRESSION:  org.apache.solr.cloud.BasicDistributedZkTest.testDistribSearch

Error Message:
Could not find new 5 slice collection called awholynewcollection_3

Stack Trace:
java.lang.AssertionError: Could not find new 5 slice collection called awholynewcollection_3
	at __randomizedtesting.SeedInfo.seed([1837B4903639C490:99D13A884166A4AC]:0)
	at org.junit.Assert.fail(Assert.java:93)
	at org.apache.solr.cloud.BasicDistributedZkTest.checkForCollection(BasicDistributedZkTest.java:920)
	at org.apache.solr.cloud.BasicDistributedZkTest.testCollectionsAPI(BasicDistributedZkTest.java:635)
	at org.apache.solr.cloud.BasicDistributedZkTest.doTest(BasicDistributedZkTest.java:341)
	at org.apache.solr.BaseDistributedSearchTestCase.testDistribSearch(BaseDistributedSearchTestCase.java:695)
	at sun.reflect.NativeMethodAccessorImpl.invoke0(Native Method)
	at sun.reflect.NativeMethodAccessorImpl.invoke(NativeMethodAccessorImpl.java:39)
	at sun.reflect.DelegatingMethodAccessorImpl.invoke(DelegatingMethodAccessorImpl.java:25)
	at java.lang.reflect.Method.invoke(Method.java:597)
	at com.carrotsearch.randomizedtesting.RandomizedRunner.invoke(RandomizedRunner.java:1559)
	at com.carrotsearch.randomizedtesting.RandomizedRunner.access$600(RandomizedRunner.java:79)
	at com.carrotsearch.randomizedtesting.RandomizedRunner$6.evaluate(RandomizedRunner.java:737)
	at com.carrotsearch.randomizedtesting.RandomizedRunner$7.evaluate(RandomizedRunner.java:773)
	at com.carrotsearch.randomizedtesting.RandomizedRunner$8.evaluate(RandomizedRunner.java:787)
	at com.carrotsearch.randomizedtesting.rules.SystemPropertiesRestoreRule$1.evaluate(SystemPropertiesRestoreRule.java:53)
	at org.apache.lucene.util.TestRuleSetupTeardownChained$1.evaluate(TestRuleSetupTeardownChained.java:50)
	at org.apache.lucene.util.TestRuleFieldCacheSanity$1.evaluate(TestRuleFieldCacheSanity.java:51)
	at org.apache.lucene.util.AbstractBeforeAfterRule$1.evaluate(AbstractBeforeAfterRule.java:45)
	at com.carrotsearch.randomizedtesting.rules.SystemPropertiesInvariantRule$1.evaluate(SystemPropertiesInvariantRule.java:55)
	at org.apache.lucene.util.TestRuleThreadAndTestName$1.evaluate(TestRuleThreadAndTestName.java:48)
	at org.apache.lucene.util.TestRuleIgnoreAfterMaxFailures$1.evaluate(TestRuleIgnoreAfterMaxFailures.java:70)
	at org.apache.lucene.util.TestRuleMarkFailure$1.evaluate(TestRuleMarkFailure.java:48)
	at com.carrotsearch.randomizedtesting.rules.StatementAdapter.evaluate(StatementAdapter.java:36)
	at com.carrotsearch.randomizedtesting.ThreadLeakControl$StatementRunner.run(ThreadLeakControl.java:358)
	at com.carrotsearch.randomizedtesting.ThreadLeakControl.forkTimeoutingTask(ThreadLeakControl.java:782)
	at com.carrotsearch.randomizedtesting.ThreadLeakControl$3.evaluate(ThreadLeakControl.java:442)
	at com.carrotsearch.randomizedtesting.RandomizedRunner.runSingleTest(RandomizedRunner.java:746)
	at com.carrotsearch.randomizedtesting.RandomizedRunner$3.evaluate(RandomizedRunner.java:648)
	at com.carrotsearch.randomizedtesting.RandomizedRunner$4.evaluate(RandomizedRunner.java:682)
	at com.carrotsearch.randomizedtesting.RandomizedRunner$5.evaluate(RandomizedRunner.java:693)
	at com.carrotsearch.randomizedtesting.rules.StatementAdapter.evaluate(StatementAdapter.java:36)
	at com.carrotsearch.randomizedtesting.rules.SystemPropertiesRestoreRule$1.evaluate(SystemPropertiesRestoreRule.java:53)
	at org.apache.lucene.util.AbstractBeforeAfterRule$1.evaluate(AbstractBeforeAfterRule.java:45)
	at org.apache.lucene.util.TestRuleStoreClassName$1.evaluate(TestRuleStoreClassName.java:42)
	at com.carrotsearch.randomizedtesting.rules.SystemPropertiesInvariantRule$1.evaluate(SystemPropertiesInvariantRule.java:55)
	at com.carrotsearch.randomizedtesting.rules.NoShadowingOrOverridesOnMethodsRule$1.evaluate(NoShadowingOrOverridesOnMethodsRule.java:39)
	at com.carrotsearch.randomizedtesting.rules.NoShadowingOrOverridesOnMethodsRule$1.evaluate(NoShadowingOrOverridesOnMethodsRule.java:39)
	at com.carrotsearch.randomizedtesting.rules.StatementAdapter.evaluate(StatementAdapter.java:36)
	at org.apache.lucene.util.TestRuleAssertionsRequired$1.evaluate(TestRuleAssertionsRequired.java:43)
	at org.apache.lucene.util.TestRuleMarkFailure$1.evaluate(TestRuleMarkFailure.java:48)
	at org.apache.lucene.util.TestRuleIgnoreAfterMaxFailures$1.evaluate(TestRuleIgnoreAfterMaxFailures.java:70)
	at org.apache.lucene.util.TestRuleIgnoreTestSuites$1.evaluate(TestRuleIgnoreTestSuites.java:55)
	at com.carrotsearch.randomizedtesting.rules.StatementAdapter.evaluate(StatementAdapter.java:36)
	at com.carrotsearch.randomizedtesting.ThreadLeakControl$StatementRunner.run(ThreadLeakControl.java:358)
	at java.lang.Thread.run(Thread.java:662)


FAILED:  junit.framework.TestSuite.org.apache.solr.cloud.BasicDistributedZkTest

Error Message:
8 threads leaked from SUITE scope at org.apache.solr.cloud.BasicDistributedZkTest:     1) Thread[id=1851, name=TEST-BasicDistributedZkTest.testDistribSearch-seed#[1837B4903639C490]-EventThread, state=TIMED_WAITING, group=TGRP-BasicDistributedZkTest]         at java.lang.Thread.sleep(Native Method)         at org.apache.solr.cloud.ZkController.registerAllCoresAsDown(ZkController.java:259)         at org.apache.solr.cloud.ZkController.access$100(ZkController.java:82)         at org.apache.solr.cloud.ZkController$1.command(ZkController.java:190)         at org.apache.solr.common.cloud.ConnectionManager$1.update(ConnectionManager.java:116)         at org.apache.solr.common.cloud.DefaultConnectionStrategy.reconnect(DefaultConnectionStrategy.java:46)         at org.apache.solr.common.cloud.ConnectionManager.process(ConnectionManager.java:90)         at org.apache.zookeeper.ClientCnxn$EventThread.processEvent(ClientCnxn.java:526)         at org.apache.zookeeper.ClientCnxn$EventThread.run(ClientCnxn.java:502)    2) Thread[id=2093, name=TEST-BasicDistributedZkTest.testDistribSearch-seed#[1837B4903639C490]-EventThread, state=BLOCKED, group=TGRP-BasicDistributedZkTest]         at org.apache.solr.common.cloud.ConnectionManager.process(ConnectionManager.java:70)         at org.apache.zookeeper.ClientCnxn$EventThread.processEvent(ClientCnxn.java:526)         at org.apache.zookeeper.ClientCnxn$EventThread.run(ClientCnxn.java:502)    3) Thread[id=1889, name=TEST-BasicDistributedZkTest.testDistribSearch-seed#[1837B4903639C490]-EventThread, state=TIMED_WAITING, group=TGRP-BasicDistributedZkTest]         at java.lang.Thread.sleep(Native Method)         at org.apache.solr.cloud.ZkController.registerAllCoresAsDown(ZkController.java:259)         at org.apache.solr.cloud.ZkController.access$100(ZkController.java:82)         at org.apache.solr.cloud.ZkController$1.command(ZkController.java:190)         at org.apache.solr.common.cloud.ConnectionManager$1.update(ConnectionManager.java:116)         at org.apache.solr.common.cloud.DefaultConnectionStrategy.reconnect(DefaultConnectionStrategy.java:46)         at org.apache.solr.common.cloud.ConnectionManager.process(ConnectionManager.java:90)         at org.apache.zookeeper.ClientCnxn$EventThread.processEvent(ClientCnxn.java:526)         at org.apache.zookeeper.ClientCnxn$EventThread.run(ClientCnxn.java:502)    4) Thread[id=1863, name=TEST-BasicDistributedZkTest.testDistribSearch-seed#[1837B4903639C490]-EventThread, state=TIMED_WAITING, group=TGRP-BasicDistributedZkTest]         at java.lang.Thread.sleep(Native Method)         at org.apache.solr.cloud.ZkController.registerAllCoresAsDown(ZkController.java:259)         at org.apache.solr.cloud.ZkController.access$100(ZkController.java:82)         at org.apache.solr.cloud.ZkController$1.command(ZkController.java:190)         at org.apache.solr.common.cloud.ConnectionManager$1.update(ConnectionManager.java:116)         at org.apache.solr.common.cloud.DefaultConnectionStrategy.reconnect(DefaultConnectionStrategy.java:46)         at org.apache.solr.common.cloud.ConnectionManager.process(ConnectionManager.java:90)         at org.apache.zookeeper.ClientCnxn$EventThread.processEvent(ClientCnxn.java:526)         at org.apache.zookeeper.ClientCnxn$EventThread.run(ClientCnxn.java:502)    5) Thread[id=2087, name=TEST-BasicDistributedZkTest.testDistribSearch-seed#[1837B4903639C490]-EventThread, state=BLOCKED, group=TGRP-BasicDistributedZkTest]         at org.apache.solr.common.cloud.ConnectionManager.process(ConnectionManager.java:70)         at org.apache.zookeeper.ClientCnxn$EventThread.processEvent(ClientCnxn.java:526)         at org.apache.zookeeper.ClientCnxn$EventThread.run(ClientCnxn.java:502)    6) Thread[id=1875, name=TEST-BasicDistributedZkTest.testDistribSearch-seed#[1837B4903639C490]-EventThread, state=TIMED_WAITING, group=TGRP-BasicDistributedZkTest]         at java.lang.Thread.sleep(Native Method)         at org.apache.solr.cloud.ZkController.registerAllCoresAsDown(ZkController.java:259)         at org.apache.solr.cloud.ZkController.access$100(ZkController.java:82)         at org.apache.solr.cloud.ZkController$1.command(ZkController.java:190)         at org.apache.solr.common.cloud.ConnectionManager$1.update(ConnectionManager.java:116)         at org.apache.solr.common.cloud.DefaultConnectionStrategy.reconnect(DefaultConnectionStrategy.java:46)         at org.apache.solr.common.cloud.ConnectionManager.process(ConnectionManager.java:90)         at org.apache.zookeeper.ClientCnxn$EventThread.processEvent(ClientCnxn.java:526)         at org.apache.zookeeper.ClientCnxn$EventThread.run(ClientCnxn.java:502)    7) Thread[id=2089, name=TEST-BasicDistributedZkTest.testDistribSearch-seed#[1837B4903639C490]-EventThread, state=BLOCKED, group=TGRP-BasicDistributedZkTest]         at org.apache.solr.common.cloud.ConnectionManager.process(ConnectionManager.java:70)         at org.apache.zookeeper.ClientCnxn$EventThread.processEvent(ClientCnxn.java:526)         at org.apache.zookeeper.ClientCnxn$EventThread.run(ClientCnxn.java:502)    8) Thread[id=2091, name=TEST-BasicDistributedZkTest.testDistribSearch-seed#[1837B4903639C490]-EventThread, state=BLOCKED, group=TGRP-BasicDistributedZkTest]         at org.apache.solr.common.cloud.ConnectionManager.process(ConnectionManager.java:70)         at org.apache.zookeeper.ClientCnxn$EventThread.processEvent(ClientCnxn.java:526)         at org.apache.zookeeper.ClientCnxn$EventThread.run(ClientCnxn.java:502)

Stack Trace:
com.carrotsearch.randomizedtesting.ThreadLeakError: 8 threads leaked from SUITE scope at org.apache.solr.cloud.BasicDistributedZkTest: 
   1) Thread[id=1851, name=TEST-BasicDistributedZkTest.testDistribSearch-seed#[1837B4903639C490]-EventThread, state=TIMED_WAITING, group=TGRP-BasicDistributedZkTest]
        at java.lang.Thread.sleep(Native Method)
        at org.apache.solr.cloud.ZkController.registerAllCoresAsDown(ZkController.java:259)
        at org.apache.solr.cloud.ZkController.access$100(ZkController.java:82)
        at org.apache.solr.cloud.ZkController$1.command(ZkController.java:190)
        at org.apache.solr.common.cloud.ConnectionManager$1.update(ConnectionManager.java:116)
        at org.apache.solr.common.cloud.DefaultConnectionStrategy.reconnect(DefaultConnectionStrategy.java:46)
        at org.apache.solr.common.cloud.ConnectionManager.process(ConnectionManager.java:90)
        at org.apache.zookeeper.ClientCnxn$EventThread.processEvent(ClientCnxn.java:526)
        at org.apache.zookeeper.ClientCnxn$EventThread.run(ClientCnxn.java:502)
   2) Thread[id=2093, name=TEST-BasicDistributedZkTest.testDistribSearch-seed#[1837B4903639C490]-EventThread, state=BLOCKED, group=TGRP-BasicDistributedZkTest]
        at org.apache.solr.common.cloud.ConnectionManager.process(ConnectionManager.java:70)
        at org.apache.zookeeper.ClientCnxn$EventThread.processEvent(ClientCnxn.java:526)
        at org.apache.zookeeper.ClientCnxn$EventThread.run(ClientCnxn.java:502)
   3) Thread[id=1889, name=TEST-BasicDistributedZkTest.testDistribSearch-seed#[1837B4903639C490]-EventThread, state=TIMED_WAITING, group=TGRP-BasicDistributedZkTest]
        at java.lang.Thread.sleep(Native Method)
        at org.apache.solr.cloud.ZkController.registerAllCoresAsDown(ZkController.java:259)
        at org.apache.solr.cloud.ZkController.access$100(ZkController.java:82)
        at org.apache.solr.cloud.ZkController$1.command(ZkController.java:190)
        at org.apache.solr.common.cloud.ConnectionManager$1.update(ConnectionManager.java:116)
        at org.apache.solr.common.cloud.DefaultConnectionStrategy.reconnect(DefaultConnectionStrategy.java:46)
        at org.apache.solr.common.cloud.ConnectionManager.process(ConnectionManager.java:90)
        at org.apache.zookeeper.ClientCnxn$EventThread.processEvent(ClientCnxn.java:526)
        at org.apache.zookeeper.ClientCnxn$EventThread.run(ClientCnxn.java:502)
   4) Thread[id=1863, name=TEST-BasicDistributedZkTest.testDistribSearch-seed#[1837B4903639C490]-EventThread, state=TIMED_WAITING, group=TGRP-BasicDistributedZkTest]
        at java.lang.Thread.sleep(Native Method)
        at org.apache.solr.cloud.ZkController.registerAllCoresAsDown(ZkController.java:259)
        at org.apache.solr.cloud.ZkController.access$100(ZkController.java:82)
        at org.apache.solr.cloud.ZkController$1.command(ZkController.java:190)
        at org.apache.solr.common.cloud.ConnectionManager$1.update(ConnectionManager.java:116)
        at org.apache.solr.common.cloud.DefaultConnectionStrategy.reconnect(DefaultConnectionStrategy.java:46)
        at org.apache.solr.common.cloud.ConnectionManager.process(ConnectionManager.java:90)
        at org.apache.zookeeper.ClientCnxn$EventThread.processEvent(ClientCnxn.java:526)
        at org.apache.zookeeper.ClientCnxn$EventThread.run(ClientCnxn.java:502)
   5) Thread[id=2087, name=TEST-BasicDistributedZkTest.testDistribSearch-seed#[1837B4903639C490]-EventThread, state=BLOCKED, group=TGRP-BasicDistributedZkTest]
        at org.apache.solr.common.cloud.ConnectionManager.process(ConnectionManager.java:70)
        at org.apache.zookeeper.ClientCnxn$EventThread.processEvent(ClientCnxn.java:526)
        at org.apache.zookeeper.ClientCnxn$EventThread.run(ClientCnxn.java:502)
   6) Thread[id=1875, name=TEST-BasicDistributedZkTest.testDistribSearch-seed#[1837B4903639C490]-EventThread, state=TIMED_WAITING, group=TGRP-BasicDistributedZkTest]
        at java.lang.Thread.sleep(Native Method)
        at org.apache.solr.cloud.ZkController.registerAllCoresAsDown(ZkController.java:259)
        at org.apache.solr.cloud.ZkController.access$100(ZkController.java:82)
        at org.apache.solr.cloud.ZkController$1.command(ZkController.java:190)
        at org.apache.solr.common.cloud.ConnectionManager$1.update(ConnectionManager.java:116)
        at org.apache.solr.common.cloud.DefaultConnectionStrategy.reconnect(DefaultConnectionStrategy.java:46)
        at org.apache.solr.common.cloud.ConnectionManager.process(ConnectionManager.java:90)
        at org.apache.zookeeper.ClientCnxn$EventThread.processEvent(ClientCnxn.java:526)
        at org.apache.zookeeper.ClientCnxn$EventThread.run(ClientCnxn.java:502)
   7) Thread[id=2089, name=TEST-BasicDistributedZkTest.testDistribSearch-seed#[1837B4903639C490]-EventThread, state=BLOCKED, group=TGRP-BasicDistributedZkTest]
        at org.apache.solr.common.cloud.ConnectionManager.process(ConnectionManager.java:70)
        at org.apache.zookeeper.ClientCnxn$EventThread.processEvent(ClientCnxn.java:526)
        at org.apache.zookeeper.ClientCnxn$EventThread.run(ClientCnxn.java:502)
   8) Thread[id=2091, name=TEST-BasicDistributedZkTest.testDistribSearch-seed#[1837B4903639C490]-EventThread, state=BLOCKED, group=TGRP-BasicDistributedZkTest]
        at org.apache.solr.common.cloud.ConnectionManager.process(ConnectionManager.java:70)
        at org.apache.zookeeper.ClientCnxn$EventThread.processEvent(ClientCnxn.java:526)
        at org.apache.zookeeper.ClientCnxn$EventThread.run(ClientCnxn.java:502)
	at __randomizedtesting.SeedInfo.seed([1837B4903639C490]:0)


FAILED:  junit.framework.TestSuite.org.apache.solr.cloud.RecoveryZkTest

Error Message:
Resource in scope SUITE failed to close. Resource was registered from thread Thread[id=2499, name=TEST-RecoveryZkTest.testDistribSearch-seed#[1837B4903639C490], state=RUNNABLE, group=TGRP-RecoveryZkTest], registration stack trace below.

Stack Trace:
com.carrotsearch.randomizedtesting.ResourceDisposalError: Resource in scope SUITE failed to close. Resource was registered from thread Thread[id=2499, name=TEST-RecoveryZkTest.testDistribSearch-seed#[1837B4903639C490], state=RUNNABLE, group=TGRP-RecoveryZkTest], registration stack trace below.
	at java.lang.Thread.getStackTrace(Thread.java:1479)
	at com.carrotsearch.randomizedtesting.RandomizedContext.closeAtEnd(RandomizedContext.java:150)
	at org.apache.lucene.util.LuceneTestCase.closeAfterSuite(LuceneTestCase.java:514)
	at org.apache.lucene.util.LuceneTestCase.wrapDirectory(LuceneTestCase.java:958)
	at org.apache.lucene.util.LuceneTestCase.newDirectory(LuceneTestCase.java:872)
	at org.apache.lucene.util.LuceneTestCase.newDirectory(LuceneTestCase.java:864)
	at org.apache.solr.core.MockDirectoryFactory.create(MockDirectoryFactory.java:33)
	at org.apache.solr.core.CachingDirectoryFactory.get(CachingDirectoryFactory.java:232)
	at org.apache.solr.core.CachingDirectoryFactory.get(CachingDirectoryFactory.java:192)
	at org.apache.solr.core.SolrCore.getNewIndexDir(SolrCore.java:238)
	at org.apache.solr.core.SolrCore.initIndex(SolrCore.java:460)
	at org.apache.solr.core.SolrCore.<init>(SolrCore.java:705)
	at org.apache.solr.core.SolrCore.<init>(SolrCore.java:618)
	at org.apache.solr.core.CoreContainer.create(CoreContainer.java:846)
	at org.apache.solr.core.CoreContainer.load(CoreContainer.java:530)
	at org.apache.solr.core.CoreContainer.load(CoreContainer.java:351)
	at org.apache.solr.core.CoreContainer$Initializer.initialize(CoreContainer.java:303)
	at org.apache.solr.servlet.SolrDispatchFilter.init(SolrDispatchFilter.java:107)
	at org.eclipse.jetty.servlet.FilterHolder.doStart(FilterHolder.java:114)
	at org.eclipse.jetty.util.component.AbstractLifeCycle.start(AbstractLifeCycle.java:59)
	at org.eclipse.jetty.servlet.ServletHandler.initialize(ServletHandler.java:754)
	at org.eclipse.jetty.servlet.ServletHandler.updateMappings(ServletHandler.java:1227)
	at org.eclipse.jetty.servlet.ServletHandler.setFilterMappings(ServletHandler.java:1263)
	at org.eclipse.jetty.servlet.ServletHandler.addFilterWithMapping(ServletHandler.java:965)
	at org.eclipse.jetty.servlet.ServletHandler.addFilterWithMapping(ServletHandler.java:923)
	at org.eclipse.jetty.servlet.ServletContextHandler.addFilter(ServletContextHandler.java:333)
	at org.apache.solr.client.solrj.embedded.JettySolrRunner$1.lifeCycleStarted(JettySolrRunner.java:173)
	at org.eclipse.jetty.util.component.AbstractLifeCycle.setStarted(AbstractLifeCycle.java:169)
	at org.eclipse.jetty.util.component.AbstractLifeCycle.start(AbstractLifeCycle.java:60)
	at org.apache.solr.client.solrj.embedded.JettySolrRunner.start(JettySolrRunner.java:225)
	at org.apache.solr.client.solrj.embedded.JettySolrRunner.start(JettySolrRunner.java:205)
	at org.apache.solr.cloud.RecoveryZkTest.doTest(RecoveryZkTest.java:71)
	at org.apache.solr.BaseDistributedSearchTestCase.testDistribSearch(BaseDistributedSearchTestCase.java:695)
	at sun.reflect.NativeMethodAccessorImpl.invoke0(Native Method)
	at sun.reflect.NativeMethodAccessorImpl.invoke(NativeMethodAccessorImpl.java:39)
	at sun.reflect.DelegatingMethodAccessorImpl.invoke(DelegatingMethodAccessorImpl.java:25)
	at java.lang.reflect.Method.invoke(Method.java:597)
	at com.carrotsearch.randomizedtesting.RandomizedRunner.invoke(RandomizedRunner.java:1559)
	at com.carrotsearch.randomizedtesting.RandomizedRunner.access$600(RandomizedRunner.java:79)
	at com.carrotsearch.randomizedtesting.RandomizedRunner$6.evaluate(RandomizedRunner.java:737)
	at com.carrotsearch.randomizedtesting.RandomizedRunner$7.evaluate(RandomizedRunner.java:773)
	at com.carrotsearch.randomizedtesting.RandomizedRunner$8.evaluate(RandomizedRunner.java:787)
	at com.carrotsearch.randomizedtesting.rules.SystemPropertiesRestoreRule$1.evaluate(SystemPropertiesRestoreRule.java:53)
	at org.apache.lucene.util.TestRuleSetupTeardownChained$1.evaluate(TestRuleSetupTeardownChained.java:50)
	at org.apache.lucene.util.TestRuleFieldCacheSanity$1.evaluate(TestRuleFieldCacheSanity.java:51)
	at org.apache.lucene.util.AbstractBeforeAfterRule$1.evaluate(AbstractBeforeAfterRule.java:45)
	at com.carrotsearch.randomizedtesting.rules.SystemPropertiesInvariantRule$1.evaluate(SystemPropertiesInvariantRule.java:55)
	at org.apache.lucene.util.TestRuleThreadAndTestName$1.evaluate(TestRuleThreadAndTestName.java:48)
	at org.apache.lucene.util.TestRuleIgnoreAfterMaxFailures$1.evaluate(TestRuleIgnoreAfterMaxFailures.java:70)
	at org.apache.lucene.util.TestRuleMarkFailure$1.evaluate(TestRuleMarkFailure.java:48)
	at com.carrotsearch.randomizedtesting.rules.StatementAdapter.evaluate(StatementAdapter.java:36)
	at com.carrotsearch.randomizedtesting.ThreadLeakControl$StatementRunner.run(ThreadLeakControl.java:358)
	at com.carrotsearch.randomizedtesting.ThreadLeakControl.forkTimeoutingTask(ThreadLeakControl.java:782)
	at com.carrotsearch.randomizedtesting.ThreadLeakControl$3.evaluate(ThreadLeakControl.java:442)
	at com.carrotsearch.randomizedtesting.RandomizedRunner.runSingleTest(RandomizedRunner.java:746)
	at com.carrotsearch.randomizedtesting.RandomizedRunner$3.evaluate(RandomizedRunner.java:648)
	at com.carrotsearch.randomizedtesting.RandomizedRunner$4.evaluate(RandomizedRunner.java:682)
	at com.carrotsearch.randomizedtesting.RandomizedRunner$5.evaluate(RandomizedRunner.java:693)
	at com.carrotsearch.randomizedtesting.rules.StatementAdapter.evaluate(StatementAdapter.java:36)
	at com.carrotsearch.randomizedtesting.rules.SystemPropertiesRestoreRule$1.evaluate(SystemPropertiesRestoreRule.java:53)
	at org.apache.lucene.util.AbstractBeforeAfterRule$1.evaluate(AbstractBeforeAfterRule.java:45)
	at org.apache.lucene.util.TestRuleStoreClassName$1.evaluate(TestRuleStoreClassName.java:42)
	at com.carrotsearch.randomizedtesting.rules.SystemPropertiesInvariantRule$1.evaluate(SystemPropertiesInvariantRule.java:55)
	at com.carrotsearch.randomizedtesting.rules.NoShadowingOrOverridesOnMethodsRule$1.evaluate(NoShadowingOrOverridesOnMethodsRule.java:39)
	at com.carrotsearch.randomizedtesting.rules.NoShadowingOrOverridesOnMethodsRule$1.evaluate(NoShadowingOrOverridesOnMethodsRule.java:39)
	at com.carrotsearch.randomizedtesting.rules.StatementAdapter.evaluate(StatementAdapter.java:36)
	at org.apache.lucene.util.TestRuleAssertionsRequired$1.evaluate(TestRuleAssertionsRequired.java:43)
	at org.apache.lucene.util.TestRuleMarkFailure$1.evaluate(TestRuleMarkFailure.java:48)
	at org.apache.lucene.util.TestRuleIgnoreAfterMaxFailures$1.evaluate(TestRuleIgnoreAfterMaxFailures.java:70)
	at org.apache.lucene.util.TestRuleIgnoreTestSuites$1.evaluate(TestRuleIgnoreTestSuites.java:55)
	at com.carrotsearch.randomizedtesting.rules.StatementAdapter.evaluate(StatementAdapter.java:36)
	at com.carrotsearch.randomizedtesting.ThreadLeakControl$StatementRunner.run(ThreadLeakControl.java:358)
	at java.lang.Thread.run(Thread.java:662)
Caused by: java.lang.AssertionError: Directory not closed: MockDirWrapper(org.apache.lucene.store.RAMDirectory@62e08426 lockFactory=org.apache.lucene.store.SimpleFSLockFactory@2af9d1d5)
	at org.junit.Assert.fail(Assert.java:93)
	at org.apache.lucene.util.CloseableDirectory.close(CloseableDirectory.java:47)
	at com.carrotsearch.randomizedtesting.RandomizedRunner$2$1.apply(RandomizedRunner.java:602)
	at com.carrotsearch.randomizedtesting.RandomizedRunner$2$1.apply(RandomizedRunner.java:599)
	at com.carrotsearch.randomizedtesting.RandomizedContext.closeResources(RandomizedContext.java:167)
	at com.carrotsearch.randomizedtesting.RandomizedRunner$2.afterAlways(RandomizedRunner.java:615)
	at com.carrotsearch.randomizedtesting.rules.StatementAdapter.evaluate(StatementAdapter.java:43)
	... 2 more


FAILED:  junit.framework.TestSuite.org.apache.solr.cloud.RecoveryZkTest

Error Message:
Resource in scope SUITE failed to close. Resource was registered from thread Thread[id=2499, name=TEST-RecoveryZkTest.testDistribSearch-seed#[1837B4903639C490], state=RUNNABLE, group=TGRP-RecoveryZkTest], registration stack trace below.

Stack Trace:
com.carrotsearch.randomizedtesting.ResourceDisposalError: Resource in scope SUITE failed to close. Resource was registered from thread Thread[id=2499, name=TEST-RecoveryZkTest.testDistribSearch-seed#[1837B4903639C490], state=RUNNABLE, group=TGRP-RecoveryZkTest], registration stack trace below.
	at java.lang.Thread.getStackTrace(Thread.java:1479)
	at com.carrotsearch.randomizedtesting.RandomizedContext.closeAtEnd(RandomizedContext.java:150)
	at org.apache.lucene.util.LuceneTestCase.closeAfterSuite(LuceneTestCase.java:514)
	at org.apache.lucene.util.LuceneTestCase.wrapDirectory(LuceneTestCase.java:958)
	at org.apache.lucene.util.LuceneTestCase.newDirectory(LuceneTestCase.java:872)
	at org.apache.lucene.util.LuceneTestCase.newDirectory(LuceneTestCase.java:864)
	at org.apache.solr.core.MockDirectoryFactory.create(MockDirectoryFactory.java:33)
	at org.apache.solr.core.CachingDirectoryFactory.get(CachingDirectoryFactory.java:232)
	at org.apache.solr.core.CachingDirectoryFactory.get(CachingDirectoryFactory.java:192)
	at org.apache.solr.handler.ReplicationHandler.getIndexSize(ReplicationHandler.java:470)
	at org.apache.solr.handler.ReplicationHandler.getStatistics(ReplicationHandler.java:516)
	at org.apache.solr.core.RequestHandlers$LazyRequestHandlerWrapper.getStatistics(RequestHandlers.java:310)
	at org.apache.solr.core.JmxMonitoredMap$SolrDynamicMBean.getMBeanInfo(JmxMonitoredMap.java:231)
	at com.sun.jmx.interceptor.DefaultMBeanServerInterceptor.getClassName(DefaultMBeanServerInterceptor.java:1780)
	at com.sun.jmx.interceptor.DefaultMBeanServerInterceptor.safeGetClassName(DefaultMBeanServerInterceptor.java:1622)
	at com.sun.jmx.interceptor.DefaultMBeanServerInterceptor.checkMBeanPermission(DefaultMBeanServerInterceptor.java:1789)
	at com.sun.jmx.interceptor.DefaultMBeanServerInterceptor.getAttribute(DefaultMBeanServerInterceptor.java:663)
	at com.sun.jmx.mbeanserver.JmxMBeanServer.getAttribute(JmxMBeanServer.java:638)
	at org.apache.solr.core.JmxMonitoredMap.unregister(JmxMonitoredMap.java:174)
	at org.apache.solr.core.JmxMonitoredMap.clear(JmxMonitoredMap.java:116)
	at org.apache.solr.core.SolrCore.close(SolrCore.java:951)
	at org.apache.solr.core.CoreContainer.shutdown(CoreContainer.java:589)
	at org.apache.solr.servlet.SolrDispatchFilter.destroy(SolrDispatchFilter.java:130)
	at org.apache.solr.cloud.ChaosMonkey.stopJettySolrRunner(ChaosMonkey.java:199)
	at org.apache.solr.cloud.ChaosMonkey.stop(ChaosMonkey.java:506)
	at org.apache.solr.cloud.AbstractFullDistribZkTestBase.destroyServers(AbstractFullDistribZkTestBase.java:1185)
	at org.apache.solr.BaseDistributedSearchTestCase.testDistribSearch(BaseDistributedSearchTestCase.java:696)
	at sun.reflect.NativeMethodAccessorImpl.invoke0(Native Method)
	at sun.reflect.NativeMethodAccessorImpl.invoke(NativeMethodAccessorImpl.java:39)
	at sun.reflect.DelegatingMethodAccessorImpl.invoke(DelegatingMethodAccessorImpl.java:25)
	at java.lang.reflect.Method.invoke(Method.java:597)
	at com.carrotsearch.randomizedtesting.RandomizedRunner.invoke(RandomizedRunner.java:1559)
	at com.carrotsearch.randomizedtesting.RandomizedRunner.access$600(RandomizedRunner.java:79)
	at com.carrotsearch.randomizedtesting.RandomizedRunner$6.evaluate(RandomizedRunner.java:737)
	at com.carrotsearch.randomizedtesting.RandomizedRunner$7.evaluate(RandomizedRunner.java:773)
	at com.carrotsearch.randomizedtesting.RandomizedRunner$8.evaluate(RandomizedRunner.java:787)
	at com.carrotsearch.randomizedtesting.rules.SystemPropertiesRestoreRule$1.evaluate(SystemPropertiesRestoreRule.java:53)
	at org.apache.lucene.util.TestRuleSetupTeardownChained$1.evaluate(TestRuleSetupTeardownChained.java:50)
	at org.apache.lucene.util.TestRuleFieldCacheSanity$1.evaluate(TestRuleFieldCacheSanity.java:51)
	at org.apache.lucene.util.AbstractBeforeAfterRule$1.evaluate(AbstractBeforeAfterRule.java:45)
	at com.carrotsearch.randomizedtesting.rules.SystemPropertiesInvariantRule$1.evaluate(SystemPropertiesInvariantRule.java:55)
	at org.apache.lucene.util.TestRuleThreadAndTestName$1.evaluate(TestRuleThreadAndTestName.java:48)
	at org.apache.lucene.util.TestRuleIgnoreAfterMaxFailures$1.evaluate(TestRuleIgnoreAfterMaxFailures.java:70)
	at org.apache.lucene.util.TestRuleMarkFailure$1.evaluate(TestRuleMarkFailure.java:48)
	at com.carrotsearch.randomizedtesting.rules.StatementAdapter.evaluate(StatementAdapter.java:36)
	at com.carrotsearch.randomizedtesting.ThreadLeakControl$StatementRunner.run(ThreadLeakControl.java:358)
	at com.carrotsearch.randomizedtesting.ThreadLeakControl.forkTimeoutingTask(ThreadLeakControl.java:782)
	at com.carrotsearch.randomizedtesting.ThreadLeakControl$3.evaluate(ThreadLeakControl.java:442)
	at com.carrotsearch.randomizedtesting.RandomizedRunner.runSingleTest(RandomizedRunner.java:746)
	at com.carrotsearch.randomizedtesting.RandomizedRunner$3.evaluate(RandomizedRunner.java:648)
	at com.carrotsearch.randomizedtesting.RandomizedRunner$4.evaluate(RandomizedRunner.java:682)
	at com.carrotsearch.randomizedtesting.RandomizedRunner$5.evaluate(RandomizedRunner.java:693)
	at com.carrotsearch.randomizedtesting.rules.StatementAdapter.evaluate(StatementAdapter.java:36)
	at com.carrotsearch.randomizedtesting.rules.SystemPropertiesRestoreRule$1.evaluate(SystemPropertiesRestoreRule.java:53)
	at org.apache.lucene.util.AbstractBeforeAfterRule$1.evaluate(AbstractBeforeAfterRule.java:45)
	at org.apache.lucene.util.TestRuleStoreClassName$1.evaluate(TestRuleStoreClassName.java:42)
	at com.carrotsearch.randomizedtesting.rules.SystemPropertiesInvariantRule$1.evaluate(SystemPropertiesInvariantRule.java:55)
	at com.carrotsearch.randomizedtesting.rules.NoShadowingOrOverridesOnMethodsRule$1.evaluate(NoShadowingOrOverridesOnMethodsRule.java:39)
	at com.carrotsearch.randomizedtesting.rules.NoShadowingOrOverridesOnMethodsRule$1.evaluate(NoShadowingOrOverridesOnMethodsRule.java:39)
	at com.carrotsearch.randomizedtesting.rules.StatementAdapter.evaluate(StatementAdapter.java:36)
	at org.apache.lucene.util.TestRuleAssertionsRequired$1.evaluate(TestRuleAssertionsRequired.java:43)
	at org.apache.lucene.util.TestRuleMarkFailure$1.evaluate(TestRuleMarkFailure.java:48)
	at org.apache.lucene.util.TestRuleIgnoreAfterMaxFailures$1.evaluate(TestRuleIgnoreAfterMaxFailures.java:70)
	at org.apache.lucene.util.TestRuleIgnoreTestSuites$1.evaluate(TestRuleIgnoreTestSuites.java:55)
	at com.carrotsearch.randomizedtesting.rules.StatementAdapter.evaluate(StatementAdapter.java:36)
	at com.carrotsearch.randomizedtesting.ThreadLeakControl$StatementRunner.run(ThreadLeakControl.java:358)
	at java.lang.Thread.run(Thread.java:662)
Caused by: java.lang.AssertionError: Directory not closed: MockDirWrapper(org.apache.lucene.store.MMapDirectory@C:\Users\JenkinsSlave\workspace\Lucene-Solr-trunk-Windows\solr\build\solr-core\test\J0\index1104711057tmp lockFactory=org.apache.lucene.store.SimpleFSLockFactory@6ff31e4b)
	at org.junit.Assert.fail(Assert.java:93)
	at org.apache.lucene.util.CloseableDirectory.close(CloseableDirectory.java:47)
	at com.carrotsearch.randomizedtesting.RandomizedRunner$2$1.apply(RandomizedRunner.java:602)
	at com.carrotsearch.randomizedtesting.RandomizedRunner$2$1.apply(RandomizedRunner.java:599)
	at com.carrotsearch.randomizedtesting.RandomizedContext.closeResources(RandomizedContext.java:167)
	at com.carrotsearch.randomizedtesting.RandomizedRunner$2.afterAlways(RandomizedRunner.java:615)
	at com.carrotsearch.randomizedtesting.rules.StatementAdapter.evaluate(StatementAdapter.java:43)
	... 2 more




Build Log:
[...truncated 8112 lines...]
[junit4:junit4] Suite: org.apache.solr.cloud.BasicDistributedZkTest
[junit4:junit4]   2> 2 T1815 oas.SolrTestCaseJ4.setUp ###Starting testDistribSearch
[junit4:junit4]   2> Creating dataDir: C:\Users\JenkinsSlave\workspace\Lucene-Solr-trunk-Windows\solr\build\solr-core\test\J0\.\solrtest-BasicDistributedZkTest-1351547277008
[junit4:junit4]   2> 6 T1815 oasc.ZkTestServer.run STARTING ZK TEST SERVER
[junit4:junit4]   2> 11 T1816 oazs.ZooKeeperServer.setTickTime tickTime set to 1000
[junit4:junit4]   2> 14 T1816 oazs.NIOServerCnxn$Factory.<init> binding to port 0.0.0.0/0.0.0.0:0
[junit4:junit4]   2> 15 T1816 oazsp.FileTxnSnapLog.save Snapshotting: 0
[junit4:junit4]   2> 137 T1815 oasc.ZkTestServer.run start zk server on port:52633
[junit4:junit4]   2> 137 T1815 oaz.ZooKeeper.<init> Initiating client connection, connectString=127.0.0.1:52633 sessionTimeout=10000 watcher=org.apache.solr.common.cloud.ConnectionManager@76e55122
[junit4:junit4]   2> 140 T1815 oascc.ConnectionManager.waitForConnected Waiting for client to connect to ZooKeeper
[junit4:junit4]   2> 140 T1821 oaz.ClientCnxn$SendThread.startConnect Opening socket connection to server /127.0.0.1:52633
[junit4:junit4]   2> 144 T1821 oaz.ClientCnxn$SendThread.primeConnection Socket connection established to 127.0.0.1/127.0.0.1:52633, initiating session
[junit4:junit4]   2> 147 T1817 oazs.NIOServerCnxn$Factory.run Accepted socket connection from /127.0.0.1:52636
[junit4:junit4]   2> 147 T1817 oazs.NIOServerCnxn.readConnectRequest Client attempting to establish new session at /127.0.0.1:52636
[junit4:junit4]   2> 148 T1819 oazsp.FileTxnLog.append Creating new log file: log.1
[junit4:junit4]   2> 159 T1821 oaz.ClientCnxn$SendThread.readConnectResult Session establishment complete on server 127.0.0.1/127.0.0.1:52633, sessionid = 0x13aae7ecedb0000, negotiated timeout = 10000
[junit4:junit4]   2> 161 T1819 oazs.NIOServerCnxn.finishSessionInit Established session 0x13aae7ecedb0000 with negotiated timeout 10000 for client /127.0.0.1:52636
[junit4:junit4]   2> 161 T1822 oascc.ConnectionManager.process Watcher org.apache.solr.common.cloud.ConnectionManager@76e55122 name:ZooKeeperConnection Watcher:127.0.0.1:52633 got event WatchedEvent state:SyncConnected type:None path:null path:null type:None
[junit4:junit4]   2> 162 T1815 oascc.ConnectionManager.waitForConnected Client is connected to ZooKeeper
[junit4:junit4]   2> 162 T1815 oascc.SolrZkClient.makePath makePath: /solr
[junit4:junit4]   2> 190 T1820 oazs.PrepRequestProcessor.pRequest Processed session termination for sessionid: 0x13aae7ecedb0000
[junit4:junit4]   2> 192 T1815 oaz.ZooKeeper.close Session: 0x13aae7ecedb0000 closed
[junit4:junit4]   2> 194 T1817 oazs.NIOServerCnxn.closeSock Closed socket connection for client /127.0.0.1:52636 which had sessionid 0x13aae7ecedb0000
[junit4:junit4]   2> 194 T1822 oaz.ClientCnxn$EventThread.run EventThread shut down
[junit4:junit4]   2> 195 T1815 oaz.ZooKeeper.<init> Initiating client connection, connectString=127.0.0.1:52633/solr sessionTimeout=10000 watcher=org.apache.solr.common.cloud.ConnectionManager@5e46d899
[junit4:junit4]   2> 197 T1823 oaz.ClientCnxn$SendThread.startConnect Opening socket connection to server /127.0.0.1:52633
[junit4:junit4]   2> 197 T1815 oascc.ConnectionManager.waitForConnected Waiting for client to connect to ZooKeeper
[junit4:junit4]   2> 199 T1823 oaz.ClientCnxn$SendThread.primeConnection Socket connection established to 127.0.0.1/127.0.0.1:52633, initiating session
[junit4:junit4]   2> 199 T1817 oazs.NIOServerCnxn$Factory.run Accepted socket connection from /127.0.0.1:52639
[junit4:junit4]   2> 199 T1817 oazs.NIOServerCnxn.readConnectRequest Client attempting to establish new session at /127.0.0.1:52639
[junit4:junit4]   2> 203 T1819 oazs.NIOServerCnxn.finishSessionInit Established session 0x13aae7ecedb0001 with negotiated timeout 10000 for client /127.0.0.1:52639
[junit4:junit4]   2> 203 T1823 oaz.ClientCnxn$SendThread.readConnectResult Session establishment complete on server 127.0.0.1/127.0.0.1:52633, sessionid = 0x13aae7ecedb0001, negotiated timeout = 10000
[junit4:junit4]   2> 203 T1824 oascc.ConnectionManager.process Watcher org.apache.solr.common.cloud.ConnectionManager@5e46d899 name:ZooKeeperConnection Watcher:127.0.0.1:52633/solr got event WatchedEvent state:SyncConnected type:None path:null path:null type:None
[junit4:junit4]   2> 203 T1815 oascc.ConnectionManager.waitForConnected Client is connected to ZooKeeper
[junit4:junit4]   2> 204 T1815 oascc.SolrZkClient.makePath makePath: /collections/collection1
[junit4:junit4]   2> 210 T1815 oascc.SolrZkClient.makePath makePath: /collections/collection1/shards
[junit4:junit4]   2> 215 T1815 oascc.SolrZkClient.makePath makePath: /collections/control_collection
[junit4:junit4]   2> 220 T1815 oascc.SolrZkClient.makePath makePath: /collections/control_collection/shards
[junit4:junit4]   2> 227 T1815 oasc.AbstractZkTestCase.putConfig put C:\Users\JenkinsSlave\workspace\Lucene-Solr-trunk-Windows\solr\build\solr-core\test-files\solr\collection1\conf\solrconfig.xml to /configs/conf1/solrconfig.xml
[junit4:junit4]   2> 227 T1815 oascc.SolrZkClient.makePath makePath: /configs/conf1/solrconfig.xml
[junit4:junit4]   2> 237 T1815 oasc.AbstractZkTestCase.putConfig put C:\Users\JenkinsSlave\workspace\Lucene-Solr-trunk-Windows\solr\build\solr-core\test-files\solr\collection1\conf\schema.xml to /configs/conf1/schema.xml
[junit4:junit4]   2> 237 T1815 oascc.SolrZkClient.makePath makePath: /configs/conf1/schema.xml
[junit4:junit4]   2> 243 T1815 oasc.AbstractZkTestCase.putConfig put C:\Users\JenkinsSlave\workspace\Lucene-Solr-trunk-Windows\solr\build\solr-core\test-files\solr\collection1\conf\solrconfig.xml to /configs/conf1/solrconfig.xml
[junit4:junit4]   2> 243 T1815 oascc.SolrZkClient.makePath makePath: /configs/conf1/solrconfig.xml
[junit4:junit4]   2> 251 T1815 oasc.AbstractZkTestCase.putConfig put C:\Users\JenkinsSlave\workspace\Lucene-Solr-trunk-Windows\solr\build\solr-core\test-files\solr\collection1\conf\stopwords.txt to /configs/conf1/stopwords.txt
[junit4:junit4]   2> 251 T1815 oascc.SolrZkClient.makePath makePath: /configs/conf1/stopwords.txt
[junit4:junit4]   2> 257 T1815 oasc.AbstractZkTestCase.putConfig put C:\Users\JenkinsSlave\workspace\Lucene-Solr-trunk-Windows\solr\build\solr-core\test-files\solr\collection1\conf\protwords.txt to /configs/conf1/protwords.txt
[junit4:junit4]   2> 258 T1815 oascc.SolrZkClient.makePath makePath: /configs/conf1/protwords.txt
[junit4:junit4]   2> 263 T1815 oasc.AbstractZkTestCase.putConfig put C:\Users\JenkinsSlave\workspace\Lucene-Solr-trunk-Windows\solr\build\solr-core\test-files\solr\collection1\conf\currency.xml to /configs/conf1/currency.xml
[junit4:junit4]   2> 265 T1815 oascc.SolrZkClient.makePath makePath: /configs/conf1/currency.xml
[junit4:junit4]   2> 270 T1815 oasc.AbstractZkTestCase.putConfig put C:\Users\JenkinsSlave\workspace\Lucene-Solr-trunk-Windows\solr\build\solr-core\test-files\solr\collection1\conf\open-exchange-rates.json to /configs/conf1/open-exchange-rates.json
[junit4:junit4]   2> 270 T1815 oascc.SolrZkClient.makePath makePath: /configs/conf1/open-exchange-rates.json
[junit4:junit4]   2> 275 T1815 oasc.AbstractZkTestCase.putConfig put C:\Users\JenkinsSlave\workspace\Lucene-Solr-trunk-Windows\solr\build\solr-core\test-files\solr\collection1\conf\mapping-ISOLatin1Accent.txt to /configs/conf1/mapping-ISOLatin1Accent.txt
[junit4:junit4]   2> 276 T1815 oascc.SolrZkClient.makePath makePath: /configs/conf1/mapping-ISOLatin1Accent.txt
[junit4:junit4]   2> 281 T1815 oasc.AbstractZkTestCase.putConfig put C:\Users\JenkinsSlave\workspace\Lucene-Solr-trunk-Windows\solr\build\solr-core\test-files\solr\collection1\conf\old_synonyms.txt to /configs/conf1/old_synonyms.txt
[junit4:junit4]   2> 281 T1815 oascc.SolrZkClient.makePath makePath: /configs/conf1/old_synonyms.txt
[junit4:junit4]   2> 286 T1815 oasc.AbstractZkTestCase.putConfig put C:\Users\JenkinsSlave\workspace\Lucene-Solr-trunk-Windows\solr\build\solr-core\test-files\solr\collection1\conf\synonyms.txt to /configs/conf1/synonyms.txt
[junit4:junit4]   2> 286 T1815 oascc.SolrZkClient.makePath makePath: /configs/conf1/synonyms.txt
[junit4:junit4]   2> 293 T1820 oazs.PrepRequestProcessor.pRequest Processed session termination for sessionid: 0x13aae7ecedb0001
[junit4:junit4]   2> 294 T1824 oaz.ClientCnxn$EventThread.run EventThread shut down
[junit4:junit4]   2> 294 T1815 oaz.ZooKeeper.close Session: 0x13aae7ecedb0001 closed
[junit4:junit4]   2> 295 T1817 oazs.NIOServerCnxn.doIO WARNING EndOfStreamException: Unable to read additional data from client sessionid 0x13aae7ecedb0001, likely client has closed socket
[junit4:junit4]   2> 298 T1817 oazs.NIOServerCnxn.closeSock Closed socket connection for client /127.0.0.1:52639 which had sessionid 0x13aae7ecedb0001
[junit4:junit4]   2> 660 T1815 oejs.Server.doStart jetty-8.1.2.v20120308
[junit4:junit4]   2> 664 T1815 oejs.AbstractConnector.doStart Started SelectChannelConnector@0.0.0.0:52640
[junit4:junit4]   2> 665 T1815 oasc.SolrResourceLoader.locateSolrHome JNDI not configured for solr (NoInitialContextEx)
[junit4:junit4]   2> 665 T1815 oasc.SolrResourceLoader.locateSolrHome using system property solr.solr.home: C:\Users\JenkinsSlave\workspace\Lucene-Solr-trunk-Windows\solr\build\solr-core\test\J0\.\org.apache.solr.cloud.BasicDistributedZkTest-controljetty-1351547277298
[junit4:junit4]   2> 665 T1815 oasc.SolrResourceLoader.<init> new SolrResourceLoader for deduced Solr Home: 'C:\Users\JenkinsSlave\workspace\Lucene-Solr-trunk-Windows\solr\build\solr-core\test\J0\.\org.apache.solr.cloud.BasicDistributedZkTest-controljetty-1351547277298\'
[junit4:junit4]   2> 697 T1815 oass.SolrDispatchFilter.init SolrDispatchFilter.init()
[junit4:junit4]   2> 697 T1815 oasc.SolrResourceLoader.locateSolrHome JNDI not configured for solr (NoInitialContextEx)
[junit4:junit4]   2> 697 T1815 oasc.SolrResourceLoader.locateSolrHome using system property solr.solr.home: C:\Users\JenkinsSlave\workspace\Lucene-Solr-trunk-Windows\solr\build\solr-core\test\J0\.\org.apache.solr.cloud.BasicDistributedZkTest-controljetty-1351547277298
[junit4:junit4]   2> 697 T1815 oasc.CoreContainer$Initializer.initialize looking for solr.xml: C:\Users\JenkinsSlave\workspace\Lucene-Solr-trunk-Windows\solr\build\solr-core\test\J0\.\org.apache.solr.cloud.BasicDistributedZkTest-controljetty-1351547277298\solr.xml
[junit4:junit4]   2> 698 T1815 oasc.CoreContainer.<init> New CoreContainer 910338929
[junit4:junit4]   2> 698 T1815 oasc.CoreContainer.load Loading CoreContainer using Solr Home: 'C:\Users\JenkinsSlave\workspace\Lucene-Solr-trunk-Windows\solr\build\solr-core\test\J0\.\org.apache.solr.cloud.BasicDistributedZkTest-controljetty-1351547277298\'
[junit4:junit4]   2> 699 T1815 oasc.SolrResourceLoader.<init> new SolrResourceLoader for directory: 'C:\Users\JenkinsSlave\workspace\Lucene-Solr-trunk-Windows\solr\build\solr-core\test\J0\.\org.apache.solr.cloud.BasicDistributedZkTest-controljetty-1351547277298\'
[junit4:junit4]   2> 717 T1815 oasc.CoreContainer.load Registering Log Listener
[junit4:junit4]   2> 736 T1815 oasc.CoreContainer.initZooKeeper Zookeeper client=127.0.0.1:52633/solr
[junit4:junit4]   2> 736 T1815 oaz.ZooKeeper.<init> Initiating client connection, connectString=127.0.0.1:52633/solr sessionTimeout=5000 watcher=org.apache.solr.common.cloud.ConnectionManager@17342542
[junit4:junit4]   2> 740 T1834 oaz.ClientCnxn$SendThread.startConnect Opening socket connection to server /127.0.0.1:52633
[junit4:junit4]   2> 740 T1815 oascc.ConnectionManager.waitForConnected Waiting for client to connect to ZooKeeper
[junit4:junit4]   2> 742 T1834 oaz.ClientCnxn$SendThread.primeConnection Socket connection established to 127.0.0.1/127.0.0.1:52633, initiating session
[junit4:junit4]   2> 742 T1817 oazs.NIOServerCnxn$Factory.run Accepted socket connection from /127.0.0.1:52645
[junit4:junit4]   2> 742 T1817 oazs.NIOServerCnxn.readConnectRequest Client attempting to establish new session at /127.0.0.1:52645
[junit4:junit4]   2> 755 T1819 oazs.NIOServerCnxn.finishSessionInit Established session 0x13aae7ecedb0002 with negotiated timeout 5000 for client /127.0.0.1:52645
[junit4:junit4]   2> 755 T1834 oaz.ClientCnxn$SendThread.readConnectResult Session establishment complete on server 127.0.0.1/127.0.0.1:52633, sessionid = 0x13aae7ecedb0002, negotiated timeout = 5000
[junit4:junit4]   2> 755 T1835 oascc.ConnectionManager.process Watcher org.apache.solr.common.cloud.ConnectionManager@17342542 name:ZooKeeperConnection Watcher:127.0.0.1:52633/solr got event WatchedEvent state:SyncConnected type:None path:null path:null type:None
[junit4:junit4]   2> 756 T1815 oascc.ConnectionManager.waitForConnected Client is connected to ZooKeeper
[junit4:junit4]   2> 759 T1820 oazs.PrepRequestProcessor.pRequest Got user-level KeeperException when processing sessionid:0x13aae7ecedb0002 type:create cxid:0x2 zxid:0xfffffffffffffffe txntype:unknown reqpath:n/a Error Path:/solr/overseer Error:KeeperErrorCode = NodeExists for /solr/overseer
[junit4:junit4]   2> 763 T1815 oascc.SolrZkClient.makePath makePath: /live_nodes
[junit4:junit4]   2> 766 T1815 oasc.ZkController.createEphemeralLiveNode Register node as live in ZooKeeper:/live_nodes/127.0.0.1:52640_solr
[junit4:junit4]   2> 768 T1820 oazs.PrepRequestProcessor.pRequest Got user-level KeeperException when processing sessionid:0x13aae7ecedb0002 type:delete cxid:0x7 zxid:0xfffffffffffffffe txntype:unknown reqpath:n/a Error Path:/solr/live_nodes/127.0.0.1:52640_solr Error:KeeperErrorCode = NoNode for /solr/live_nodes/127.0.0.1:52640_solr
[junit4:junit4]   2> 769 T1815 oascc.SolrZkClient.makePath makePath: /live_nodes/127.0.0.1:52640_solr
[junit4:junit4]   2> 774 T1815 oashc.HttpShardHandlerFactory.getParameter Setting socketTimeout to: 0
[junit4:junit4]   2> 774 T1815 oashc.HttpShardHandlerFactory.getParameter Setting urlScheme to: http://
[junit4:junit4]   2> 774 T1815 oashc.HttpShardHandlerFactory.getParameter Setting connTimeout to: 0
[junit4:junit4]   2> 774 T1815 oashc.HttpShardHandlerFactory.getParameter Setting maxConnectionsPerHost to: 20
[junit4:junit4]   2> 775 T1815 oashc.HttpShardHandlerFactory.getParameter Setting corePoolSize to: 0
[junit4:junit4]   2> 775 T1815 oashc.HttpShardHandlerFactory.getParameter Setting maximumPoolSize to: 2147483647
[junit4:junit4]   2> 775 T1815 oashc.HttpShardHandlerFactory.getParameter Setting maxThreadIdleTime to: 5
[junit4:junit4]   2> 775 T1815 oashc.HttpShardHandlerFactory.getParameter Setting sizeOfQueue to: -1
[junit4:junit4]   2> 775 T1815 oashc.HttpShardHandlerFactory.getParameter Setting fairnessPolicy to: false
[junit4:junit4]   2> 778 T1815 oascsi.HttpClientUtil.createClient Creating new http client, config:maxConnectionsPerHost=20&maxConnections=10000&socketTimeout=0&connTimeout=0&retry=false
[junit4:junit4]   2> 787 T1815 oascc.SolrZkClient.makePath makePath: /overseer_elect/election
[junit4:junit4]   2> 796 T1820 oazs.PrepRequestProcessor.pRequest Got user-level KeeperException when processing sessionid:0x13aae7ecedb0002 type:delete cxid:0x15 zxid:0xfffffffffffffffe txntype:unknown reqpath:n/a Error Path:/solr/overseer_elect/leader Error:KeeperErrorCode = NoNode for /solr/overseer_elect/leader
[junit4:junit4]   2> 797 T1815 oascc.SolrZkClient.makePath makePath: /overseer_elect/leader
[junit4:junit4]   2> 801 T1815 oasc.Overseer.start Overseer (id=88575002346717186-127.0.0.1:52640_solr-n_0000000000) starting
[junit4:junit4]   2> 802 T1820 oazs.PrepRequestProcessor.pRequest Got user-level KeeperException when processing sessionid:0x13aae7ecedb0002 type:create cxid:0x1a zxid:0xfffffffffffffffe txntype:unknown reqpath:n/a Error Path:/solr/overseer Error:KeeperErrorCode = NodeExists for /solr/overseer
[junit4:junit4]   2> 803 T1820 oazs.PrepRequestProcessor.pRequest Got user-level KeeperException when processing sessionid:0x13aae7ecedb0002 type:create cxid:0x1b zxid:0xfffffffffffffffe txntype:unknown reqpath:n/a Error Path:/solr/overseer Error:KeeperErrorCode = NodeExists for /solr/overseer
[junit4:junit4]   2> 806 T1820 oazs.PrepRequestProcessor.pRequest Got user-level KeeperException when processing sessionid:0x13aae7ecedb0002 type:create cxid:0x1c zxid:0xfffffffffffffffe txntype:unknown reqpath:n/a Error Path:/solr/overseer Error:KeeperErrorCode = NodeExists for /solr/overseer
[junit4:junit4]   2> 808 T1820 oazs.PrepRequestProcessor.pRequest Got user-level KeeperException when processing sessionid:0x13aae7ecedb0002 type:create cxid:0x1d zxid:0xfffffffffffffffe txntype:unknown reqpath:n/a Error Path:/solr/overseer Error:KeeperErrorCode = NodeExists for /solr/overseer
[junit4:junit4]   2> 811 T1837 oasc.OverseerCollectionProcessor.run Process current queue of collection messages
[junit4:junit4]   2> 811 T1815 oascc.SolrZkClient.makePath makePath: /clusterstate.json
[junit4:junit4]   2> 815 T1815 oascc.ZkStateReader.createClusterStateWatchersAndUpdate Updating cluster state from ZooKeeper... 
[junit4:junit4]   2> 817 T1836 oasc.Overseer$ClusterStateUpdater.run Starting to work on the main queue
[junit4:junit4]   2> 824 T1815 oasc.CoreContainer.create Creating SolrCore 'collection1' using instanceDir: C:\Users\JenkinsSlave\workspace\Lucene-Solr-trunk-Windows\solr\build\solr-core\test\J0\.\org.apache.solr.cloud.BasicDistributedZkTest-controljetty-1351547277298\collection1
[junit4:junit4]   2> 824 T1815 oasc.ZkController.createCollectionZkNode Check for collection zkNode:control_collection
[junit4:junit4]   2> 825 T1815 oasc.ZkController.createCollectionZkNode Collection zkNode exists
[junit4:junit4]   2> 825 T1815 oasc.ZkController.readConfigName Load collection config from:/collections/control_collection
[junit4:junit4]   2> 827 T1815 oasc.SolrResourceLoader.<init> new SolrResourceLoader for directory: 'C:\Users\JenkinsSlave\workspace\Lucene-Solr-trunk-Windows\solr\build\solr-core\test\J0\.\org.apache.solr.cloud.BasicDistributedZkTest-controljetty-1351547277298\collection1\'
[junit4:junit4]   2> 829 T1815 oasc.SolrResourceLoader.replaceClassLoader Adding 'file:/C:/Users/JenkinsSlave/workspace/Lucene-Solr-trunk-Windows/solr/build/solr-core/test/J0/org.apache.solr.cloud.BasicDistributedZkTest-controljetty-1351547277298/collection1/lib/classes/' to classloader
[junit4:junit4]   2> 830 T1815 oasc.SolrResourceLoader.replaceClassLoader Adding 'file:/C:/Users/JenkinsSlave/workspace/Lucene-Solr-trunk-Windows/solr/build/solr-core/test/J0/org.apache.solr.cloud.BasicDistributedZkTest-controljetty-1351547277298/collection1/lib/README' to classloader
[junit4:junit4]   2> 882 T1815 oasc.SolrConfig.<init> Using Lucene MatchVersion: LUCENE_50
[junit4:junit4]   2> 951 T1815 oasc.SolrConfig.<init> Loaded SolrConfig: solrconfig.xml
[junit4:junit4]   2> 958 T1815 oass.IndexSchema.readSchema Reading Solr Schema
[junit4:junit4]   2> 962 T1815 oass.IndexSchema.readSchema Schema name=test
[junit4:junit4]   2> 1668 T1815 oass.OpenExchangeRatesOrgProvider.init Initialized with rates=open-exchange-rates.json, refreshInterval=1440.
[junit4:junit4]   2> 1680 T1815 oass.IndexSchema.readSchema default search field in schema is text
[junit4:junit4]   2> 1687 T1815 oass.IndexSchema.readSchema unique key field: id
[junit4:junit4]   2> 1705 T1815 oass.FileExchangeRateProvider.reload Reloading exchange rates from file currency.xml
[junit4:junit4]   2> 1709 T1815 oass.FileExchangeRateProvider.reload Reloading exchange rates from file currency.xml
[junit4:junit4]   2> 1715 T1815 oass.OpenExchangeRatesOrgProvider.reload Reloading exchange rates from open-exchange-rates.json
[junit4:junit4]   2> 1718 T1815 oass.OpenExchangeRatesOrgProvider.reload Reloading exchange rates from open-exchange-rates.json
[junit4:junit4]   2> 1721 T1815 oasc.SolrCore.<init> [collection1] Opening new SolrCore at C:\Users\JenkinsSlave\workspace\Lucene-Solr-trunk-Windows\solr\build\solr-core\test\J0\.\org.apache.solr.cloud.BasicDistributedZkTest-controljetty-1351547277298\collection1\, dataDir=.\org.apache.solr.cloud.BasicDistributedZkTest-1351547277005/control/data\
[junit4:junit4]   2> 1721 T1815 oasc.JmxMonitoredMap.<init> JMX monitoring is enabled. Adding Solr mbeans to JMX Server: com.sun.jmx.mbeanserver.JmxMBeanServer@36bf7916
[junit4:junit4]   2> 1721 T1815 oasc.SolrCore.initDirectoryFactory solr.NRTCachingDirectoryFactory
[junit4:junit4]   2> 1723 T1815 oasc.CachingDirectoryFactory.injectLockFactory WARNING No lockType configured for NRTCachingDirectory(org.apache.lucene.store.MMapDirectory@C:\Users\JenkinsSlave\workspace\Lucene-Solr-trunk-Windows\solr\build\solr-core\test\J0\org.apache.solr.cloud.BasicDistributedZkTest-1351547277005\control\data lockFactory=org.apache.lucene.store.NativeFSLockFactory@110bab65; maxCacheMB=48.0 maxMergeSizeMB=4.0) assuming 'simple'
[junit4:junit4]   2> 1723 T1815 oasc.CachingDirectoryFactory.get return new directory for C:\Users\JenkinsSlave\workspace\Lucene-Solr-trunk-Windows\solr\build\solr-core\test\J0\.\org.apache.solr.cloud.BasicDistributedZkTest-1351547277005\control\data forceNew:false
[junit4:junit4]   2> 1724 T1815 oasc.CachingDirectoryFactory.close Releasing directory:C:\Users\JenkinsSlave\workspace\Lucene-Solr-trunk-Windows\solr\build\solr-core\test\J0\.\org.apache.solr.cloud.BasicDistributedZkTest-1351547277005\control\data
[junit4:junit4]   2> 1724 T1815 oasc.SolrCore.getNewIndexDir New index directory detected: old=null new=.\org.apache.solr.cloud.BasicDistributedZkTest-1351547277005/control/data\index/
[junit4:junit4]   2> 1725 T1815 oasc.SolrCore.initIndex WARNING [collection1] Solr index directory '.\org.apache.solr.cloud.BasicDistributedZkTest-1351547277005\control\data\index' doesn't exist. Creating new index...
[junit4:junit4]   2> 1725 T1815 oasc.CachingDirectoryFactory.get return new directory for C:\Users\JenkinsSlave\workspace\Lucene-Solr-trunk-Windows\solr\build\solr-core\test\J0\.\org.apache.solr.cloud.BasicDistributedZkTest-1351547277005\control\data\index forceNew:false
[junit4:junit4]   2> 1740 T1815 oasc.SolrDeletionPolicy.onCommit SolrDeletionPolicy.onCommit: commits:num=1
[junit4:junit4]   2> 		commit{dir=NRTCachingDirectory(org.apache.lucene.store.MMapDirectory@C:\Users\JenkinsSlave\workspace\Lucene-Solr-trunk-Windows\solr\build\solr-core\test\J0\org.apache.solr.cloud.BasicDistributedZkTest-1351547277005\control\data\index lockFactory=org.apache.lucene.store.NativeFSLockFactory@2adc0e3f; maxCacheMB=48.0 maxMergeSizeMB=4.0),segFN=segments_1,generation=1,filenames=[segments_1]
[junit4:junit4]   2> 1740 T1815 oasc.SolrDeletionPolicy.updateCommits newest commit = 1[segments_1]
[junit4:junit4]   2> 1744 T1815 oasc.CachingDirectoryFactory.close Releasing directory:C:\Users\JenkinsSlave\workspace\Lucene-Solr-trunk-Windows\solr\build\solr-core\test\J0\.\org.apache.solr.cloud.BasicDistributedZkTest-1351547277005\control\data\index
[junit4:junit4]   2> 1744 T1815 oasc.SolrCore.initWriters created xml: solr.XMLResponseWriter
[junit4:junit4]   2> 1746 T1815 oasup.UpdateRequestProcessorChain.init inserting DistributedUpdateProcessorFactory into updateRequestProcessorChain "dedupe"
[junit4:junit4]   2> 1746 T1815 oasup.UpdateRequestProcessorChain.init inserting DistributedUpdateProcessorFactory into updateRequestProcessorChain "dedupe-allfields"
[junit4:junit4]   2> 1747 T1815 oasup.UpdateRequestProcessorChain.init inserting DistributedUpdateProcessorFactory into updateRequestProcessorChain "stored_sig"
[junit4:junit4]   2> 1747 T1815 oasup.UpdateRequestProcessorChain.init inserting DistributedUpdateProcessorFactory into updateRequestProcessorChain "uniq-fields"
[junit4:junit4]   2> 1748 T1815 oasup.UpdateRequestProcessorChain.init inserting DistributedUpdateProcessorFactory into updateRequestProcessorChain "distrib-dup-test-chain-implicit"
[junit4:junit4]   2> 1748 T1815 oasc.RequestHandlers.initHandlersFromConfig adding lazy requestHandler: solr.ReplicationHandler
[junit4:junit4]   2> 1749 T1815 oasc.RequestHandlers.initHandlersFromConfig created /replication: solr.ReplicationHandler
[junit4:junit4]   2> 1749 T1815 oasc.RequestHandlers.initHandlersFromConfig created standard: solr.StandardRequestHandler
[junit4:junit4]   2> 1750 T1815 oasc.RequestHandlers.initHandlersFromConfig created /get: solr.RealTimeGetHandler
[junit4:junit4]   2> 1750 T1815 oasc.RequestHandlers.initHandlersFromConfig created dismax: solr.SearchHandler
[junit4:junit4]   2> 1752 T1815 oasc.RequestHandlers.initHandlersFromConfig created mock: org.apache.solr.core.MockQuerySenderListenerReqHandler
[junit4:junit4]   2> 1752 T1815 oasc.RequestHandlers.initHandlersFromConfig created /admin/: org.apache.solr.handler.admin.AdminHandlers
[junit4:junit4]   2> 1753 T1815 oasc.RequestHandlers.initHandlersFromConfig created defaults: solr.StandardRequestHandler
[junit4:junit4]   2> 1753 T1815 oasc.RequestHandlers.initHandlersFromConfig adding lazy requestHandler: solr.StandardRequestHandler
[junit4:junit4]   2> 1754 T1815 oasc.RequestHandlers.initHandlersFromConfig created lazy: solr.StandardRequestHandler
[junit4:junit4]   2> 1754 T1815 oasc.RequestHandlers.initHandlersFromConfig created /update: solr.UpdateRequestHandler
[junit4:junit4]   2> 1755 T1815 oasc.RequestHandlers.initHandlersFromConfig created /terms: org.apache.solr.handler.component.SearchHandler
[junit4:junit4]   2> 1755 T1815 oasc.RequestHandlers.initHandlersFromConfig created spellCheckCompRH: org.apache.solr.handler.component.SearchHandler
[junit4:junit4]   2> 1756 T1815 oasc.RequestHandlers.initHandlersFromConfig created spellCheckCompRH_Direct: org.apache.solr.handler.component.SearchHandler
[junit4:junit4]   2> 1756 T1815 oasc.RequestHandlers.initHandlersFromConfig created spellCheckWithWordbreak: org.apache.solr.handler.component.SearchHandler
[junit4:junit4]   2> 1757 T1815 oasc.RequestHandlers.initHandlersFromConfig created spellCheckWithWordbreak_Direct: org.apache.solr.handler.component.SearchHandler
[junit4:junit4]   2> 1757 T1815 oasc.RequestHandlers.initHandlersFromConfig created spellCheckCompRH1: org.apache.solr.handler.component.SearchHandler
[junit4:junit4]   2> 1758 T1815 oasc.RequestHandlers.initHandlersFromConfig created tvrh: org.apache.solr.handler.component.SearchHandler
[junit4:junit4]   2> 1758 T1815 oasc.RequestHandlers.initHandlersFromConfig created /mlt: solr.MoreLikeThisHandler
[junit4:junit4]   2> 1760 T1815 oasc.RequestHandlers.initHandlersFromConfig created /debug/dump: solr.DumpRequestHandler
[junit4:junit4]   2> 1769 T1815 oashl.XMLLoader.init xsltCacheLifetimeSeconds=60
[junit4:junit4]   2> 1774 T1815 oasc.SolrCore.initDeprecatedSupport WARNING solrconfig.xml uses deprecated <admin/gettableFiles>, Please update your config to use the ShowFileRequestHandler.
[junit4:junit4]   2> 1777 T1815 oasc.SolrCore.initDeprecatedSupport WARNING adding ShowFileRequestHandler with hidden files: [SCHEMA.XML, OLD_SYNONYMS.TXT, STOPWORDS.TXT, PROTWORDS.TXT, OPEN-EXCHANGE-RATES.JSON, SYNONYMS.TXT, CURRENCY.XML, MAPPING-ISOLATIN1ACCENT.TXT]
[junit4:junit4]   2> 1779 T1815 oasc.CachingDirectoryFactory.close Releasing directory:C:\Users\JenkinsSlave\workspace\Lucene-Solr-trunk-Windows\solr\build\solr-core\test\J0\.\org.apache.solr.cloud.BasicDistributedZkTest-1351547277005\control\data
[junit4:junit4]   2> 1781 T1815 oass.SolrIndexSearcher.<init> Opening Searcher@18d14949 main
[junit4:junit4]   2> 1784 T1815 oasu.CommitTracker.<init> Hard AutoCommit: disabled
[junit4:junit4]   2> 1784 T1815 oasu.CommitTracker.<init> Soft AutoCommit: disabled
[junit4:junit4]   2> 1784 T1815 oashc.SpellCheckComponent.inform Initializing spell checkers
[junit4:junit4]   2> 1797 T1815 oass.DirectSolrSpellChecker.init init: {name=direct,classname=DirectSolrSpellChecker,field=lowerfilt,minQueryLength=3}
[junit4:junit4]   2> 1875 T1838 oasc.SolrCore.registerSearcher [collection1] Registered new searcher Searcher@18d14949 main{StandardDirectoryReader(segments_1:1)}
[junit4:junit4]   2> 1877 T1815 oasc.ZkController.publish numShards not found on descriptor - reading it from system property
[junit4:junit4]   2> 1878 T1820 oazs.PrepRequestProcessor.pRequest Got user-level KeeperException when processing sessionid:0x13aae7ecedb0002 type:create cxid:0x53 zxid:0xfffffffffffffffe txntype:unknown reqpath:n/a Error Path:/solr/overseer/queue Error:KeeperErrorCode = NoNode for /solr/overseer/queue
[junit4:junit4]   2> 1884 T1815 oasc.CoreContainer.register registering core: collection1
[junit4:junit4]   2> 1885 T1815 oasc.ZkController.register Register shard - core:collection1 address:http://127.0.0.1:52640/solr shardId:control_shard
[junit4:junit4]   2> 1886 T1815 oascc.SolrZkClient.makePath makePath: /collections/control_collection/leader_elect/control_shard/election
[junit4:junit4]   2> 1899 T1820 oazs.PrepRequestProcessor.pRequest Got user-level KeeperException when processing sessionid:0x13aae7ecedb0002 type:delete cxid:0x62 zxid:0xfffffffffffffffe txntype:unknown reqpath:n/a Error Path:/solr/collections/control_collection/leaders Error:KeeperErrorCode = NoNode for /solr/collections/control_collection/leaders
[junit4:junit4]   2> 1900 T1815 oasc.ShardLeaderElectionContext.runLeaderProcess Running the leader process.
[junit4:junit4]   2> 1901 T1820 oazs.PrepRequestProcessor.pRequest Got user-level KeeperException when processing sessionid:0x13aae7ecedb0002 type:create cxid:0x63 zxid:0xfffffffffffffffe txntype:unknown reqpath:n/a Error Path:/solr/overseer Error:KeeperErrorCode = NodeExists for /solr/overseer
[junit4:junit4]   2> 1993 T1836 oascc.ZkStateReader.updateClusterState Updating cloud state from ZooKeeper... 
[junit4:junit4]   2> 1995 T1836 oasc.Overseer$ClusterStateUpdater.updateState Update state numShards=null message={
[junit4:junit4]   2> 	  "operation":"state",
[junit4:junit4]   2> 	  "numShards":null,
[junit4:junit4]   2> 	  "shard":"control_shard",
[junit4:junit4]   2> 	  "roles":null,
[junit4:junit4]   2> 	  "state":"down",
[junit4:junit4]   2> 	  "core":"collection1",
[junit4:junit4]   2> 	  "collection":"control_collection",
[junit4:junit4]   2> 	  "node_name":"127.0.0.1:52640_solr",
[junit4:junit4]   2> 	  "base_url":"http://127.0.0.1:52640/solr"}
[junit4:junit4]   2> 1995 T1820 oazs.PrepRequestProcessor.pRequest Got user-level KeeperException when processing sessionid:0x13aae7ecedb0002 type:create cxid:0x6a zxid:0xfffffffffffffffe txntype:unknown reqpath:n/a Error Path:/solr/overseer/queue-work Error:KeeperErrorCode = NoNode for /solr/overseer/queue-work
[junit4:junit4]   2> 2013 T1835 oascc.ZkStateReader$2.process A cluster state change has occurred - updating... (1)
[junit4:junit4]   2> 2488 T1815 oasc.ShardLeaderElectionContext.waitForReplicasToComeUp Enough replicas found to continue.
[junit4:junit4]   2> 2488 T1815 oasc.ShardLeaderElectionContext.runLeaderProcess I may be the new leader - try and sync
[junit4:junit4]   2> 2490 T1815 oasc.SyncStrategy.sync Sync replicas to http://127.0.0.1:52640/solr/collection1/
[junit4:junit4]   2> 2490 T1815 oasc.SyncStrategy.syncReplicas Sync Success - now sync replicas to me
[junit4:junit4]   2> 2490 T1815 oasc.SyncStrategy.syncToMe http://127.0.0.1:52640/solr/collection1/ has no replicas
[junit4:junit4]   2> 2491 T1815 oasc.ShardLeaderElectionContext.runLeaderProcess I am the new leader: http://127.0.0.1:52640/solr/collection1/
[junit4:junit4]   2> 2491 T1815 oascc.SolrZkClient.makePath makePath: /collections/control_collection/leaders/control_shard
[junit4:junit4]   2> 2503 T1820 oazs.PrepRequestProcessor.pRequest Got user-level KeeperException when processing sessionid:0x13aae7ecedb0002 type:create cxid:0x89 zxid:0xfffffffffffffffe txntype:unknown reqpath:n/a Error Path:/solr/overseer Error:KeeperErrorCode = NodeExists for /solr/overseer
[junit4:junit4]   2> 2607 T1836 oascc.ZkStateReader.updateClusterState Updating cloud state from ZooKeeper... 
[junit4:junit4]   2> 2616 T1835 oascc.ZkStateReader$2.process A cluster state change has occurred - updating... (1)
[junit4:junit4]   2> 2628 T1815 oasc.ZkController.register We are http://127.0.0.1:52640/solr/collection1/ and leader is http://127.0.0.1:52640/solr/collection1/
[junit4:junit4]   2> 2628 T1815 oasc.ZkController.register No LogReplay needed for core=collection1 baseURL=http://127.0.0.1:52640/solr
[junit4:junit4]   2> 2628 T1815 oasc.ZkController.checkRecovery I am the leader, no recovery necessary
[junit4:junit4]   2> 2629 T1815 oasc.ZkController.publish numShards not found on descriptor - reading it from system property
[junit4:junit4]   2> 2631 T1815 oascc.ZkStateReader.updateClusterState Updating cloud state from ZooKeeper... 
[junit4:junit4]   2> 2632 T1815 oass.SolrDispatchFilter.init user.dir=C:\Users\JenkinsSlave\workspace\Lucene-Solr-trunk-Windows\solr\build\solr-core\test\J0
[junit4:junit4]   2> 2632 T1815 oass.SolrDispatchFilter.init SolrDispatchFilter.init() done
[junit4:junit4]   2> 2633 T1815 oascsi.HttpClientUtil.createClient Creating new http client, config:maxConnections=128&maxConnectionsPerHost=32&followRedirects=false
[junit4:junit4]   2> 2642 T1815 oascsi.HttpClientUtil.createClient Creating new http client, config:
[junit4:junit4]   2> 2646 T1815 oaz.ZooKeeper.<init> Initiating client connection, connectString=127.0.0.1:52633/solr sessionTimeout=10000 watcher=org.apache.solr.common.cloud.ConnectionManager@1a051163
[junit4:junit4]   2> 2648 T1839 oaz.ClientCnxn$SendThread.startConnect Opening socket connection to server /127.0.0.1:52633
[junit4:junit4]   2> 2648 T1815 oascc.ConnectionManager.waitForConnected Waiting for client to connect to ZooKeeper
[junit4:junit4]   2> 2650 T1839 oaz.ClientCnxn$SendThread.primeConnection Socket connection established to 127.0.0.1/127.0.0.1:52633, initiating session
[junit4:junit4]   2> 2650 T1817 oazs.NIOServerCnxn$Factory.run Accepted socket connection from /127.0.0.1:52648
[junit4:junit4]   2> 2650 T1817 oazs.NIOServerCnxn.readConnectRequest Client attempting to establish new session at /127.0.0.1:52648
[junit4:junit4]   2> 2653 T1819 oazs.NIOServerCnxn.finishSessionInit Established session 0x13aae7ecedb0003 with negotiated timeout 10000 for client /127.0.0.1:52648
[junit4:junit4]   2> 2653 T1839 oaz.ClientCnxn$SendThread.readConnectResult Session establishment complete on server 127.0.0.1/127.0.0.1:52633, sessionid = 0x13aae7ecedb0003, negotiated timeout = 10000
[junit4:junit4]   2> 2653 T1840 oascc.ConnectionManager.process Watcher org.apache.solr.common.cloud.ConnectionManager@1a051163 name:ZooKeeperConnection Watcher:127.0.0.1:52633/solr got event WatchedEvent state:SyncConnected type:None path:null path:null type:None
[junit4:junit4]   2> 2654 T1815 oascc.ConnectionManager.waitForConnected Client is connected to ZooKeeper
[junit4:junit4]   2> 2654 T1815 oascc.ZkStateReader.createClusterStateWatchersAndUpdate Updating cluster state from ZooKeeper... 
[junit4:junit4]   2> 2656 T1815 oasc.ChaosMonkey.monkeyLog monkey: init - expire sessions:true cause connection loss:true
[junit4:junit4]   2> 2989 T1815 oejs.Server.doStart jetty-8.1.2.v20120308
[junit4:junit4]   2> 2998 T1815 oejs.AbstractConnector.doStart Started SelectChannelConnector@0.0.0.0:52649
[junit4:junit4]   2> 2999 T1815 oasc.SolrResourceLoader.locateSolrHome JNDI not configured for solr (NoInitialContextEx)
[junit4:junit4]   2> 3001 T1815 oasc.SolrResourceLoader.locateSolrHome using system property solr.solr.home: C:\Users\JenkinsSlave\workspace\Lucene-Solr-trunk-Windows\solr\build\solr-core\test\J0\.\org.apache.solr.cloud.BasicDistributedZkTest-jetty1-1351547279659
[junit4:junit4]   2> 3001 T1815 oasc.SolrResourceLoader.<init> new SolrResourceLoader for deduced Solr Home: 'C:\Users\JenkinsSlave\workspace\Lucene-Solr-trunk-Windows\solr\build\solr-core\test\J0\.\org.apache.solr.cloud.BasicDistributedZkTest-jetty1-1351547279659\'
[junit4:junit4]   2> 3031 T1815 oass.SolrDispatchFilter.init SolrDispatchFilter.init()
[junit4:junit4]   2> 3032 T1815 oasc.SolrResourceLoader.locateSolrHome JNDI not configured for solr (NoInitialContextEx)
[junit4:junit4]   2> 3032 T1815 oasc.SolrResourceLoader.locateSolrHome using system property solr.solr.home: C:\Users\JenkinsSlave\workspace\Lucene-Solr-trunk-Windows\solr\build\solr-core\test\J0\.\org.apache.solr.cloud.BasicDistributedZkTest-jetty1-1351547279659
[junit4:junit4]   2> 3032 T1815 oasc.CoreContainer$Initializer.initialize looking for solr.xml: C:\Users\JenkinsSlave\workspace\Lucene-Solr-trunk-Windows\solr\build\solr-core\test\J0\.\org.apache.solr.cloud.BasicDistributedZkTest-jetty1-1351547279659\solr.xml
[junit4:junit4]   2> 3032 T1815 oasc.CoreContainer.<init> New CoreContainer 1498144337
[junit4:junit4]   2> 3034 T1815 oasc.CoreContainer.load Loading CoreContainer using Solr Home: 'C:\Users\JenkinsSlave\workspace\Lucene-Solr-trunk-Windows\solr\build\solr-core\test\J0\.\org.apache.solr.cloud.BasicDistributedZkTest-jetty1-1351547279659\'
[junit4:junit4]   2> 3034 T1815 oasc.SolrResourceLoader.<init> new SolrResourceLoader for directory: 'C:\Users\JenkinsSlave\workspace\Lucene-Solr-trunk-Windows\solr\build\solr-core\test\J0\.\org.apache.solr.cloud.BasicDistributedZkTest-jetty1-1351547279659\'
[junit4:junit4]   2> 3055 T1815 oasc.CoreContainer.load Registering Log Listener
[junit4:junit4]   2> 3071 T1815 oasc.CoreContainer.initZooKeeper Zookeeper client=127.0.0.1:52633/solr
[junit4:junit4]   2> 3072 T1815 oaz.ZooKeeper.<init> Initiating client connection, connectString=127.0.0.1:52633/solr sessionTimeout=5000 watcher=org.apache.solr.common.cloud.ConnectionManager@343f9401
[junit4:junit4]   2> 3075 T1850 oaz.ClientCnxn$SendThread.startConnect Opening socket connection to server /127.0.0.1:52633
[junit4:junit4]   2> 3075 T1815 oascc.ConnectionManager.waitForConnected Waiting for client to connect to ZooKeeper
[junit4:junit4]   2> 3078 T1850 oaz.ClientCnxn$SendThread.primeConnection Socket connection established to 127.0.0.1/127.0.0.1:52633, initiating session
[junit4:junit4]   2> 3078 T1817 oazs.NIOServerCnxn$Factory.run Accepted socket connection from /127.0.0.1:52654
[junit4:junit4]   2> 3078 T1817 oazs.NIOServerCnxn.readConnectRequest Client attempting to establish new session at /127.0.0.1:52654
[junit4:junit4]   2> 3090 T1819 oazs.NIOServerCnxn.finishSessionInit Established session 0x13aae7ecedb0004 with negotiated timeout 5000 for client /127.0.0.1:52654
[junit4:junit4]   2> 3090 T1850 oaz.ClientCnxn$SendThread.readConnectResult Session establishment complete on server 127.0.0.1/127.0.0.1:52633, sessionid = 0x13aae7ecedb0004, negotiated timeout = 5000
[junit4:junit4]   2> 3091 T1851 oascc.ConnectionManager.process Watcher org.apache.solr.common.cloud.ConnectionManager@343f9401 name:ZooKeeperConnection Watcher:127.0.0.1:52633/solr got event WatchedEvent state:SyncConnected type:None path:null path:null type:None
[junit4:junit4]   2> 3091 T1815 oascc.ConnectionManager.waitForConnected Client is connected to ZooKeeper
[junit4:junit4]   2> 3092 T1820 oazs.PrepRequestProcessor.pRequest Got user-level KeeperException when processing sessionid:0x13aae7ecedb0004 type:create cxid:0x1 zxid:0xfffffffffffffffe txntype:unknown reqpath:n/a Error Path:/solr/overseer Error:KeeperErrorCode = NodeExists for /solr/overseer
[junit4:junit4]   2> 3094 T1820 oazs.PrepRequestProcessor.pRequest Got user-level KeeperException when processing sessionid:0x13aae7ecedb0004 type:create cxid:0x2 zxid:0xfffffffffffffffe txntype:unknown reqpath:n/a Error Path:/solr/overseer Error:KeeperErrorCode = NodeExists for /solr/overseer
[junit4:junit4]   2> 3096 T1815 oasc.ZkController.createEphemeralLiveNode Register node as live in ZooKeeper:/live_nodes/127.0.0.1:52649_solr
[junit4:junit4]   2> 3097 T1820 oazs.PrepRequestProcessor.pRequest Got user-level KeeperException when processing sessionid:0x13aae7ecedb0004 type:delete cxid:0x4 zxid:0xfffffffffffffffe txntype:unknown reqpath:n/a Error Path:/solr/live_nodes/127.0.0.1:52649_solr Error:KeeperErrorCode = NoNode for /solr/live_nodes/127.0.0.1:52649_solr
[junit4:junit4]   2> 3099 T1815 oascc.SolrZkClient.makePath makePath: /live_nodes/127.0.0.1:52649_solr
[junit4:junit4]   2> 3102 T1835 oascc.ZkStateReader$2.process A cluster state change has occurred - updating... (1)
[junit4:junit4]   2> 3104 T1840 oascc.ZkStateReader$3.process Updating live nodes... (2)
[junit4:junit4]   2> 3104 T1815 oashc.HttpShardHandlerFactory.getParameter Setting socketTimeout to: 0
[junit4:junit4]   2> 3104 T1815 oashc.HttpShardHandlerFactory.getParameter Setting urlScheme to: http://
[junit4:junit4]   2> 3105 T1835 oascc.ZkStateReader$3.process Updating live nodes... (2)
[junit4:junit4]   2> 3105 T1815 oashc.HttpShardHandlerFactory.getParameter Setting connTimeout to: 0
[junit4:junit4]   2> 3105 T1815 oashc.HttpShardHandlerFactory.getParameter Setting maxConnectionsPerHost to: 20
[junit4:junit4]   2> 3105 T1815 oashc.HttpShardHandlerFactory.getParameter Setting corePoolSize to: 0
[junit4:junit4]   2> 3105 T1815 oashc.HttpShardHandlerFactory.getParameter Setting maximumPoolSize to: 2147483647
[junit4:junit4]   2> 3105 T1815 oashc.HttpShardHandlerFactory.getParameter Setting maxThreadIdleTime to: 5
[junit4:junit4]   2> 3108 T1815 oashc.HttpShardHandlerFactory.getParameter Setting sizeOfQueue to: -1
[junit4:junit4]   2> 3108 T1815 oashc.HttpShardHandlerFactory.getParameter Setting fairnessPolicy to: false
[junit4:junit4]   2> 3108 T1815 oascsi.HttpClientUtil.createClient Creating new http client, config:maxConnectionsPerHost=20&maxConnections=10000&socketTimeout=0&connTimeout=0&retry=false
[junit4:junit4]   2> 3118 T1815 oascc.ZkStateReader.createClusterStateWatchersAndUpdate Updating cluster state from ZooKeeper... 
[junit4:junit4]   2> 3127 T1815 oasc.CoreContainer.create Creating SolrCore 'collection1' using instanceDir: C:\Users\JenkinsSlave\workspace\Lucene-Solr-trunk-Windows\solr\build\solr-core\test\J0\.\org.apache.solr.cloud.BasicDistributedZkTest-jetty1-1351547279659\collection1
[junit4:junit4]   2> 3127 T1815 oasc.ZkController.createCollectionZkNode Check for collection zkNode:collection1
[junit4:junit4]   2> 3128 T1815 oasc.ZkController.createCollectionZkNode Collection zkNode exists
[junit4:junit4]   2> 3128 T1815 oasc.ZkController.readConfigName Load collection config from:/collections/collection1
[junit4:junit4]   2> 3131 T1815 oasc.SolrResourceLoader.<init> new SolrResourceLoader for directory: 'C:\Users\JenkinsSlave\workspace\Lucene-Solr-trunk-Windows\solr\build\solr-core\test\J0\.\org.apache.solr.cloud.BasicDistributedZkTest-jetty1-1351547279659\collection1\'
[junit4:junit4]   2> 3132 T1815 oasc.SolrResourceLoader.replaceClassLoader Adding 'file:/C:/Users/JenkinsSlave/workspace/Lucene-Solr-trunk-Windows/solr/build/solr-core/test/J0/org.apache.solr.cloud.BasicDistributedZkTest-jetty1-1351547279659/collection1/lib/classes/' to classloader
[junit4:junit4]   2> 3133 T1815 oasc.SolrResourceLoader.replaceClassLoader Adding 'file:/C:/Users/JenkinsSlave/workspace/Lucene-Solr-trunk-Windows/solr/build/solr-core/test/J0/org.apache.solr.cloud.BasicDistributedZkTest-jetty1-1351547279659/collection1/lib/README' to classloader
[junit4:junit4]   2> 3177 T1815 oasc.SolrConfig.<init> Using Lucene MatchVersion: LUCENE_50
[junit4:junit4]   2> 3209 T1836 oascc.ZkStateReader.updateClusterState Updating cloud state from ZooKeeper... 
[junit4:junit4]   2> 3210 T1836 oasc.Overseer$ClusterStateUpdater.updateState Update state numShards=null message={
[junit4:junit4]   2> 	  "operation":"state",
[junit4:junit4]   2> 	  "numShards":null,
[junit4:junit4]   2> 	  "shard":"control_shard",
[junit4:junit4]   2> 	  "roles":null,
[junit4:junit4]   2> 	  "state":"active",
[junit4:junit4]   2> 	  "core":"collection1",
[junit4:junit4]   2> 	  "collection":"control_collection",
[junit4:junit4]   2> 	  "node_name":"127.0.0.1:52640_solr",
[junit4:junit4]   2> 	  "base_url":"http://127.0.0.1:52640/solr"}
[junit4:junit4]   2> 3223 T1840 oascc.ZkStateReader$2.process A cluster state change has occurred - updating... (2)
[junit4:junit4]   2> 3224 T1851 oascc.ZkStateReader$2.process A cluster state change has occurred - updating... (2)
[junit4:junit4]   2> 3224 T1835 oascc.ZkStateReader$2.process A cluster state change has occurred - updating... (2)
[junit4:junit4]   2> 3274 T1815 oasc.SolrConfig.<init> Loaded SolrConfig: solrconfig.xml
[junit4:junit4]   2> 3277 T1815 oass.IndexSchema.readSchema Reading Solr Schema
[junit4:junit4]   2> 3282 T1815 oass.IndexSchema.readSchema Schema name=test
[junit4:junit4]   2> 4015 T1815 oass.OpenExchangeRatesOrgProvider.init Initialized with rates=open-exchange-rates.json, refreshInterval=1440.
[junit4:junit4]   2> 4027 T1815 oass.IndexSchema.readSchema default search field in schema is text
[junit4:junit4]   2> 4033 T1815 oass.IndexSchema.readSchema unique key field: id
[junit4:junit4]   2> 4048 T1815 oass.FileExchangeRateProvider.reload Reloading exchange rates from file currency.xml
[junit4:junit4]   2> 4053 T1815 oass.FileExchangeRateProvider.reload Reloading exchange rates from file currency.xml
[junit4:junit4]   2> 4059 T1815 oass.OpenExchangeRatesOrgProvider.reload Reloading exchange rates from open-exchange-rates.json
[junit4:junit4]   2> 4061 T1815 oass.OpenExchangeRatesOrgProvider.reload Reloading exchange rates from open-exchange-rates.json
[junit4:junit4]   2> 4061 T1815 oasc.SolrCore.<init> [collection1] Opening new SolrCore at C:\Users\JenkinsSlave\workspace\Lucene-Solr-trunk-Windows\solr\build\solr-core\test\J0\.\org.apache.solr.cloud.BasicDistributedZkTest-jetty1-1351547279659\collection1\, dataDir=.\org.apache.solr.cloud.BasicDistributedZkTest-1351547277005/jetty1\
[junit4:junit4]   2> 4062 T1815 oasc.JmxMonitoredMap.<init> JMX monitoring is enabled. Adding Solr mbeans to JMX Server: com.sun.jmx.mbeanserver.JmxMBeanServer@36bf7916
[junit4:junit4]   2> 4062 T1815 oasc.SolrCore.initDirectoryFactory solr.NRTCachingDirectoryFactory
[junit4:junit4]   2> 4065 T1815 oasc.CachingDirectoryFactory.injectLockFactory WARNING No lockType configured for NRTCachingDirectory(org.apache.lucene.store.MMapDirectory@C:\Users\JenkinsSlave\workspace\Lucene-Solr-trunk-Windows\solr\build\solr-core\test\J0\org.apache.solr.cloud.BasicDistributedZkTest-1351547277005\jetty1 lockFactory=org.apache.lucene.store.NativeFSLockFactory@7cde7ad2; maxCacheMB=48.0 maxMergeSizeMB=4.0) assuming 'simple'
[junit4:junit4]   2> 4065 T1815 oasc.CachingDirectoryFactory.get return new directory for C:\Users\JenkinsSlave\workspace\Lucene-Solr-trunk-Windows\solr\build\solr-core\test\J0\.\org.apache.solr.cloud.BasicDistributedZkTest-1351547277005\jetty1 forceNew:false
[junit4:junit4]   2> 4066 T1815 oasc.CachingDirectoryFactory.close Releasing directory:C:\Users\JenkinsSlave\workspace\Lucene-Solr-trunk-Windows\solr\build\solr-core\test\J0\.\org.apache.solr.cloud.BasicDistributedZkTest-1351547277005\jetty1
[junit4:junit4]   2> 4066 T1815 oasc.SolrCore.getNewIndexDir New index directory detected: old=null new=.\org.apache.solr.cloud.BasicDistributedZkTest-1351547277005/jetty1\index/
[junit4:junit4]   2> 4067 T1815 oasc.SolrCore.initIndex WARNING [collection1] Solr index directory '.\org.apache.solr.cloud.BasicDistributedZkTest-1351547277005\jetty1\index' doesn't exist. Creating new index...
[junit4:junit4]   2> 4068 T1815 oasc.CachingDirectoryFactory.get return new directory for C:\Users\JenkinsSlave\workspace\Lucene-Solr-trunk-Windows\solr\build\solr-core\test\J0\.\org.apache.solr.cloud.BasicDistributedZkTest-1351547277005\jetty1\index forceNew:false
[junit4:junit4]   2> 4081 T1815 oasc.SolrDeletionPolicy.onCommit SolrDeletionPolicy.onCommit: commits:num=1
[junit4:junit4]   2> 		commit{dir=NRTCachingDirectory(org.apache.lucene.store.MMapDirectory@C:\Users\JenkinsSlave\workspace\Lucene-Solr-trunk-Windows\solr\build\solr-core\test\J0\org.apache.solr.cloud.BasicDistributedZkTest-1351547277005\jetty1\index lockFactory=org.apache.lucene.store.NativeFSLockFactory@7f7f2e13; maxCacheMB=48.0 maxMergeSizeMB=4.0),segFN=segments_1,generation=1,filenames=[segments_1]
[junit4:junit4]   2> 4082 T1815 oasc.SolrDeletionPolicy.updateCommits newest commit = 1[segments_1]
[junit4:junit4]   2> 4083 T1815 oasc.CachingDirectoryFactory.close Releasing directory:C:\Users\JenkinsSlave\workspace\Lucene-Solr-trunk-Windows\solr\build\solr-core\test\J0\.\org.apache.solr.cloud.BasicDistributedZkTest-1351547277005\jetty1\index
[junit4:junit4]   2> 4083 T1815 oasc.SolrCore.initWriters created xml: solr.XMLResponseWriter
[junit4:junit4]   2> 4085 T1815 oasup.UpdateRequestProcessorChain.init inserting DistributedUpdateProcessorFactory into updateRequestProcessorChain "dedupe"
[junit4:junit4]   2> 4085 T1815 oasup.UpdateRequestProcessorChain.init inserting DistributedUpdateProcessorFactory into updateRequestProcessorChain "dedupe-allfields"
[junit4:junit4]   2> 4085 T1815 oasup.UpdateRequestProcessorChain.init inserting DistributedUpdateProcessorFactory into updateRequestProcessorChain "stored_sig"
[junit4:junit4]   2> 4086 T1815 oasup.UpdateRequestProcessorChain.init inserting DistributedUpdateProcessorFactory into updateRequestProcessorChain "uniq-fields"
[junit4:junit4]   2> 4086 T1815 oasup.UpdateRequestProcessorChain.init inserting DistributedUpdateProcessorFactory into updateRequestProcessorChain "distrib-dup-test-chain-implicit"
[junit4:junit4]   2> 4086 T1815 oasc.RequestHandlers.initHandlersFromConfig adding lazy requestHandler: solr.ReplicationHandler
[junit4:junit4]   2> 4088 T1815 oasc.RequestHandlers.initHandlersFromConfig created /replication: solr.ReplicationHandler
[junit4:junit4]   2> 4088 T1815 oasc.RequestHandlers.initHandlersFromConfig created standard: solr.StandardRequestHandler
[junit4:junit4]   2> 4089 T1815 oasc.RequestHandlers.initHandlersFromConfig created /get: solr.RealTimeGetHandler
[junit4:junit4]   2> 4089 T1815 oasc.RequestHandlers.initHandlersFromConfig created dismax: solr.SearchHandler
[junit4:junit4]   2> 4089 T1815 oasc.RequestHandlers.initHandlersFromConfig created mock: org.apache.solr.core.MockQuerySenderListenerReqHandler
[junit4:junit4]   2> 4091 T1815 oasc.RequestHandlers.initHandlersFromConfig created /admin/: org.apache.solr.handler.admin.AdminHandlers
[junit4:junit4]   2> 4091 T1815 oasc.RequestHandlers.initHandlersFromConfig created defaults: solr.StandardRequestHandler
[junit4:junit4]   2> 4091 T1815 oasc.RequestHandlers.initHandlersFromConfig adding lazy requestHandler: solr.StandardRequestHandler
[junit4:junit4]   2> 4092 T1815 oasc.RequestHandlers.initHandlersFromConfig created lazy: solr.StandardRequestHandler
[junit4:junit4]   2> 4092 T1815 oasc.RequestHandlers.initHandlersFromConfig created /update: solr.UpdateRequestHandler
[junit4:junit4]   2> 4093 T1815 oasc.RequestHandlers.initHandlersFromConfig created /terms: org.apache.solr.handler.component.SearchHandler
[junit4:junit4]   2> 4093 T1815 oasc.RequestHandlers.initHandlersFromConfig created spellCheckCompRH: org.apache.solr.handler.component.SearchHandler
[junit4:junit4]   2> 4094 T1815 oasc.RequestHandlers.initHandlersFromConfig created spellCheckCompRH_Direct: org.apache.solr.handler.component.SearchHandler
[junit4:junit4]   2> 4094 T1815 oasc.RequestHandlers.initHandlersFromConfig created spellCheckWithWordbreak: org.apache.solr.handler.component.SearchHandler
[junit4:junit4]   2> 4096 T1815 oasc.RequestHandlers.initHandlersFromConfig created spellCheckWithWordbreak_Direct: org.apache.solr.handler.component.SearchHandler
[junit4:junit4]   2> 4096 T1815 oasc.RequestHandlers.initHandlersFromConfig created spellCheckCompRH1: org.apache.solr.handler.component.SearchHandler
[junit4:junit4]   2> 4097 T1815 oasc.RequestHandlers.initHandlersFromConfig created tvrh: org.apache.solr.handler.component.SearchHandler
[junit4:junit4]   2> 4098 T1815 oasc.RequestHandlers.initHandlersFromConfig created /mlt: solr.MoreLikeThisHandler
[junit4:junit4]   2> 4098 T1815 oasc.RequestHandlers.initHandlersFromConfig created /debug/dump: solr.DumpRequestHandler
[junit4:junit4]   2> 4107 T1815 oashl.XMLLoader.init xsltCacheLifetimeSeconds=60
[junit4:junit4]   2> 4113 T1815 oasc.SolrCore.initDeprecatedSupport WARNING solrconfig.xml uses deprecated <admin/gettableFiles>, Please update your config to use the ShowFileRequestHandler.
[junit4:junit4]   2> 4114 T1815 oasc.SolrCore.initDeprecatedSupport WARNING adding ShowFileRequestHandler with hidden files: [SCHEMA.XML, OLD_SYNONYMS.TXT, STOPWORDS.TXT, PROTWORDS.TXT, OPEN-EXCHANGE-RATES.JSON, SYNONYMS.TXT, CURRENCY.XML, MAPPING-ISOLATIN1ACCENT.TXT]
[junit4:junit4]   2> 4117 T1815 oasc.CachingDirectoryFactory.close Releasing directory:C:\Users\JenkinsSlave\workspace\Lucene-Solr-trunk-Windows\solr\build\solr-core\test\J0\.\org.apache.solr.cloud.BasicDistributedZkTest-1351547277005\jetty1
[junit4:junit4]   2> 4121 T1815 oass.SolrIndexSearcher.<init> Opening Searcher@28e8e687 main
[junit4:junit4]   2> 4122 T1815 oasu.CommitTracker.<init> Hard AutoCommit: disabled
[junit4:junit4]   2> 4122 T1815 oasu.CommitTracker.<init> Soft AutoCommit: disabled
[junit4:junit4]   2> 4124 T1815 oashc.SpellCheckComponent.inform Initializing spell checkers
[junit4:junit4]   2> 4137 T1815 oass.DirectSolrSpellChecker.init init: {name=direct,classname=DirectSolrSpellChecker,field=lowerfilt,minQueryLength=3}
[junit4:junit4]   2> 4212 T1815 oasc.ZkController.publish numShards not found on descriptor - reading it from system property
[junit4:junit4]   2> 4218 T1852 oasc.SolrCore.registerSearcher [collection1] Registered new searcher Searcher@28e8e687 main{StandardDirectoryReader(segments_1:1)}
[junit4:junit4]   2> 4406 T1836 oascc.ZkStateReader.updateClusterState Updating cloud state from ZooKeeper... 
[junit4:junit4]   2> 4407 T1836 oasc.Overseer$ClusterStateUpdater.updateState Update state numShards=2 message={
[junit4:junit4]   2> 	  "operation":"state",
[junit4:junit4]   2> 	  "numShards":"2",
[junit4:junit4]   2> 	  "shard":null,
[junit4:junit4]   2> 	  "roles":null,
[junit4:junit4]   2> 	  "state":"down",
[junit4:junit4]   2> 	  "core":"collection1",
[junit4:junit4]   2> 	  "collection":"collection1",
[junit4:junit4]   2> 	  "node_name":"127.0.0.1:52649_solr",
[junit4:junit4]   2> 	  "base_url":"http://127.0.0.1:52649/solr"}
[junit4:junit4]   2> 4407 T1836 oasc.Overseer$ClusterStateUpdater.createCollection Create collection collection1 with numShards 2
[junit4:junit4]   2> 4426 T1840 oascc.ZkStateReader$2.process A cluster state change has occurred - updating... (2)
[junit4:junit4]   2> 4427 T1835 oascc.ZkStateReader$2.process A cluster state change has occurred - updating... (2)
[junit4:junit4]   2> 4426 T1851 oascc.ZkStateReader$2.process A cluster state change has occurred - updating... (2)
[junit4:junit4]   2> 4803 T1815 oasc.CoreContainer.register registering core: collection1
[junit4:junit4]   2> 4804 T1815 oasc.ZkController.register Register shard - core:collection1 address:http://127.0.0.1:52649/solr shardId:shard1
[junit4:junit4]   2> 4806 T1815 oascc.SolrZkClient.makePath makePath: /collections/collection1/leader_elect/shard1/election
[junit4:junit4]   2> 4833 T1820 oazs.PrepRequestProcessor.pRequest Got user-level KeeperException when processing sessionid:0x13aae7ecedb0004 type:delete cxid:0x45 zxid:0xfffffffffffffffe txntype:unknown reqpath:n/a Error Path:/solr/collections/collection1/leaders Error:KeeperErrorCode = NoNode for /solr/collections/collection1/leaders
[junit4:junit4]   2> 4836 T1815 oasc.ShardLeaderElectionContext.runLeaderProcess Running the leader process.
[junit4:junit4]   2> 4837 T1820 oazs.PrepRequestProcessor.pRequest Got user-level KeeperException when processing sessionid:0x13aae7ecedb0004 type:create cxid:0x46 zxid:0xfffffffffffffffe txntype:unknown reqpath:n/a Error Path:/solr/overseer Error:KeeperErrorCode = NodeExists for /solr/overseer
[junit4:junit4]   2> 4845 T1815 oasc.ShardLeaderElectionContext.waitForReplicasToComeUp Enough replicas found to continue.
[junit4:junit4]   2> 4847 T1815 oasc.ShardLeaderElectionContext.runLeaderProcess I may be the new leader - try and sync
[junit4:junit4]   2> 4847 T1815 oasc.SyncStrategy.sync Sync replicas to http://127.0.0.1:52649/solr/collection1/
[junit4:junit4]   2> 4847 T1815 oasc.SyncStrategy.syncReplicas Sync Success - now sync replicas to me
[junit4:junit4]   2> 4848 T1815 oasc.SyncStrategy.syncToMe http://127.0.0.1:52649/solr/collection1/ has no replicas
[junit4:junit4]   2> 4848 T1815 oasc.ShardLeaderElectionContext.runLeaderProcess I am the new leader: http://127.0.0.1:52649/solr/collection1/
[junit4:junit4]   2> 4849 T1815 oascc.SolrZkClient.makePath makePath: /collections/collection1/leaders/shard1
[junit4:junit4]   2> 4865 T1820 oazs.PrepRequestProcessor.pRequest Got user-level KeeperException when processing sessionid:0x13aae7ecedb0004 type:create cxid:0x50 zxid:0xfffffffffffffffe txntype:unknown reqpath:n/a Error Path:/solr/overseer Error:KeeperErrorCode = NodeExists for /solr/overseer
[junit4:junit4]   2> 5023 T1836 oascc.ZkStateReader.updateClusterState Updating cloud state from ZooKeeper... 
[junit4:junit4]   2> 5055 T1840 oascc.ZkStateReader$2.process A cluster state change has occurred - updating... (2)
[junit4:junit4]   2> 5055 T1851 oascc.ZkStateReader$2.process A cluster state change has occurred - updating... (2)
[junit4:junit4]   2> 5057 T1835 oascc.ZkStateReader$2.process A cluster state change has occurred - updating... (2)
[junit4:junit4]   2> 5062 T1815 oasc.ZkController.register We are http://127.0.0.1:52649/solr/collection1/ and leader is http://127.0.0.1:52649/solr/collection1/
[junit4:junit4]   2> 5062 T1815 oasc.ZkController.register No LogReplay needed for core=collection1 baseURL=http://127.0.0.1:52649/solr
[junit4:junit4]   2> 5063 T1815 oasc.ZkController.checkRecovery I am the leader, no recovery necessary
[junit4:junit4]   2> 5063 T1815 oasc.ZkController.publish numShards not found on descriptor - reading it from system property
[junit4:junit4]   2> 5067 T1815 oascc.ZkStateReader.updateClusterState Updating cloud state from ZooKeeper... 
[junit4:junit4]   2> 5071 T1815 oass.SolrDispatchFilter.init user.dir=C:\Users\JenkinsSlave\workspace\Lucene-Solr-trunk-Windows\solr\build\solr-core\test\J0
[junit4:junit4]   2> 5071 T1815 oass.SolrDispatchFilter.init SolrDispatchFilter.init() done
[junit4:junit4]   2> 5072 T1815 oascsi.HttpClientUtil.createClient Creating new http client, config:maxConnections=128&maxConnectionsPerHost=32&followRedirects=false
[junit4:junit4]   2> 5399 T1815 oejs.Server.doStart jetty-8.1.2.v20120308
[junit4:junit4]   2> 5403 T1815 oejs.AbstractConnector.doStart Started SelectChannelConnector@0.0.0.0:52655
[junit4:junit4]   2> 5404 T1815 oasc.SolrResourceLoader.locateSolrHome JNDI not configured for solr (NoInitialContextEx)
[junit4:junit4]   2> 5404 T1815 oasc.SolrResourceLoader.locateSolrHome using system property solr.solr.home: C:\Users\JenkinsSlave\workspace\Lucene-Solr-trunk-Windows\solr\build\solr-core\test\J0\.\org.apache.solr.cloud.BasicDistributedZkTest-jetty2-1351547282084
[junit4:junit4]   2> 5404 T1815 oasc.SolrResourceLoader.<init> new SolrResourceLoader for deduced Solr Home: 'C:\Users\JenkinsSlave\workspace\Lucene-Solr-trunk-Windows\solr\build\solr-core\test\J0\.\org.apache.solr.cloud.BasicDistributedZkTest-jetty2-1351547282084\'
[junit4:junit4]   2> 5437 T1815 oass.SolrDispatchFilter.init SolrDispatchFilter.init()
[junit4:junit4]   2> 5437 T1815 oasc.SolrResourceLoader.locateSolrHome JNDI not configured for solr (NoInitialContextEx)
[junit4:junit4]   2> 5437 T1815 oasc.SolrResourceLoader.locateSolrHome using system property solr.solr.home: C:\Users\JenkinsSlave\workspace\Lucene-Solr-trunk-Windows\solr\build\solr-core\test\J0\.\org.apache.solr.cloud.BasicDistributedZkTest-jetty2-1351547282084
[junit4:junit4]   2> 5438 T1815 oasc.CoreContainer$Initializer.initialize looking for solr.xml: C:\Users\JenkinsSlave\workspace\Lucene-Solr-trunk-Windows\solr\build\solr-core\test\J0\.\org.apache.solr.cloud.BasicDistributedZkTest-jetty2-1351547282084\solr.xml
[junit4:junit4]   2> 5438 T1815 oasc.CoreContainer.<init> New CoreContainer 1721215804
[junit4:junit4]   2> 5439 T1815 oasc.CoreContainer.load Loading CoreContainer using Solr Home: 'C:\Users\JenkinsSlave\workspace\Lucene-Solr-trunk-Windows\solr\build\solr-core\test\J0\.\org.apache.solr.cloud.BasicDistributedZkTest-jetty2-1351547282084\'
[junit4:junit4]   2> 5439 T1815 oasc.SolrResourceLoader.<init> new SolrResourceLoader for directory: 'C:\Users\JenkinsSlave\workspace\Lucene-Solr-trunk-Windows\solr\build\solr-core\test\J0\.\org.apache.solr.cloud.BasicDistributedZkTest-jetty2-1351547282084\'
[junit4:junit4]   2> 5461 T1815 oasc.CoreContainer.load Registering Log Listener
[junit4:junit4]   2> 5484 T1815 oasc.CoreContainer.initZooKeeper Zookeeper client=127.0.0.1:52633/solr
[junit4:junit4]   2> 5486 T1815 oaz.ZooKeeper.<init> Initiating client connection, connectString=127.0.0.1:52633/solr sessionTimeout=5000 watcher=org.apache.solr.common.cloud.ConnectionManager@13056daa
[junit4:junit4]   2> 5487 T1815 oascc.ConnectionManager.waitForConnected Waiting for client to connect to ZooKeeper
[junit4:junit4]   2> 5487 T1862 oaz.ClientCnxn$SendThread.startConnect Opening socket connection to server /127.0.0.1:52633
[junit4:junit4]   2> 5489 T1862 oaz.ClientCnxn$SendThread.primeConnection Socket connection established to 127.0.0.1/127.0.0.1:52633, initiating session
[junit4:junit4]   2> 5489 T1817 oazs.NIOServerCnxn$Factory.run Accepted socket connection from /127.0.0.1:52660
[junit4:junit4]   2> 5490 T1817 oazs.NIOServerCnxn.readConnectRequest Client attempting to establish new session at /127.0.0.1:52660
[junit4:junit4]   2> 5503 T1819 oazs.NIOServerCnxn.finishSessionInit Established session 0x13aae7ecedb0005 with negotiated timeout 5000 for client /127.0.0.1:52660
[junit4:junit4]   2> 5503 T1862 oaz.ClientCnxn$SendThread.readConnectResult Session establishment complete on server 127.0.0.1/127.0.0.1:52633, sessionid = 0x13aae7ecedb0005, negotiated timeout = 5000
[junit4:junit4]   2> 5503 T1863 oascc.ConnectionManager.process Watcher org.apache.solr.common.cloud.ConnectionManager@13056daa name:ZooKeeperConnection Watcher:127.0.0.1:52633/solr got event WatchedEvent state:SyncConnected type:None path:null path:null type:None
[junit4:junit4]   2> 5503 T1815 oascc.ConnectionManager.waitForConnected Client is connected to ZooKeeper
[junit4:junit4]   2> 5504 T1820 oazs.PrepRequestProcessor.pRequest Got user-level KeeperException when processing sessionid:0x13aae7ecedb0005 type:create cxid:0x1 zxid:0xfffffffffffffffe txntype:unknown reqpath:n/a Error Path:/solr/overseer Error:KeeperErrorCode = NodeExists for /solr/overseer
[junit4:junit4]   2> 5506 T1820 oazs.PrepRequestProcessor.pRequest Got user-level KeeperException when processing sessionid:0x13aae7ecedb0005 type:create cxid:0x2 zxid:0xfffffffffffffffe txntype:unknown reqpath:n/a Error Path:/solr/overseer Error:KeeperErrorCode = NodeExists for /solr/overseer
[junit4:junit4]   2> 5510 T1815 oasc.ZkController.createEphemeralLiveNode Register node as live in ZooKeeper:/live_nodes/127.0.0.1:52655_solr
[junit4:junit4]   2> 5511 T1820 oazs.PrepRequestProcessor.pRequest Got user-level KeeperException when processing sessionid:0x13aae7ecedb0005 type:delete cxid:0x4 zxid:0xfffffffffffffffe txntype:unknown reqpath:n/a Error Path:/solr/live_nodes/127.0.0.1:52655_solr Error:KeeperErrorCode = NoNode for /solr/live_nodes/127.0.0.1:52655_solr
[junit4:junit4]   2> 5512 T1815 oascc.SolrZkClient.makePath makePath: /live_nodes/127.0.0.1:52655_solr
[junit4:junit4]   2> 5519 T1851 oascc.ZkStateReader$2.process A cluster state change has occurred - updating... (2)
[junit4:junit4]   2> 5519 T1835 oascc.ZkStateReader$2.process A cluster state change has occurred - updating... (2)
[junit4:junit4]   2> 5520 T1840 oascc.ZkStateReader$2.process A cluster state change has occurred - updating... (2)
[junit4:junit4]   2> 5525 T1815 oashc.HttpShardHandlerFactory.getParameter Setting socketTimeout to: 0
[junit4:junit4]   2> 5526 T1815 oashc.HttpShardHandlerFactory.getParameter Setting urlScheme to: http://
[junit4:junit4]   2> 5527 T1815 oashc.HttpShardHandlerFactory.getParameter Setting connTimeout to: 0
[junit4:junit4]   2> 5527 T1851 oascc.ZkStateReader$3.process Updating live nodes... (3)
[junit4:junit4]   2> 5527 T1840 oascc.ZkStateReader$3.process Updating live nodes... (3)
[junit4:junit4]   2> 5528 T1835 oascc.ZkStateReader$3.process Updating live nodes... (3)
[junit4:junit4]   2> 5527 T1815 oashc.HttpShardHandlerFactory.getParameter Setting maxConnectionsPerHost to: 20
[junit4:junit4]   2> 5528 T1815 oashc.HttpShardHandlerFactory.getParameter Setting corePoolSize to: 0
[junit4:junit4]   2> 5528 T1815 oashc.HttpShardHandlerFactory.getParameter Setting maximumPoolSize to: 2147483647
[junit4:junit4]   2> 5528 T1815 oashc.HttpShardHandlerFactory.getParameter Setting maxThreadIdleTime to: 5
[junit4:junit4]   2> 5528 T1815 oashc.HttpShardHandlerFactory.getParameter Setting sizeOfQueue to: -1
[junit4:junit4]   2> 5529 T1815 oashc.HttpShardHandlerFactory.getParameter Setting fairnessPolicy to: false
[junit4:junit4]   2> 5529 T1815 oascsi.HttpClientUtil.createClient Creating new http client, config:maxConnectionsPerHost=20&maxConnections=10000&socketTimeout=0&connTimeout=0&retry=false
[junit4:junit4]   2> 5541 T1815 oascc.ZkStateReader.createClusterStateWatchersAndUpdate Updating cluster state from ZooKeeper... 
[junit4:junit4]   2> 5549 T1815 oasc.CoreContainer.create Creating SolrCore 'collection1' using instanceDir: C:\Users\JenkinsSlave\workspace\Lucene-Solr-trunk-Windows\solr\build\solr-core\test\J0\.\org.apache.solr.cloud.BasicDistributedZkTest-jetty2-1351547282084\collection1
[junit4:junit4]   2> 5549 T1815 oasc.ZkController.createCollectionZkNode Check for collection zkNode:collection1
[junit4:junit4]   2> 5550 T1815 oasc.ZkController.createCollectionZkNode Collection zkNode exists
[junit4:junit4]   2> 5550 T1815 oasc.ZkController.readConfigName Load collection config from:/collections/collection1
[junit4:junit4]   2> 5552 T1815 oasc.SolrResourceLoader.<init> new SolrResourceLoader for directory: 'C:\Users\JenkinsSlave\workspace\Lucene-Solr-trunk-Windows\solr\build\solr-core\test\J0\.\org.apache.solr.cloud.BasicDistributedZkTest-jetty2-1351547282084\collection1\'
[junit4:junit4]   2> 5553 T1815 oasc.SolrResourceLoader.replaceClassLoader Adding 'file:/C:/Users/JenkinsSlave/workspace/Lucene-Solr-trunk-Windows/solr/build/solr-core/test/J0/org.apache.solr.cloud.BasicDistributedZkTest-jetty2-1351547282084/collection1/lib/classes/' to classloader
[junit4:junit4]   2> 5555 T1815 oasc.SolrResourceLoader.replaceClassLoader Adding 'file:/C:/Users/JenkinsSlave/workspace/Lucene-Solr-trunk-Windows/solr/build/solr-core/test/J0/org.apache.solr.cloud.BasicDistributedZkTest-jetty2-1351547282084/collection1/lib/README' to classloader
[junit4:junit4]   2> 5598 T1815 oasc.SolrConfig.<init> Using Lucene MatchVersion: LUCENE_50
[junit4:junit4]   2> 5673 T1815 oasc.SolrConfig.<init> Loaded SolrConfig: solrconfig.xml
[junit4:junit4]   2> 5674 T1815 oass.IndexSchema.readSchema Reading Solr Schema
[junit4:junit4]   2> 5675 T1836 oascc.ZkStateReader.updateClusterState Updating cloud state from ZooKeeper... 
[junit4:junit4]   2> 5675 T1836 oasc.Overseer$ClusterStateUpdater.updateState Update state numShards=2 message={
[junit4:junit4]   2> 	  "operation":"state",
[junit4:junit4]   2> 	  "numShards":"2",
[junit4:junit4]   2> 	  "shard":"shard1",
[junit4:junit4]   2> 	  "roles":null,
[junit4:junit4]   2> 	  "state":"active",
[junit4:junit4]   2> 	  "core":"collection1",
[junit4:junit4]   2> 	  "collection":"collection1",
[junit4:junit4]   2> 	  "node_name":"127.0.0.1:52649_solr",
[junit4:junit4]   2> 	  "base_url":"http://127.0.0.1:52649/solr"}
[junit4:junit4]   2> 5681 T1815 oass.IndexSchema.readSchema Schema name=test
[junit4:junit4]   2> 5692 T1840 oascc.ZkStateReader$2.process A cluster state change has occurred - updating... (3)
[junit4:junit4]   2> 5693 T1863 oascc.ZkStateReader$2.process A cluster state change has occurred - updating... (3)
[junit4:junit4]   2> 5695 T1851 oascc.ZkStateReader$2.process A cluster state change has occurred - updating... (3)
[junit4:junit4]   2> 5695 T1835 oascc.ZkStateReader$2.process A cluster state change has occurred - updating... (3)
[junit4:junit4]   2> 6435 T1815 oass.OpenExchangeRatesOrgProvider.init Initialized with rates=open-exchange-rates.json, refreshInterval=1440.
[junit4:junit4]   2> 6443 T1815 oass.IndexSchema.readSchema default search field in schema is text
[junit4:junit4]   2> 6446 T1815 oass.IndexSchema.readSchema unique key field: id
[junit4:junit4]   2> 6466 T1815 oass.FileExchangeRateProvider.reload Reloading exchange rates from file currency.xml
[junit4:junit4]   2> 6471 T1815 oass.FileExchangeRateProvider.reload Reloading exchange rates from file currency.xml
[junit4:junit4]   2> 6482 T1815 oass.OpenExchangeRatesOrgProvider.reload Reloading exchange rates from open-exchange-rates.json
[junit4:junit4]   2> 6484 T1815 oass.OpenExchangeRatesOrgProvider.reload Reloading exchange rates from open-exchange-rates.json
[junit4:junit4]   2> 6486 T1815 oasc.SolrCore.<init> [collection1] Opening new SolrCore at C:\Users\JenkinsSlave\workspace\Lucene-Solr-trunk-Windows\solr\build\solr-core\test\J0\.\org.apache.solr.cloud.BasicDistributedZkTest-jetty2-1351547282084\collection1\, dataDir=.\org.apache.solr.cloud.BasicDistributedZkTest-1351547277005/jetty2\
[junit4:junit4]   2> 6486 T1815 oasc.JmxMonitoredMap.<init> JMX monitoring is enabled. Adding Solr mbeans to JMX Server: com.sun.jmx.mbeanserver.JmxMBeanServer@36bf7916
[junit4:junit4]   2> 6486 T1815 oasc.SolrCore.initDirectoryFactory solr.NRTCachingDirectoryFactory
[junit4:junit4]   2> 6487 T1815 oasc.CachingDirectoryFactory.injectLockFactory WARNING No lockType configured for NRTCachingDirectory(org.apache.lucene.store.MMapDirectory@C:\Users\JenkinsSlave\workspace\Lucene-Solr-trunk-Windows\solr\build\solr-core\test\J0\org.apache.solr.cloud.BasicDistributedZkTest-1351547277005\jetty2 lockFactory=org.apache.lucene.store.NativeFSLockFactory@13192444; maxCacheMB=48.0 maxMergeSizeMB=4.0) assuming 'simple'
[junit4:junit4]   2> 6487 T1815 oasc.CachingDirectoryFactory.get return new directory for C:\Users\JenkinsSlave\workspace\Lucene-Solr-trunk-Windows\solr\build\solr-core\test\J0\.\org.apache.solr.cloud.BasicDistributedZkTest-1351547277005\jetty2 forceNew:false
[junit4:junit4]   2> 6488 T1815 oasc.CachingDirectoryFactory.close Releasing directory:C:\Users\JenkinsSlave\workspace\Lucene-Solr-trunk-Windows\solr\build\solr-core\test\J0\.\org.apache.solr.cloud.BasicDistributedZkTest-1351547277005\jetty2
[junit4:junit4]   2> 6488 T1815 oasc.SolrCore.getNewIndexDir New index directory detected: old=null new=.\org.apache.solr.cloud.BasicDistributedZkTest-1351547277005/jetty2\index/
[junit4:junit4]   2> 6490 T1815 oasc.SolrCore.initIndex WARNING [collection1] Solr index directory '.\org.apache.solr.cloud.BasicDistributedZkTest-1351547277005\jetty2\index' doesn't exist. Creating new index...
[junit4:junit4]   2> 6490 T1815 oasc.CachingDirectoryFactory.get return new directory for C:\Users\JenkinsSlave\workspace\Lucene-Solr-trunk-Windows\solr\build\solr-core\test\J0\.\org.apache.solr.cloud.BasicDistributedZkTest-1351547277005\jetty2\index forceNew:false
[junit4:junit4]   2> 6501 T1815 oasc.SolrDeletionPolicy.onCommit SolrDeletionPolicy.onCommit: commits:num=1
[junit4:junit4]   2> 		commit{dir=NRTCachingDirectory(org.apache.lucene.store.MMapDirectory@C:\Users\JenkinsSlave\workspace\Lucene-Solr-trunk-Windows\solr\build\solr-core\test\J0\org.apache.solr.cloud.BasicDistributedZkTest-1351547277005\jetty2\index lockFactory=org.apache.lucene.store.NativeFSLockFactory@36e1cccd; maxCacheMB=48.0 maxMergeSizeMB=4.0),segFN=segments_1,generation=1,filenames=[segments_1]
[junit4:junit4]   2> 6502 T1815 oasc.SolrDeletionPolicy.updateCommits newest commit = 1[segments_1]
[junit4:junit4]   2> 6504 T1815 oasc.CachingDirectoryFactory.close Releasing directory:C:\Users\JenkinsSlave\workspace\Lucene-Solr-trunk-Windows\solr\build\solr-core\test\J0\.\org.apache.solr.cloud.BasicDistributedZkTest-1351547277005\jetty2\index
[junit4:junit4]   2> 6504 T1815 oasc.SolrCore.initWriters created xml: solr.XMLResponseWriter
[junit4:junit4]   2> 6507 T1815 oasup.UpdateRequestProcessorChain.init inserting DistributedUpdateProcessorFactory into updateRequestProcessorChain "dedupe"
[junit4:junit4]   2> 6508 T1815 oasup.UpdateRequestProcessorChain.init inserting DistributedUpdateProcessorFactory into updateRequestProcessorChain "dedupe-allfields"
[junit4:junit4]   2> 6508 T1815 oasup.UpdateRequestProcessorChain.init inserting DistributedUpdateProcessorFactory into updateRequestProcessorChain "stored_sig"
[junit4:junit4]   2> 6509 T1815 oasup.UpdateRequestProcessorChain.init inserting DistributedUpdateProcessorFactory into updateRequestProcessorChain "uniq-fields"
[junit4:junit4]   2> 6510 T1815 oasup.UpdateRequestProcessorChain.init inserting DistributedUpdateProcessorFactory into updateRequestProcessorChain "distrib-dup-test-chain-implicit"
[junit4:junit4]   2> 6510 T1815 oasc.RequestHandlers.initHandlersFromConfig adding lazy requestHandler: solr.ReplicationHandler
[junit4:junit4]   2> 6511 T1815 oasc.RequestHandlers.initHandlersFromConfig created /replication: solr.ReplicationHandler
[junit4:junit4]   2> 6511 T1815 oasc.RequestHandlers.initHandlersFromConfig created standard: solr.StandardRequestHandler
[junit4:junit4]   2> 6512 T1815 oasc.RequestHandlers.initHandlersFromConfig created /get: solr.RealTimeGetHandler
[junit4:junit4]   2> 6512 T1815 oasc.RequestHandlers.initHandlersFromConfig created dismax: solr.SearchHandler
[junit4:junit4]   2> 6514 T1815 oasc.RequestHandlers.initHandlersFromConfig created mock: org.apache.solr.core.MockQuerySenderListenerReqHandler
[junit4:junit4]   2> 6514 T1815 oasc.RequestHandlers.initHandlersFromConfig created /admin/: org.apache.solr.handler.admin.AdminHandlers
[junit4:junit4]   2> 6515 T1815 oasc.RequestHandlers.initHandlersFromConfig created defaults: solr.StandardRequestHandler
[junit4:junit4]   2> 6515 T1815 oasc.RequestHandlers.initHandlersFromConfig adding lazy requestHandler: solr.StandardRequestHandler
[junit4:junit4]   2> 6516 T1815 oasc.RequestHandlers.initHandlersFromConfig created lazy: solr.StandardRequestHandler
[junit4:junit4]   2> 6516 T1815 oasc.RequestHandlers.initHandlersFromConfig created /update: solr.UpdateRequestHandler
[junit4:junit4]   2> 6517 T1815 oasc.RequestHandlers.initHandlersFromConfig created /terms: org.apache.solr.handler.component.SearchHandler
[junit4:junit4]   2> 6517 T1815 oasc.RequestHandlers.initHandlersFromConfig created spellCheckCompRH: org.apache.solr.handler.component.SearchHandler
[junit4:junit4]   2> 6518 T1815 oasc.RequestHandlers.initHandlersFromConfig created spellCheckCompRH_Direct: org.apache.solr.handler.component.SearchHandler
[junit4:junit4]   2> 6518 T1815 oasc.RequestHandlers.initHandlersFromConfig created spellCheckWithWordbreak: org.apache.solr.handler.component.SearchHandler
[junit4:junit4]   2> 6519 T1815 oasc.RequestHandlers.initHandlersFromConfig created spellCheckWithWordbreak_Direct: org.apache.solr.handler.component.SearchHandler
[junit4:junit4]   2> 6519 T1815 oasc.RequestHandlers.initHandlersFromConfig created spellCheckCompRH1: org.apache.solr.handler.component.SearchHandler
[junit4:junit4]   2> 6520 T1815 oasc.RequestHandlers.initHandlersFromConfig created tvrh: org.apache.solr.handler.component.SearchHandler
[junit4:junit4]   2> 6520 T1815 oasc.RequestHandlers.initHandlersFromConfig created /mlt: solr.MoreLikeThisHandler
[junit4:junit4]   2> 6522 T1815 oasc.RequestHandlers.initHandlersFromConfig created /debug/dump: solr.DumpRequestHandler
[junit4:junit4]   2> 6530 T1815 oashl.XMLLoader.init xsltCacheLifetimeSeconds=60
[junit4:junit4]   2> 6535 T1815 oasc.SolrCore.initDeprecatedSupport WARNING solrconfig.xml uses deprecated <admin/gettableFiles>, Please update your config to use the ShowFileRequestHandler.
[junit4:junit4]   2> 6538 T1815 oasc.SolrCore.initDeprecatedSupport WARNING adding ShowFileRequestHandler with hidden files: [SCHEMA.XML, OLD_SYNONYMS.TXT, STOPWORDS.TXT, PROTWORDS.TXT, OPEN-EXCHANGE-RATES.JSON, SYNONYMS.TXT, CURRENCY.XML, MAPPING-ISOLATIN1ACCENT.TXT]
[junit4:junit4]   2> 6542 T1815 oasc.CachingDirectoryFactory.close Releasing directory:C:\Users\JenkinsSlave\workspace\Lucene-Solr-trunk-Windows\solr\build\solr-core\test\J0\.\org.apache.solr.cloud.BasicDistributedZkTest-1351547277005\jetty2
[junit4:junit4]   2> 6547 T1815 oass.SolrIndexSearcher.<init> Opening Searcher@5de4c159 main
[junit4:junit4]   2> 6550 T1815 oasu.CommitTracker.<init> Hard AutoCommit: disabled
[junit4:junit4]   2> 6551 T1815 oasu.CommitTracker.<init> Soft AutoCommit: disabled
[junit4:junit4]   2> 6551 T1815 oashc.SpellCheckComponent.inform Initializing spell checkers
[junit4:junit4]   2> 6565 T1815 oass.DirectSolrSpellChecker.init init: {name=direct,classname=DirectSolrSpellChecker,field=lowerfilt,minQueryLength=3}
[junit4:junit4]   2> 6633 T1864 oasc.SolrCore.registerSearcher [collection1] Registered new searcher Searcher@5de4c159 main{StandardDirectoryReader(segments_1:1)}
[junit4:junit4]   2> 6638 T1815 oasc.ZkController.publish numShards not found on descriptor - reading it from system property
[junit4:junit4]   2> 6873 T1836 oascc.ZkStateReader.updateClusterState Updating cloud state from ZooKeeper... 
[junit4:junit4]   2> 6874 T1836 oasc.Overseer$ClusterStateUpdater.updateState Update state numShards=2 message={
[junit4:junit4]   2> 	  "operation":"state",
[junit4:junit4]   2> 	  "numShards":"2",
[junit4:junit4]   2> 	  "shard":null,
[junit4:junit4]   2> 	  "roles":null,
[junit4:junit4]   2> 	  "state":"down",
[junit4:junit4]   2> 	  "core":"collection1",
[junit4:junit4]   2> 	  "collection":"collection1",
[junit4:junit4]   2> 	  "node_name":"127.0.0.1:52655_solr",
[junit4:junit4]   2> 	  "base_url":"http://127.0.0.1:52655/solr"}
[junit4:junit4]   2> 6883 T1863 oascc.ZkStateReader$2.process A cluster state change has occurred - updating... (3)
[junit4:junit4]   2> 6883 T1835 oascc.ZkStateReader$2.process A cluster state change has occurred - updating... (3)
[junit4:junit4]   2> 6883 T1840 oascc.ZkStateReader$2.process A cluster state change has occurred - updating... (3)
[junit4:junit4]   2> 6885 T1851 oascc.ZkStateReader$2.process A cluster state change has occurred - updating... (3)
[junit4:junit4]   2> 7224 T1815 oasc.CoreContainer.register registering core: collection1
[junit4:junit4]   2> 7225 T1815 oasc.ZkController.register Register shard - core:collection1 address:http://127.0.0.1:52655/solr shardId:shard2
[junit4:junit4]   2> 7226 T1815 oascc.SolrZkClient.makePath makePath: /collections/collection1/leader_elect/shard2/election
[junit4:junit4]   2> 7239 T1820 oazs.PrepRequestProcessor.pRequest Got user-level KeeperException when processing sessionid:0x13aae7ecedb0005 type:delete cxid:0x44 zxid:0xfffffffffffffffe txntype:unknown reqpath:n/a Error Path:/solr/collections/collection1/leaders/shard2 Error:KeeperErrorCode = NoNode for /solr/collections/collection1/leaders/shard2
[junit4:junit4]   2> 7241 T1815 oasc.ShardLeaderElectionContext.runLeaderProcess Running the leader process.
[junit4:junit4]   2> 7242 T1820 oazs.PrepRequestProcessor.pRequest Got user-level KeeperException when processing sessionid:0x13aae7ecedb0005 type:create cxid:0x45 zxid:0xfffffffffffffffe txntype:unknown reqpath:n/a Error Path:/solr/overseer Error:KeeperErrorCode = NodeExists for /solr/overseer
[junit4:junit4]   2> 7249 T1815 oasc.ShardLeaderElectionContext.waitForReplicasToComeUp Enough replicas found to continue.
[junit4:junit4]   2> 7249 T1815 oasc.ShardLeaderElectionContext.runLeaderProcess I may be the new leader - try and sync
[junit4:junit4]   2> 7250 T1815 oasc.SyncStrategy.sync Sync replicas to http://127.0.0.1:52655/solr/collection1/
[junit4:junit4]   2> 7250 T1815 oasc.SyncStrategy.syncReplicas Sync Success - now sync replicas to me
[junit4:junit4]   2> 7250 T1815 oasc.SyncStrategy.syncToMe http://127.0.0.1:52655/solr/collection1/ has no replicas
[junit4:junit4]   2> 7252 T1815 oasc.ShardLeaderElectionContext.runLeaderProcess I am the new leader: http://127.0.0.1:52655/solr/collection1/
[junit4:junit4]   2> 7252 T1815 oascc.SolrZkClient.makePath makePath: /collections/collection1/leaders/shard2
[junit4:junit4]   2> 7256 T1820 oazs.PrepRequestProcessor.pRequest Got user-level KeeperException when processing sessionid:0x13aae7ecedb0005 type:create cxid:0x4e zxid:0xfffffffffffffffe txntype:unknown reqpath:n/a Error Path:/solr/overseer Error:KeeperErrorCode = NodeExists for /solr/overseer
[junit4:junit4]   2> 7479 T1836 oascc.ZkStateReader.updateClusterState Updating cloud state from ZooKeeper... 
[junit4:junit4]   2> 7500 T1863 oascc.ZkStateReader$2.process A cluster state change has occurred - updating... (3)
[junit4:junit4]   2> 7500 T1835 oascc.ZkStateReader$2.process A cluster state change has occurred - updating... (3)
[junit4:junit4]   2> 7500 T1840 oascc.ZkStateReader$2.process A cluster state change has occurred - updating... (3)
[junit4:junit4]   2> 7500 T1851 oascc.ZkStateReader$2.process A cluster state change has occurred - updating... (3)
[junit4:junit4]   2> 7557 T1815 oasc.ZkController.register We are http://127.0.0.1:52655/solr/collection1/ and leader is http://127.0.0.1:52655/solr/collection1/
[junit4:junit4]   2> 7558 T1815 oasc.ZkController.register No LogReplay needed for core=collection1 baseURL=http://127.0.0.1:52655/solr
[junit4:junit4]   2> 7558 T1815 oasc.ZkController.checkRecovery I am the leader, no recovery necessary
[junit4:junit4]   2> 7560 T1815 oasc.ZkController.publish numShards not found on descriptor - reading it from system property
[junit4:junit4]   2> 7566 T1815 oascc.ZkStateReader.updateClusterState Updating cloud state from ZooKeeper... 
[junit4:junit4]   2> 7567 T1815 oass.SolrDispatchFilter.init user.dir=C:\Users\JenkinsSlave\workspace\Lucene-Solr-trunk-Windows\solr\build\solr-core\test\J0
[junit4:junit4]   2> 7569 T1815 oass.SolrDispatchFilter.init SolrDispatchFilter.init() done
[junit4:junit4]   2> 7569 T1815 oascsi.HttpClientUtil.createClient Creating new http client, config:maxConnections=128&maxConnectionsPerHost=32&followRedirects=false
[junit4:junit4]   2> 7904 T1815 oejs.Server.doStart jetty-8.1.2.v20120308
[junit4:junit4]   2> 7909 T1815 oejs.AbstractConnector.doStart Started SelectChannelConnector@0.0.0.0:52661
[junit4:junit4]   2> 7910 T1815 oasc.SolrResourceLoader.locateSolrHome JNDI not configured for solr (NoInitialContextEx)
[junit4:junit4]   2> 7910 T1815 oasc.SolrResourceLoader.locateSolrHome using system property solr.solr.home: C:\Users\JenkinsSlave\workspace\Lucene-Solr-trunk-Windows\solr\build\solr-core\test\J0\.\org.apache.solr.cloud.BasicDistributedZkTest-jetty3-1351547284580
[junit4:junit4]   2> 7911 T1815 oasc.SolrResourceLoader.<init> new SolrResourceLoader for deduced Solr Home: 'C:\Users\JenkinsSlave\workspace\Lucene-Solr-trunk-Windows\solr\build\solr-core\test\J0\.\org.apache.solr.cloud.BasicDistributedZkTest-jetty3-1351547284580\'
[junit4:junit4]   2> 7947 T1815 oass.SolrDispatchFilter.init SolrDispatchFilter.init()
[junit4:junit4]   2> 7948 T1815 oasc.SolrResourceLoader.locateSolrHome JNDI not configured for solr (NoInitialContextEx)
[junit4:junit4]   2> 7948 T1815 oasc.SolrResourceLoader.locateSolrHome using system property solr.solr.home: C:\Users\JenkinsSlave\workspace\Lucene-Solr-trunk-Windows\solr\build\solr-core\test\J0\.\org.apache.solr.cloud.BasicDistributedZkTest-jetty3-1351547284580
[junit4:junit4]   2> 7948 T1815 oasc.CoreContainer$Initializer.initialize looking for solr.xml: C:\Users\JenkinsSlave\workspace\Lucene-Solr-trunk-Windows\solr\build\solr-core\test\J0\.\org.apache.solr.cloud.BasicDistributedZkTest-jetty3-1351547284580\solr.xml
[junit4:junit4]   2> 7950 T1815 oasc.CoreContainer.<init> New CoreContainer 774315196
[junit4:junit4]   2> 7950 T1815 oasc.CoreContainer.load Loading CoreContainer using Solr Home: 'C:\Users\JenkinsSlave\workspace\Lucene-Solr-trunk-Windows\solr\build\solr-core\test\J0\.\org.apache.solr.cloud.BasicDistributedZkTest-jetty3-1351547284580\'
[junit4:junit4]   2> 7950 T1815 oasc.SolrResourceLoader.<init> new SolrResourceLoader for directory: 'C:\Users\JenkinsSlave\workspace\Lucene-Solr-trunk-Windows\solr\build\solr-core\test\J0\.\org.apache.solr.cloud.BasicDistributedZkTest-jetty3-1351547284580\'
[junit4:junit4]   2> 7968 T1815 oasc.CoreContainer.load Registering Log Listener
[junit4:junit4]   2> 7986 T1815 oasc.CoreContainer.initZooKeeper Zookeeper client=127.0.0.1:52633/solr
[junit4:junit4]   2> 7987 T1815 oaz.ZooKeeper.<init> Initiating client connection, connectString=127.0.0.1:52633/solr sessionTimeout=5000 watcher=org.apache.solr.common.cloud.ConnectionManager@1a8ec738
[junit4:junit4]   2> 7990 T1874 oaz.ClientCnxn$SendThread.startConnect Opening socket connection to server /127.0.0.1:52633
[junit4:junit4]   2> 7990 T1815 oascc.ConnectionManager.waitForConnected Waiting for client to connect to ZooKeeper
[junit4:junit4]   2> 7992 T1874 oaz.ClientCnxn$SendThread.primeConnection Socket connection established to 127.0.0.1/127.0.0.1:52633, initiating session
[junit4:junit4]   2> 7992 T1817 oazs.NIOServerCnxn$Factory.run Accepted socket connection from /127.0.0.1:52666
[junit4:junit4]   2> 7993 T1817 oazs.NIOServerCnxn.readConnectRequest Client attempting to establish new session at /127.0.0.1:52666
[junit4:junit4]   2> 8003 T1819 oazs.NIOServerCnxn.finishSessionInit Established session 0x13aae7ecedb0006 with negotiated timeout 5000 for client /127.0.0.1:52666
[junit4:junit4]   2> 8003 T1874 oaz.ClientCnxn$SendThread.readConnectResult Session establishment complete on server 127.0.0.1/127.0.0.1:52633, sessionid = 0x13aae7ecedb0006, negotiated timeout = 5000
[junit4:junit4]   2> 8003 T1875 oascc.ConnectionManager.process Watcher org.apache.solr.common.cloud.ConnectionManager@1a8ec738 name:ZooKeeperConnection Watcher:127.0.0.1:52633/solr got event WatchedEvent state:SyncConnected type:None path:null path:null type:None
[junit4:junit4]   2> 8004 T1815 oascc.ConnectionManager.waitForConnected Client is connected to ZooKeeper
[junit4:junit4]   2> 8005 T1820 oazs.PrepRequestProcessor.pRequest Got user-level KeeperException when processing sessionid:0x13aae7ecedb0006 type:create cxid:0x1 zxid:0xfffffffffffffffe txntype:unknown reqpath:n/a Error Path:/solr/overseer Error:KeeperErrorCode = NodeExists for /solr/overseer
[junit4:junit4]   2> 8008 T1820 oazs.PrepRequestProcessor.pRequest Got user-level KeeperException when processing sessionid:0x13aae7ecedb0006 type:create cxid:0x2 zxid:0xfffffffffffffffe txntype:unknown reqpath:n/a Error Path:/solr/overseer Error:KeeperErrorCode = NodeExists for /solr/overseer
[junit4:junit4]   2> 8010 T1815 oasc.ZkController.createEphemeralLiveNode Register node as live in ZooKeeper:/live_nodes/127.0.0.1:52661_solr
[junit4:junit4]   2> 8011 T1820 oazs.PrepRequestProcessor.pRequest Got user-level KeeperException when processing sessionid:0x13aae7ecedb0006 type:delete cxid:0x4 zxid:0xfffffffffffffffe txntype:unknown reqpath:n/a Error Path:/solr/live_nodes/127.0.0.1:52661_solr Error:KeeperErrorCode = NoNode for /solr/live_nodes/127.0.0.1:52661_solr
[junit4:junit4]   2> 8013 T1815 oascc.SolrZkClient.makePath makePath: /live_nodes/127.0.0.1:52661_solr
[junit4:junit4]   2> 8018 T1840 oascc.ZkStateReader$2.process A cluster state change has occurred - updating... (3)
[junit4:junit4]   2> 8018 T1835 oascc.ZkStateReader$2.process A cluster state change has occurred - updating... (3)
[junit4:junit4]   2> 8018 T1851 oascc.ZkStateReader$2.process A cluster state change has occurred - updating... (3)
[junit4:junit4]   2> 8019 T1863 oascc.ZkStateReader$3.process Updating live nodes... (4)
[junit4:junit4]   2> 8019 T1863 oascc.ZkStateReader$2.process A cluster state change has occurred - updating... (4)
[junit4:junit4]   2> 8023 T1815 oashc.HttpShardHandlerFactory.getParameter Setting socketTimeout to: 0
[junit4:junit4]   2> 8024 T1840 oascc.ZkStateReader$3.process Updating live nodes... (4)
[junit4:junit4]   2> 8024 T1815 oashc.HttpShardHandlerFactory.getParameter Setting urlScheme to: http://
[junit4:junit4]   2> 8024 T1835 oascc.ZkStateReader$3.process Updating live nodes... (4)
[junit4:junit4]   2> 8025 T1851 oascc.ZkStateReader$3.process Updating live nodes... (4)
[junit4:junit4]   2> 8024 T1815 oashc.HttpShardHandlerFactory.getParameter Setting connTimeout to: 0
[junit4:junit4]   2> 8025 T1815 oashc.HttpShardHandlerFactory.getParameter Setting maxConnectionsPerHost to: 20
[junit4:junit4]   2> 8026 T1815 oashc.HttpShardHandlerFactory.getParameter Setting corePoolSize to: 0
[junit4:junit4]   2> 8026 T1815 oashc.HttpShardHandlerFactory.getParameter Setting maximumPoolSize to: 2147483647
[junit4:junit4]   2> 8026 T1815 oashc.HttpShardHandlerFactory.getParameter Setting maxThreadIdleTime to: 5
[junit4:junit4]   2> 8027 T1815 oashc.HttpShardHandlerFactory.getParameter Setting sizeOfQueue to: -1
[junit4:junit4]   2> 8027 T1815 oashc.HttpShardHandlerFactory.getParameter Setting fairnessPolicy to: false
[junit4:junit4]   2> 8027 T1815 oascsi.HttpClientUtil.createClient Creating new http client, config:maxConnectionsPerHost=20&maxConnections=10000&socketTimeout=0&connTimeout=0&retry=false
[junit4:junit4]   2> 8041 T1815 oascc.ZkStateReader.createClusterStateWatchersAndUpdate Updating cluster state from ZooKeeper... 
[junit4:junit4]   2> 8048 T1815 oasc.CoreContainer.create Creating SolrCore 'collection1' using instanceDir: C:\Users\JenkinsSlave\workspace\Lucene-Solr-trunk-Windows\solr\build\solr-core\test\J0\.\org.apache.solr.cloud.BasicDistributedZkTest-jetty3-1351547284580\collection1
[junit4:junit4]   2> 8048 T1815 oasc.ZkController.createCollectionZkNode Check for collection zkNode:collection1
[junit4:junit4]   2> 8049 T1815 oasc.ZkController.createCollectionZkNode Collection zkNode exists
[junit4:junit4]   2> 8049 T1815 oasc.ZkController.readConfigName Load collection config from:/collections/collection1
[junit4:junit4]   2> 8052 T1815 oasc.SolrResourceLoader.<init> new SolrResourceLoader for directory: 'C:\Users\JenkinsSlave\workspace\Lucene-Solr-trunk-Windows\solr\build\solr-core\test\J0\.\org.apache.solr.cloud.BasicDistributedZkTest-jetty3-1351547284580\collection1\'
[junit4:junit4]   2> 8055 T1815 oasc.SolrResourceLoader.replaceClassLoader Adding 'file:/C:/Users/JenkinsSlave/workspace/Lucene-Solr-trunk-Windows/solr/build/solr-core/test/J0/org.apache.solr.cloud.BasicDistributedZkTest-jetty3-1351547284580/collection1/lib/classes/' to classloader
[junit4:junit4]   2> 8055 T1815 oasc.SolrResourceLoader.replaceClassLoader Adding 'file:/C:/Users/JenkinsSlave/workspace/Lucene-Solr-trunk-Windows/solr/build/solr-core/test/J0/org.apache.solr.cloud.BasicDistributedZkTest-jetty3-1351547284580/collection1/lib/README' to classloader
[junit4:junit4]   2> 8094 T1836 oascc.ZkStateReader.updateClusterState Updating cloud state from ZooKeeper... 
[junit4:junit4]   2> 8097 T1836 oasc.Overseer$ClusterStateUpdater.updateState Update state numShards=2 message={
[junit4:junit4]   2> 	  "operation":"state",
[junit4:junit4]   2> 	  "numShards":"2",
[junit4:junit4]   2> 	  "shard":"shard2",
[junit4:junit4]   2> 	  "roles":null,
[junit4:junit4]   2> 	  "state":"active",
[junit4:junit4]   2> 	  "core":"collection1",
[junit4:junit4]   2> 	  "collection":"collection1",
[junit4:junit4]   2> 	  "node_name":"127.0.0.1:52655_solr",
[junit4:junit4]   2> 	  "base_url":"http://127.0.0.1:52655/solr"}
[junit4:junit4]   2> 8104 T1863 oascc.ZkStateReader$2.process A cluster state change has occurred - updating... (4)
[junit4:junit4]   2> 8104 T1835 oascc.ZkStateReader$2.process A cluster state change has occurred - updating... (4)
[junit4:junit4]   2> 8105 T1875 oascc.ZkStateReader$2.process A cluster state change has occurred - updating... (4)
[junit4:junit4]   2> 8105 T1840 oascc.ZkStateReader$2.process A cluster state change has occurred - updating... (4)
[junit4:junit4]   2> 8105 T1851 oascc.ZkStateReader$2.process A cluster state change has occurred - updating... (4)
[junit4:junit4]   2> 8121 T1815 oasc.SolrConfig.<init> Using Lucene MatchVersion: LUCENE_50
[junit4:junit4]   2> 8186 T1815 oasc.SolrConfig.<init> Loaded SolrConfig: solrconfig.xml
[junit4:junit4]   2> 8188 T1815 oass.IndexSchema.readSchema Reading Solr Schema
[junit4:junit4]   2> 8193 T1815 oass.IndexSchema.readSchema Schema name=test
[junit4:junit4]   2> 8902 T1815 oass.OpenExchangeRatesOrgProvider.init Initialized with rates=open-exchange-rates.json, refreshInterval=1440.
[junit4:junit4]   2> 8913 T1815 oass.IndexSchema.readSchema default search field in schema is text
[junit4:junit4]   2> 8919 T1815 oass.IndexSchema.readSchema unique key field: id
[junit4:junit4]   2> 8940 T1815 oass.FileExchangeRateProvider.reload Reloading exchange rates from file currency.xml
[junit4:junit4]   2> 8949 T1815 oass.FileExchangeRateProvider.reload Reloading exchange rates from file currency.xml
[junit4:junit4]   2> 8954 T1815 oass.OpenExchangeRatesOrgProvider.reload Reloading exchange rates from open-exchange-rates.json
[junit4:junit4]   2> 8957 T1815 oass.OpenExchangeRatesOrgProvider.reload Reloading exchange rates from open-exchange-rates.json
[junit4:junit4]   2> 8959 T1815 oasc.SolrCore.<init> [collection1] Opening new SolrCore at C:\Users\JenkinsSlave\workspace\Lucene-Solr-trunk-Windows\solr\build\solr-core\test\J0\.\org.apache.solr.cloud.BasicDistributedZkTest-jetty3-1351547284580\collection1\, dataDir=.\org.apache.solr.cloud.BasicDistributedZkTest-1351547277005/jetty3\
[junit4:junit4]   2> 8959 T1815 oasc.JmxMonitoredMap.<init> JMX monitoring is enabled. Adding Solr mbeans to JMX Server: com.sun.jmx.mbeanserver.JmxMBeanServer@36bf7916
[junit4:junit4]   2> 8960 T1815 oasc.SolrCore.initDirectoryFactory solr.NRTCachingDirectoryFactory
[junit4:junit4]   2> 8961 T1815 oasc.CachingDirectoryFactory.injectLockFactory WARNING No lockType configured for NRTCachingDirectory(org.apache.lucene.store.MMapDirectory@C:\Users\JenkinsSlave\workspace\Lucene-Solr-trunk-Windows\solr\build\solr-core\test\J0\org.apache.solr.cloud.BasicDistributedZkTest-1351547277005\jetty3 lockFactory=org.apache.lucene.store.NativeFSLockFactory@490dba68; maxCacheMB=48.0 maxMergeSizeMB=4.0) assuming 'simple'
[junit4:junit4]   2> 8962 T1815 oasc.CachingDirectoryFactory.get return new directory for C:\Users\JenkinsSlave\workspace\Lucene-Solr-trunk-Windows\solr\build\solr-core\test\J0\.\org.apache.solr.cloud.BasicDistributedZkTest-1351547277005\jetty3 forceNew:false
[junit4:junit4]   2> 8962 T1815 oasc.CachingDirectoryFactory.close Releasing directory:C:\Users\JenkinsSlave\workspace\Lucene-Solr-trunk-Windows\solr\build\solr-core\test\J0\.\org.apache.solr.cloud.BasicDistributedZkTest-1351547277005\jetty3
[junit4:junit4]   2> 8964 T1815 oasc.SolrCore.getNewIndexDir New index directory detected: old=null new=.\org.apache.solr.cloud.BasicDistributedZkTest-1351547277005/jetty3\index/
[junit4:junit4]   2> 8965 T1815 oasc.SolrCore.initIndex WARNING [collection1] Solr index directory '.\org.apache.solr.cloud.BasicDistributedZkTest-1351547277005\jetty3\index' doesn't exist. Creating new index...
[junit4:junit4]   2> 8966 T1815 oasc.CachingDirectoryFactory.get return new directory for C:\Users\JenkinsSlave\workspace\Lucene-Solr-trunk-Windows\solr\build\solr-core\test\J0\.\org.apache.solr.cloud.BasicDistributedZkTest-1351547277005\jetty3\index forceNew:false
[junit4:junit4]   2> 8981 T1815 oasc.SolrDeletionPolicy.onCommit SolrDeletionPolicy.onCommit: commits:num=1
[junit4:junit4]   2> 		commit{dir=NRTCachingDirectory(org.apache.lucene.store.MMapDirectory@C:\Users\JenkinsSlave\workspace\Lucene-Solr-trunk-Windows\solr\build\solr-core\test\J0\org.apache.solr.cloud.BasicDistributedZkTest-1351547277005\jetty3\index lockFactory=org.apache.lucene.store.NativeFSLockFactory@5e0cabd4; maxCacheMB=48.0 maxMergeSizeMB=4.0),segFN=segments_1,generation=1,filenames=[segments_1]
[junit4:junit4]   2> 8981 T1815 oasc.SolrDeletionPolicy.updateCommits newest commit = 1[segments_1]
[junit4:junit4]   2> 8983 T1815 oasc.CachingDirectoryFactory.close Releasing directory:C:\Users\JenkinsSlave\workspace\Lucene-Solr-trunk-Windows\solr\build\solr-core\test\J0\.\org.apache.solr.cloud.BasicDistributedZkTest-1351547277005\jetty3\index
[junit4:junit4]   2> 8983 T1815 oasc.SolrCore.initWriters created xml: solr.XMLResponseWriter
[junit4:junit4]   2> 8985 T1815 oasup.UpdateRequestProcessorChain.init inserting DistributedUpdateProcessorFactory into updateRequestProcessorChain "dedupe"
[junit4:junit4]   2> 8986 T1815 oasup.UpdateRequestProcessorChain.init inserting DistributedUpdateProcessorFactory into updateRequestProcessorChain "dedupe-allfields"
[junit4:junit4]   2> 8986 T1815 oasup.UpdateRequestProcessorChain.init inserting DistributedUpdateProcessorFactory into updateRequestProcessorChain "stored_sig"
[junit4:junit4]   2> 8986 T1815 oasup.UpdateRequestProcessorChain.init inserting DistributedUpdateProcessorFactory into updateRequestProcessorChain "uniq-fields"
[junit4:junit4]   2> 8989 T1815 oasup.UpdateRequestProcessorChain.init inserting DistributedUpdateProcessorFactory into updateRequestProcessorChain "distrib-dup-test-chain-implicit"
[junit4:junit4]   2> 8989 T1815 oasc.RequestHandlers.initHandlersFromConfig adding lazy requestHandler: solr.ReplicationHandler
[junit4:junit4]   2> 8990 T1815 oasc.RequestHandlers.initHandlersFromConfig created /replication: solr.ReplicationHandler
[junit4:junit4]   2> 8990 T1815 oasc.RequestHandlers.initHandlersFromConfig created standard: solr.StandardRequestHandler
[junit4:junit4]   2> 8991 T1815 oasc.RequestHandlers.initHandlersFromConfig created /get: solr.RealTimeGetHandler
[junit4:junit4]   2> 8991 T1815 oasc.RequestHandlers.initHandlersFromConfig created dismax: solr.SearchHandler
[junit4:junit4]   2> 8992 T1815 oasc.RequestHandlers.initHandlersFromConfig created mock: org.apache.solr.core.MockQuerySenderListenerReqHandler
[junit4:junit4]   2> 8992 T1815 oasc.RequestHandlers.initHandlersFromConfig created /admin/: org.apache.solr.handler.admin.AdminHandlers
[junit4:junit4]   2> 8993 T1815 oasc.RequestHandlers.initHandlersFromConfig created defaults: solr.StandardRequestHandler
[junit4:junit4]   2> 8993 T1815 oasc.RequestHandlers.initHandlersFromConfig adding lazy requestHandler: solr.StandardRequestHandler
[junit4:junit4]   2> 8994 T1815 oasc.RequestHandlers.initHandlersFromConfig created lazy: solr.StandardRequestHandler
[junit4:junit4]   2> 8994 T1815 oasc.RequestHandlers.initHandlersFromConfig created /update: solr.UpdateRequestHandler
[junit4:junit4]   2> 8996 T1815 oasc.RequestHandlers.initHandlersFromConfig created /terms: org.apache.solr.handler.component.SearchHandler
[junit4:junit4]   2> 8996 T1815 oasc.RequestHandlers.initHandlersFromConfig created spellCheckCompRH: org.apache.solr.handler.component.SearchHandler
[junit4:junit4]   2> 8997 T1815 oasc.RequestHandlers.initHandlersFromConfig created spellCheckCompRH_Direct: org.apache.solr.handler.component.SearchHandler
[junit4:junit4]   2> 8997 T1815 oasc.RequestHandlers.initHandlersFromConfig created spellCheckWithWordbreak: org.apache.solr.handler.component.SearchHandler
[junit4:junit4]   2> 8998 T1815 oasc.RequestHandlers.initHandlersFromConfig created spellCheckWithWordbreak_Direct: org.apache.solr.handler.component.SearchHandler
[junit4:junit4]   2> 8998 T1815 oasc.RequestHandlers.initHandlersFromConfig created spellCheckCompRH1: org.apache.solr.handler.component.SearchHandler
[junit4:junit4]   2> 8999 T1815 oasc.RequestHandlers.initHandlersFromConfig created tvrh: org.apache.solr.handler.component.SearchHandler
[junit4:junit4]   2> 8999 T1815 oasc.RequestHandlers.initHandlersFromConfig created /mlt: solr.MoreLikeThisHandler
[junit4:junit4]   2> 9000 T1815 oasc.RequestHandlers.initHandlersFromConfig created /debug/dump: solr.DumpRequestHandler
[junit4:junit4]   2> 9008 T1815 oashl.XMLLoader.init xsltCacheLifetimeSeconds=60
[junit4:junit4]   2> 9014 T1815 oasc.SolrCore.initDeprecatedSupport WARNING solrconfig.xml uses deprecated <admin/gettableFiles>, Please update your config to use the ShowFileRequestHandler.
[junit4:junit4]   2> 9016 T1815 oasc.SolrCore.initDeprecatedSupport WARNING adding ShowFileRequestHandler with hidden files: [SCHEMA.XML, OLD_SYNONYMS.TXT, STOPWORDS.TXT, PROTWORDS.TXT, OPEN-EXCHANGE-RATES.JSON, SYNONYMS.TXT, CURRENCY.XML, MAPPING-ISOLATIN1ACCENT.TXT]
[junit4:junit4]   2> 9019 T1815 oasc.CachingDirectoryFactory.close Releasing directory:C:\Users\JenkinsSlave\workspace\Lucene-Solr-trunk-Windows\solr\build\solr-core\test\J0\.\org.apache.solr.cloud.BasicDistributedZkTest-1351547277005\jetty3
[junit4:junit4]   2> 9022 T1815 oass.SolrIndexSearcher.<init> Opening Searcher@36ed4769 main
[junit4:junit4]   2> 9024 T1815 oasu.CommitTracker.<init> Hard AutoCommit: disabled
[junit4:junit4]   2> 9024 T1815 oasu.CommitTracker.<init> Soft AutoCommit: disabled
[junit4:junit4]   2> 9025 T1815 oashc.SpellCheckComponent.inform Initializing spell checkers
[junit4:junit4]   2> 9083 T1815 oass.DirectSolrSpellChecker.init init: {name=direct,classname=DirectSolrSpellChecker,field=lowerfilt,minQueryLength=3}
[junit4:junit4]   2> 9159 T1876 oasc.SolrCore.registerSearcher [collection1] Registered new searcher Searcher@36ed4769 main{StandardDirectoryReader(segments_1:1)}
[junit4:junit4]   2> 9164 T1815 oasc.ZkController.publish numShards not found on descriptor - reading it from system property
[junit4:junit4]   2> 9286 T1836 oascc.ZkStateReader.updateClusterState Updating cloud state from ZooKeeper... 
[junit4:junit4]   2> 9288 T1836 oasc.Overseer$ClusterStateUpdater.updateState Update state numShards=2 message={
[junit4:junit4]   2> 	  "operation":"state",
[junit4:junit4]   2> 	  "numShards":"2",
[junit4:junit4]   2> 	  "shard":null,
[junit4:junit4]   2> 	  "roles":null,
[junit4:junit4]   2> 	  "state":"down",
[junit4:junit4]   2> 	  "core":"collection1",
[junit4:junit4]   2> 	  "collection":"collection1",
[junit4:junit4]   2> 	  "node_name":"127.0.0.1:52661_solr",
[junit4:junit4]   2> 	  "base_url":"http://127.0.0.1:52661/solr"}
[junit4:junit4]   2> 9303 T1840 oascc.ZkStateReader$2.process A cluster state change has occurred - updating... (4)
[junit4:junit4]   2> 9303 T1863 oascc.ZkStateReader$2.process A cluster state change has occurred - updating... (4)
[junit4:junit4]   2> 9305 T1835 oascc.ZkStateReader$2.process A cluster state change has occurred - updating... (4)
[junit4:junit4]   2> 9305 T1851 oascc.ZkStateReader$2.process A cluster state change has occurred - updating... (4)
[junit4:junit4]   2> 9305 T1875 oascc.ZkStateReader$2.process A cluster state change has occurred - updating... (4)
[junit4:junit4]   2> 9752 T1815 oasc.CoreContainer.register registering core: collection1
[junit4:junit4]   2> 9752 T1815 oasc.ZkController.register Register shard - core:collection1 address:http://127.0.0.1:52661/solr shardId:shard1
[junit4:junit4]   2> 9759 T1815 oasc.ZkController.register We are http://127.0.0.1:52661/solr/collection1/ and leader is http://127.0.0.1:52649/solr/collection1/
[junit4:junit4]   2> 9759 T1815 oasc.ZkController.register No LogReplay needed for core=collection1 baseURL=http://127.0.0.1:52661/solr
[junit4:junit4]   2> 9760 T1815 oasc.ZkController.checkRecovery Core needs to recover:collection1
[junit4:junit4]   2> 9760 T1815 oasu.DefaultSolrCoreState.doRecovery Running recovery - first canceling any ongoing recovery
[junit4:junit4]   2> ASYNC  NEW_CORE C150 name=collection1 org.apache.solr.core.SolrCore@34be51e8 url=http://127.0.0.1:52661/solr/collection1 node=127.0.0.1:52661_solr
[junit4:junit4]   2> 9763 T1877 C150 P52661 oasc.RecoveryStrategy.run Starting recovery process.  core=collection1 recoveringAfterStartup=true
[junit4:junit4]   2> 9763 T1815 oascc.ZkStateReader.updateClusterState Updating cloud state from ZooKeeper... 
[junit4:junit4]   2> 9764 T1877 C150 P52661 oasc.RecoveryStrategy.doRecovery ###### startupVersions=[]
[junit4:junit4]   2> 9764 T1877 C150 P52661 oasc.ZkController.publish numShards not found on descriptor - reading it from system property
[junit4:junit4]   2> 9765 T1815 oass.SolrDispatchFilter.init user.dir=C:\Users\JenkinsSlave\workspace\Lucene-Solr-trunk-Windows\solr\build\solr-core\test\J0
[junit4:junit4]   2> 9767 T1815 oass.SolrDispatchFilter.init SolrDispatchFilter.init() done
[junit4:junit4]   2> 9767 T1815 oascsi.HttpClientUtil.createClient Creating new http client, config:maxConnections=128&maxConnectionsPerHost=32&followRedirects=false
[junit4:junit4]   2> 9768 T1877 C150 P52661 oasc.RecoveryStrategy.doRecovery Attempting to PeerSync from http://127.0.0.1:52649/solr/collection1/ core=collection1 - recoveringAfterStartup=true
[junit4:junit4]   2> 9768 T1877 C150 P52661 oasu.PeerSync.sync PeerSync: core=collection1 url=http://127.0.0.1:52661/solr START replicas=[http://127.0.0.1:52649/solr/collection1/] nUpdates=100
[junit4:junit4]   2> 9768 T1877 C150 P52661 oasu.PeerSync.sync WARNING no frame of reference to tell of we've missed updates
[junit4:junit4]   2> 9772 T1877 C150 P52661 oasc.RecoveryStrategy.doRecovery PeerSync Recovery was not successful - trying replication. core=collection1
[junit4:junit4]   2> 9773 T1877 C150 P52661 oasc.RecoveryStrategy.doRecovery Starting Replication Recovery. core=collection1
[junit4:junit4]   2> 9773 T1877 C150 P52661 oascsi.HttpClientUtil.createClient Creating new http client, config:maxConnections=128&maxConnectionsPerHost=32&followRedirects=false
[junit4:junit4]   2> ASYNC  NEW_CORE C151 name=collection1 org.apache.solr.core.SolrCore@7adc252c url=http://127.0.0.1:52649/solr/collection1 node=127.0.0.1:52649_solr
[junit4:junit4]   2> 9787 T1847 C151 P52649 REQ /get {distrib=false&qt=/get&wt=javabin&version=2&getVersions=100} status=0 QTime=0 
[junit4:junit4]   2> 9900 T1836 oascc.ZkStateReader.updateClusterState Updating cloud state from ZooKeeper... 
[junit4:junit4]   2> 9901 T1836 oasc.Overseer$ClusterStateUpdater.updateState Update state numShards=2 message={
[junit4:junit4]   2> 	  "operation":"state",
[junit4:junit4]   2> 	  "numShards":"2",
[junit4:junit4]   2> 	  "shard":"shard1",
[junit4:junit4]   2> 	  "roles":null,
[junit4:junit4]   2> 	  "state":"recovering",
[junit4:junit4]   2> 	  "core":"collection1",
[junit4:junit4]   2> 	  "collection":"collection1",
[junit4:junit4]   2> 	  "node_name":"127.0.0.1:52661_solr",
[junit4:junit4]   2> 	  "base_url":"http://127.0.0.1:52661/solr"}
[junit4:junit4]   2> 9916 T1863 oascc.ZkStateReader$2.process A cluster state change has occurred - updating... (4)
[junit4:junit4]   2> 9916 T1835 oascc.ZkStateReader$2.process A cluster state change has occurred - updating... (4)
[junit4:junit4]   2> 9916 T1851 oascc.ZkStateReader$2.process A cluster state change has occurred - updating... (4)
[junit4:junit4]   2> 9916 T1875 oascc.ZkStateReader$2.process A cluster state change has occurred - updating... (4)
[junit4:junit4]   2> 9917 T1840 oascc.ZkStateReader$2.process A cluster state change has occurred - updating... (4)
[junit4:junit4]   2> 10129 T1815 oejs.Server.doStart jetty-8.1.2.v20120308
[junit4:junit4]   2> 10133 T1815 oejs.AbstractConnector.doStart Started SelectChannelConnector@0.0.0.0:52669
[junit4:junit4]   2> 10134 T1815 oasc.SolrResourceLoader.locateSolrHome JNDI not configured for solr (NoInitialContextEx)
[junit4:junit4]   2> 10135 T1815 oasc.SolrResourceLoader.locateSolrHome using system property solr.solr.home: C:\Users\JenkinsSlave\workspace\Lucene-Solr-trunk-Windows\solr\build\solr-core\test\J0\.\org.apache.solr.cloud.BasicDistributedZkTest-jetty4-1351547286794
[junit4:junit4]   2> 10136 T1815 oasc.SolrResourceLoader.<init> new SolrResourceLoader for deduced Solr Home: 'C:\Users\JenkinsSlave\workspace\Lucene-Solr-trunk-Windows\solr\build\solr-core\test\J0\.\org.apache.solr.cloud.BasicDistributedZkTest-jetty4-1351547286794\'
[junit4:junit4]   2> 10169 T1815 oass.SolrDispatchFilter.init SolrDispatchFilter.init()
[junit4:junit4]   2> 10169 T1815 oasc.SolrResourceLoader.locateSolrHome JNDI not configured for solr (NoInitialContextEx)
[junit4:junit4]   2> 10169 T1815 oasc.SolrResourceLoader.locateSolrHome using system property solr.solr.home: C:\Users\JenkinsSlave\workspace\Lucene-Solr-trunk-Windows\solr\build\solr-core\test\J0\.\org.apache.solr.cloud.BasicDistributedZkTest-jetty4-1351547286794
[junit4:junit4]   2> 10169 T1815 oasc.CoreContainer$Initializer.initialize looking for solr.xml: C:\Users\JenkinsSlave\workspace\Lucene-Solr-trunk-Windows\solr\build\solr-core\test\J0\.\org.apache.solr.cloud.BasicDistributedZkTest-jetty4-1351547286794\solr.xml
[junit4:junit4]   2> 10171 T1815 oasc.CoreContainer.<init> New CoreContainer 1156464092
[junit4:junit4]   2> 10171 T1815 oasc.CoreContainer.load Loading CoreContainer using Solr Home: 'C:\Users\JenkinsSlave\workspace\Lucene-Solr-trunk-Windows\solr\build\solr-core\test\J0\.\org.apache.solr.cloud.BasicDistributedZkTest-jetty4-1351547286794\'
[junit4:junit4]   2> 10171 T1815 oasc.SolrResourceLoader.<init> new SolrResourceLoader for directory: 'C:\Users\JenkinsSlave\workspace\Lucene-Solr-trunk-Windows\solr\build\solr-core\test\J0\.\org.apache.solr.cloud.BasicDistributedZkTest-jetty4-1351547286794\'
[junit4:junit4]   2> 10191 T1815 oasc.CoreContainer.load Registering Log Listener
[junit4:junit4]   2> 10205 T1815 oasc.CoreContainer.initZooKeeper Zookeeper client=127.0.0.1:52633/solr
[junit4:junit4]   2> 10205 T1815 oaz.ZooKeeper.<init> Initiating client connection, connectString=127.0.0.1:52633/solr sessionTimeout=5000 watcher=org.apache.solr.common.cloud.ConnectionManager@5d4539e4
[junit4:junit4]   2> 10208 T1888 oaz.ClientCnxn$SendThread.startConnect Opening socket connection to server /127.0.0.1:52633
[junit4:junit4]   2> 10208 T1815 oascc.ConnectionManager.waitForConnected Waiting for client to connect to ZooKeeper
[junit4:junit4]   2> 10210 T1888 oaz.ClientCnxn$SendThread.primeConnection Socket connection established to 127.0.0.1/127.0.0.1:52633, initiating session
[junit4:junit4]   2> 10210 T1817 oazs.NIOServerCnxn$Factory.run Accepted socket connection from /127.0.0.1:52674
[junit4:junit4]   2> 10210 T1817 oazs.NIOServerCnxn.readConnectRequest Client attempting to establish new session at /127.0.0.1:52674
[junit4:junit4]   2> 10219 T1819 oazs.NIOServerCnxn.finishSessionInit Established session 0x13aae7ecedb0007 with negotiated timeout 5000 for client /127.0.0.1:52674
[junit4:junit4]   2> 10219 T1888 oaz.ClientCnxn$SendThread.readConnectResult Session establishment complete on server 127.0.0.1/127.0.0.1:52633, sessionid = 0x13aae7ecedb0007, negotiated timeout = 5000
[junit4:junit4]   2> 10219 T1889 oascc.ConnectionManager.process Watcher org.apache.solr.common.cloud.ConnectionManager@5d4539e4 name:ZooKeeperConnection Watcher:127.0.0.1:52633/solr got event WatchedEvent state:SyncConnected type:None path:null path:null type:None
[junit4:junit4]   2> 10219 T1815 oascc.ConnectionManager.waitForConnected Client is connected to ZooKeeper
[junit4:junit4]   2> 10221 T1820 oazs.PrepRequestProcessor.pRequest Got user-level KeeperException when processing sessionid:0x13aae7ecedb0007 type:create cxid:0x1 zxid:0xfffffffffffffffe txntype:unknown reqpath:n/a Error Path:/solr/overseer Error:KeeperErrorCode = NodeExists for /solr/overseer
[junit4:junit4]   2> 10223 T1820 oazs.PrepRequestProcessor.pRequest Got user-level KeeperException when processing sessionid:0x13aae7ecedb0007 type:create cxid:0x2 zxid:0xfffffffffffffffe txntype:unknown reqpath:n/a Error Path:/solr/overseer Error:KeeperErrorCode = NodeExists for /solr/overseer
[junit4:junit4]   2> 10225 T1815 oasc.ZkController.createEphemeralLiveNode Register node as live in ZooKeeper:/live_nodes/127.0.0.1:52669_solr
[junit4:junit4]   2> 10226 T1820 oazs.PrepRequestProcessor.pRequest Got user-level KeeperException when processing sessionid:0x13aae7ecedb0007 type:delete cxid:0x4 zxid:0xfffffffffffffffe txntype:unknown reqpath:n/a Error Path:/solr/live_nodes/127.0.0.1:52669_solr Error:KeeperErrorCode = NoNode for /solr/live_nodes/127.0.0.1:52669_solr
[junit4:junit4]   2> 10229 T1815 oascc.SolrZkClient.makePath makePath: /live_nodes/127.0.0.1:52669_solr
[junit4:junit4]   2> 10232 T1835 oascc.ZkStateReader$2.process A cluster state change has occurred - updating... (4)
[junit4:junit4]   2> 10232 T1840 oascc.ZkStateReader$2.process A cluster state change has occurred - updating... (4)
[junit4:junit4]   2> 10232 T1875 oascc.ZkStateReader$2.process A cluster state change has occurred - updating... (4)
[junit4:junit4]   2> 10232 T1851 oascc.ZkStateReader$2.process A cluster state change has occurred - updating... (4)
[junit4:junit4]   2> 10233 T1863 oascc.ZkStateReader$3.process Updating live nodes... (5)
[junit4:junit4]   2> 10233 T1863 oascc.ZkStateReader$2.process A cluster state change has occurred - updating... (5)
[junit4:junit4]   2> 10235 T1815 oashc.HttpShardHandlerFactory.getParameter Setting socketTimeout to: 0
[junit4:junit4]   2> 10237 T1815 oashc.HttpShardHandlerFactory.getParameter Setting urlScheme to: http://
[junit4:junit4]   2> 10237 T1815 oashc.HttpShardHandlerFactory.getParameter Setting connTimeout to: 0
[junit4:junit4]   2> 10237 T1835 oascc.ZkStateReader$3.process Updating live nodes... (5)
[junit4:junit4]   2> 10237 T1815 oashc.HttpShardHandlerFactory.getParameter Setting maxConnectionsPerHost to: 20
[junit4:junit4]   2> 10238 T1815 oashc.HttpShardHandlerFactory.getParameter Setting corePoolSize to: 0
[junit4:junit4]   2> 10238 T1840 oascc.ZkStateReader$3.process Updating live nodes... (5)
[junit4:junit4]   2> 10238 T1815 oashc.HttpShardHandlerFactory.getParameter Setting maximumPoolSize to: 2147483647
[junit4:junit4]   2> 10237 T1875 oascc.ZkStateReader$3.process Updating live nodes... (5)
[junit4:junit4]   2> 10238 T1851 oascc.ZkStateReader$3.process Updating live nodes... (5)
[junit4:junit4]   2> 10238 T1815 oashc.HttpShardHandlerFactory.getParameter Setting maxThreadIdleTime to: 5
[junit4:junit4]   2> 10239 T1815 oashc.HttpShardHandlerFactory.getParameter Setting sizeOfQueue to: -1
[junit4:junit4]   2> 10239 T1815 oashc.HttpShardHandlerFactory.getParameter Setting fairnessPolicy to: false
[junit4:junit4]   2> 10239 T1815 oascsi.HttpClientUtil.createClient Creating new http client, config:maxConnectionsPerHost=20&maxConnections=10000&socketTimeout=0&connTimeout=0&retry=false
[junit4:junit4]   2> 10249 T1815 oascc.ZkStateReader.createClusterStateWatchersAndUpdate Updating cluster state from ZooKeeper... 
[junit4:junit4]   2> 10264 T1815 oasc.CoreContainer.create Creating SolrCore 'collection1' using instanceDir: C:\Users\JenkinsSlave\workspace\Lucene-Solr-trunk-Windows\solr\build\solr-core\test\J0\.\org.apache.solr.cloud.BasicDistributedZkTest-jetty4-1351547286794\collection1
[junit4:junit4]   2> 10264 T1815 oasc.ZkController.createCollectionZkNode Check for collection zkNode:collection1
[junit4:junit4]   2> 10276 T1815 oasc.ZkController.createCollectionZkNode Collection zkNode exists
[junit4:junit4]   2> 10276 T1815 oasc.ZkController.readConfigName Load collection config from:/collections/collection1
[junit4:junit4]   2> 10279 T1815 oasc.SolrResourceLoader.<init> new SolrResourceLoader for directory: 'C:\Users\JenkinsSlave\workspace\Lucene-Solr-trunk-Windows\solr\build\solr-core\test\J0\.\org.apache.solr.cloud.BasicDistributedZkTest-jetty4-1351547286794\collection1\'
[junit4:junit4]   2> 10280 T1815 oasc.SolrResourceLoader.replaceClassLoader Adding 'file:/C:/Users/JenkinsSlave/workspace/Lucene-Solr-trunk-Windows/solr/build/solr-core/test/J0/org.apache.solr.cloud.BasicDistributedZkTest-jetty4-1351547286794/collection1/lib/classes/' to classloader
[junit4:junit4]   2> 10281 T1815 oasc.SolrResourceLoader.replaceClassLoader Adding 'file:/C:/Users/JenkinsSlave/workspace/Lucene-Solr-trunk-Windows/solr/build/solr-core/test/J0/org.apache.solr.cloud.BasicDistributedZkTest-jetty4-1351547286794/collection1/lib/README' to classloader
[junit4:junit4]   2> 10322 T1815 oasc.SolrConfig.<init> Using Lucene MatchVersion: LUCENE_50
[junit4:junit4]   2> 10408 T1815 oasc.SolrConfig.<init> Loaded SolrConfig: solrconfig.xml
[junit4:junit4]   2> 10410 T1815 oass.IndexSchema.readSchema Reading Solr Schema
[junit4:junit4]   2> 10416 T1815 oass.IndexSchema.readSchema Schema name=test
[junit4:junit4]   2> 11166 T1815 oass.OpenExchangeRatesOrgProvider.init Initialized with rates=open-exchange-rates.json, refreshInterval=1440.
[junit4:junit4]   2> 11177 T1815 oass.IndexSchema.readSchema default search field in schema is text
[junit4:junit4]   2> 11182 T1815 oass.IndexSchema.readSchema unique key field: id
[junit4:junit4]   2> 11201 T1815 oass.FileExchangeRateProvider.reload Reloading exchange rates from file currency.xml
[junit4:junit4]   2> 11209 T1815 oass.FileExchangeRateProvider.reload Reloading exchange rates from file currency.xml
[junit4:junit4]   2> 11217 T1815 oass.OpenExchangeRatesOrgProvider.reload Reloading exchange rates from open-exchange-rates.json
[junit4:junit4]   2> 11220 T1815 oass.OpenExchangeRatesOrgProvider.reload Reloading exchange rates from open-exchange-rates.json
[junit4:junit4]   2> 11221 T1815 oasc.SolrCore.<init> [collection1] Opening new SolrCore at C:\Users\JenkinsSlave\workspace\Lucene-Solr-trunk-Windows\solr\build\solr-core\test\J0\.\org.apache.solr.cloud.BasicDistributedZkTest-jetty4-1351547286794\collection1\, dataDir=.\org.apache.solr.cloud.BasicDistributedZkTest-1351547277005/jetty4\
[junit4:junit4]   2> 11221 T1815 oasc.JmxMonitoredMap.<init> JMX monitoring is enabled. Adding Solr mbeans to JMX Server: com.sun.jmx.mbeanserver.JmxMBeanServer@36bf7916
[junit4:junit4]   2> 11222 T1815 oasc.SolrCore.initDirectoryFactory solr.NRTCachingDirectoryFactory
[junit4:junit4]   2> 11223 T1815 oasc.CachingDirectoryFactory.injectLockFactory WARNING No lockType configured for NRTCachingDirectory(org.apache.lucene.store.MMapDirectory@C:\Users\JenkinsSlave\workspace\Lucene-Solr-trunk-Windows\solr\build\solr-core\test\J0\org.apache.solr.cloud.BasicDistributedZkTest-1351547277005\jetty4 lockFactory=org.apache.lucene.store.NativeFSLockFactory@71cbe5bf; maxCacheMB=48.0 maxMergeSizeMB=4.0) assuming 'simple'
[junit4:junit4]   2> 11223 T1815 oasc.CachingDirectoryFactory.get return new directory for C:\Users\JenkinsSlave\workspace\Lucene-Solr-trunk-Windows\solr\build\solr-core\test\J0\.\org.apache.solr.cloud.BasicDistributedZkTest-1351547277005\jetty4 forceNew:false
[junit4:junit4]   2> 11224 T1815 oasc.CachingDirectoryFactory.close Releasing directory:C:\Users\JenkinsSlave\workspace\Lucene-Solr-trunk-Windows\solr\build\solr-core\test\J0\.\org.apache.solr.cloud.BasicDistributedZkTest-1351547277005\jetty4
[junit4:junit4]   2> 11224 T1815 oasc.SolrCore.getNewIndexDir New index directory detected: old=null new=.\org.apache.solr.cloud.BasicDistributedZkTest-1351547277005/jetty4\index/
[junit4:junit4]   2> 11225 T1815 oasc.SolrCore.initIndex WARNING [collection1] Solr index directory '.\org.apache.solr.cloud.BasicDistributedZkTest-1351547277005\jetty4\index' doesn't exist. Creating new index...
[junit4:junit4]   2> 11225 T1815 oasc.CachingDirectoryFactory.get return new directory for C:\Users\JenkinsSlave\workspace\Lucene-Solr-trunk-Windows\solr\build\solr-core\test\J0\.\org.apache.solr.cloud.BasicDistributedZkTest-1351547277005\jetty4\index forceNew:false
[junit4:junit4]   2> 11245 T1815 oasc.SolrDeletionPolicy.onCommit SolrDeletionPolicy.onCommit: commits:num=1
[junit4:junit4]   2> 		commit{dir=NRTCachingDirectory(org.apache.lucene.store.MMapDirectory@C:\Users\JenkinsSlave\workspace\Lucene-Solr-trunk-Windows\solr\build\solr-core\test\J0\org.apache.solr.cloud.BasicDistributedZkTest-1351547277005\jetty4\index lockFactory=org.apache.lucene.store.NativeFSLockFactory@7cf5b93e; maxCacheMB=48.0 maxMergeSizeMB=4.0),segFN=segments_1,generation=1,filenames=[segments_1]
[junit4:junit4]   2> 11245 T1815 oasc.SolrDeletionPolicy.updateCommits newest commit = 1[segments_1]
[junit4:junit4]   2> 11248 T1815 oasc.CachingDirectoryFactory.close Releasing directory:C:\Users\JenkinsSlave\workspace\Lucene-Solr-trunk-Windows\solr\build\solr-core\test\J0\.\org.apache.solr.cloud.BasicDistributedZkTest-1351547277005\jetty4\index
[junit4:junit4]   2> 11249 T1815 oasc.SolrCore.initWriters created xml: solr.XMLResponseWriter
[junit4:junit4]   2> 11253 T1815 oasup.UpdateRequestProcessorChain.init inserting DistributedUpdateProcessorFactory into updateRequestProcessorChain "dedupe"
[junit4:junit4]   2> 11253 T1815 oasup.UpdateRequestProcessorChain.init inserting DistributedUpdateProcessorFactory into updateRequestProcessorChain "dedupe-allfields"
[junit4:junit4]   2> 11254 T1815 oasup.UpdateRequestProcessorChain.init inserting DistributedUpdateProcessorFactory into updateRequestProcessorChain "stored_sig"
[junit4:junit4]   2> 11255 T1815 oasup.UpdateRequestProcessorChain.init inserting DistributedUpdateProcessorFactory into updateRequestProcessorChain "uniq-fields"
[junit4:junit4]   2> 11256 T1815 oasup.UpdateRequestProcessorChain.init inserting DistributedUpdateProcessorFactory into updateRequestProcessorChain "distrib-dup-test-chain-implicit"
[junit4:junit4]   2> 11257 T1815 oasc.RequestHandlers.initHandlersFromConfig adding lazy requestHandler: solr.ReplicationHandler
[junit4:junit4]   2> 11258 T1815 oasc.RequestHandlers.initHandlersFromConfig created /replication: solr.ReplicationHandler
[junit4:junit4]   2> 11260 T1815 oasc.RequestHandlers.initHandlersFromConfig created standard: solr.StandardRequestHandler
[junit4:junit4]   2> 11261 T1815 oasc.RequestHandlers.initHandlersFromConfig created /get: solr.RealTimeGetHandler
[junit4:junit4]   2> 11262 T1815 oasc.RequestHandlers.initHandlersFromConfig created dismax: solr.SearchHandler
[junit4:junit4]   2> 11262 T1815 oasc.RequestHandlers.initHandlersFromConfig created mock: org.apache.solr.core.MockQuerySenderListenerReqHandler
[junit4:junit4]   2> 11262 T1815 oasc.RequestHandlers.initHandlersFromConfig created /admin/: org.apache.solr.handler.admin.AdminHandlers
[junit4:junit4]   2> 11263 T1815 oasc.RequestHandlers.initHandlersFromConfig created defaults: solr.StandardRequestHandler
[junit4:junit4]   2> 11263 T1815 oasc.RequestHandlers.initHandlersFromConfig adding lazy requestHandler: solr.StandardRequestHandler
[junit4:junit4]   2> 11264 T1815 oasc.RequestHandlers.initHandlersFromConfig created lazy: solr.StandardRequestHandler
[junit4:junit4]   2> 11264 T1815 oasc.RequestHandlers.initHandlersFromConfig created /update: solr.UpdateRequestHandler
[junit4:junit4]   2> 11265 T1815 oasc.RequestHandlers.initHandlersFromConfig created /terms: org.apache.solr.handler.component.SearchHandler
[junit4:junit4]   2> 11265 T1815 oasc.RequestHandlers.initHandlersFromConfig created spellCheckCompRH: org.apache.solr.handler.component.SearchHandler
[junit4:junit4]   2> 11266 T1815 oasc.RequestHandlers.initHandlersFromConfig created spellCheckCompRH_Direct: org.apache.solr.handler.component.SearchHandler
[junit4:junit4]   2> 11266 T1815 oasc.RequestHandlers.initHandlersFromConfig created spellCheckWithWordbreak: org.apache.solr.handler.component.SearchHandler
[junit4:junit4]   2> 11268 T1815 oasc.RequestHandlers.initHandlersFromConfig created spellCheckWithWordbreak_Direct: org.apache.solr.handler.component.SearchHandler
[junit4:junit4]   2> 11268 T1815 oasc.RequestHandlers.initHandlersFromConfig created spellCheckCompRH1: org.apache.solr.handler.component.SearchHandler
[junit4:junit4]   2> 11268 T1815 oasc.RequestHandlers.initHandlersFromConfig created tvrh: org.apache.solr.handler.component.SearchHandler
[junit4:junit4]   2> 11269 T1815 oasc.RequestHandlers.initHandlersFromConfig created /mlt: solr.MoreLikeThisHandler
[junit4:junit4]   2> 11269 T1815 oasc.RequestHandlers.initHandlersFromConfig created /debug/dump: solr.DumpRequestHandler
[junit4:junit4]   2> 11277 T1815 oashl.XMLLoader.init xsltCacheLifetimeSeconds=60
[junit4:junit4]   2> 11284 T1815 oasc.SolrCore.initDeprecatedSupport WARNING solrconfig.xml uses deprecated <admin/gettableFiles>, Please update your config to use the ShowFileRequestHandler.
[junit4:junit4]   2> 11285 T1815 oasc.SolrCore.initDeprecatedSupport WARNING adding ShowFileRequestHandler with hidden files: [SCHEMA.XML, OLD_SYNONYMS.TXT, STOPWORDS.TXT, PROTWORDS.TXT, OPEN-EXCHANGE-RATES.JSON, SYNONYMS.TXT, CURRENCY.XML, MAPPING-ISOLATIN1ACCENT.TXT]
[junit4:junit4]   2> 11288 T1815 oasc.CachingDirectoryFactory.close Releasing directory:C:\Users\JenkinsSlave\workspace\Lucene-Solr-trunk-Windows\solr\build\solr-core\test\J0\.\org.apache.solr.cloud.BasicDistributedZkTest-1351547277005\jetty4
[junit4:junit4]   2> 11290 T1815 oass.SolrIndexSearcher.<init> Opening Searcher@75b039 main
[junit4:junit4]   2> 11293 T1815 oasu.CommitTracker.<init> Hard AutoCommit: disabled
[junit4:junit4]   2> 11293 T1815 oasu.CommitTracker.<init> Soft AutoCommit: disabled
[junit4:junit4]   2> 11293 T1815 oashc.SpellCheckComponent.inform Initializing spell checkers
[junit4:junit4]   2> 11305 T1815 oass.DirectSolrSpellChecker.init init: {name=direct,classname=DirectSolrSpellChecker,field=lowerfilt,minQueryLength=3}
[junit4:junit4]   2> 11368 T1890 oasc.SolrCore.registerSearcher [collection1] Registered new searcher Searcher@75b039 main{StandardDirectoryReader(segments_1:1)}
[junit4:junit4]   2> 11371 T1815 oasc.ZkController.publish numShards not found on descriptor - reading it from system property
[junit4:junit4]   2> 11685 T1836 oascc.ZkStateReader.updateClusterState Updating cloud state from ZooKeeper... 
[junit4:junit4]   2> 11687 T1836 oasc.Overseer$ClusterStateUpdater.updateState Update state numShards=2 message={
[junit4:junit4]   2> 	  "operation":"state",
[junit4:junit4]   2> 	  "numShards":"2",
[junit4:junit4]   2> 	  "shard":null,
[junit4:junit4]   2> 	  "roles":null,
[junit4:junit4]   2> 	  "state":"down",
[junit4:junit4]   2> 	  "core":"collection1",
[junit4:junit4]   2> 	  "collection":"collection1",
[junit4:junit4]   2> 	  "node_name":"127.0.0.1:52669_solr",
[junit4:junit4]   2> 	  "base_url":"http://127.0.0.1:52669/solr"}
[junit4:junit4]   2> 11703 T1863 oascc.ZkStateReader$2.process A cluster state change has occurred - updating... (5)
[junit4:junit4]   2> 11703 T1840 oascc.ZkStateReader$2.process A cluster state change has occurred - updating... (5)
[junit4:junit4]   2> 11704 T1835 oascc.ZkStateReader$2.process A cluster state change has occurred - updating... (5)
[junit4:junit4]   2> 11706 T1851 oascc.ZkStateReader$2.process A cluster state change has occurred - updating... (5)
[junit4:junit4]   2> 11706 T1875 oascc.ZkStateReader$2.process A cluster state change has occurred - updating... (5)
[junit4:junit4]   2> 11706 T1889 oascc.ZkStateReader$2.process A cluster state change has occurred - updating... (5)
[junit4:junit4]   2> 11959 T1815 oasc.CoreContainer.register registering core: collection1
[junit4:junit4]   2> 11959 T1815 oasc.ZkController.register Register shard - core:collection1 address:http://127.0.0.1:52669/solr shardId:shard2
[junit4:junit4]   2> 11969 T1815 oasc.ZkController.register We are http://127.0.0.1:52669/solr/collection1/ and leader is http://127.0.0.1:52655/solr/collection1/
[junit4:junit4]   2> 11969 T1815 oasc.ZkController.register No LogReplay needed for core=collection1 baseURL=http://127.0.0.1:52669/solr
[junit4:junit4]   2> 11969 T1815 oasc.ZkController.checkRecovery Core needs to recover:collection1
[junit4:junit4]   2> 11971 T1815 oasu.DefaultSolrCoreState.doRecovery Running recovery - first canceling any ongoing recovery
[junit4:junit4]   2> ASYNC  NEW_CORE C152 name=collection1 org.apache.solr.core.SolrCore@3f22f41e url=http://127.0.0.1:52669/solr/collection1 node=127.0.0.1:52669_solr
[junit4:junit4]   2> 11972 T1891 C152 P52669 oasc.RecoveryStrategy.run Starting recovery process.  core=collection1 recoveringAfterStartup=true
[junit4:junit4]   2> 11975 T1891 C152 P52669 oasc.RecoveryStrategy.doRecovery ###### startupVersions=[]
[junit4:junit4]   2> 11975 T1815 oascc.ZkStateReader.updateClusterState Updating cloud state from ZooKeeper... 
[junit4:junit4]   2> 11975 T1891 C152 P52669 oasc.ZkController.publish numShards not found on descriptor - reading it from system property
[junit4:junit4]   2> 11977 T1815 oass.SolrDispatchFilter.init user.dir=C:\Users\JenkinsSlave\workspace\Lucene-Solr-trunk-Windows\solr\build\solr-core\test\J0
[junit4:junit4]   2> 11978 T1815 oass.SolrDispatchFilter.init SolrDispatchFilter.init() done
[junit4:junit4]   2> 11979 T1815 oascsi.HttpClientUtil.createClient Creating new http client, config:maxConnections=128&maxConnectionsPerHost=32&followRedirects=false
[junit4:junit4]   2> 11982 T1891 C152 P52669 oasc.RecoveryStrategy.doRecovery Attempting to PeerSync from http://127.0.0.1:52655/solr/collection1/ core=collection1 - recoveringAfterStartup=true
[junit4:junit4]   2> 11982 T1891 C152 P52669 oasu.PeerSync.sync PeerSync: core=collection1 url=http://127.0.0.1:52669/solr START replicas=[http://127.0.0.1:52655/solr/collection1/] nUpdates=100
[junit4:junit4]   2> 11984 T1891 C152 P52669 oasu.PeerSync.sync WARNING no frame of reference to tell of we've missed updates
[junit4:junit4]   2> 11984 T1891 C152 P52669 oasc.RecoveryStrategy.doRecovery PeerSync Recovery was not successful - trying replication. core=collection1
[junit4:junit4]   2> 11985 T1891 C152 P52669 oasc.RecoveryStrategy.doRecovery Starting Replication Recovery. core=collection1
[junit4:junit4]   2> 11985 T1891 C152 P52669 oascsi.HttpClientUtil.createClient Creating new http client, config:maxConnections=128&maxConnectionsPerHost=32&followRedirects=false
[junit4:junit4]   2> 12003 T1815 oascc.ZkStateReader.updateClusterState Updating cloud state from ZooKeeper... 
[junit4:junit4]   2> 12006 T1815 oasc.AbstractDistribZkTestBase.waitForRecoveriesToFinish Wait for recoveries to finish - collection: collection1 failOnTimeout:true timeout (sec):180
[junit4:junit4]   2> 12007 T1815 oascc.ZkStateReader.updateClusterState Updating cloud state from ZooKeeper... 
[junit4:junit4]   2> ASYNC  NEW_CORE C153 name=collection1 org.apache.solr.core.SolrCore@38d73fcc url=http://127.0.0.1:52655/solr/collection1 node=127.0.0.1:52655_solr
[junit4:junit4]   2> 12012 T1858 C153 P52655 REQ /get {distrib=false&qt=/get&wt=javabin&version=2&getVersions=100} status=0 QTime=0 
[junit4:junit4]   2> 12304 T1836 oascc.ZkStateReader.updateClusterState Updating cloud state from ZooKeeper... 
[junit4:junit4]   2> 12306 T1836 oasc.Overseer$ClusterStateUpdater.updateState Update state numShards=2 message={
[junit4:junit4]   2> 	  "operation":"state",
[junit4:junit4]   2> 	  "numShards":"2",
[junit4:junit4]   2> 	  "shard":"shard2",
[junit4:junit4]   2> 	  "roles":null,
[junit4:junit4]   2> 	  "state":"recovering",
[junit4:junit4]   2> 	  "core":"collection1",
[junit4:junit4]   2> 	  "collection":"collection1",
[junit4:junit4]   2> 	  "node_name":"127.0.0.1:52669_solr",
[junit4:junit4]   2> 	  "base_url":"http://127.0.0.1:52669/solr"}
[junit4:junit4]   2> 12316 T1863 oascc.ZkStateReader$2.process A cluster state change has occurred - updating... (5)
[junit4:junit4]   2> 12316 T1840 oascc.ZkStateReader$2.process A cluster state change has occurred - updating... (5)
[junit4:junit4]   2> 12317 T1835 oascc.ZkStateReader$2.process A cluster state change has occurred - updating... (5)
[junit4:junit4]   2> 12317 T1851 oascc.ZkStateReader$2.process A cluster state change has occurred - updating... (5)
[junit4:junit4]   2> 12317 T1889 oascc.ZkStateReader$2.process A cluster state change has occurred - updating... (5)
[junit4:junit4]   2> 12317 T1875 oascc.ZkStateReader$2.process A cluster state change has occurred - updating... (5)
[junit4:junit4]   2> 13108 T1815 oascc.ZkStateReader.updateClusterState Updating cloud state from ZooKeeper... 
[junit4:junit4]   2>  C150_STATE=coll:collection1 core:collection1 props:{shard=shard1, roles=null, state=recovering, core=collection1, collection=collection1, node_name=127.0.0.1:52661_solr, base_url=http://127.0.0.1:52661/solr}
[junit4:junit4]   2> 13221 T1877 C150 P52661 oasc.RecoveryStrategy.doRecovery Begin buffering updates. core=collection1
[junit4:junit4]   2> 13221 T1877 C150 P52661 oasu.UpdateLog.bufferUpdates Starting to buffer updates. FSUpdateLog{state=ACTIVE, tlog=null}
[junit4:junit4]   2> 13221 T1877 C150 P52661 oasc.RecoveryStrategy.replicate Attempting to replicate from http://127.0.0.1:52649/solr/collection1/. core=collection1
[junit4:junit4]   2> 13221 T1877 C150 P52661 oascsi.HttpClientUtil.createClient Creating new http client, config:maxConnections=128&maxConnectionsPerHost=32&followRedirects=false
[junit4:junit4]   2> 13231 T1844 C151 P52649 oasu.DirectUpdateHandler2.commit start commit{flags=0,_version_=0,optimize=false,openSearcher=false,waitSearcher=true,expungeDeletes=false,softCommit=false}
[junit4:junit4]   2> 13234 T1844 C151 P52649 oasc.CachingDirectoryFactory.close Releasing directory:C:\Users\JenkinsSlave\workspace\Lucene-Solr-trunk-Windows\solr\build\solr-core\test\J0\.\org.apache.solr.cloud.BasicDistributedZkTest-1351547277005\jetty1
[junit4:junit4]   2> 13241 T1844 C151 P52649 oasc.SolrDeletionPolicy.onInit SolrDeletionPolicy.onInit: commits:num=1
[junit4:junit4]   2> 		commit{dir=NRTCachingDirectory(org.apache.lucene.store.MMapDirectory@C:\Users\JenkinsSlave\workspace\Lucene-Solr-trunk-Windows\solr\build\solr-core\test\J0\org.apache.solr.cloud.BasicDistributedZkTest-1351547277005\jetty1\index lockFactory=org.apache.lucene.store.NativeFSLockFactory@7f7f2e13; maxCacheMB=48.0 maxMergeSizeMB=4.0),segFN=segments_1,generation=1,filenames=[segments_1]
[junit4:junit4]   2> 13242 T1844 C151 P52649 oasc.SolrDeletionPolicy.updateCommits newest commit = 1[segments_1]
[junit4:junit4]   2> 13242 T1844 C151 P52649 oasc.CachingDirectoryFactory.close Releasing directory:C:\Users\JenkinsSlave\workspace\Lucene-Solr-trunk-Windows\solr\build\solr-core\test\J0\.\org.apache.solr.cloud.BasicDistributedZkTest-1351547277005\jetty1
[junit4:junit4]   2> 13243 T1844 C151 P52649 oass.SolrIndexSearcher.<init> Opening Searcher@665f8c19 realtime
[junit4:junit4]   2> 13243 T1844 C151 P52649 oasu.DirectUpdateHandler2.commit end_commit_flush
[junit4:junit4]   2> 13243 T1844 C151 P52649 /update {waitSearcher=true&openSearcher=false&commit=true&commit_end_point=true&wt=javabin&softCommit=false&version=2} {commit=} 0 12
[junit4:junit4]   2> 13244 T1877 C150 P52661 oash.ReplicationHandler.inform Commits will be reserved for  10000
[junit4:junit4]   2> 13244 T1877 C150 P52661 oash.SnapPuller.<init>  No value set for 'pollInterval'. Timer Task not started.
[junit4:junit4]   2> 13247 T1847 C151 P52649 oash.ReplicationHandler.inform Commits will be reserved for  10000
[junit4:junit4]   2> 13247 T1847 C151 P52649 REQ /replication {command=indexversion&wt=javabin&qt=/replication&version=2} status=0 QTime=1 
[junit4:junit4]   2> 13248 T1877 C150 P52661 oasc.CachingDirectoryFactory.close Releasing directory:C:\Users\JenkinsSlave\workspace\Lucene-Solr-trunk-Windows\solr\build\solr-core\test\J0\.\org.apache.solr.cloud.BasicDistributedZkTest-1351547277005\jetty3
[junit4:junit4]   2> 13254 T1877 C150 P52661 oasc.SolrDeletionPolicy.onInit SolrDeletionPolicy.onInit: commits:num=1
[junit4:junit4]   2> 		commit{dir=NRTCachingDirectory(org.apache.lucene.store.MMapDirectory@C:\Users\JenkinsSlave\workspace\Lucene-Solr-trunk-Windows\solr\build\solr-core\test\J0\org.apache.solr.cloud.BasicDistributedZkTest-1351547277005\jetty3\index lockFactory=org.apache.lucene.store.NativeFSLockFactory@5e0cabd4; maxCacheMB=48.0 maxMergeSizeMB=4.0),segFN=segments_1,generation=1,filenames=[segments_1]
[junit4:junit4]   2> 13255 T1877 C150 P52661 oasc.SolrDeletionPolicy.updateCommits newest commit = 1[segments_1]
[junit4:junit4]   2> 13255 T1877 C150 P52661 oasu.DirectUpdateHandler2.commit start commit{flags=0,_version_=0,optimize=false,openSearcher=true,waitSearcher=true,expungeDeletes=false,softCommit=false}
[junit4:junit4]   2> 13266 T1877 C150 P52661 oasc.SolrDeletionPolicy.onCommit SolrDeletionPolicy.onCommit: commits:num=2
[junit4:junit4]   2> 		commit{dir=NRTCachingDirectory(org.apache.lucene.store.MMapDirectory@C:\Users\JenkinsSlave\workspace\Lucene-Solr-trunk-Windows\solr\build\solr-core\test\J0\org.apache.solr.cloud.BasicDistributedZkTest-1351547277005\jetty3\index lockFactory=org.apache.lucene.store.NativeFSLockFactory@5e0cabd4; maxCacheMB=48.0 maxMergeSizeMB=4.0),segFN=segments_1,generation=1,filenames=[segments_1]
[junit4:junit4]   2> 		commit{dir=NRTCachingDirectory(org.apache.lucene.store.MMapDirectory@C:\Users\JenkinsSlave\workspace\Lucene-Solr-trunk-Windows\solr\build\solr-core\test\J0\org.apache.solr.cloud.BasicDistributedZkTest-1351547277005\jetty3\index lockFactory=org.apache.lucene.store.NativeFSLockFactory@5e0cabd4; maxCacheMB=48.0 maxMergeSizeMB=4.0),segFN=segments_2,generation=2,filenames=[segments_2]
[junit4:junit4]   2> 13267 T1877 C150 P52661 oasc.SolrDeletionPolicy.updateCommits newest commit = 2[segments_2]
[junit4:junit4]   2> 13268 T1877 C150 P52661 oasc.CachingDirectoryFactory.close Releasing directory:C:\Users\JenkinsSlave\workspace\Lucene-Solr-trunk-Windows\solr\build\solr-core\test\J0\.\org.apache.solr.cloud.BasicDistributedZkTest-1351547277005\jetty3
[junit4:junit4]   2> 13273 T1877 C150 P52661 oass.SolrIndexSearcher.<init> Opening Searcher@37a1ffa3 main
[junit4:junit4]   2> 13273 T1877 C150 P52661 oasu.DirectUpdateHandler2.commit end_commit_flush
[junit4:junit4]   2> 13274 T1876 oasc.SolrCore.registerSearcher [collection1] Registered new searcher Searcher@37a1ffa3 main{StandardDirectoryReader(segments_2:2)}
[junit4:junit4]   2> 13274 T1876 oasc.CachingDirectoryFactory.close Releasing directory:C:\Users\JenkinsSlave\workspace\Lucene-Solr-trunk-Windows\solr\build\solr-core\test\J0\.\org.apache.solr.cloud.BasicDistributedZkTest-1351547277005\jetty3\index
[junit4:junit4]   2> 13275 T1877 C150 P52661 oasc.RecoveryStrategy.replay No replay needed. core=collection1
[junit4:junit4]   2> 13275 T1877 C150 P52661 oasc.RecoveryStrategy.doRecovery Replication Recovery was successful - registering as Active. core=collection1
[junit4:junit4]   2> 13275 T1877 C150 P52661 oasc.ZkController.publish numShards not found on descriptor - reading it from system property
[junit4:junit4]   2> 13279 T1877 C150 P52661 oasc.RecoveryStrategy.doRecovery Finished recovery process. core=collection1
[junit4:junit4]   2> 13400 T1836 oascc.ZkStateReader.updateClusterState Updating cloud state from ZooKeeper... 
[junit4:junit4]   2> 13401 T1836 oasc.Overseer$ClusterStateUpdater.updateState Update state numShards=2 message={
[junit4:junit4]   2> 	  "operation":"state",
[junit4:junit4]   2> 	  "numShards":"2",
[junit4:junit4]   2> 	  "shard":"shard1",
[junit4:junit4]   2> 	  "roles":null,
[junit4:junit4]   2> 	  "state":"active",
[junit4:junit4]   2> 	  "core":"collection1",
[junit4:junit4]   2> 	  "collection":"collection1",
[junit4:junit4]   2> 	  "node_name":"127.0.0.1:52661_solr",
[junit4:junit4]   2> 	  "base_url":"http://127.0.0.1:52661/solr"}
[junit4:junit4]   2> 13409 T1863 oascc.ZkStateReader$2.process A cluster state change has occurred - updating... (5)
[junit4:junit4]   2> 13409 T1835 oascc.ZkStateReader$2.process A cluster state change has occurred - updating... (5)
[junit4:junit4]   2> 13409 T1840 oascc.ZkStateReader$2.process A cluster state change has occurred - updating... (5)
[junit4:junit4]   2> 13410 T1851 oascc.ZkStateReader$2.process A cluster state change has occurred - updating... (5)
[junit4:junit4]   2> 13410 T1889 oascc.ZkStateReader$2.process A cluster state change has occurred - updating... (5)
[junit4:junit4]   2> 13410 T1875 oascc.ZkStateReader$2.process A cluster state change has occurred - updating... (5)
[junit4:junit4]   2> 14161 T1815 oascc.ZkStateReader.updateClusterState Updating cloud state from ZooKeeper... 
[junit4:junit4]   2>  C152_STATE=coll:collection1 core:collection1 props:{shard=shard2, roles=null, state=recovering, core=collection1, collection=collection1, node_name=127.0.0.1:52669_solr, base_url=http://127.0.0.1:52669/solr}
[junit4:junit4]   2> 15208 T1891 C152 P52669 oasc.RecoveryStrategy.doRecovery Begin buffering updates. core=collection1
[junit4:junit4]   2> 15208 T1891 C152 P52669 oasu.UpdateLog.bufferUpdates Starting to buffer updates. FSUpdateLog{state=ACTIVE, tlog=null}
[junit4:junit4]   2> 15210 T1891 C152 P52669 oasc.RecoveryStrategy.replicate Attempting to replicate from http://127.0.0.1:52655/solr/collection1/. core=collection1
[junit4:junit4]   2> 15210 T1891 C152 P52669 oascsi.HttpClientUtil.createClient Creating new http client, config:maxConnections=128&maxConnectionsPerHost=32&followRedirects=false
[junit4:junit4]   2> 15215 T1815 oascc.ZkStateReader.updateClusterState Updating cloud state from ZooKeeper... 
[junit4:junit4]   2> 15229 T1856 C153 P52655 oasu.DirectUpdateHandler2.commit start commit{flags=0,_version_=0,optimize=false,openSearcher=false,waitSearcher=true,expungeDeletes=false,softCommit=false}
[junit4:junit4]   2> 15232 T1856 C153 P52655 oasc.CachingDirectoryFactory.close Releasing directory:C:\Users\JenkinsSlave\workspace\Lucene-Solr-trunk-Windows\solr\build\solr-core\test\J0\.\org.apache.solr.cloud.BasicDistributedZkTest-1351547277005\jetty2
[junit4:junit4]   2> 15242 T1856 C153 P52655 oasc.SolrDeletionPolicy.onInit SolrDeletionPolicy.onInit: commits:num=1
[junit4:junit4]   2> 		commit{dir=NRTCachingDirectory(org.apache.lucene.store.MMapDirectory@C:\Users\JenkinsSlave\workspace\Lucene-Solr-trunk-Windows\solr\build\solr-core\test\J0\org.apache.solr.cloud.BasicDistributedZkTest-1351547277005\jetty2\index lockFactory=org.apache.lucene.store.NativeFSLockFactory@36e1cccd; maxCacheMB=48.0 maxMergeSizeMB=4.0),segFN=segments_1,generation=1,filenames=[segments_1]
[junit4:junit4]   2> 15243 T1856 C153 P52655 oasc.SolrDeletionPolicy.updateCommits newest commit = 1[segments_1]
[junit4:junit4]   2> 15245 T1856 C153 P52655 oasc.CachingDirectoryFactory.close Releasing directory:C:\Users\JenkinsSlave\workspace\Lucene-Solr-trunk-Windows\solr\build\solr-core\test\J0\.\org.apache.solr.cloud.BasicDistributedZkTest-1351547277005\jetty2
[junit4:junit4]   2> 15245 T1856 C153 P52655 oass.SolrIndexSearcher.<init> Opening Searcher@668d9c17 realtime
[junit4:junit4]   2> 15246 T1856 C153 P52655 oasu.DirectUpdateHandler2.commit end_commit_flush
[junit4:junit4]   2> 15246 T1856 C153 P52655 /update {waitSearcher=true&openSearcher=false&commit=true&commit_end_point=true&wt=javabin&softCommit=false&version=2} {commit=} 0 17
[junit4:junit4]   2> 15249 T1891 C152 P52669 oash.ReplicationHandler.inform Commits will be reserved for  10000
[junit4:junit4]   2> 15249 T1891 C152 P52669 oash.SnapPuller.<init>  No value set for 'pollInterval'. Timer Task not started.
[junit4:junit4]   2> 15251 T1858 C153 P52655 oash.ReplicationHandler.inform Commits will be reserved for  10000
[junit4:junit4]   2> 15251 T1858 C153 P52655 REQ /replication {command=indexversion&wt=javabin&qt=/replication&version=2} status=0 QTime=0 
[junit4:junit4]   2> 15253 T1891 C152 P52669 oasc.CachingDirectoryFactory.close Releasing directory:C:\Users\JenkinsSlave\workspace\Lucene-Solr-trunk-Windows\solr\build\solr-core\test\J0\.\org.apache.solr.cloud.BasicDistributedZkTest-1351547277005\jetty4
[junit4:junit4]   2> 15259 T1891 C152 P52669 oasc.SolrDeletionPolicy.onInit SolrDeletionPolicy.onInit: commits:num=1
[junit4:junit4]   2> 		commit{dir=NRTCachingDirectory(org.apache.lucene.store.MMapDirectory@C:\Users\JenkinsSlave\workspace\Lucene-Solr-trunk-Windows\solr\build\solr-core\test\J0\org.apache.solr.cloud.BasicDistributedZkTest-1351547277005\jetty4\index lockFactory=org.apache.lucene.store.NativeFSLockFactory@7cf5b93e; maxCacheMB=48.0 maxMergeSizeMB=4.0),segFN=segments_1,generation=1,filenames=[segments_1]
[junit4:junit4]   2> 15261 T1891 C152 P52669 oasc.SolrDeletionPolicy.updateCommits newest commit = 1[segments_1]
[junit4:junit4]   2> 15262 T1891 C152 P52669 oasu.DirectUpdateHandler2.commit start commit{flags=0,_version_=0,optimize=false,openSearcher=true,waitSearcher=true,expungeDeletes=false,softCommit=false}
[junit4:junit4]   2> 15274 T1891 C152 P52669 oasc.SolrDeletionPolicy.onCommit SolrDeletionPolicy.onCommit: commits:num=2
[junit4:junit4]   2> 		commit{dir=NRTCachingDirectory(org.apache.lucene.store.MMapDirectory@C:\Users\JenkinsSlave\workspace\Lucene-Solr-trunk-Windows\solr\build\solr-core\test\J0\org.apache.solr.cloud.BasicDistributedZkTest-1351547277005\jetty4\index lockFactory=org.apache.lucene.store.NativeFSLockFactory@7cf5b93e; maxCacheMB=48.0 maxMergeSizeMB=4.0),segFN=segments_1,generation=1,filenames=[segments_1]
[junit4:junit4]   2> 		commit{dir=NRTCachingDirectory(org.apache.lucene.store.MMapDirectory@C:\Users\JenkinsSlave\workspace\Lucene-Solr-trunk-Windows\solr\build\solr-core\test\J0\org.apache.solr.cloud.BasicDistributedZkTest-1351547277005\jetty4\index lockFactory=org.apache.lucene.store.NativeFSLockFactory@7cf5b93e; maxCacheMB=48.0 maxMergeSizeMB=4.0),segFN=segments_2,generation=2,filenames=[segments_2]
[junit4:junit4]   2> 15274 T1891 C152 P52669 oasc.SolrDeletionPolicy.updateCommits newest commit = 2[segments_2]
[junit4:junit4]   2> 15275 T1891 C152 P52669 oasc.CachingDirectoryFactory.close Releasing directory:C:\Users\JenkinsSlave\workspace\Lucene-Solr-trunk-Windows\solr\build\solr-core\test\J0\.\org.apache.solr.cloud.BasicDistributedZkTest-1351547277005\jetty4
[junit4:junit4]   2> 15279 T1891 C152 P52669 oass.SolrIndexSearcher.<init> Opening Searcher@1e9f5eeb main
[junit4:junit4]   2> 15279 T1891 C152 P52669 oasu.DirectUpdateHandler2.commit end_commit_flush
[junit4:junit4]   2> 15280 T1890 oasc.SolrCore.registerSearcher [collection1] Registered new searcher Searcher@1e9f5eeb main{StandardDirectoryReader(segments_2:2)}
[junit4:junit4]   2> 15280 T1890 oasc.CachingDirectoryFactory.close Releasing directory:C:\Users\JenkinsSlave\workspace\Lucene-Solr-trunk-Windows\solr\build\solr-core\test\J0\.\org.apache.solr.cloud.BasicDistributedZkTest-1351547277005\jetty4\index
[junit4:junit4]   2> 15281 T1891 C152 P52669 oasc.RecoveryStrategy.replay No replay needed. core=collection1
[junit4:junit4]   2> 15281 T1891 C152 P52669 oasc.RecoveryStrategy.doRecovery Replication Recovery was successful - registering as Active. core=collection1
[junit4:junit4]   2> 15281 T1891 C152 P52669 oasc.ZkController.publish numShards not found on descriptor - reading it from system property
[junit4:junit4]   2> 15283 T1891 C152 P52669 oasc.RecoveryStrategy.doRecovery Finished recovery process. core=collection1
[junit4:junit4]   2> 15530 T1836 oascc.ZkStateReader.updateClusterState Updating cloud state from ZooKeeper... 
[junit4:junit4]   2> 15532 T1836 oasc.Overseer$ClusterStateUpdater.updateState Update state numShards=2 message={
[junit4:junit4]   2> 	  "operation":"state",
[junit4:junit4]   2> 	  "numShards":"2",
[junit4:junit4]   2> 	  "shard":"shard2",
[junit4:junit4]   2> 	  "roles":null,
[junit4:junit4]   2> 	  "state":"active",
[junit4:junit4]   2> 	  "core":"collection1",
[junit4:junit4]   2> 	  "collection":"collection1",
[junit4:junit4]   2> 	  "node_name":"127.0.0.1:52669_solr",
[junit4:junit4]   2> 	  "base_url":"http://127.0.0.1:52669/solr"}
[junit4:junit4]   2> 15547 T1863 oascc.ZkStateReader$2.process A cluster state change has occurred - updating... (5)
[junit4:junit4]   2> 15547 T1840 oascc.ZkStateReader$2.process A cluster state change has occurred - updating... (5)
[junit4:junit4]   2> 15548 T1835 oascc.ZkStateReader$2.process A cluster state change has occurred - updating... (5)
[junit4:junit4]   2> 15549 T1851 oascc.ZkStateReader$2.process A cluster state change has occurred - updating... (5)
[junit4:junit4]   2> 15549 T1889 oascc.ZkStateReader$2.process A cluster state change has occurred - updating... (5)
[junit4:junit4]   2> 15549 T1875 oascc.ZkStateReader$2.process A cluster state change has occurred - updating... (5)
[junit4:junit4]   2> 16268 T1815 oascc.ZkStateReader.updateClusterState Updating cloud state from ZooKeeper... 
[junit4:junit4]   2> ASYNC  NEW_CORE C154 name=collection1 org.apache.solr.core.SolrCore@7d7e1d80 url=http://127.0.0.1:52640/solr/collection1 node=127.0.0.1:52640_solr
[junit4:junit4]   2> 16279 T1832 C154 P52640 oasc.CachingDirectoryFactory.close Releasing directory:C:\Users\JenkinsSlave\workspace\Lucene-Solr-trunk-Windows\solr\build\solr-core\test\J0\.\org.apache.solr.cloud.BasicDistributedZkTest-1351547277005\control\data
[junit4:junit4]   2> 16285 T1832 C154 P52640 oasc.SolrDeletionPolicy.onInit SolrDeletionPolicy.onInit: commits:num=1
[junit4:junit4]   2> 		commit{dir=NRTCachingDirectory(org.apache.lucene.store.MMapDirectory@C:\Users\JenkinsSlave\workspace\Lucene-Solr-trunk-Windows\solr\build\solr-core\test\J0\org.apache.solr.cloud.BasicDistributedZkTest-1351547277005\control\data\index lockFactory=org.apache.lucene.store.NativeFSLockFactory@2adc0e3f; maxCacheMB=48.0 maxMergeSizeMB=4.0),segFN=segments_1,generation=1,filenames=[segments_1]
[junit4:junit4]   2> 16288 T1832 C154 P52640 oasc.SolrDeletionPolicy.updateCommits newest commit = 1[segments_1]
[junit4:junit4]   2> 16290 T1832 C154 P52640 oasc.CachingDirectoryFactory.close Releasing directory:C:\Users\JenkinsSlave\workspace\Lucene-Solr-trunk-Windows\solr\build\solr-core\test\J0\.\org.apache.solr.cloud.BasicDistributedZkTest-1351547277005\control\data
[junit4:junit4]   2> 16290 T1832 C154 P52640 oass.SolrIndexSearcher.<init> Opening Searcher@66013e23 realtime
[junit4:junit4]   2> 16291 T1832 C154 P52640 /update {wt=javabin&version=2} {deleteByQuery=*:* (-1417200054599417856)} 0 13
[junit4:junit4]   2> 16296 T1859 C153 P52655 oasc.CachingDirectoryFactory.close Releasing directory:C:\Users\JenkinsSlave\workspace\Lucene-Solr-trunk-Windows\solr\build\solr-core\test\J0\.\org.apache.solr.cloud.BasicDistributedZkTest-1351547277005\jetty2
[junit4:junit4]   2> 16303 T1849 C151 P52649 oasc.CachingDirectoryFactory.close Releasing directory:C:\Users\JenkinsSlave\workspace\Lucene-Solr-trunk-Windows\solr\build\solr-core\test\J0\.\org.apache.solr.cloud.BasicDistributedZkTest-1351547277005\jetty1
[junit4:junit4]   2>  C152_STATE=coll:collection1 core:collection1 props:{shard=shard2, roles=null, state=active, core=collection1, collection=collection1, node_name=127.0.0.1:52669_solr, base_url=http://127.0.0.1:52669/solr}
[junit4:junit4]   2> 16314 T1884 C152 P52669 oasc.CachingDirectoryFactory.close Releasing directory:C:\Users\JenkinsSlave\workspace\Lucene-Solr-trunk-Windows\solr\build\solr-core\test\J0\.\org.apache.solr.cloud.BasicDistributedZkTest-1351547277005\jetty4
[junit4:junit4]   2> 16315 T1884 C152 P52669 oass.SolrIndexSearcher.<init> Opening Searcher@af85fc6 realtime
[junit4:junit4]   2> 16315 T1884 C152 P52669 REQ /update {update.distrib=FROMLEADER&_version_=-1417200054616195072&update.from=http://127.0.0.1:52655/solr/collection1/&wt=javabin&version=2} status=0 QTime=3 
[junit4:junit4]   2>  C150_STATE=coll:collection1 core:collection1 props:{shard=shard1, roles=null, state=active, core=collection1, collection=collection1, node_name=127.0.0.1:52661_solr, base_url=http://127.0.0.1:52661/solr}
[junit4:junit4]   2> 16321 T1868 C150 P52661 oasc.CachingDirectoryFactory.close Releasing directory:C:\Users\JenkinsSlave\workspace\Lucene-Solr-trunk-Windows\solr\build\solr-core\test\J0\.\org.apache.solr.cloud.BasicDistributedZkTest-1351547277005\jetty3
[junit4:junit4]   2> 16322 T1868 C150 P52661 oass.SolrIndexSearcher.<init> Opening Searcher@7ca45a07 realtime
[junit4:junit4]   2> 16322 T1868 C150 P52661 REQ /update {update.distrib=FROMLEADER&_version_=-1417200054622486528&update.from=http://127.0.0.1:52649/solr/collection1/&wt=javabin&version=2} status=0 QTime=4 
[junit4:junit4]   2> 16322 T1849 C151 P52649 REQ /update {update.distrib=TOLEADER&wt=javabin&version=2} status=0 QTime=23 
[junit4:junit4]   2> 16323 T1859 C153 P52655 /update {wt=javabin&version=2} {deleteByQuery=*:* (-1417200054616195072)} 0 29
[junit4:junit4]   2> 16330 T1833 C154 P52640 /update {wt=javabin&version=2} {add=[1 (1417200054650798080)]} 0 3
[junit4:junit4]   2> 16343 T1869 C150 P52661 REQ /update {distrib.from=http://127.0.0.1:52649/solr/collection1/&update.distrib=FROMLEADER&wt=javabin&version=2} status=0 QTime=4 
[junit4:junit4]   2> 16345 T1846 C151 P52649 /update {wt=javabin&version=2} {add=[1 (1417200054658138112)]} 0 11
[junit4:junit4]   2> 16349 T1828 C154 P52640 /update {wt=javabin&version=2} {add=[2 (1417200054672818176)]} 0 2
[junit4:junit4]   2> 16361 T1885 C152 P52669 REQ /update {distrib.from=http://127.0.0.1:52655/solr/collection1/&update.distrib=FROMLEADER&wt=javabin&version=2} status=0 QTime=2 
[junit4:junit4]   2> 16362 T1856 C153 P52655 REQ /update {distrib.from=http://127.0.0.1:52649/solr/collection1/&update.distrib=TOLEADER&wt=javabin&version=2} status=0 QTime=8 
[junit4:junit4]   2> 16363 T1844 C151 P52649 /update {wt=javabin&version=2} {add=[2]} 0 11
[junit4:junit4]   2> 16366 T1829 C154 P52640 /update {wt=javabin&version=2} {add=[3 (1417200054690643968)]} 0 1
[junit4:junit4]   2> 16376 T1886 C152 P52669 REQ /update {distrib.from=http://127.0.0.1:52655/solr/collection1/&update.distrib=FROMLEADER&wt=javabin&version=2} status=0 QTime=1 
[junit4:junit4]   2> 16377 T1857 C153 P52655 REQ /update {distrib.from=http://127.0.0.1:52649/solr/collection1/&update.distrib=TOLEADER&wt=javabin&version=2} status=0 QTime=5 
[junit4:junit4]   2> 16377 T1845 C151 P52649 /update {wt=javabin&version=2} {add=[3]} 0 8
[junit4:junit4]   2> 16381 T1830 C154 P52640 /update {wt=javabin&version=2} {add=[4 (1417200054706372608)]} 0 1
[junit4:junit4]   2> 16389 T1870 C150 P52661 REQ /update {distrib.from=http://127.0.0.1:52649/solr/collection1/&update.distrib=FROMLEADER&wt=javabin&version=2} status=0 QTime=1 
[junit4:junit4]   2> 16390 T1847 C151 P52649 /update {wt=javabin&version=2} {add=[4 (1417200054710566912)]} 0 6
[junit4:junit4]   2> 16394 T1831 C154 P52640 /update {wt=javabin&version=2} {add=[5 (1417200054720004096)]} 0 1
[junit4:junit4]   2> 16404 T1887 C152 P52669 REQ /update {distrib.from=http://127.0.0.1:52655/solr/collection1/&update.distrib=FROMLEADER&wt=javabin&version=2} status=0 QTime=1 
[junit4:junit4]   2> 16405 T1858 C153 P52655 REQ /update {distrib.from=http://127.0.0.1:52649/solr/collection1/&update.distrib=TOLEADER&wt=javabin&version=2} status=0 QTime=5 
[junit4:junit4]   2> 16406 T1848 C151 P52649 /update {wt=javabin&version=2} {add=[5]} 0 9
[junit4:junit4]   2> 16411 T1832 C154 P52640 /update {wt=javabin&version=2} {add=[6 (1417200054737829888)]} 0 1
[junit4:junit4]   2> 16419 T1882 C152 P52669 REQ /update {distrib.from=http://127.0.0.1:52655/solr/collection1/&update.distrib=FROMLEADER&wt=javabin&version=2} status=0 QTime=0 
[junit4:junit4]   2> 16420 T1860 C153 P52655 REQ /update {distrib.from=http://127.0.0.1:52649/solr/collection1/&update.distrib=TOLEADER&wt=javabin&version=2} status=0 QTime=4 
[junit4:junit4]   2> 16421 T1849 C151 P52649 /update {wt=javabin&version=2} {add=[6]} 0 7
[junit4:junit4]   2> 16424 T1833 C154 P52640 /update {wt=javabin&version=2} {add=[7 (1417200054751461376)]} 0 1
[junit4:junit4]   2> 16431 T1883 C152 P52669 REQ /update {distrib.from=http://127.0.0.1:52655/solr/collection1/&update.distrib=FROMLEADER&wt=javabin&version=2} status=0 QTime=1 
[junit4:junit4]   2> 16431 T1861 C153 P52655 /update {wt=javabin&version=2} {add=[7 (1417200054755655680)]} 0 4
[junit4:junit4]   2> 16435 T1828 C154 P52640 /update {wt=javabin&version=2} {add=[8 (1417200054762995712)]} 0 1
[junit4:junit4]   2> 16441 T1872 C150 P52661 REQ /update {distrib.from=http://127.0.0.1:52649/solr/collection1/&update.distrib=FROMLEADER&wt=javabin&version=2} status=0 QTime=1 
[junit4:junit4]   2> 16442 T1846 C151 P52649 /update {wt=javabin&version=2} {add=[8 (1417200054766141440)]} 0 5
[junit4:junit4]   2> 16446 T1829 C154 P52640 /update {wt=javabin&version=2} {add=[9 (1417200054774530048)]} 0 1
[junit4:junit4]   2> 16457 T1884 C152 P52669 REQ /update {distrib.from=http://127.0.0.1:52655/solr/collection1/&update.distrib=FROMLEADER&wt=javabin&version=2} status=0 QTime=1 
[junit4:junit4]   2> 16457 T1859 C153 P52655 REQ /update {distrib.from=http://127.0.0.1:52649/solr/collection1/&update.distrib=TOLEADER&wt=javabin&version=2} status=0 QTime=4 
[junit4:junit4]   2> 16458 T1844 C151 P52649 /update {wt=javabin&version=2} {add=[9]} 0 8
[junit4:junit4]   2> 16468 T1830 C154 P52640 /update {wt=javabin&version=2} {add=[10 (1417200054790258688)]} 0 8
[junit4:junit4]   2> 16478 T1873 C150 P52661 REQ /update {distrib.from=http://127.0.0.1:52649/solr/collection1/&update.distrib=FROMLEADER&wt=javabin&version=2} status=0 QTime=1 
[junit4:junit4]   2> 16479 T1845 C151 P52649 REQ /update {distrib.from=http://127.0.0.1:52655/solr/collection1/&update.distrib=TOLEADER&wt=javabin&version=2} status=0 QTime=5 
[junit4:junit4]   2> 16480 T1856 C153 P52655 /update {wt=javabin&version=2} {add=[10]} 0 9
[junit4:junit4]   2> 16486 T1831 C154 P52640 /update {wt=javabin&version=2} {add=[11 (1417200054813327360)]} 

[...truncated too long message...]

ch.randomizedtesting.RandomizedContext.closeAtEnd(RandomizedContext.java:150)
[junit4:junit4]    > 	at org.apache.lucene.util.LuceneTestCase.closeAfterSuite(LuceneTestCase.java:514)
[junit4:junit4]    > 	at org.apache.lucene.util.LuceneTestCase.wrapDirectory(LuceneTestCase.java:958)
[junit4:junit4]    > 	at org.apache.lucene.util.LuceneTestCase.newDirectory(LuceneTestCase.java:872)
[junit4:junit4]    > 	at org.apache.lucene.util.LuceneTestCase.newDirectory(LuceneTestCase.java:864)
[junit4:junit4]    > 	at org.apache.solr.core.MockDirectoryFactory.create(MockDirectoryFactory.java:33)
[junit4:junit4]    > 	at org.apache.solr.core.CachingDirectoryFactory.get(CachingDirectoryFactory.java:232)
[junit4:junit4]    > 	at org.apache.solr.core.CachingDirectoryFactory.get(CachingDirectoryFactory.java:192)
[junit4:junit4]    > 	at org.apache.solr.handler.ReplicationHandler.getIndexSize(ReplicationHandler.java:470)
[junit4:junit4]    > 	at org.apache.solr.handler.ReplicationHandler.getStatistics(ReplicationHandler.java:516)
[junit4:junit4]    > 	at org.apache.solr.core.RequestHandlers$LazyRequestHandlerWrapper.getStatistics(RequestHandlers.java:310)
[junit4:junit4]    > 	at org.apache.solr.core.JmxMonitoredMap$SolrDynamicMBean.getMBeanInfo(JmxMonitoredMap.java:231)
[junit4:junit4]    > 	at com.sun.jmx.interceptor.DefaultMBeanServerInterceptor.getClassName(DefaultMBeanServerInterceptor.java:1780)
[junit4:junit4]    > 	at com.sun.jmx.interceptor.DefaultMBeanServerInterceptor.safeGetClassName(DefaultMBeanServerInterceptor.java:1622)
[junit4:junit4]    > 	at com.sun.jmx.interceptor.DefaultMBeanServerInterceptor.checkMBeanPermission(DefaultMBeanServerInterceptor.java:1789)
[junit4:junit4]    > 	at com.sun.jmx.interceptor.DefaultMBeanServerInterceptor.getAttribute(DefaultMBeanServerInterceptor.java:663)
[junit4:junit4]    > 	at com.sun.jmx.mbeanserver.JmxMBeanServer.getAttribute(JmxMBeanServer.java:638)
[junit4:junit4]    > 	at org.apache.solr.core.JmxMonitoredMap.unregister(JmxMonitoredMap.java:174)
[junit4:junit4]    > 	at org.apache.solr.core.JmxMonitoredMap.clear(JmxMonitoredMap.java:116)
[junit4:junit4]    > 	at org.apache.solr.core.SolrCore.close(SolrCore.java:951)
[junit4:junit4]    > 	at org.apache.solr.core.CoreContainer.shutdown(CoreContainer.java:589)
[junit4:junit4]    > 	at org.apache.solr.servlet.SolrDispatchFilter.destroy(SolrDispatchFilter.java:130)
[junit4:junit4]    > 	at org.apache.solr.cloud.ChaosMonkey.stopJettySolrRunner(ChaosMonkey.java:199)
[junit4:junit4]    > 	at org.apache.solr.cloud.ChaosMonkey.stop(ChaosMonkey.java:506)
[junit4:junit4]    > 	at org.apache.solr.cloud.AbstractFullDistribZkTestBase.destroyServers(AbstractFullDistribZkTestBase.java:1185)
[junit4:junit4]    > 	at org.apache.solr.BaseDistributedSearchTestCase.testDistribSearch(BaseDistributedSearchTestCase.java:696)
[junit4:junit4]    > 	at sun.reflect.NativeMethodAccessorImpl.invoke0(Native Method)
[junit4:junit4]    > 	at sun.reflect.NativeMethodAccessorImpl.invoke(NativeMethodAccessorImpl.java:39)
[junit4:junit4]    > 	at sun.reflect.DelegatingMethodAccessorImpl.invoke(DelegatingMethodAccessorImpl.java:25)
[junit4:junit4]    > 	at java.lang.reflect.Method.invoke(Method.java:597)
[junit4:junit4]    > 	at com.carrotsearch.randomizedtesting.RandomizedRunner.invoke(RandomizedRunner.java:1559)
[junit4:junit4]    > 	at com.carrotsearch.randomizedtesting.RandomizedRunner.access$600(RandomizedRunner.java:79)
[junit4:junit4]    > 	at com.carrotsearch.randomizedtesting.RandomizedRunner$6.evaluate(RandomizedRunner.java:737)
[junit4:junit4]    > 	at com.carrotsearch.randomizedtesting.RandomizedRunner$7.evaluate(RandomizedRunner.java:773)
[junit4:junit4]    > 	at com.carrotsearch.randomizedtesting.RandomizedRunner$8.evaluate(RandomizedRunner.java:787)
[junit4:junit4]    > 	at com.carrotsearch.randomizedtesting.rules.SystemPropertiesRestoreRule$1.evaluate(SystemPropertiesRestoreRule.java:53)
[junit4:junit4]    > 	at org.apache.lucene.util.TestRuleSetupTeardownChained$1.evaluate(TestRuleSetupTeardownChained.java:50)
[junit4:junit4]    > 	at org.apache.lucene.util.TestRuleFieldCacheSanity$1.evaluate(TestRuleFieldCacheSanity.java:51)
[junit4:junit4]    > 	at org.apache.lucene.util.AbstractBeforeAfterRule$1.evaluate(AbstractBeforeAfterRule.java:45)
[junit4:junit4]    > 	at com.carrotsearch.randomizedtesting.rules.SystemPropertiesInvariantRule$1.evaluate(SystemPropertiesInvariantRule.java:55)
[junit4:junit4]    > 	at org.apache.lucene.util.TestRuleThreadAndTestName$1.evaluate(TestRuleThreadAndTestName.java:48)
[junit4:junit4]    > 	at org.apache.lucene.util.TestRuleIgnoreAfterMaxFailures$1.evaluate(TestRuleIgnoreAfterMaxFailures.java:70)
[junit4:junit4]    > 	at org.apache.lucene.util.TestRuleMarkFailure$1.evaluate(TestRuleMarkFailure.java:48)
[junit4:junit4]    > 	at com.carrotsearch.randomizedtesting.rules.StatementAdapter.evaluate(StatementAdapter.java:36)
[junit4:junit4]    > 	at com.carrotsearch.randomizedtesting.ThreadLeakControl$StatementRunner.run(ThreadLeakControl.java:358)
[junit4:junit4]    > 	at com.carrotsearch.randomizedtesting.ThreadLeakControl.forkTimeoutingTask(ThreadLeakControl.java:782)
[junit4:junit4]    > 	at com.carrotsearch.randomizedtesting.ThreadLeakControl$3.evaluate(ThreadLeakControl.java:442)
[junit4:junit4]    > 	at com.carrotsearch.randomizedtesting.RandomizedRunner.runSingleTest(RandomizedRunner.java:746)
[junit4:junit4]    > 	at com.carrotsearch.randomizedtesting.RandomizedRunner$3.evaluate(RandomizedRunner.java:648)
[junit4:junit4]    > 	at com.carrotsearch.randomizedtesting.RandomizedRunner$4.evaluate(RandomizedRunner.java:682)
[junit4:junit4]    > 	at com.carrotsearch.randomizedtesting.RandomizedRunner$5.evaluate(RandomizedRunner.java:693)
[junit4:junit4]    > 	at com.carrotsearch.randomizedtesting.rules.StatementAdapter.evaluate(StatementAdapter.java:36)
[junit4:junit4]    > 	at com.carrotsearch.randomizedtesting.rules.SystemPropertiesRestoreRule$1.evaluate(SystemPropertiesRestoreRule.java:53)
[junit4:junit4]    > 	at org.apache.lucene.util.AbstractBeforeAfterRule$1.evaluate(AbstractBeforeAfterRule.java:45)
[junit4:junit4]    > 	at org.apache.lucene.util.TestRuleStoreClassName$1.evaluate(TestRuleStoreClassName.java:42)
[junit4:junit4]    > 	at com.carrotsearch.randomizedtesting.rules.SystemPropertiesInvariantRule$1.evaluate(SystemPropertiesInvariantRule.java:55)
[junit4:junit4]    > 	at com.carrotsearch.randomizedtesting.rules.NoShadowingOrOverridesOnMethodsRule$1.evaluate(NoShadowingOrOverridesOnMethodsRule.java:39)
[junit4:junit4]    > 	at com.carrotsearch.randomizedtesting.rules.NoShadowingOrOverridesOnMethodsRule$1.evaluate(NoShadowingOrOverridesOnMethodsRule.java:39)
[junit4:junit4]    > 	at com.carrotsearch.randomizedtesting.rules.StatementAdapter.evaluate(StatementAdapter.java:36)
[junit4:junit4]    > 	at org.apache.lucene.util.TestRuleAssertionsRequired$1.evaluate(TestRuleAssertionsRequired.java:43)
[junit4:junit4]    > 	at org.apache.lucene.util.TestRuleMarkFailure$1.evaluate(TestRuleMarkFailure.java:48)
[junit4:junit4]    > 	at org.apache.lucene.util.TestRuleIgnoreAfterMaxFailures$1.evaluate(TestRuleIgnoreAfterMaxFailures.java:70)
[junit4:junit4]    > 	at org.apache.lucene.util.TestRuleIgnoreTestSuites$1.evaluate(TestRuleIgnoreTestSuites.java:55)
[junit4:junit4]    > 	at com.carrotsearch.randomizedtesting.rules.StatementAdapter.evaluate(StatementAdapter.java:36)
[junit4:junit4]    > 	at com.carrotsearch.randomizedtesting.ThreadLeakControl$StatementRunner.run(ThreadLeakControl.java:358)
[junit4:junit4]    > 	at java.lang.Thread.run(Thread.java:662)
[junit4:junit4]    > Caused by: java.lang.AssertionError: Directory not closed: MockDirWrapper(org.apache.lucene.store.MMapDirectory@C:\Users\JenkinsSlave\workspace\Lucene-Solr-trunk-Windows\solr\build\solr-core\test\J0\index1104711057tmp lockFactory=org.apache.lucene.store.SimpleFSLockFactory@6ff31e4b)
[junit4:junit4]    > 	at org.junit.Assert.fail(Assert.java:93)
[junit4:junit4]    > 	at org.apache.lucene.util.CloseableDirectory.close(CloseableDirectory.java:47)
[junit4:junit4]    > 	at com.carrotsearch.randomizedtesting.RandomizedRunner$2$1.apply(RandomizedRunner.java:602)
[junit4:junit4]    > 	at com.carrotsearch.randomizedtesting.RandomizedRunner$2$1.apply(RandomizedRunner.java:599)
[junit4:junit4]    > 	at com.carrotsearch.randomizedtesting.RandomizedContext.closeResources(RandomizedContext.java:167)
[junit4:junit4]    > 	at com.carrotsearch.randomizedtesting.RandomizedRunner$2.afterAlways(RandomizedRunner.java:615)
[junit4:junit4]    > 	at com.carrotsearch.randomizedtesting.rules.StatementAdapter.evaluate(StatementAdapter.java:43)
[junit4:junit4]    > 	... 2 more
[junit4:junit4] Completed in 19.09s, 1 test, 2 errors <<< FAILURES!

[...truncated 358 lines...]
BUILD FAILED
C:\Users\JenkinsSlave\workspace\Lucene-Solr-trunk-Windows\build.xml:335: The following error occurred while executing this line:
C:\Users\JenkinsSlave\workspace\Lucene-Solr-trunk-Windows\build.xml:39: The following error occurred while executing this line:
C:\Users\JenkinsSlave\workspace\Lucene-Solr-trunk-Windows\solr\build.xml:178: The following error occurred while executing this line:
C:\Users\JenkinsSlave\workspace\Lucene-Solr-trunk-Windows\lucene\module-build.xml:61: The following error occurred while executing this line:
C:\Users\JenkinsSlave\workspace\Lucene-Solr-trunk-Windows\lucene\common-build.xml:1159: The following error occurred while executing this line:
C:\Users\JenkinsSlave\workspace\Lucene-Solr-trunk-Windows\lucene\common-build.xml:827: There were test failures: 232 suites, 961 tests, 3 suite-level errors, 1 failure, 12 ignored (7 assumptions)

Total time: 39 minutes 21 seconds
Build step 'Invoke Ant' marked build as failure
Archiving artifacts
Recording test results
Description set: Java: 64bit/jdk1.6.0_35 -XX:+UseSerialGC
Email was triggered for: Failure
Sending email for trigger: Failure



Mime
View raw message