lucene-dev mailing list archives

Site index · List index
Message view « Date » · « Thread »
Top « Date » · « Thread »
From Apache Jenkins Server <jenk...@builds.apache.org>
Subject [JENKINS] Lucene-Solr-Tests-4.x-java7 - Build # 510 - Failure
Date Tue, 02 Oct 2012 04:02:12 GMT
Build: https://builds.apache.org/job/Lucene-Solr-Tests-4.x-java7/510/

1 tests failed.
REGRESSION:  org.apache.solr.cloud.BasicDistributedZkTest.testDistribSearch

Error Message:
Could not find new 2 slice collection called awholynewcollection_4

Stack Trace:
java.lang.AssertionError: Could not find new 2 slice collection called awholynewcollection_4
	at __randomizedtesting.SeedInfo.seed([E953C32319CFEBBC:68B54D3B6E908B80]:0)
	at org.junit.Assert.fail(Assert.java:93)
	at org.apache.solr.cloud.BasicDistributedZkTest.checkForCollection(BasicDistributedZkTest.java:590)
	at org.apache.solr.cloud.BasicDistributedZkTest.testCollectionsAPI(BasicDistributedZkTest.java:379)
	at org.apache.solr.cloud.BasicDistributedZkTest.doTest(BasicDistributedZkTest.java:331)
	at org.apache.solr.BaseDistributedSearchTestCase.testDistribSearch(BaseDistributedSearchTestCase.java:695)
	at sun.reflect.NativeMethodAccessorImpl.invoke0(Native Method)
	at sun.reflect.NativeMethodAccessorImpl.invoke(NativeMethodAccessorImpl.java:57)
	at sun.reflect.DelegatingMethodAccessorImpl.invoke(DelegatingMethodAccessorImpl.java:43)
	at java.lang.reflect.Method.invoke(Method.java:601)
	at com.carrotsearch.randomizedtesting.RandomizedRunner.invoke(RandomizedRunner.java:1559)
	at com.carrotsearch.randomizedtesting.RandomizedRunner.access$600(RandomizedRunner.java:79)
	at com.carrotsearch.randomizedtesting.RandomizedRunner$6.evaluate(RandomizedRunner.java:737)
	at com.carrotsearch.randomizedtesting.RandomizedRunner$7.evaluate(RandomizedRunner.java:773)
	at com.carrotsearch.randomizedtesting.RandomizedRunner$8.evaluate(RandomizedRunner.java:787)
	at com.carrotsearch.randomizedtesting.rules.SystemPropertiesRestoreRule$1.evaluate(SystemPropertiesRestoreRule.java:53)
	at org.apache.lucene.util.TestRuleSetupTeardownChained$1.evaluate(TestRuleSetupTeardownChained.java:50)
	at org.apache.lucene.util.TestRuleFieldCacheSanity$1.evaluate(TestRuleFieldCacheSanity.java:51)
	at org.apache.lucene.util.AbstractBeforeAfterRule$1.evaluate(AbstractBeforeAfterRule.java:45)
	at com.carrotsearch.randomizedtesting.rules.SystemPropertiesInvariantRule$1.evaluate(SystemPropertiesInvariantRule.java:55)
	at org.apache.lucene.util.TestRuleThreadAndTestName$1.evaluate(TestRuleThreadAndTestName.java:48)
	at org.apache.lucene.util.TestRuleIgnoreAfterMaxFailures$1.evaluate(TestRuleIgnoreAfterMaxFailures.java:70)
	at org.apache.lucene.util.TestRuleMarkFailure$1.evaluate(TestRuleMarkFailure.java:48)
	at com.carrotsearch.randomizedtesting.rules.StatementAdapter.evaluate(StatementAdapter.java:36)
	at com.carrotsearch.randomizedtesting.ThreadLeakControl$StatementRunner.run(ThreadLeakControl.java:358)
	at com.carrotsearch.randomizedtesting.ThreadLeakControl.forkTimeoutingTask(ThreadLeakControl.java:782)
	at com.carrotsearch.randomizedtesting.ThreadLeakControl$3.evaluate(ThreadLeakControl.java:442)
	at com.carrotsearch.randomizedtesting.RandomizedRunner.runSingleTest(RandomizedRunner.java:746)
	at com.carrotsearch.randomizedtesting.RandomizedRunner$3.evaluate(RandomizedRunner.java:648)
	at com.carrotsearch.randomizedtesting.RandomizedRunner$4.evaluate(RandomizedRunner.java:682)
	at com.carrotsearch.randomizedtesting.RandomizedRunner$5.evaluate(RandomizedRunner.java:693)
	at com.carrotsearch.randomizedtesting.rules.StatementAdapter.evaluate(StatementAdapter.java:36)
	at com.carrotsearch.randomizedtesting.rules.SystemPropertiesRestoreRule$1.evaluate(SystemPropertiesRestoreRule.java:53)
	at org.apache.lucene.util.AbstractBeforeAfterRule$1.evaluate(AbstractBeforeAfterRule.java:45)
	at org.apache.lucene.util.TestRuleStoreClassName$1.evaluate(TestRuleStoreClassName.java:42)
	at com.carrotsearch.randomizedtesting.rules.SystemPropertiesInvariantRule$1.evaluate(SystemPropertiesInvariantRule.java:55)
	at com.carrotsearch.randomizedtesting.rules.NoShadowingOrOverridesOnMethodsRule$1.evaluate(NoShadowingOrOverridesOnMethodsRule.java:39)
	at com.carrotsearch.randomizedtesting.rules.NoShadowingOrOverridesOnMethodsRule$1.evaluate(NoShadowingOrOverridesOnMethodsRule.java:39)
	at com.carrotsearch.randomizedtesting.rules.StatementAdapter.evaluate(StatementAdapter.java:36)
	at org.apache.lucene.util.TestRuleAssertionsRequired$1.evaluate(TestRuleAssertionsRequired.java:43)
	at org.apache.lucene.util.TestRuleMarkFailure$1.evaluate(TestRuleMarkFailure.java:48)
	at org.apache.lucene.util.TestRuleIgnoreAfterMaxFailures$1.evaluate(TestRuleIgnoreAfterMaxFailures.java:70)
	at org.apache.lucene.util.TestRuleIgnoreTestSuites$1.evaluate(TestRuleIgnoreTestSuites.java:55)
	at com.carrotsearch.randomizedtesting.rules.StatementAdapter.evaluate(StatementAdapter.java:36)
	at com.carrotsearch.randomizedtesting.ThreadLeakControl$StatementRunner.run(ThreadLeakControl.java:358)
	at java.lang.Thread.run(Thread.java:722)




Build Log:
[...truncated 8837 lines...]
[junit4:junit4] Suite: org.apache.solr.cloud.BasicDistributedZkTest
[junit4:junit4]   2> 33 T760 oas.SolrTestCaseJ4.setUp ###Starting testDistribSearch
[junit4:junit4]   2> Creating dataDir: /usr/home/hudson/hudson-slave/workspace/Lucene-Solr-Tests-4.x-java7/solr/build/solr-core/test/J0/./solrtest-BasicDistributedZkTest-1349149944494
[junit4:junit4]   2> 44 T760 oasc.ZkTestServer.run STARTING ZK TEST SERVER
[junit4:junit4]   2> 183 T761 oaz.Environment.logEnv Server environment:zookeeper.version=3.3.6-1366786, built on 07/29/2012 06:22 GMT
[junit4:junit4]   2> 184 T761 oaz.Environment.logEnv Server environment:host.name=lucene.zones.apache.org
[junit4:junit4]   2> 184 T761 oaz.Environment.logEnv Server environment:java.version=1.7.0_06
[junit4:junit4]   2> 184 T761 oaz.Environment.logEnv Server environment:java.vendor=Oracle Corporation
[junit4:junit4]   2> 184 T761 oaz.Environment.logEnv Server environment:java.home=/usr/local/openjdk7/jre
[junit4:junit4]   2> 184 T761 oaz.Environment.logEnv Server environment:java.class.path=/usr/home/hudson/hudson-slave/workspace/Lucene-Solr-Tests-4.x-java7/solr/build/solr-core/classes/test:/usr/home/hudson/hudson-slave/workspace/Lucene-Solr-Tests-4.x-java7/solr/build/solr-test-framework/classes/java:/usr/home/hudson/hudson-slave/workspace/Lucene-Solr-Tests-4.x-java7/solr/build/solr-core/test-files:/usr/home/hudson/hudson-slave/workspace/Lucene-Solr-Tests-4.x-java7/lucene/build/codecs/classes/java:/usr/home/hudson/hudson-slave/workspace/Lucene-Solr-Tests-4.x-java7/lucene/build/test-framework/classes/java:/usr/home/hudson/hudson-slave/workspace/Lucene-Solr-Tests-4.x-java7/solr/build/solr-solrj/classes/java:/usr/home/hudson/hudson-slave/workspace/Lucene-Solr-Tests-4.x-java7/solr/build/solr-core/classes/java:/usr/home/hudson/hudson-slave/workspace/Lucene-Solr-Tests-4.x-java7/lucene/build/analysis/common/lucene-analyzers-common-4.1-SNAPSHOT.jar:/usr/home/hudson/hudson-slave/workspace/Lucene-Solr-Tests-4.x-java7/lucene/build/analysis/kuromoji/lucene-analyzers-kuromoji-4.1-SNAPSHOT.jar:/usr/home/hudson/hudson-slave/workspace/Lucene-Solr-Tests-4.x-java7/lucene/build/analysis/phonetic/lucene-analyzers-phonetic-4.1-SNAPSHOT.jar:/usr/home/hudson/hudson-slave/workspace/Lucene-Solr-Tests-4.x-java7/lucene/build/highlighter/lucene-highlighter-4.1-SNAPSHOT.jar:/usr/home/hudson/hudson-slave/workspace/Lucene-Solr-Tests-4.x-java7/lucene/build/memory/lucene-memory-4.1-SNAPSHOT.jar:/usr/home/hudson/hudson-slave/workspace/Lucene-Solr-Tests-4.x-java7/lucene/build/misc/lucene-misc-4.1-SNAPSHOT.jar:/usr/home/hudson/hudson-slave/workspace/Lucene-Solr-Tests-4.x-java7/lucene/build/spatial/lucene-spatial-4.1-SNAPSHOT.jar:/usr/home/hudson/hudson-slave/workspace/Lucene-Solr-Tests-4.x-java7/lucene/build/suggest/lucene-suggest-4.1-SNAPSHOT.jar:/usr/home/hudson/hudson-slave/workspace/Lucene-Solr-Tests-4.x-java7/lucene/build/grouping/lucene-grouping-4.1-SNAPSHOT.jar:/usr/home/hudson/hudson-slave/workspace/Lucene-Solr-Tests-4.x-java7/lucene/build/queries/lucene-queries-4.1-SNAPSHOT.jar:/usr/home/hudson/hudson-slave/workspace/Lucene-Solr-Tests-4.x-java7/lucene/build/queryparser/lucene-queryparser-4.1-SNAPSHOT.jar:/usr/home/hudson/hudson-slave/workspace/Lucene-Solr-Tests-4.x-java7/solr/core/lib/commons-cli-1.2.jar:/usr/home/hudson/hudson-slave/workspace/Lucene-Solr-Tests-4.x-java7/solr/core/lib/commons-codec-1.7.jar:/usr/home/hudson/hudson-slave/workspace/Lucene-Solr-Tests-4.x-java7/solr/core/lib/commons-fileupload-1.2.1.jar:/usr/home/hudson/hudson-slave/workspace/Lucene-Solr-Tests-4.x-java7/solr/core/lib/commons-lang-2.6.jar:/usr/home/hudson/hudson-slave/workspace/Lucene-Solr-Tests-4.x-java7/solr/core/lib/easymock-2.2.jar:/usr/home/hudson/hudson-slave/workspace/Lucene-Solr-Tests-4.x-java7/solr/core/lib/guava-r05.jar:/usr/home/hudson/hudson-slave/workspace/Lucene-Solr-Tests-4.x-java7/solr/core/lib/javax.servlet-api-3.0.1.jar:/usr/home/hudson/hudson-slave/workspace/Lucene-Solr-Tests-4.x-java7/solr/core/lib/spatial4j-0.3.jar:/usr/home/hudson/hudson-slave/workspace/Lucene-Solr-Tests-4.x-java7/solr/solrj/lib/commons-io-2.1.jar:/usr/home/hudson/hudson-slave/workspace/Lucene-Solr-Tests-4.x-java7/solr/solrj/lib/httpclient-4.1.3.jar:/usr/home/hudson/hudson-slave/workspace/Lucene-Solr-Tests-4.x-java7/solr/solrj/lib/httpcore-4.1.4.jar:/usr/home/hudson/hudson-slave/workspace/Lucene-Solr-Tests-4.x-java7/solr/solrj/lib/httpmime-4.1.3.jar:/usr/home/hudson/hudson-slave/workspace/Lucene-Solr-Tests-4.x-java7/solr/solrj/lib/jcl-over-slf4j-1.6.4.jar:/usr/home/hudson/hudson-slave/workspace/Lucene-Solr-Tests-4.x-java7/solr/solrj/lib/log4j-over-slf4j-1.6.4.jar:/usr/home/hudson/hudson-slave/workspace/Lucene-Solr-Tests-4.x-java7/solr/solrj/lib/slf4j-api-1.6.4.jar:/usr/home/hudson/hudson-slave/workspace/Lucene-Solr-Tests-4.x-java7/solr/solrj/lib/slf4j-jdk14-1.6.4.jar:/usr/home/hudson/hudson-slave/workspace/Lucene-Solr-Tests-4.x-java7/solr/solrj/lib/wstx-asl-3.2.7.jar:/usr/home/hudson/hudson-slave/workspace/Lucene-Solr-Tests-4.x-java7/solr/solrj/lib/zookeeper-3.3.6.jar:/usr/home/hudson/hudson-slave/workspace/Lucene-Solr-Tests-4.x-java7/solr/example/lib/jetty-continuation-8.1.2.v20120308.jar:/usr/home/hudson/hudson-slave/workspace/Lucene-Solr-Tests-4.x-java7/solr/example/lib/jetty-deploy-8.1.2.v20120308.jar:/usr/home/hudson/hudson-slave/workspace/Lucene-Solr-Tests-4.x-java7/solr/example/lib/jetty-http-8.1.2.v20120308.jar:/usr/home/hudson/hudson-slave/workspace/Lucene-Solr-Tests-4.x-java7/solr/example/lib/jetty-io-8.1.2.v20120308.jar:/usr/home/hudson/hudson-slave/workspace/Lucene-Solr-Tests-4.x-java7/solr/example/lib/jetty-jmx-8.1.2.v20120308.jar:/usr/home/hudson/hudson-slave/workspace/Lucene-Solr-Tests-4.x-java7/solr/example/lib/jetty-security-8.1.2.v20120308.jar:/usr/home/hudson/hudson-slave/workspace/Lucene-Solr-Tests-4.x-java7/solr/example/lib/jetty-server-8.1.2.v20120308.jar:/usr/home/hudson/hudson-slave/workspace/Lucene-Solr-Tests-4.x-java7/solr/example/lib/jetty-servlet-8.1.2.v20120308.jar:/usr/home/hudson/hudson-slave/workspace/Lucene-Solr-Tests-4.x-java7/solr/example/lib/jetty-util-8.1.2.v20120308.jar:/usr/home/hudson/hudson-slave/workspace/Lucene-Solr-Tests-4.x-java7/solr/example/lib/jetty-webapp-8.1.2.v20120308.jar:/usr/home/hudson/hudson-slave/workspace/Lucene-Solr-Tests-4.x-java7/solr/example/lib/jetty-xml-8.1.2.v20120308.jar:/usr/home/hudson/hudson-slave/workspace/Lucene-Solr-Tests-4.x-java7/solr/example/lib/servlet-api-3.0.jar:/usr/home/hudson/hudson-slave/workspace/Lucene-Solr-Tests-4.x-java7/solr/example/example-DIH/solr/db/lib/hsqldb-1.8.0.10.jar:/usr/home/hudson/hudson-slave/workspace/Lucene-Solr-Tests-4.x-java7/lucene/build/core/classes/java:/usr/home/hudson/hudson-slave/workspace/Lucene-Solr-Tests-4.x-java7/lucene/test-framework/lib/junit-4.10.jar:/usr/home/hudson/hudson-slave/workspace/Lucene-Solr-Tests-4.x-java7/lucene/test-framework/lib/randomizedtesting-runner-2.0.2.jar:/home/hudson/hudson-slave/tools/Ant/ant-1.8.2/lib/ant-launcher.jar:/home/hudson/.ant/lib/ivy-2.2.0.jar:/home/hudson/hudson-slave/tools/Ant/ant-1.8.2/lib/ant-apache-regexp.jar:/home/hudson/hudson-slave/tools/Ant/ant-1.8.2/lib/ant-junit.jar:/home/hudson/hudson-slave/tools/Ant/ant-1.8.2/lib/ant-apache-bsf.jar:/home/hudson/hudson-slave/tools/Ant/ant-1.8.2/lib/ant-commons-net.jar:/home/hudson/hudson-slave/tools/Ant/ant-1.8.2/lib/ant-antlr.jar:/home/hudson/hudson-slave/tools/Ant/ant-1.8.2/lib/ant-apache-log4j.jar:/home/hudson/hudson-slave/tools/Ant/ant-1.8.2/lib/ant-commons-logging.jar:/home/hudson/hudson-slave/tools/Ant/ant-1.8.2/lib/ant-apache-xalan2.jar:/home/hudson/hudson-slave/tools/Ant/ant-1.8.2/lib/ant-apache-oro.jar:/home/hudson/hudson-slave/tools/Ant/ant-1.8.2/lib/ant-junit4.jar:/home/hudson/hudson-slave/tools/Ant/ant-1.8.2/lib/ant-netrexx.jar:/home/hudson/hudson-slave/tools/Ant/ant-1.8.2/lib/ant-swing.jar:/home/hudson/hudson-slave/tools/Ant/ant-1.8.2/lib/ant-javamail.jar:/home/hudson/hudson-slave/tools/Ant/ant-1.8.2/lib/ant-jsch.jar:/home/hudson/hudson-slave/tools/Ant/ant-1.8.2/lib/ant-jmf.jar:/home/hudson/hudson-slave/tools/Ant/ant-1.8.2/lib/ant.jar:/home/hudson/hudson-slave/tools/Ant/ant-1.8.2/lib/ant-apache-bcel.jar:/home/hudson/hudson-slave/tools/Ant/ant-1.8.2/lib/ant-jai.jar:/home/hudson/hudson-slave/tools/Ant/ant-1.8.2/lib/ant-testutil.jar:/home/hudson/hudson-slave/tools/Ant/ant-1.8.2/lib/ant-apache-resolver.jar:/home/hudson/hudson-slave/tools/Ant/ant-1.8.2/lib/ant-jdepend.jar:/usr/local/openjdk7/lib/tools.jar:/home/hudson/.ivy2/cache/com.carrotsearch.randomizedtesting/junit4-ant/jars/junit4-ant-2.0.2.jar
[junit4:junit4]   2> 185 T761 oaz.Environment.logEnv Server environment:java.library.path=/usr/local/openjdk7/jre/lib/amd64/server:/usr/local/openjdk7/jre/lib/amd64:/usr/local/openjdk7/jre/../lib/amd64:/usr/local/openjdk6/jre/lib/amd64/server:/usr/local/openjdk6/jre/lib/amd64:/usr/local/openjdk6/jre/../lib/amd64:/usr/java/packages/lib/amd64:/lib:/usr/lib:/usr/local/lib
[junit4:junit4]   2> 186 T761 oaz.Environment.logEnv Server environment:java.io.tmpdir=.
[junit4:junit4]   2> 186 T761 oaz.Environment.logEnv Server environment:java.compiler=<NA>
[junit4:junit4]   2> 186 T761 oaz.Environment.logEnv Server environment:os.name=FreeBSD
[junit4:junit4]   2> 186 T761 oaz.Environment.logEnv Server environment:os.arch=amd64
[junit4:junit4]   2> 186 T761 oaz.Environment.logEnv Server environment:os.version=9.0-RELEASE
[junit4:junit4]   2> 186 T761 oaz.Environment.logEnv Server environment:user.name=hudson
[junit4:junit4]   2> 186 T761 oaz.Environment.logEnv Server environment:user.home=/home/hudson
[junit4:junit4]   2> 186 T761 oaz.Environment.logEnv Server environment:user.dir=/usr/home/hudson/hudson-slave/workspace/Lucene-Solr-Tests-4.x-java7/solr/build/solr-core/test/J0
[junit4:junit4]   2> 242 T761 oazs.ZooKeeperServer.setTickTime tickTime set to 1000
[junit4:junit4]   2> 303 T761 oazs.NIOServerCnxn$Factory.<init> binding to port 0.0.0.0/0.0.0.0:0
[junit4:junit4]   2> 355 T760 oasc.ZkTestServer.run start zk server on port:49410
[junit4:junit4]   2> 393 T761 oazsp.FileTxnSnapLog.save Snapshotting: 0
[junit4:junit4]   2> 447 T760 oaz.Environment.logEnv Client environment:zookeeper.version=3.3.6-1366786, built on 07/29/2012 06:22 GMT
[junit4:junit4]   2> 447 T760 oaz.Environment.logEnv Client environment:host.name=lucene.zones.apache.org
[junit4:junit4]   2> 448 T760 oaz.Environment.logEnv Client environment:java.version=1.7.0_06
[junit4:junit4]   2> 448 T760 oaz.Environment.logEnv Client environment:java.vendor=Oracle Corporation
[junit4:junit4]   2> 448 T760 oaz.Environment.logEnv Client environment:java.home=/usr/local/openjdk7/jre
[junit4:junit4]   2> 449 T760 oaz.Environment.logEnv Client environment:java.class.path=/usr/home/hudson/hudson-slave/workspace/Lucene-Solr-Tests-4.x-java7/solr/build/solr-core/classes/test:/usr/home/hudson/hudson-slave/workspace/Lucene-Solr-Tests-4.x-java7/solr/build/solr-test-framework/classes/java:/usr/home/hudson/hudson-slave/workspace/Lucene-Solr-Tests-4.x-java7/solr/build/solr-core/test-files:/usr/home/hudson/hudson-slave/workspace/Lucene-Solr-Tests-4.x-java7/lucene/build/codecs/classes/java:/usr/home/hudson/hudson-slave/workspace/Lucene-Solr-Tests-4.x-java7/lucene/build/test-framework/classes/java:/usr/home/hudson/hudson-slave/workspace/Lucene-Solr-Tests-4.x-java7/solr/build/solr-solrj/classes/java:/usr/home/hudson/hudson-slave/workspace/Lucene-Solr-Tests-4.x-java7/solr/build/solr-core/classes/java:/usr/home/hudson/hudson-slave/workspace/Lucene-Solr-Tests-4.x-java7/lucene/build/analysis/common/lucene-analyzers-common-4.1-SNAPSHOT.jar:/usr/home/hudson/hudson-slave/workspace/Lucene-Solr-Tests-4.x-java7/lucene/build/analysis/kuromoji/lucene-analyzers-kuromoji-4.1-SNAPSHOT.jar:/usr/home/hudson/hudson-slave/workspace/Lucene-Solr-Tests-4.x-java7/lucene/build/analysis/phonetic/lucene-analyzers-phonetic-4.1-SNAPSHOT.jar:/usr/home/hudson/hudson-slave/workspace/Lucene-Solr-Tests-4.x-java7/lucene/build/highlighter/lucene-highlighter-4.1-SNAPSHOT.jar:/usr/home/hudson/hudson-slave/workspace/Lucene-Solr-Tests-4.x-java7/lucene/build/memory/lucene-memory-4.1-SNAPSHOT.jar:/usr/home/hudson/hudson-slave/workspace/Lucene-Solr-Tests-4.x-java7/lucene/build/misc/lucene-misc-4.1-SNAPSHOT.jar:/usr/home/hudson/hudson-slave/workspace/Lucene-Solr-Tests-4.x-java7/lucene/build/spatial/lucene-spatial-4.1-SNAPSHOT.jar:/usr/home/hudson/hudson-slave/workspace/Lucene-Solr-Tests-4.x-java7/lucene/build/suggest/lucene-suggest-4.1-SNAPSHOT.jar:/usr/home/hudson/hudson-slave/workspace/Lucene-Solr-Tests-4.x-java7/lucene/build/grouping/lucene-grouping-4.1-SNAPSHOT.jar:/usr/home/hudson/hudson-slave/workspace/Lucene-Solr-Tests-4.x-java7/lucene/build/queries/lucene-queries-4.1-SNAPSHOT.jar:/usr/home/hudson/hudson-slave/workspace/Lucene-Solr-Tests-4.x-java7/lucene/build/queryparser/lucene-queryparser-4.1-SNAPSHOT.jar:/usr/home/hudson/hudson-slave/workspace/Lucene-Solr-Tests-4.x-java7/solr/core/lib/commons-cli-1.2.jar:/usr/home/hudson/hudson-slave/workspace/Lucene-Solr-Tests-4.x-java7/solr/core/lib/commons-codec-1.7.jar:/usr/home/hudson/hudson-slave/workspace/Lucene-Solr-Tests-4.x-java7/solr/core/lib/commons-fileupload-1.2.1.jar:/usr/home/hudson/hudson-slave/workspace/Lucene-Solr-Tests-4.x-java7/solr/core/lib/commons-lang-2.6.jar:/usr/home/hudson/hudson-slave/workspace/Lucene-Solr-Tests-4.x-java7/solr/core/lib/easymock-2.2.jar:/usr/home/hudson/hudson-slave/workspace/Lucene-Solr-Tests-4.x-java7/solr/core/lib/guava-r05.jar:/usr/home/hudson/hudson-slave/workspace/Lucene-Solr-Tests-4.x-java7/solr/core/lib/javax.servlet-api-3.0.1.jar:/usr/home/hudson/hudson-slave/workspace/Lucene-Solr-Tests-4.x-java7/solr/core/lib/spatial4j-0.3.jar:/usr/home/hudson/hudson-slave/workspace/Lucene-Solr-Tests-4.x-java7/solr/solrj/lib/commons-io-2.1.jar:/usr/home/hudson/hudson-slave/workspace/Lucene-Solr-Tests-4.x-java7/solr/solrj/lib/httpclient-4.1.3.jar:/usr/home/hudson/hudson-slave/workspace/Lucene-Solr-Tests-4.x-java7/solr/solrj/lib/httpcore-4.1.4.jar:/usr/home/hudson/hudson-slave/workspace/Lucene-Solr-Tests-4.x-java7/solr/solrj/lib/httpmime-4.1.3.jar:/usr/home/hudson/hudson-slave/workspace/Lucene-Solr-Tests-4.x-java7/solr/solrj/lib/jcl-over-slf4j-1.6.4.jar:/usr/home/hudson/hudson-slave/workspace/Lucene-Solr-Tests-4.x-java7/solr/solrj/lib/log4j-over-slf4j-1.6.4.jar:/usr/home/hudson/hudson-slave/workspace/Lucene-Solr-Tests-4.x-java7/solr/solrj/lib/slf4j-api-1.6.4.jar:/usr/home/hudson/hudson-slave/workspace/Lucene-Solr-Tests-4.x-java7/solr/solrj/lib/slf4j-jdk14-1.6.4.jar:/usr/home/hudson/hudson-slave/workspace/Lucene-Solr-Tests-4.x-java7/solr/solrj/lib/wstx-asl-3.2.7.jar:/usr/home/hudson/hudson-slave/workspace/Lucene-Solr-Tests-4.x-java7/solr/solrj/lib/zookeeper-3.3.6.jar:/usr/home/hudson/hudson-slave/workspace/Lucene-Solr-Tests-4.x-java7/solr/example/lib/jetty-continuation-8.1.2.v20120308.jar:/usr/home/hudson/hudson-slave/workspace/Lucene-Solr-Tests-4.x-java7/solr/example/lib/jetty-deploy-8.1.2.v20120308.jar:/usr/home/hudson/hudson-slave/workspace/Lucene-Solr-Tests-4.x-java7/solr/example/lib/jetty-http-8.1.2.v20120308.jar:/usr/home/hudson/hudson-slave/workspace/Lucene-Solr-Tests-4.x-java7/solr/example/lib/jetty-io-8.1.2.v20120308.jar:/usr/home/hudson/hudson-slave/workspace/Lucene-Solr-Tests-4.x-java7/solr/example/lib/jetty-jmx-8.1.2.v20120308.jar:/usr/home/hudson/hudson-slave/workspace/Lucene-Solr-Tests-4.x-java7/solr/example/lib/jetty-security-8.1.2.v20120308.jar:/usr/home/hudson/hudson-slave/workspace/Lucene-Solr-Tests-4.x-java7/solr/example/lib/jetty-server-8.1.2.v20120308.jar:/usr/home/hudson/hudson-slave/workspace/Lucene-Solr-Tests-4.x-java7/solr/example/lib/jetty-servlet-8.1.2.v20120308.jar:/usr/home/hudson/hudson-slave/workspace/Lucene-Solr-Tests-4.x-java7/solr/example/lib/jetty-util-8.1.2.v20120308.jar:/usr/home/hudson/hudson-slave/workspace/Lucene-Solr-Tests-4.x-java7/solr/example/lib/jetty-webapp-8.1.2.v20120308.jar:/usr/home/hudson/hudson-slave/workspace/Lucene-Solr-Tests-4.x-java7/solr/example/lib/jetty-xml-8.1.2.v20120308.jar:/usr/home/hudson/hudson-slave/workspace/Lucene-Solr-Tests-4.x-java7/solr/example/lib/servlet-api-3.0.jar:/usr/home/hudson/hudson-slave/workspace/Lucene-Solr-Tests-4.x-java7/solr/example/example-DIH/solr/db/lib/hsqldb-1.8.0.10.jar:/usr/home/hudson/hudson-slave/workspace/Lucene-Solr-Tests-4.x-java7/lucene/build/core/classes/java:/usr/home/hudson/hudson-slave/workspace/Lucene-Solr-Tests-4.x-java7/lucene/test-framework/lib/junit-4.10.jar:/usr/home/hudson/hudson-slave/workspace/Lucene-Solr-Tests-4.x-java7/lucene/test-framework/lib/randomizedtesting-runner-2.0.2.jar:/home/hudson/hudson-slave/tools/Ant/ant-1.8.2/lib/ant-launcher.jar:/home/hudson/.ant/lib/ivy-2.2.0.jar:/home/hudson/hudson-slave/tools/Ant/ant-1.8.2/lib/ant-apache-regexp.jar:/home/hudson/hudson-slave/tools/Ant/ant-1.8.2/lib/ant-junit.jar:/home/hudson/hudson-slave/tools/Ant/ant-1.8.2/lib/ant-apache-bsf.jar:/home/hudson/hudson-slave/tools/Ant/ant-1.8.2/lib/ant-commons-net.jar:/home/hudson/hudson-slave/tools/Ant/ant-1.8.2/lib/ant-antlr.jar:/home/hudson/hudson-slave/tools/Ant/ant-1.8.2/lib/ant-apache-log4j.jar:/home/hudson/hudson-slave/tools/Ant/ant-1.8.2/lib/ant-commons-logging.jar:/home/hudson/hudson-slave/tools/Ant/ant-1.8.2/lib/ant-apache-xalan2.jar:/home/hudson/hudson-slave/tools/Ant/ant-1.8.2/lib/ant-apache-oro.jar:/home/hudson/hudson-slave/tools/Ant/ant-1.8.2/lib/ant-junit4.jar:/home/hudson/hudson-slave/tools/Ant/ant-1.8.2/lib/ant-netrexx.jar:/home/hudson/hudson-slave/tools/Ant/ant-1.8.2/lib/ant-swing.jar:/home/hudson/hudson-slave/tools/Ant/ant-1.8.2/lib/ant-javamail.jar:/home/hudson/hudson-slave/tools/Ant/ant-1.8.2/lib/ant-jsch.jar:/home/hudson/hudson-slave/tools/Ant/ant-1.8.2/lib/ant-jmf.jar:/home/hudson/hudson-slave/tools/Ant/ant-1.8.2/lib/ant.jar:/home/hudson/hudson-slave/tools/Ant/ant-1.8.2/lib/ant-apache-bcel.jar:/home/hudson/hudson-slave/tools/Ant/ant-1.8.2/lib/ant-jai.jar:/home/hudson/hudson-slave/tools/Ant/ant-1.8.2/lib/ant-testutil.jar:/home/hudson/hudson-slave/tools/Ant/ant-1.8.2/lib/ant-apache-resolver.jar:/home/hudson/hudson-slave/tools/Ant/ant-1.8.2/lib/ant-jdepend.jar:/usr/local/openjdk7/lib/tools.jar:/home/hudson/.ivy2/cache/com.carrotsearch.randomizedtesting/junit4-ant/jars/junit4-ant-2.0.2.jar
[junit4:junit4]   2> 450 T760 oaz.Environment.logEnv Client environment:java.library.path=/usr/local/openjdk7/jre/lib/amd64/server:/usr/local/openjdk7/jre/lib/amd64:/usr/local/openjdk7/jre/../lib/amd64:/usr/local/openjdk6/jre/lib/amd64/server:/usr/local/openjdk6/jre/lib/amd64:/usr/local/openjdk6/jre/../lib/amd64:/usr/java/packages/lib/amd64:/lib:/usr/lib:/usr/local/lib
[junit4:junit4]   2> 451 T760 oaz.Environment.logEnv Client environment:java.io.tmpdir=.
[junit4:junit4]   2> 451 T760 oaz.Environment.logEnv Client environment:java.compiler=<NA>
[junit4:junit4]   2> 451 T760 oaz.Environment.logEnv Client environment:os.name=FreeBSD
[junit4:junit4]   2> 452 T760 oaz.Environment.logEnv Client environment:os.arch=amd64
[junit4:junit4]   2> 452 T760 oaz.Environment.logEnv Client environment:os.version=9.0-RELEASE
[junit4:junit4]   2> 452 T760 oaz.Environment.logEnv Client environment:user.name=hudson
[junit4:junit4]   2> 453 T760 oaz.Environment.logEnv Client environment:user.home=/home/hudson
[junit4:junit4]   2> 453 T760 oaz.Environment.logEnv Client environment:user.dir=/usr/home/hudson/hudson-slave/workspace/Lucene-Solr-Tests-4.x-java7/solr/build/solr-core/test/J0
[junit4:junit4]   2> 458 T760 oaz.ZooKeeper.<init> Initiating client connection, connectString=127.0.0.1:49410 sessionTimeout=10000 watcher=org.apache.solr.common.cloud.ConnectionManager@53b9e58
[junit4:junit4]   2> 514 T765 oaz.ClientCnxn$SendThread.startConnect Opening socket connection to server /127.0.0.1:49410
[junit4:junit4]   2> 514 T760 oascc.ConnectionManager.waitForConnected Waiting for client to connect to ZooKeeper
[junit4:junit4]   2> 518 T765 oaz.ClientCnxn$SendThread.primeConnection Socket connection established to localhost/127.0.0.1:49410, initiating session
[junit4:junit4]   2> 519 T762 oazs.NIOServerCnxn$Factory.run Accepted socket connection from /140.211.11.196:49411
[junit4:junit4]   2> 541 T762 oazs.NIOServerCnxn.doIO WARNING Exception causing close of session 0x0 due to java.io.IOException: ZooKeeperServer not running
[junit4:junit4]   2> 541 T762 oazs.NIOServerCnxn.closeSock Closed socket connection for client /140.211.11.196:49411 (no session established for client)
[junit4:junit4]   2> 542 T765 oaz.ClientCnxn$SendThread.run Unable to read additional data from server sessionid 0x0, likely server has closed socket, closing socket connection and attempting reconnect
[junit4:junit4]   2> 2321 T765 oaz.ClientCnxn$SendThread.startConnect Opening socket connection to server localhost/127.0.0.1:49410
[junit4:junit4]   2> 2321 T765 oaz.ClientCnxn$SendThread.primeConnection Socket connection established to localhost/127.0.0.1:49410, initiating session
[junit4:junit4]   2> 2322 T762 oazs.NIOServerCnxn$Factory.run Accepted socket connection from /140.211.11.196:49414
[junit4:junit4]   2> 2323 T762 oazs.NIOServerCnxn.readConnectRequest Client attempting to establish new session at /140.211.11.196:49414
[junit4:junit4]   2> 2336 T764 oazsp.FileTxnLog.append Creating new log file: log.1
[junit4:junit4]   2> 2379 T764 oazs.NIOServerCnxn.finishSessionInit Established session 0x13a1f9a6c480000 with negotiated timeout 10000 for client /140.211.11.196:49414
[junit4:junit4]   2> 2380 T765 oaz.ClientCnxn$SendThread.readConnectResult Session establishment complete on server localhost/127.0.0.1:49410, sessionid = 0x13a1f9a6c480000, negotiated timeout = 10000
[junit4:junit4]   2> 2384 T766 oascc.ConnectionManager.process Watcher org.apache.solr.common.cloud.ConnectionManager@53b9e58 name:ZooKeeperConnection Watcher:127.0.0.1:49410 got event WatchedEvent state:SyncConnected type:None path:null path:null type:None
[junit4:junit4]   2> 2384 T760 oascc.ConnectionManager.waitForConnected Client is connected to ZooKeeper
[junit4:junit4]   2> 2389 T760 oascc.SolrZkClient.makePath makePath: /solr
[junit4:junit4]   2> 2472 T767 oazs.PrepRequestProcessor.pRequest Processed session termination for sessionid: 0x13a1f9a6c480000
[junit4:junit4]   2> 2478 T766 oaz.ClientCnxn$EventThread.run EventThread shut down
[junit4:junit4]   2> 2478 T760 oaz.ZooKeeper.close Session: 0x13a1f9a6c480000 closed
[junit4:junit4]   2> 2479 T760 oaz.ZooKeeper.<init> Initiating client connection, connectString=127.0.0.1:49410/solr sessionTimeout=10000 watcher=org.apache.solr.common.cloud.ConnectionManager@3dab2915
[junit4:junit4]   2> 2479 T762 oazs.NIOServerCnxn.closeSock Closed socket connection for client /140.211.11.196:49414 which had sessionid 0x13a1f9a6c480000
[junit4:junit4]   2> 2480 T768 oaz.ClientCnxn$SendThread.startConnect Opening socket connection to server /127.0.0.1:49410
[junit4:junit4]   2> 2480 T760 oascc.ConnectionManager.waitForConnected Waiting for client to connect to ZooKeeper
[junit4:junit4]   2> 2481 T768 oaz.ClientCnxn$SendThread.primeConnection Socket connection established to localhost/127.0.0.1:49410, initiating session
[junit4:junit4]   2> 2481 T762 oazs.NIOServerCnxn$Factory.run Accepted socket connection from /140.211.11.196:49416
[junit4:junit4]   2> 2481 T762 oazs.NIOServerCnxn.readConnectRequest Client attempting to establish new session at /140.211.11.196:49416
[junit4:junit4]   2> 2486 T764 oazs.NIOServerCnxn.finishSessionInit Established session 0x13a1f9a6c480001 with negotiated timeout 10000 for client /140.211.11.196:49416
[junit4:junit4]   2> 2487 T768 oaz.ClientCnxn$SendThread.readConnectResult Session establishment complete on server localhost/127.0.0.1:49410, sessionid = 0x13a1f9a6c480001, negotiated timeout = 10000
[junit4:junit4]   2> 2487 T769 oascc.ConnectionManager.process Watcher org.apache.solr.common.cloud.ConnectionManager@3dab2915 name:ZooKeeperConnection Watcher:127.0.0.1:49410/solr got event WatchedEvent state:SyncConnected type:None path:null path:null type:None
[junit4:junit4]   2> 2487 T760 oascc.ConnectionManager.waitForConnected Client is connected to ZooKeeper
[junit4:junit4]   2> 2493 T760 oascc.SolrZkClient.makePath makePath: /collections/collection1
[junit4:junit4]   2> 2501 T760 oascc.SolrZkClient.makePath makePath: /collections/collection1/shards
[junit4:junit4]   2> 2652 T760 oascc.SolrZkClient.makePath makePath: /collections/control_collection
[junit4:junit4]   2> 2656 T760 oascc.SolrZkClient.makePath makePath: /collections/control_collection/shards
[junit4:junit4]   2> 2661 T760 oasc.AbstractZkTestCase.putConfig put /usr/home/hudson/hudson-slave/workspace/Lucene-Solr-Tests-4.x-java7/solr/build/solr-core/test-files/solr/collection1/conf/solrconfig.xml to /configs/conf1/solrconfig.xml
[junit4:junit4]   2> 2662 T760 oascc.SolrZkClient.makePath makePath: /configs/conf1/solrconfig.xml
[junit4:junit4]   2> 2694 T760 oasc.AbstractZkTestCase.putConfig put /usr/home/hudson/hudson-slave/workspace/Lucene-Solr-Tests-4.x-java7/solr/build/solr-core/test-files/solr/collection1/conf/schema.xml to /configs/conf1/schema.xml
[junit4:junit4]   2> 2695 T760 oascc.SolrZkClient.makePath makePath: /configs/conf1/schema.xml
[junit4:junit4]   2> 2800 T760 oasc.AbstractZkTestCase.putConfig put /usr/home/hudson/hudson-slave/workspace/Lucene-Solr-Tests-4.x-java7/solr/build/solr-core/test-files/solr/collection1/conf/solrconfig.xml to /configs/conf1/solrconfig.xml
[junit4:junit4]   2> 2801 T760 oascc.SolrZkClient.makePath makePath: /configs/conf1/solrconfig.xml
[junit4:junit4]   2> 2821 T760 oasc.AbstractZkTestCase.putConfig put /usr/home/hudson/hudson-slave/workspace/Lucene-Solr-Tests-4.x-java7/solr/build/solr-core/test-files/solr/collection1/conf/stopwords.txt to /configs/conf1/stopwords.txt
[junit4:junit4]   2> 2821 T760 oascc.SolrZkClient.makePath makePath: /configs/conf1/stopwords.txt
[junit4:junit4]   2> 2825 T760 oasc.AbstractZkTestCase.putConfig put /usr/home/hudson/hudson-slave/workspace/Lucene-Solr-Tests-4.x-java7/solr/build/solr-core/test-files/solr/collection1/conf/protwords.txt to /configs/conf1/protwords.txt
[junit4:junit4]   2> 2826 T760 oascc.SolrZkClient.makePath makePath: /configs/conf1/protwords.txt
[junit4:junit4]   2> 2829 T760 oasc.AbstractZkTestCase.putConfig put /usr/home/hudson/hudson-slave/workspace/Lucene-Solr-Tests-4.x-java7/solr/build/solr-core/test-files/solr/collection1/conf/currency.xml to /configs/conf1/currency.xml
[junit4:junit4]   2> 2830 T760 oascc.SolrZkClient.makePath makePath: /configs/conf1/currency.xml
[junit4:junit4]   2> 2843 T760 oasc.AbstractZkTestCase.putConfig put /usr/home/hudson/hudson-slave/workspace/Lucene-Solr-Tests-4.x-java7/solr/build/solr-core/test-files/solr/collection1/conf/open-exchange-rates.json to /configs/conf1/open-exchange-rates.json
[junit4:junit4]   2> 2844 T760 oascc.SolrZkClient.makePath makePath: /configs/conf1/open-exchange-rates.json
[junit4:junit4]   2> 2852 T760 oasc.AbstractZkTestCase.putConfig put /usr/home/hudson/hudson-slave/workspace/Lucene-Solr-Tests-4.x-java7/solr/build/solr-core/test-files/solr/collection1/conf/mapping-ISOLatin1Accent.txt to /configs/conf1/mapping-ISOLatin1Accent.txt
[junit4:junit4]   2> 2852 T760 oascc.SolrZkClient.makePath makePath: /configs/conf1/mapping-ISOLatin1Accent.txt
[junit4:junit4]   2> 2856 T760 oasc.AbstractZkTestCase.putConfig put /usr/home/hudson/hudson-slave/workspace/Lucene-Solr-Tests-4.x-java7/solr/build/solr-core/test-files/solr/collection1/conf/old_synonyms.txt to /configs/conf1/old_synonyms.txt
[junit4:junit4]   2> 2857 T760 oascc.SolrZkClient.makePath makePath: /configs/conf1/old_synonyms.txt
[junit4:junit4]   2> 2861 T760 oasc.AbstractZkTestCase.putConfig put /usr/home/hudson/hudson-slave/workspace/Lucene-Solr-Tests-4.x-java7/solr/build/solr-core/test-files/solr/collection1/conf/synonyms.txt to /configs/conf1/synonyms.txt
[junit4:junit4]   2> 2862 T760 oascc.SolrZkClient.makePath makePath: /configs/conf1/synonyms.txt
[junit4:junit4]   2> 2870 T767 oazs.PrepRequestProcessor.pRequest Processed session termination for sessionid: 0x13a1f9a6c480001
[junit4:junit4]   2> 2871 T769 oaz.ClientCnxn$EventThread.run EventThread shut down
[junit4:junit4]   2> 2871 T762 oazs.NIOServerCnxn.closeSock Closed socket connection for client /140.211.11.196:49416 which had sessionid 0x13a1f9a6c480001
[junit4:junit4]   2> 2871 T760 oaz.ZooKeeper.close Session: 0x13a1f9a6c480001 closed
[junit4:junit4]   2> 2874 T760 oejs.Server.doStart jetty-8.1.2.v20120308
[junit4:junit4]   2> 2878 T760 oejs.AbstractConnector.doStart Started SocketConnector@0.0.0.0:49417
[junit4:junit4]   2> 2879 T760 oasc.SolrResourceLoader.locateSolrHome JNDI not configured for solr (NoInitialContextEx)
[junit4:junit4]   2> 2879 T760 oasc.SolrResourceLoader.locateSolrHome using system property solr.solr.home: /usr/home/hudson/hudson-slave/workspace/Lucene-Solr-Tests-4.x-java7/solr/build/solr-core/test-files/solr
[junit4:junit4]   2> 2880 T760 oasc.SolrResourceLoader.<init> new SolrResourceLoader for deduced Solr Home: '/usr/home/hudson/hudson-slave/workspace/Lucene-Solr-Tests-4.x-java7/solr/build/solr-core/test-files/solr/'
[junit4:junit4]   2> 2923 T760 oass.SolrDispatchFilter.init SolrDispatchFilter.init()
[junit4:junit4]   2> 2924 T760 oasc.SolrResourceLoader.locateSolrHome JNDI not configured for solr (NoInitialContextEx)
[junit4:junit4]   2> 2924 T760 oasc.SolrResourceLoader.locateSolrHome using system property solr.solr.home: /usr/home/hudson/hudson-slave/workspace/Lucene-Solr-Tests-4.x-java7/solr/build/solr-core/test-files/solr
[junit4:junit4]   2> 2925 T760 oasc.CoreContainer$Initializer.initialize looking for solr.xml: /usr/home/hudson/hudson-slave/workspace/Lucene-Solr-Tests-4.x-java7/solr/build/solr-core/test-files/solr/solr.xml
[junit4:junit4]   2> 2925 T760 oasc.CoreContainer.<init> New CoreContainer 366951464
[junit4:junit4]   2> 2926 T760 oasc.CoreContainer.load Loading CoreContainer using Solr Home: '/usr/home/hudson/hudson-slave/workspace/Lucene-Solr-Tests-4.x-java7/solr/build/solr-core/test-files/solr/'
[junit4:junit4]   2> 2927 T760 oasc.SolrResourceLoader.<init> new SolrResourceLoader for directory: '/usr/home/hudson/hudson-slave/workspace/Lucene-Solr-Tests-4.x-java7/solr/build/solr-core/test-files/solr/'
[junit4:junit4]   2> 2964 T760 oasc.CoreContainer.load Registering Log Listener
[junit4:junit4]   2> 2982 T760 oasc.CoreContainer.initZooKeeper Zookeeper client=127.0.0.1:49410/solr
[junit4:junit4]   2> 3016 T760 oaz.ZooKeeper.<init> Initiating client connection, connectString=127.0.0.1:49410/solr sessionTimeout=5000 watcher=org.apache.solr.common.cloud.ConnectionManager@f153f83
[junit4:junit4]   2> 3018 T779 oaz.ClientCnxn$SendThread.startConnect Opening socket connection to server /127.0.0.1:49410
[junit4:junit4]   2> 3018 T760 oascc.ConnectionManager.waitForConnected Waiting for client to connect to ZooKeeper
[junit4:junit4]   2> 3019 T779 oaz.ClientCnxn$SendThread.primeConnection Socket connection established to localhost/127.0.0.1:49410, initiating session
[junit4:junit4]   2> 3019 T762 oazs.NIOServerCnxn$Factory.run Accepted socket connection from /140.211.11.196:49418
[junit4:junit4]   2> 3020 T762 oazs.NIOServerCnxn.readConnectRequest Client attempting to establish new session at /140.211.11.196:49418
[junit4:junit4]   2> 3022 T764 oazs.NIOServerCnxn.finishSessionInit Established session 0x13a1f9a6c480002 with negotiated timeout 5000 for client /140.211.11.196:49418
[junit4:junit4]   2> 3022 T779 oaz.ClientCnxn$SendThread.readConnectResult Session establishment complete on server localhost/127.0.0.1:49410, sessionid = 0x13a1f9a6c480002, negotiated timeout = 5000
[junit4:junit4]   2> 3023 T780 oascc.ConnectionManager.process Watcher org.apache.solr.common.cloud.ConnectionManager@f153f83 name:ZooKeeperConnection Watcher:127.0.0.1:49410/solr got event WatchedEvent state:SyncConnected type:None path:null path:null type:None
[junit4:junit4]   2> 3023 T760 oascc.ConnectionManager.waitForConnected Client is connected to ZooKeeper
[junit4:junit4]   2> 3043 T767 oazs.PrepRequestProcessor.pRequest Got user-level KeeperException when processing sessionid:0x13a1f9a6c480002 type:create cxid:0x2 zxid:0xfffffffffffffffe txntype:unknown reqpath:n/a Error Path:/solr/overseer Error:KeeperErrorCode = NodeExists for /solr/overseer
[junit4:junit4]   2> 3057 T760 oascc.SolrZkClient.makePath makePath: /live_nodes
[junit4:junit4]   2> 3061 T760 oasc.ZkController.createEphemeralLiveNode Register node as live in ZooKeeper:/live_nodes/127.0.0.1:49417_solr
[junit4:junit4]   2> 3068 T767 oazs.PrepRequestProcessor.pRequest Got user-level KeeperException when processing sessionid:0x13a1f9a6c480002 type:delete cxid:0x7 zxid:0xfffffffffffffffe txntype:unknown reqpath:n/a Error Path:/solr/live_nodes/127.0.0.1:49417_solr Error:KeeperErrorCode = NoNode for /solr/live_nodes/127.0.0.1:49417_solr
[junit4:junit4]   2> 3069 T760 oascc.SolrZkClient.makePath makePath: /live_nodes/127.0.0.1:49417_solr
[junit4:junit4]   2> 3076 T760 oashc.HttpShardHandlerFactory.getParameter Setting socketTimeout to: 0
[junit4:junit4]   2> 3077 T760 oashc.HttpShardHandlerFactory.getParameter Setting urlScheme to: http://
[junit4:junit4]   2> 3077 T760 oashc.HttpShardHandlerFactory.getParameter Setting connTimeout to: 0
[junit4:junit4]   2> 3078 T760 oashc.HttpShardHandlerFactory.getParameter Setting maxConnectionsPerHost to: 20
[junit4:junit4]   2> 3078 T760 oashc.HttpShardHandlerFactory.getParameter Setting corePoolSize to: 0
[junit4:junit4]   2> 3079 T760 oashc.HttpShardHandlerFactory.getParameter Setting maximumPoolSize to: 2147483647
[junit4:junit4]   2> 3079 T760 oashc.HttpShardHandlerFactory.getParameter Setting maxThreadIdleTime to: 5
[junit4:junit4]   2> 3080 T760 oashc.HttpShardHandlerFactory.getParameter Setting sizeOfQueue to: -1
[junit4:junit4]   2> 3080 T760 oashc.HttpShardHandlerFactory.getParameter Setting fairnessPolicy to: false
[junit4:junit4]   2> 3081 T760 oascsi.HttpClientUtil.createClient Creating new http client, config:maxConnectionsPerHost=20&maxConnections=10000&socketTimeout=0&connTimeout=0&retry=false
[junit4:junit4]   2> 3100 T760 oascc.SolrZkClient.makePath makePath: /overseer_elect/election
[junit4:junit4]   2> 3303 T767 oazs.PrepRequestProcessor.pRequest Got user-level KeeperException when processing sessionid:0x13a1f9a6c480002 type:delete cxid:0x15 zxid:0xfffffffffffffffe txntype:unknown reqpath:n/a Error Path:/solr/overseer_elect/leader Error:KeeperErrorCode = NoNode for /solr/overseer_elect/leader
[junit4:junit4]   2> 3359 T760 oascc.SolrZkClient.makePath makePath: /overseer_elect/leader
[junit4:junit4]   2> 3406 T760 oasc.Overseer.start Overseer (id=88417890789228546-127.0.0.1:49417_solr-n_0000000000) starting
[junit4:junit4]   2> 3407 T767 oazs.PrepRequestProcessor.pRequest Got user-level KeeperException when processing sessionid:0x13a1f9a6c480002 type:create cxid:0x1a zxid:0xfffffffffffffffe txntype:unknown reqpath:n/a Error Path:/solr/overseer Error:KeeperErrorCode = NodeExists for /solr/overseer
[junit4:junit4]   2> 3444 T767 oazs.PrepRequestProcessor.pRequest Got user-level KeeperException when processing sessionid:0x13a1f9a6c480002 type:create cxid:0x1b zxid:0xfffffffffffffffe txntype:unknown reqpath:n/a Error Path:/solr/overseer Error:KeeperErrorCode = NodeExists for /solr/overseer
[junit4:junit4]   2> 3533 T767 oazs.PrepRequestProcessor.pRequest Got user-level KeeperException when processing sessionid:0x13a1f9a6c480002 type:create cxid:0x1c zxid:0xfffffffffffffffe txntype:unknown reqpath:n/a Error Path:/solr/overseer Error:KeeperErrorCode = NodeExists for /solr/overseer
[junit4:junit4]   2> 3558 T767 oazs.PrepRequestProcessor.pRequest Got user-level KeeperException when processing sessionid:0x13a1f9a6c480002 type:create cxid:0x1d zxid:0xfffffffffffffffe txntype:unknown reqpath:n/a Error Path:/solr/overseer Error:KeeperErrorCode = NodeExists for /solr/overseer
[junit4:junit4]   2> 3613 T782 oasc.OverseerCollectionProcessor.run Process current queue of collection creations
[junit4:junit4]   2> 3613 T760 oascc.SolrZkClient.makePath makePath: /clusterstate.json
[junit4:junit4]   2> 3701 T760 oascc.ZkStateReader.createClusterStateWatchersAndUpdate Updating cluster state from ZooKeeper... 
[junit4:junit4]   2> 3737 T781 oasc.Overseer$ClusterStateUpdater.run Starting to work on the main queue
[junit4:junit4]   2> 3748 T760 oasc.CoreContainer.create Creating SolrCore 'collection1' using instanceDir: /usr/home/hudson/hudson-slave/workspace/Lucene-Solr-Tests-4.x-java7/solr/build/solr-core/test-files/solr/collection1
[junit4:junit4]   2> 3749 T760 oasc.ZkController.createCollectionZkNode Check for collection zkNode:control_collection
[junit4:junit4]   2> 3750 T760 oasc.ZkController.createCollectionZkNode Collection zkNode exists
[junit4:junit4]   2> 3750 T760 oasc.ZkController.readConfigName Load collection config from:/collections/control_collection
[junit4:junit4]   2> 3753 T760 oasc.SolrResourceLoader.<init> new SolrResourceLoader for directory: '/usr/home/hudson/hudson-slave/workspace/Lucene-Solr-Tests-4.x-java7/solr/build/solr-core/test-files/solr/collection1/'
[junit4:junit4]   2> 3755 T760 oasc.SolrResourceLoader.replaceClassLoader Adding 'file:/usr/home/hudson/hudson-slave/workspace/Lucene-Solr-Tests-4.x-java7/solr/build/solr-core/test-files/solr/collection1/lib/README' to classloader
[junit4:junit4]   2> 3755 T760 oasc.SolrResourceLoader.replaceClassLoader Adding 'file:/usr/home/hudson/hudson-slave/workspace/Lucene-Solr-Tests-4.x-java7/solr/build/solr-core/test-files/solr/collection1/lib/classes/' to classloader
[junit4:junit4]   2> 3812 T760 oasc.SolrConfig.<init> Using Lucene MatchVersion: LUCENE_41
[junit4:junit4]   2> 3867 T760 oasc.SolrConfig.<init> Loaded SolrConfig: solrconfig.xml
[junit4:junit4]   2> 3968 T760 oass.IndexSchema.readSchema Reading Solr Schema
[junit4:junit4]   2> 3979 T760 oass.IndexSchema.readSchema Schema name=test
[junit4:junit4]   2> 4689 T760 oass.OpenExchangeRatesOrgProvider.init Initialized with rates=open-exchange-rates.json, refreshInterval=1440.
[junit4:junit4]   2> 4701 T760 oass.IndexSchema.readSchema default search field in schema is text
[junit4:junit4]   2> 4705 T760 oass.IndexSchema.readSchema unique key field: id
[junit4:junit4]   2> 4753 T760 oass.FileExchangeRateProvider.reload Reloading exchange rates from file currency.xml
[junit4:junit4]   2> 4759 T760 oass.FileExchangeRateProvider.reload Reloading exchange rates from file currency.xml
[junit4:junit4]   2> 4767 T760 oass.OpenExchangeRatesOrgProvider.reload Reloading exchange rates from open-exchange-rates.json
[junit4:junit4]   2> 4769 T760 oass.OpenExchangeRatesOrgProvider.reload Reloading exchange rates from open-exchange-rates.json
[junit4:junit4]   2> 4772 T760 oasc.SolrCore.<init> [collection1] Opening new SolrCore at /usr/home/hudson/hudson-slave/workspace/Lucene-Solr-Tests-4.x-java7/solr/build/solr-core/test-files/solr/collection1/, dataDir=./org.apache.solr.cloud.BasicDistributedZkTest-1349149944493/control/data/
[junit4:junit4]   2> 4772 T760 oasc.JmxMonitoredMap.<init> JMX monitoring is enabled. Adding Solr mbeans to JMX Server: com.sun.jmx.mbeanserver.JmxMBeanServer@184ce1cd
[junit4:junit4]   2> 4775 T760 oasc.SolrCore.getNewIndexDir New index directory detected: old=null new=./org.apache.solr.cloud.BasicDistributedZkTest-1349149944493/control/data/index/
[junit4:junit4]   2> 4776 T760 oasc.SolrCore.initIndex WARNING [collection1] Solr index directory './org.apache.solr.cloud.BasicDistributedZkTest-1349149944493/control/data/index' doesn't exist. Creating new index...
[junit4:junit4]   2> 4777 T760 oasc.CachingDirectoryFactory.get return new directory for /usr/home/hudson/hudson-slave/workspace/Lucene-Solr-Tests-4.x-java7/solr/build/solr-core/test/J0/./org.apache.solr.cloud.BasicDistributedZkTest-1349149944493/control/data/index forceNew:false
[junit4:junit4]   2> 4792 T760 oasc.SolrDeletionPolicy.onCommit SolrDeletionPolicy.onCommit: commits:num=1
[junit4:junit4]   2> 		commit{dir=NRTCachingDirectory(org.apache.lucene.store.NIOFSDirectory@/usr/home/hudson/hudson-slave/workspace/Lucene-Solr-Tests-4.x-java7/solr/build/solr-core/test/J0/org.apache.solr.cloud.BasicDistributedZkTest-1349149944493/control/data/index lockFactory=org.apache.lucene.store.NativeFSLockFactory@2003a6d0; maxCacheMB=48.0 maxMergeSizeMB=4.0),segFN=segments_1,generation=1,filenames=[segments_1]
[junit4:junit4]   2> 4793 T760 oasc.SolrDeletionPolicy.updateCommits newest commit = 1
[junit4:junit4]   2> 4869 T760 oasc.SolrCore.initWriters created xml: solr.XMLResponseWriter
[junit4:junit4]   2> 4872 T760 oasup.UpdateRequestProcessorChain.init inserting DistributedUpdateProcessorFactory into updateRequestProcessorChain "dedupe"
[junit4:junit4]   2> 4873 T760 oasup.UpdateRequestProcessorChain.init inserting DistributedUpdateProcessorFactory into updateRequestProcessorChain "dedupe-allfields"
[junit4:junit4]   2> 4873 T760 oasup.UpdateRequestProcessorChain.init inserting DistributedUpdateProcessorFactory into updateRequestProcessorChain "stored_sig"
[junit4:junit4]   2> 4874 T760 oasup.UpdateRequestProcessorChain.init inserting DistributedUpdateProcessorFactory into updateRequestProcessorChain "uniq-fields"
[junit4:junit4]   2> 4875 T760 oasup.UpdateRequestProcessorChain.init inserting DistributedUpdateProcessorFactory into updateRequestProcessorChain "distrib-dup-test-chain-implicit"
[junit4:junit4]   2> 4875 T760 oasc.RequestHandlers.initHandlersFromConfig adding lazy requestHandler: solr.ReplicationHandler
[junit4:junit4]   2> 4876 T760 oasc.RequestHandlers.initHandlersFromConfig created /replication: solr.ReplicationHandler
[junit4:junit4]   2> 4877 T760 oasc.RequestHandlers.initHandlersFromConfig created standard: solr.StandardRequestHandler
[junit4:junit4]   2> 4878 T760 oasc.RequestHandlers.initHandlersFromConfig created /get: solr.RealTimeGetHandler
[junit4:junit4]   2> 4878 T760 oasc.RequestHandlers.initHandlersFromConfig created dismax: solr.SearchHandler
[junit4:junit4]   2> 4879 T760 oasc.RequestHandlers.initHandlersFromConfig created mock: org.apache.solr.core.MockQuerySenderListenerReqHandler
[junit4:junit4]   2> 4880 T760 oasc.RequestHandlers.initHandlersFromConfig created /admin/: org.apache.solr.handler.admin.AdminHandlers
[junit4:junit4]   2> 4880 T760 oasc.RequestHandlers.initHandlersFromConfig created defaults: solr.StandardRequestHandler
[junit4:junit4]   2> 4881 T760 oasc.RequestHandlers.initHandlersFromConfig adding lazy requestHandler: solr.StandardRequestHandler
[junit4:junit4]   2> 4881 T760 oasc.RequestHandlers.initHandlersFromConfig created lazy: solr.StandardRequestHandler
[junit4:junit4]   2> 4882 T760 oasc.RequestHandlers.initHandlersFromConfig created /update: solr.UpdateRequestHandler
[junit4:junit4]   2> 4883 T760 oasc.RequestHandlers.initHandlersFromConfig created /terms: org.apache.solr.handler.component.SearchHandler
[junit4:junit4]   2> 4884 T760 oasc.RequestHandlers.initHandlersFromConfig created spellCheckCompRH: org.apache.solr.handler.component.SearchHandler
[junit4:junit4]   2> 4884 T760 oasc.RequestHandlers.initHandlersFromConfig created spellCheckCompRH_Direct: org.apache.solr.handler.component.SearchHandler
[junit4:junit4]   2> 4885 T760 oasc.RequestHandlers.initHandlersFromConfig created spellCheckWithWordbreak: org.apache.solr.handler.component.SearchHandler
[junit4:junit4]   2> 4886 T760 oasc.RequestHandlers.initHandlersFromConfig created spellCheckWithWordbreak_Direct: org.apache.solr.handler.component.SearchHandler
[junit4:junit4]   2> 4886 T760 oasc.RequestHandlers.initHandlersFromConfig created spellCheckCompRH1: org.apache.solr.handler.component.SearchHandler
[junit4:junit4]   2> 4887 T760 oasc.RequestHandlers.initHandlersFromConfig created tvrh: org.apache.solr.handler.component.SearchHandler
[junit4:junit4]   2> 4888 T760 oasc.RequestHandlers.initHandlersFromConfig created /mlt: solr.MoreLikeThisHandler
[junit4:junit4]   2> 4888 T760 oasc.RequestHandlers.initHandlersFromConfig created /debug/dump: solr.DumpRequestHandler
[junit4:junit4]   2> 4902 T760 oashl.XMLLoader.init xsltCacheLifetimeSeconds=60
[junit4:junit4]   2> 4907 T760 oasc.SolrCore.initDeprecatedSupport WARNING solrconfig.xml uses deprecated <admin/gettableFiles>, Please update your config to use the ShowFileRequestHandler.
[junit4:junit4]   2> 4910 T760 oasc.SolrCore.initDeprecatedSupport WARNING adding ShowFileRequestHandler with hidden files: [SCHEMA.XML, OLD_SYNONYMS.TXT, STOPWORDS.TXT, PROTWORDS.TXT, OPEN-EXCHANGE-RATES.JSON, SYNONYMS.TXT, CURRENCY.XML, MAPPING-ISOLATIN1ACCENT.TXT]
[junit4:junit4]   2> 4914 T760 oass.SolrIndexSearcher.<init> Opening Searcher@61740b61 main
[junit4:junit4]   2> 4916 T760 oasu.CommitTracker.<init> Hard AutoCommit: disabled
[junit4:junit4]   2> 4916 T760 oasu.CommitTracker.<init> Soft AutoCommit: disabled
[junit4:junit4]   2> 4917 T760 oashc.SpellCheckComponent.inform Initializing spell checkers
[junit4:junit4]   2> 4952 T760 oass.DirectSolrSpellChecker.init init: {name=direct,classname=DirectSolrSpellChecker,field=lowerfilt,minQueryLength=3}
[junit4:junit4]   2> 5070 T783 oasc.SolrCore.registerSearcher [collection1] Registered new searcher Searcher@61740b61 main{StandardDirectoryReader(segments_1:1)}
[junit4:junit4]   2> 5076 T767 oazs.PrepRequestProcessor.pRequest Got user-level KeeperException when processing sessionid:0x13a1f9a6c480002 type:create cxid:0x56 zxid:0xfffffffffffffffe txntype:unknown reqpath:n/a Error Path:/solr/overseer/queue Error:KeeperErrorCode = NoNode for /solr/overseer/queue
[junit4:junit4]   2> 5116 T760 oasc.CoreContainer.register registering core: collection1
[junit4:junit4]   2> 5117 T760 oasc.ZkController.register Register shard - core:collection1 address:http://127.0.0.1:49417/solr shardId:control_shard
[junit4:junit4]   2> 5133 T760 oascsi.HttpClientUtil.createClient Creating new http client, config:maxConnections=10000&maxConnectionsPerHost=20&connTimeout=30000&socketTimeout=30000&retry=false
[junit4:junit4]   2> 5155 T760 oascc.SolrZkClient.makePath makePath: /collections/control_collection/leader_elect/control_shard/election
[junit4:junit4]   2> 5179 T767 oazs.PrepRequestProcessor.pRequest Got user-level KeeperException when processing sessionid:0x13a1f9a6c480002 type:delete cxid:0x65 zxid:0xfffffffffffffffe txntype:unknown reqpath:n/a Error Path:/solr/collections/control_collection/leaders Error:KeeperErrorCode = NoNode for /solr/collections/control_collection/leaders
[junit4:junit4]   2> 5185 T760 oasc.ShardLeaderElectionContext.runLeaderProcess Running the leader process.
[junit4:junit4]   2> 5187 T767 oazs.PrepRequestProcessor.pRequest Got user-level KeeperException when processing sessionid:0x13a1f9a6c480002 type:create cxid:0x66 zxid:0xfffffffffffffffe txntype:unknown reqpath:n/a Error Path:/solr/overseer Error:KeeperErrorCode = NodeExists for /solr/overseer
[junit4:junit4]   2> 5249 T781 oascc.ZkStateReader.updateClusterState Updating cloud state from ZooKeeper... 
[junit4:junit4]   2> 5268 T767 oazs.PrepRequestProcessor.pRequest Got user-level KeeperException when processing sessionid:0x13a1f9a6c480002 type:create cxid:0x6d zxid:0xfffffffffffffffe txntype:unknown reqpath:n/a Error Path:/solr/overseer/queue-work Error:KeeperErrorCode = NoNode for /solr/overseer/queue-work
[junit4:junit4]   2> 5331 T780 oascc.ZkStateReader$2.process A cluster state change has occurred - updating...
[junit4:junit4]   2> 5691 T760 oasc.ShardLeaderElectionContext.waitForReplicasToComeUp Enough replicas found to continue.
[junit4:junit4]   2> 5692 T760 oasc.ShardLeaderElectionContext.runLeaderProcess I may be the new leader - try and sync
[junit4:junit4]   2> 5693 T760 oasc.SyncStrategy.sync Sync replicas to http://127.0.0.1:49417/solr/collection1/
[junit4:junit4]   2> 5694 T760 oasc.SyncStrategy.syncReplicas Sync Success - now sync replicas to me
[junit4:junit4]   2> 5695 T760 oasc.SyncStrategy.syncToMe http://127.0.0.1:49417/solr/collection1/ has no replicas
[junit4:junit4]   2> 5695 T760 oasc.ShardLeaderElectionContext.runLeaderProcess I am the new leader: http://127.0.0.1:49417/solr/collection1/
[junit4:junit4]   2> 5696 T760 oascc.SolrZkClient.makePath makePath: /collections/control_collection/leaders/control_shard
[junit4:junit4]   2> 5704 T767 oazs.PrepRequestProcessor.pRequest Got user-level KeeperException when processing sessionid:0x13a1f9a6c480002 type:create cxid:0x8b zxid:0xfffffffffffffffe txntype:unknown reqpath:n/a Error Path:/solr/overseer Error:KeeperErrorCode = NodeExists for /solr/overseer
[junit4:junit4]   2> 5841 T781 oascc.ZkStateReader.updateClusterState Updating cloud state from ZooKeeper... 
[junit4:junit4]   2> 5859 T780 oascc.ZkStateReader$2.process A cluster state change has occurred - updating...
[junit4:junit4]   2> 5870 T760 oasc.ZkController.register We are http://127.0.0.1:49417/solr/collection1/ and leader is http://127.0.0.1:49417/solr/collection1/
[junit4:junit4]   2> 5871 T760 oasc.ZkController.register No LogReplay needed for core=collection1 baseURL=http://127.0.0.1:49417/solr
[junit4:junit4]   2> 5871 T760 oasc.ZkController.checkRecovery I am the leader, no recovery necessary
[junit4:junit4]   2> 5875 T760 oascc.ZkStateReader.updateClusterState Updating cloud state from ZooKeeper... 
[junit4:junit4]   2> 5876 T760 oass.SolrDispatchFilter.init user.dir=/usr/home/hudson/hudson-slave/workspace/Lucene-Solr-Tests-4.x-java7/solr/build/solr-core/test/J0
[junit4:junit4]   2> 5877 T760 oass.SolrDispatchFilter.init SolrDispatchFilter.init() done
[junit4:junit4]   2> 5877 T760 oascsi.HttpClientUtil.createClient Creating new http client, config:maxConnections=128&maxConnectionsPerHost=32&followRedirects=false
[junit4:junit4]   2> 6077 T760 oejs.Server.doStart jetty-8.1.2.v20120308
[junit4:junit4]   2> 6080 T760 oejs.AbstractConnector.doStart Started SocketConnector@0.0.0.0:49425
[junit4:junit4]   2> 6080 T760 oasc.SolrResourceLoader.locateSolrHome JNDI not configured for solr (NoInitialContextEx)
[junit4:junit4]   2> 6081 T760 oasc.SolrResourceLoader.locateSolrHome using system property solr.solr.home: /usr/home/hudson/hudson-slave/workspace/Lucene-Solr-Tests-4.x-java7/solr/build/solr-core/test/J0/./solrtest-jetty1-1349149950347
[junit4:junit4]   2> 6081 T760 oasc.SolrResourceLoader.<init> new SolrResourceLoader for deduced Solr Home: '/usr/home/hudson/hudson-slave/workspace/Lucene-Solr-Tests-4.x-java7/solr/build/solr-core/test/J0/./solrtest-jetty1-1349149950347/'
[junit4:junit4]   2> 6111 T760 oass.SolrDispatchFilter.init SolrDispatchFilter.init()
[junit4:junit4]   2> 6112 T760 oasc.SolrResourceLoader.locateSolrHome JNDI not configured for solr (NoInitialContextEx)
[junit4:junit4]   2> 6112 T760 oasc.SolrResourceLoader.locateSolrHome using system property solr.solr.home: /usr/home/hudson/hudson-slave/workspace/Lucene-Solr-Tests-4.x-java7/solr/build/solr-core/test/J0/./solrtest-jetty1-1349149950347
[junit4:junit4]   2> 6112 T760 oasc.CoreContainer$Initializer.initialize looking for solr.xml: /usr/home/hudson/hudson-slave/workspace/Lucene-Solr-Tests-4.x-java7/solr/build/solr-core/test/J0/./solrtest-jetty1-1349149950347/solr.xml
[junit4:junit4]   2> 6113 T760 oasc.CoreContainer.<init> New CoreContainer 34267471
[junit4:junit4]   2> 6113 T760 oasc.CoreContainer.load Loading CoreContainer using Solr Home: '/usr/home/hudson/hudson-slave/workspace/Lucene-Solr-Tests-4.x-java7/solr/build/solr-core/test/J0/./solrtest-jetty1-1349149950347/'
[junit4:junit4]   2> 6113 T760 oasc.SolrResourceLoader.<init> new SolrResourceLoader for directory: '/usr/home/hudson/hudson-slave/workspace/Lucene-Solr-Tests-4.x-java7/solr/build/solr-core/test/J0/./solrtest-jetty1-1349149950347/'
[junit4:junit4]   2> 6141 T760 oasc.CoreContainer.load Registering Log Listener
[junit4:junit4]   2> 6153 T760 oasc.CoreContainer.initZooKeeper Zookeeper client=127.0.0.1:49410/solr
[junit4:junit4]   2> 6154 T760 oaz.ZooKeeper.<init> Initiating client connection, connectString=127.0.0.1:49410/solr sessionTimeout=5000 watcher=org.apache.solr.common.cloud.ConnectionManager@1c46e27
[junit4:junit4]   2> 6155 T793 oaz.ClientCnxn$SendThread.startConnect Opening socket connection to server /127.0.0.1:49410
[junit4:junit4]   2> 6155 T760 oascc.ConnectionManager.waitForConnected Waiting for client to connect to ZooKeeper
[junit4:junit4]   2> 6156 T793 oaz.ClientCnxn$SendThread.primeConnection Socket connection established to localhost/127.0.0.1:49410, initiating session
[junit4:junit4]   2> 6156 T762 oazs.NIOServerCnxn$Factory.run Accepted socket connection from /140.211.11.196:49426
[junit4:junit4]   2> 6157 T762 oazs.NIOServerCnxn.readConnectRequest Client attempting to establish new session at /140.211.11.196:49426
[junit4:junit4]   2> 6159 T764 oazs.NIOServerCnxn.finishSessionInit Established session 0x13a1f9a6c480003 with negotiated timeout 5000 for client /140.211.11.196:49426
[junit4:junit4]   2> 6159 T793 oaz.ClientCnxn$SendThread.readConnectResult Session establishment complete on server localhost/127.0.0.1:49410, sessionid = 0x13a1f9a6c480003, negotiated timeout = 5000
[junit4:junit4]   2> 6159 T794 oascc.ConnectionManager.process Watcher org.apache.solr.common.cloud.ConnectionManager@1c46e27 name:ZooKeeperConnection Watcher:127.0.0.1:49410/solr got event WatchedEvent state:SyncConnected type:None path:null path:null type:None
[junit4:junit4]   2> 6159 T760 oascc.ConnectionManager.waitForConnected Client is connected to ZooKeeper
[junit4:junit4]   2> 6160 T767 oazs.PrepRequestProcessor.pRequest Got user-level KeeperException when processing sessionid:0x13a1f9a6c480003 type:create cxid:0x1 zxid:0xfffffffffffffffe txntype:unknown reqpath:n/a Error Path:/solr/overseer Error:KeeperErrorCode = NodeExists for /solr/overseer
[junit4:junit4]   2> 6162 T767 oazs.PrepRequestProcessor.pRequest Got user-level KeeperException when processing sessionid:0x13a1f9a6c480003 type:create cxid:0x2 zxid:0xfffffffffffffffe txntype:unknown reqpath:n/a Error Path:/solr/overseer Error:KeeperErrorCode = NodeExists for /solr/overseer
[junit4:junit4]   2> 6164 T760 oasc.ZkController.createEphemeralLiveNode Register node as live in ZooKeeper:/live_nodes/127.0.0.1:49425_solr
[junit4:junit4]   2> 6165 T767 oazs.PrepRequestProcessor.pRequest Got user-level KeeperException when processing sessionid:0x13a1f9a6c480003 type:delete cxid:0x4 zxid:0xfffffffffffffffe txntype:unknown reqpath:n/a Error Path:/solr/live_nodes/127.0.0.1:49425_solr Error:KeeperErrorCode = NoNode for /solr/live_nodes/127.0.0.1:49425_solr
[junit4:junit4]   2> 6166 T760 oascc.SolrZkClient.makePath makePath: /live_nodes/127.0.0.1:49425_solr
[junit4:junit4]   2> 6169 T780 oascc.ZkStateReader$3.process Updating live nodes
[junit4:junit4]   2> 6171 T760 oashc.HttpShardHandlerFactory.getParameter Setting socketTimeout to: 0
[junit4:junit4]   2> 6171 T760 oashc.HttpShardHandlerFactory.getParameter Setting urlScheme to: http://
[junit4:junit4]   2> 6171 T760 oashc.HttpShardHandlerFactory.getParameter Setting connTimeout to: 0
[junit4:junit4]   2> 6172 T760 oashc.HttpShardHandlerFactory.getParameter Setting maxConnectionsPerHost to: 20
[junit4:junit4]   2> 6172 T760 oashc.HttpShardHandlerFactory.getParameter Setting corePoolSize to: 0
[junit4:junit4]   2> 6172 T760 oashc.HttpShardHandlerFactory.getParameter Setting maximumPoolSize to: 2147483647
[junit4:junit4]   2> 6173 T760 oashc.HttpShardHandlerFactory.getParameter Setting maxThreadIdleTime to: 5
[junit4:junit4]   2> 6173 T760 oashc.HttpShardHandlerFactory.getParameter Setting sizeOfQueue to: -1
[junit4:junit4]   2> 6173 T760 oashc.HttpShardHandlerFactory.getParameter Setting fairnessPolicy to: false
[junit4:junit4]   2> 6174 T760 oascsi.HttpClientUtil.createClient Creating new http client, config:maxConnectionsPerHost=20&maxConnections=10000&socketTimeout=0&connTimeout=0&retry=false
[junit4:junit4]   2> 6193 T760 oascc.ZkStateReader.createClusterStateWatchersAndUpdate Updating cluster state from ZooKeeper... 
[junit4:junit4]   2> 6199 T760 oasc.CoreContainer.create Creating SolrCore 'collection1' using instanceDir: /usr/home/hudson/hudson-slave/workspace/Lucene-Solr-Tests-4.x-java7/solr/build/solr-core/test/J0/./solrtest-jetty1-1349149950347/collection1
[junit4:junit4]   2> 6200 T760 oasc.ZkController.createCollectionZkNode Check for collection zkNode:collection1
[junit4:junit4]   2> 6201 T760 oasc.ZkController.createCollectionZkNode Collection zkNode exists
[junit4:junit4]   2> 6201 T760 oasc.ZkController.readConfigName Load collection config from:/collections/collection1
[junit4:junit4]   2> 6203 T760 oasc.SolrResourceLoader.<init> new SolrResourceLoader for directory: '/usr/home/hudson/hudson-slave/workspace/Lucene-Solr-Tests-4.x-java7/solr/build/solr-core/test/J0/./solrtest-jetty1-1349149950347/collection1/'
[junit4:junit4]   2> 6204 T760 oasc.SolrResourceLoader.replaceClassLoader Adding 'file:/usr/home/hudson/hudson-slave/workspace/Lucene-Solr-Tests-4.x-java7/solr/build/solr-core/test/J0/solrtest-jetty1-1349149950347/collection1/lib/README' to classloader
[junit4:junit4]   2> 6205 T760 oasc.SolrResourceLoader.replaceClassLoader Adding 'file:/usr/home/hudson/hudson-slave/workspace/Lucene-Solr-Tests-4.x-java7/solr/build/solr-core/test/J0/solrtest-jetty1-1349149950347/collection1/lib/classes/' to classloader
[junit4:junit4]   2> 6248 T760 oasc.SolrConfig.<init> Using Lucene MatchVersion: LUCENE_41
[junit4:junit4]   2> 6302 T760 oasc.SolrConfig.<init> Loaded SolrConfig: solrconfig.xml
[junit4:junit4]   2> 6366 T781 oascc.ZkStateReader.updateClusterState Updating cloud state from ZooKeeper... 
[junit4:junit4]   2> 6384 T780 oascc.ZkStateReader$2.process A cluster state change has occurred - updating...
[junit4:junit4]   2> 6403 T760 oass.IndexSchema.readSchema Reading Solr Schema
[junit4:junit4]   2> 6405 T794 oascc.ZkStateReader$2.process A cluster state change has occurred - updating...
[junit4:junit4]   2> 6412 T760 oass.IndexSchema.readSchema Schema name=test
[junit4:junit4]   2> 7033 T760 oass.OpenExchangeRatesOrgProvider.init Initialized with rates=open-exchange-rates.json, refreshInterval=1440.
[junit4:junit4]   2> 7045 T760 oass.IndexSchema.readSchema default search field in schema is text
[junit4:junit4]   2> 7050 T760 oass.IndexSchema.readSchema unique key field: id
[junit4:junit4]   2> 7069 T760 oass.FileExchangeRateProvider.reload Reloading exchange rates from file currency.xml
[junit4:junit4]   2> 7074 T760 oass.FileExchangeRateProvider.reload Reloading exchange rates from file currency.xml
[junit4:junit4]   2> 7080 T760 oass.OpenExchangeRatesOrgProvider.reload Reloading exchange rates from open-exchange-rates.json
[junit4:junit4]   2> 7082 T760 oass.OpenExchangeRatesOrgProvider.reload Reloading exchange rates from open-exchange-rates.json
[junit4:junit4]   2> 7083 T760 oasc.SolrCore.<init> [collection1] Opening new SolrCore at /usr/home/hudson/hudson-slave/workspace/Lucene-Solr-Tests-4.x-java7/solr/build/solr-core/test/J0/./solrtest-jetty1-1349149950347/collection1/, dataDir=./org.apache.solr.cloud.BasicDistributedZkTest-1349149944493/jetty1/
[junit4:junit4]   2> 7084 T760 oasc.JmxMonitoredMap.<init> JMX monitoring is enabled. Adding Solr mbeans to JMX Server: com.sun.jmx.mbeanserver.JmxMBeanServer@184ce1cd
[junit4:junit4]   2> 7085 T760 oasc.SolrCore.getNewIndexDir New index directory detected: old=null new=./org.apache.solr.cloud.BasicDistributedZkTest-1349149944493/jetty1/index/
[junit4:junit4]   2> 7086 T760 oasc.SolrCore.initIndex WARNING [collection1] Solr index directory './org.apache.solr.cloud.BasicDistributedZkTest-1349149944493/jetty1/index' doesn't exist. Creating new index...
[junit4:junit4]   2> 7086 T760 oasc.CachingDirectoryFactory.get return new directory for /usr/home/hudson/hudson-slave/workspace/Lucene-Solr-Tests-4.x-java7/solr/build/solr-core/test/J0/./org.apache.solr.cloud.BasicDistributedZkTest-1349149944493/jetty1/index forceNew:false
[junit4:junit4]   2> 7105 T760 oasc.SolrDeletionPolicy.onCommit SolrDeletionPolicy.onCommit: commits:num=1
[junit4:junit4]   2> 		commit{dir=NRTCachingDirectory(org.apache.lucene.store.NIOFSDirectory@/usr/home/hudson/hudson-slave/workspace/Lucene-Solr-Tests-4.x-java7/solr/build/solr-core/test/J0/org.apache.solr.cloud.BasicDistributedZkTest-1349149944493/jetty1/index lockFactory=org.apache.lucene.store.NativeFSLockFactory@3623e183; maxCacheMB=48.0 maxMergeSizeMB=4.0),segFN=segments_1,generation=1,filenames=[segments_1]
[junit4:junit4]   2> 7106 T760 oasc.SolrDeletionPolicy.updateCommits newest commit = 1
[junit4:junit4]   2> 7107 T760 oasc.SolrCore.initWriters created xml: solr.XMLResponseWriter
[junit4:junit4]   2> 7109 T760 oasup.UpdateRequestProcessorChain.init inserting DistributedUpdateProcessorFactory into updateRequestProcessorChain "dedupe"
[junit4:junit4]   2> 7110 T760 oasup.UpdateRequestProcessorChain.init inserting DistributedUpdateProcessorFactory into updateRequestProcessorChain "dedupe-allfields"
[junit4:junit4]   2> 7110 T760 oasup.UpdateRequestProcessorChain.init inserting DistributedUpdateProcessorFactory into updateRequestProcessorChain "stored_sig"
[junit4:junit4]   2> 7111 T760 oasup.UpdateRequestProcessorChain.init inserting DistributedUpdateProcessorFactory into updateRequestProcessorChain "uniq-fields"
[junit4:junit4]   2> 7111 T760 oasup.UpdateRequestProcessorChain.init inserting DistributedUpdateProcessorFactory into updateRequestProcessorChain "distrib-dup-test-chain-implicit"
[junit4:junit4]   2> 7112 T760 oasc.RequestHandlers.initHandlersFromConfig adding lazy requestHandler: solr.ReplicationHandler
[junit4:junit4]   2> 7112 T760 oasc.RequestHandlers.initHandlersFromConfig created /replication: solr.ReplicationHandler
[junit4:junit4]   2> 7113 T760 oasc.RequestHandlers.initHandlersFromConfig created standard: solr.StandardRequestHandler
[junit4:junit4]   2> 7113 T760 oasc.RequestHandlers.initHandlersFromConfig created /get: solr.RealTimeGetHandler
[junit4:junit4]   2> 7114 T760 oasc.RequestHandlers.initHandlersFromConfig created dismax: solr.SearchHandler
[junit4:junit4]   2> 7114 T760 oasc.RequestHandlers.initHandlersFromConfig created mock: org.apache.solr.core.MockQuerySenderListenerReqHandler
[junit4:junit4]   2> 7115 T760 oasc.RequestHandlers.initHandlersFromConfig created /admin/: org.apache.solr.handler.admin.AdminHandlers
[junit4:junit4]   2> 7115 T760 oasc.RequestHandlers.initHandlersFromConfig created defaults: solr.StandardRequestHandler
[junit4:junit4]   2> 7116 T760 oasc.RequestHandlers.initHandlersFromConfig adding lazy requestHandler: solr.StandardRequestHandler
[junit4:junit4]   2> 7116 T760 oasc.RequestHandlers.initHandlersFromConfig created lazy: solr.StandardRequestHandler
[junit4:junit4]   2> 7117 T760 oasc.RequestHandlers.initHandlersFromConfig created /update: solr.UpdateRequestHandler
[junit4:junit4]   2> 7117 T760 oasc.RequestHandlers.initHandlersFromConfig created /terms: org.apache.solr.handler.component.SearchHandler
[junit4:junit4]   2> 7118 T760 oasc.RequestHandlers.initHandlersFromConfig created spellCheckCompRH: org.apache.solr.handler.component.SearchHandler
[junit4:junit4]   2> 7118 T760 oasc.RequestHandlers.initHandlersFromConfig created spellCheckCompRH_Direct: org.apache.solr.handler.component.SearchHandler
[junit4:junit4]   2> 7119 T760 oasc.RequestHandlers.initHandlersFromConfig created spellCheckWithWordbreak: org.apache.solr.handler.component.SearchHandler
[junit4:junit4]   2> 7120 T760 oasc.RequestHandlers.initHandlersFromConfig created spellCheckWithWordbreak_Direct: org.apache.solr.handler.component.SearchHandler
[junit4:junit4]   2> 7120 T760 oasc.RequestHandlers.initHandlersFromConfig created spellCheckCompRH1: org.apache.solr.handler.component.SearchHandler
[junit4:junit4]   2> 7121 T760 oasc.RequestHandlers.initHandlersFromConfig created tvrh: org.apache.solr.handler.component.SearchHandler
[junit4:junit4]   2> 7121 T760 oasc.RequestHandlers.initHandlersFromConfig created /mlt: solr.MoreLikeThisHandler
[junit4:junit4]   2> 7122 T760 oasc.RequestHandlers.initHandlersFromConfig created /debug/dump: solr.DumpRequestHandler
[junit4:junit4]   2> 7132 T760 oashl.XMLLoader.init xsltCacheLifetimeSeconds=60
[junit4:junit4]   2> 7136 T760 oasc.SolrCore.initDeprecatedSupport WARNING solrconfig.xml uses deprecated <admin/gettableFiles>, Please update your config to use the ShowFileRequestHandler.
[junit4:junit4]   2> 7138 T760 oasc.SolrCore.initDeprecatedSupport WARNING adding ShowFileRequestHandler with hidden files: [SCHEMA.XML, OLD_SYNONYMS.TXT, STOPWORDS.TXT, PROTWORDS.TXT, OPEN-EXCHANGE-RATES.JSON, SYNONYMS.TXT, CURRENCY.XML, MAPPING-ISOLATIN1ACCENT.TXT]
[junit4:junit4]   2> 7143 T760 oass.SolrIndexSearcher.<init> Opening Searcher@6e0e2fea main
[junit4:junit4]   2> 7144 T760 oasu.CommitTracker.<init> Hard AutoCommit: disabled
[junit4:junit4]   2> 7144 T760 oasu.CommitTracker.<init> Soft AutoCommit: disabled
[junit4:junit4]   2> 7145 T760 oashc.SpellCheckComponent.inform Initializing spell checkers
[junit4:junit4]   2> 7161 T760 oass.DirectSolrSpellChecker.init init: {name=direct,classname=DirectSolrSpellChecker,field=lowerfilt,minQueryLength=3}
[junit4:junit4]   2> 7244 T795 oasc.SolrCore.registerSearcher [collection1] Registered new searcher Searcher@6e0e2fea main{StandardDirectoryReader(segments_1:1)}
[junit4:junit4]   2> 7394 T781 oascc.ZkStateReader.updateClusterState Updating cloud state from ZooKeeper... 
[junit4:junit4]   2> 7410 T794 oascc.ZkStateReader$2.process A cluster state change has occurred - updating...
[junit4:junit4]   2> 7410 T780 oascc.ZkStateReader$2.process A cluster state change has occurred - updating...
[junit4:junit4]   2> 7754 T760 oasc.CoreContainer.register registering core: collection1
[junit4:junit4]   2> 7754 T760 oasc.ZkController.register Register shard - core:collection1 address:http://127.0.0.1:49425/solr shardId:shard1
[junit4:junit4]   2> 7756 T760 oascc.SolrZkClient.makePath makePath: /collections/collection1/leader_elect/shard1/election
[junit4:junit4]   2> 7775 T767 oazs.PrepRequestProcessor.pRequest Got user-level KeeperException when processing sessionid:0x13a1f9a6c480003 type:delete cxid:0x43 zxid:0xfffffffffffffffe txntype:unknown reqpath:n/a Error Path:/solr/collections/collection1/leaders Error:KeeperErrorCode = NoNode for /solr/collections/collection1/leaders
[junit4:junit4]   2> 7782 T760 oasc.ShardLeaderElectionContext.runLeaderProcess Running the leader process.
[junit4:junit4]   2> 7783 T767 oazs.PrepRequestProcessor.pRequest Got user-level KeeperException when processing sessionid:0x13a1f9a6c480003 type:create cxid:0x44 zxid:0xfffffffffffffffe txntype:unknown reqpath:n/a Error Path:/solr/overseer Error:KeeperErrorCode = NodeExists for /solr/overseer
[junit4:junit4]   2> 7787 T760 oasc.ShardLeaderElectionContext.waitForReplicasToComeUp Enough replicas found to continue.
[junit4:junit4]   2> 7787 T760 oasc.ShardLeaderElectionContext.runLeaderProcess I may be the new leader - try and sync
[junit4:junit4]   2> 7788 T760 oasc.SyncStrategy.sync Sync replicas to http://127.0.0.1:49425/solr/collection1/
[junit4:junit4]   2> 7788 T760 oasc.SyncStrategy.syncReplicas Sync Success - now sync replicas to me
[junit4:junit4]   2> 7789 T760 oasc.SyncStrategy.syncToMe http://127.0.0.1:49425/solr/collection1/ has no replicas
[junit4:junit4]   2> 7790 T760 oasc.ShardLeaderElectionContext.runLeaderProcess I am the new leader: http://127.0.0.1:49425/solr/collection1/
[junit4:junit4]   2> 7790 T760 oascc.SolrZkClient.makePath makePath: /collections/collection1/leaders/shard1
[junit4:junit4]   2> 7796 T767 oazs.PrepRequestProcessor.pRequest Got user-level KeeperException when processing sessionid:0x13a1f9a6c480003 type:create cxid:0x4e zxid:0xfffffffffffffffe txntype:unknown reqpath:n/a Error Path:/solr/overseer Error:KeeperErrorCode = NodeExists for /solr/overseer
[junit4:junit4]   2> 7915 T781 oascc.ZkStateReader.updateClusterState Updating cloud state from ZooKeeper... 
[junit4:junit4]   2> 7937 T794 oascc.ZkStateReader$2.process A cluster state change has occurred - updating...
[junit4:junit4]   2> 7937 T780 oascc.ZkStateReader$2.process A cluster state change has occurred - updating...
[junit4:junit4]   2> 7962 T760 oasc.ZkController.register We are http://127.0.0.1:49425/solr/collection1/ and leader is http://127.0.0.1:49425/solr/collection1/
[junit4:junit4]   2> 7962 T760 oasc.ZkController.register No LogReplay needed for core=collection1 baseURL=http://127.0.0.1:49425/solr
[junit4:junit4]   2> 7963 T760 oasc.ZkController.checkRecovery I am the leader, no recovery necessary
[junit4:junit4]   2> 7965 T760 oascc.ZkStateReader.updateClusterState Updating cloud state from ZooKeeper... 
[junit4:junit4]   2> 7966 T760 oass.SolrDispatchFilter.init user.dir=/usr/home/hudson/hudson-slave/workspace/Lucene-Solr-Tests-4.x-java7/solr/build/solr-core/test/J0
[junit4:junit4]   2> 7966 T760 oass.SolrDispatchFilter.init SolrDispatchFilter.init() done
[junit4:junit4]   2> 7967 T760 oascsi.HttpClientUtil.createClient Creating new http client, config:maxConnections=128&maxConnectionsPerHost=32&followRedirects=false
[junit4:junit4]   2> 8109 T760 oejs.Server.doStart jetty-8.1.2.v20120308
[junit4:junit4]   2> 8111 T760 oejs.AbstractConnector.doStart Started SocketConnector@0.0.0.0:49428
[junit4:junit4]   2> 8112 T760 oasc.SolrResourceLoader.locateSolrHome JNDI not configured for solr (NoInitialContextEx)
[junit4:junit4]   2> 8112 T760 oasc.SolrResourceLoader.locateSolrHome using system property solr.solr.home: /usr/home/hudson/hudson-slave/workspace/Lucene-Solr-Tests-4.x-java7/solr/build/solr-core/test/J0/./solrtest-jetty2-1349149952437
[junit4:junit4]   2> 8113 T760 oasc.SolrResourceLoader.<init> new SolrResourceLoader for deduced Solr Home: '/usr/home/hudson/hudson-slave/workspace/Lucene-Solr-Tests-4.x-java7/solr/build/solr-core/test/J0/./solrtest-jetty2-1349149952437/'
[junit4:junit4]   2> 8143 T760 oass.SolrDispatchFilter.init SolrDispatchFilter.init()
[junit4:junit4]   2> 8144 T760 oasc.SolrResourceLoader.locateSolrHome JNDI not configured for solr (NoInitialContextEx)
[junit4:junit4]   2> 8144 T760 oasc.SolrResourceLoader.locateSolrHome using system property solr.solr.home: /usr/home/hudson/hudson-slave/workspace/Lucene-Solr-Tests-4.x-java7/solr/build/solr-core/test/J0/./solrtest-jetty2-1349149952437
[junit4:junit4]   2> 8145 T760 oasc.CoreContainer$Initializer.initialize looking for solr.xml: /usr/home/hudson/hudson-slave/workspace/Lucene-Solr-Tests-4.x-java7/solr/build/solr-core/test/J0/./solrtest-jetty2-1349149952437/solr.xml
[junit4:junit4]   2> 8145 T760 oasc.CoreContainer.<init> New CoreContainer 910066512
[junit4:junit4]   2> 8145 T760 oasc.CoreContainer.load Loading CoreContainer using Solr Home: '/usr/home/hudson/hudson-slave/workspace/Lucene-Solr-Tests-4.x-java7/solr/build/solr-core/test/J0/./solrtest-jetty2-1349149952437/'
[junit4:junit4]   2> 8146 T760 oasc.SolrResourceLoader.<init> new SolrResourceLoader for directory: '/usr/home/hudson/hudson-slave/workspace/Lucene-Solr-Tests-4.x-java7/solr/build/solr-core/test/J0/./solrtest-jetty2-1349149952437/'
[junit4:junit4]   2> 8170 T760 oasc.CoreContainer.load Registering Log Listener
[junit4:junit4]   2> 8182 T760 oasc.CoreContainer.initZooKeeper Zookeeper client=127.0.0.1:49410/solr
[junit4:junit4]   2> 8183 T760 oaz.ZooKeeper.<init> Initiating client connection, connectString=127.0.0.1:49410/solr sessionTimeout=5000 watcher=org.apache.solr.common.cloud.ConnectionManager@2d584b77
[junit4:junit4]   2> 8184 T805 oaz.ClientCnxn$SendThread.startConnect Opening socket connection to server /127.0.0.1:49410
[junit4:junit4]   2> 8184 T760 oascc.ConnectionManager.waitForConnected Waiting for client to connect to ZooKeeper
[junit4:junit4]   2> 8185 T805 oaz.ClientCnxn$SendThread.primeConnection Socket connection established to localhost/127.0.0.1:49410, initiating session
[junit4:junit4]   2> 8186 T762 oazs.NIOServerCnxn$Factory.run Accepted socket connection from /140.211.11.196:49429
[junit4:junit4]   2> 8186 T762 oazs.NIOServerCnxn.readConnectRequest Client attempting to establish new session at /140.211.11.196:49429
[junit4:junit4]   2> 8195 T764 oazs.NIOServerCnxn.finishSessionInit Established session 0x13a1f9a6c480004 with negotiated timeout 5000 for client /140.211.11.196:49429
[junit4:junit4]   2> 8195 T805 oaz.ClientCnxn$SendThread.readConnectResult Session establishment complete on server localhost/127.0.0.1:49410, sessionid = 0x13a1f9a6c480004, negotiated timeout = 5000
[junit4:junit4]   2> 8196 T806 oascc.ConnectionManager.process Watcher org.apache.solr.common.cloud.ConnectionManager@2d584b77 name:ZooKeeperConnection Watcher:127.0.0.1:49410/solr got event WatchedEvent state:SyncConnected type:None path:null path:null type:None
[junit4:junit4]   2> 8196 T760 oascc.ConnectionManager.waitForConnected Client is connected to ZooKeeper
[junit4:junit4]   2> 8197 T767 oazs.PrepRequestProcessor.pRequest Got user-level KeeperException when processing sessionid:0x13a1f9a6c480004 type:create cxid:0x1 zxid:0xfffffffffffffffe txntype:unknown reqpath:n/a Error Path:/solr/overseer Error:KeeperErrorCode = NodeExists for /solr/overseer
[junit4:junit4]   2> 8198 T767 oazs.PrepRequestProcessor.pRequest Got user-level KeeperException when processing sessionid:0x13a1f9a6c480004 type:create cxid:0x2 zxid:0xfffffffffffffffe txntype:unknown reqpath:n/a Error Path:/solr/overseer Error:KeeperErrorCode = NodeExists for /solr/overseer
[junit4:junit4]   2> 8207 T760 oasc.ZkController.createEphemeralLiveNode Register node as live in ZooKeeper:/live_nodes/127.0.0.1:49428_solr
[junit4:junit4]   2> 8208 T767 oazs.PrepRequestProcessor.pRequest Got user-level KeeperException when processing sessionid:0x13a1f9a6c480004 type:delete cxid:0x4 zxid:0xfffffffffffffffe txntype:unknown reqpath:n/a Error Path:/solr/live_nodes/127.0.0.1:49428_solr Error:KeeperErrorCode = NoNode for /solr/live_nodes/127.0.0.1:49428_solr
[junit4:junit4]   2> 8209 T760 oascc.SolrZkClient.makePath makePath: /live_nodes/127.0.0.1:49428_solr
[junit4:junit4]   2> 8221 T794 oascc.ZkStateReader$3.process Updating live nodes
[junit4:junit4]   2> 8221 T780 oascc.ZkStateReader$3.process Updating live nodes
[junit4:junit4]   2> 8222 T760 oashc.HttpShardHandlerFactory.getParameter Setting socketTimeout to: 0
[junit4:junit4]   2> 8222 T760 oashc.HttpShardHandlerFactory.getParameter Setting urlScheme to: http://
[junit4:junit4]   2> 8223 T760 oashc.HttpShardHandlerFactory.getParameter Setting connTimeout to: 0
[junit4:junit4]   2> 8223 T760 oashc.HttpShardHandlerFactory.getParameter Setting maxConnectionsPerHost to: 20
[junit4:junit4]   2> 8223 T760 oashc.HttpShardHandlerFactory.getParameter Setting corePoolSize to: 0
[junit4:junit4]   2> 8224 T760 oashc.HttpShardHandlerFactory.getParameter Setting maximumPoolSize to: 2147483647
[junit4:junit4]   2> 8224 T760 oashc.HttpShardHandlerFactory.getParameter Setting maxThreadIdleTime to: 5
[junit4:junit4]   2> 8224 T760 oashc.HttpShardHandlerFactory.getParameter Setting sizeOfQueue to: -1
[junit4:junit4]   2> 8224 T760 oashc.HttpShardHandlerFactory.getParameter Setting fairnessPolicy to: false
[junit4:junit4]   2> 8225 T760 oascsi.HttpClientUtil.createClient Creating new http client, config:maxConnectionsPerHost=20&maxConnections=10000&socketTimeout=0&connTimeout=0&retry=false
[junit4:junit4]   2> 8240 T760 oascc.ZkStateReader.createClusterStateWatchersAndUpdate Updating cluster state from ZooKeeper... 
[junit4:junit4]   2> 8246 T760 oasc.CoreContainer.create Creating SolrCore 'collection1' using instanceDir: /usr/home/hudson/hudson-slave/workspace/Lucene-Solr-Tests-4.x-java7/solr/build/solr-core/test/J0/./solrtest-jetty2-1349149952437/collection1
[junit4:junit4]   2> 8247 T760 oasc.ZkController.createCollectionZkNode Check for collection zkNode:collection1
[junit4:junit4]   2> 8248 T760 oasc.ZkController.createCollectionZkNode Collection zkNode exists
[junit4:junit4]   2> 8248 T760 oasc.ZkController.readConfigName Load collection config from:/collections/collection1
[junit4:junit4]   2> 8250 T760 oasc.SolrResourceLoader.<init> new SolrResourceLoader for directory: '/usr/home/hudson/hudson-slave/workspace/Lucene-Solr-Tests-4.x-java7/solr/build/solr-core/test/J0/./solrtest-jetty2-1349149952437/collection1/'
[junit4:junit4]   2> 8251 T760 oasc.SolrResourceLoader.replaceClassLoader Adding 'file:/usr/home/hudson/hudson-slave/workspace/Lucene-Solr-Tests-4.x-java7/solr/build/solr-core/test/J0/solrtest-jetty2-1349149952437/collection1/lib/classes/' to classloader
[junit4:junit4]   2> 8251 T760 oasc.SolrResourceLoader.replaceClassLoader Adding 'file:/usr/home/hudson/hudson-slave/workspace/Lucene-Solr-Tests-4.x-java7/solr/build/solr-core/test/J0/solrtest-jetty2-1349149952437/collection1/lib/README' to classloader
[junit4:junit4]   2> 8294 T760 oasc.SolrConfig.<init> Using Lucene MatchVersion: LUCENE_41
[junit4:junit4]   2> 8351 T760 oasc.SolrConfig.<init> Loaded SolrConfig: solrconfig.xml
[junit4:junit4]   2> 8445 T781 oascc.ZkStateReader.updateClusterState Updating cloud state from ZooKeeper... 
[junit4:junit4]   2> 8452 T760 oass.IndexSchema.readSchema Reading Solr Schema
[junit4:junit4]   2> 8457 T760 oass.IndexSchema.readSchema Schema name=test
[junit4:junit4]   2> 8462 T794 oascc.ZkStateReader$2.process A cluster state change has occurred - updating...
[junit4:junit4]   2> 8462 T806 oascc.ZkStateReader$2.process A cluster state change has occurred - updating...
[junit4:junit4]   2> 8462 T780 oascc.ZkStateReader$2.process A cluster state change has occurred - updating...
[junit4:junit4]   2> 8905 T760 oass.OpenExchangeRatesOrgProvider.init Initialized with rates=open-exchange-rates.json, refreshInterval=1440.
[junit4:junit4]   2> 8914 T760 oass.IndexSchema.readSchema default search field in schema is text
[junit4:junit4]   2> 8917 T760 oass.IndexSchema.readSchema unique key field: id
[junit4:junit4]   2> 8931 T760 oass.FileExchangeRateProvider.reload Reloading exchange rates from file currency.xml
[junit4:junit4]   2> 8935 T760 oass.FileExchangeRateProvider.reload Reloading exchange rates from file currency.xml
[junit4:junit4]   2> 8940 T760 oass.OpenExchangeRatesOrgProvider.reload Reloading exchange rates from open-exchange-rates.json
[junit4:junit4]   2> 8942 T760 oass.OpenExchangeRatesOrgProvider.reload Reloading exchange rates from open-exchange-rates.json
[junit4:junit4]   2> 8943 T760 oasc.SolrCore.<init> [collection1] Opening new SolrCore at /usr/home/hudson/hudson-slave/workspace/Lucene-Solr-Tests-4.x-java7/solr/build/solr-core/test/J0/./solrtest-jetty2-1349149952437/collection1/, dataDir=./org.apache.solr.cloud.BasicDistributedZkTest-1349149944493/jetty2/
[junit4:junit4]   2> 8943 T760 oasc.JmxMonitoredMap.<init> JMX monitoring is enabled. Adding Solr mbeans to JMX Server: com.sun.jmx.mbeanserver.JmxMBeanServer@184ce1cd
[junit4:junit4]   2> 8944 T760 oasc.SolrCore.getNewIndexDir New index directory detected: old=null new=./org.apache.solr.cloud.BasicDistributedZkTest-1349149944493/jetty2/index/
[junit4:junit4]   2> 8945 T760 oasc.SolrCore.initIndex WARNING [collection1] Solr index directory './org.apache.solr.cloud.BasicDistributedZkTest-1349149944493/jetty2/index' doesn't exist. Creating new index...
[junit4:junit4]   2> 8946 T760 oasc.CachingDirectoryFactory.get return new directory for /usr/home/hudson/hudson-slave/workspace/Lucene-Solr-Tests-4.x-java7/solr/build/solr-core/test/J0/./org.apache.solr.cloud.BasicDistributedZkTest-1349149944493/jetty2/index forceNew:false
[junit4:junit4]   2> 8952 T760 oasc.SolrDeletionPolicy.onCommit SolrDeletionPolicy.onCommit: commits:num=1
[junit4:junit4]   2> 		commit{dir=NRTCachingDirectory(org.apache.lucene.store.NIOFSDirectory@/usr/home/hudson/hudson-slave/workspace/Lucene-Solr-Tests-4.x-java7/solr/build/solr-core/test/J0/org.apache.solr.cloud.BasicDistributedZkTest-1349149944493/jetty2/index lockFactory=org.apache.lucene.store.NativeFSLockFactory@5f604505; maxCacheMB=48.0 maxMergeSizeMB=4.0),segFN=segments_1,generation=1,filenames=[segments_1]
[junit4:junit4]   2> 8952 T760 oasc.SolrDeletionPolicy.updateCommits newest commit = 1
[junit4:junit4]   2> 8953 T760 oasc.SolrCore.initWriters created xml: solr.XMLResponseWriter
[junit4:junit4]   2> 8955 T760 oasup.UpdateRequestProcessorChain.init inserting DistributedUpdateProcessorFactory into updateRequestProcessorChain "dedupe"
[junit4:junit4]   2> 8956 T760 oasup.UpdateRequestProcessorChain.init inserting DistributedUpdateProcessorFactory into updateRequestProcessorChain "dedupe-allfields"
[junit4:junit4]   2> 8956 T760 oasup.UpdateRequestProcessorChain.init inserting DistributedUpdateProcessorFactory into updateRequestProcessorChain "stored_sig"
[junit4:junit4]   2> 8957 T760 oasup.UpdateRequestProcessorChain.init inserting DistributedUpdateProcessorFactory into updateRequestProcessorChain "uniq-fields"
[junit4:junit4]   2> 8957 T760 oasup.UpdateRequestProcessorChain.init inserting DistributedUpdateProcessorFactory into updateRequestProcessorChain "distrib-dup-test-chain-implicit"
[junit4:junit4]   2> 8958 T760 oasc.RequestHandlers.initHandlersFromConfig adding lazy requestHandler: solr.ReplicationHandler
[junit4:junit4]   2> 8958 T760 oasc.RequestHandlers.initHandlersFromConfig created /replication: solr.ReplicationHandler
[junit4:junit4]   2> 8959 T760 oasc.RequestHandlers.initHandlersFromConfig created standard: solr.StandardRequestHandler
[junit4:junit4]   2> 8959 T760 oasc.RequestHandlers.initHandlersFromConfig created /get: solr.RealTimeGetHandler
[junit4:junit4]   2> 8960 T760 oasc.RequestHandlers.initHandlersFromConfig created dismax: solr.SearchHandler
[junit4:junit4]   2> 8960 T760 oasc.RequestHandlers.initHandlersFromConfig created mock: org.apache.solr.core.MockQuerySenderListenerReqHandler
[junit4:junit4]   2> 8961 T760 oasc.RequestHandlers.initHandlersFromConfig created /admin/: org.apache.solr.handler.admin.AdminHandlers
[junit4:junit4]   2> 8961 T760 oasc.RequestHandlers.initHandlersFromConfig created defaults: solr.StandardRequestHandler
[junit4:junit4]   2> 8962 T760 oasc.RequestHandlers.initHandlersFromConfig adding lazy requestHandler: solr.StandardRequestHandler
[junit4:junit4]   2> 8962 T760 oasc.RequestHandlers.initHandlersFromConfig created lazy: solr.StandardRequestHandler
[junit4:junit4]   2> 8963 T760 oasc.RequestHandlers.initHandlersFromConfig created /update: solr.UpdateRequestHandler
[junit4:junit4]   2> 8963 T760 oasc.RequestHandlers.initHandlersFromConfig created /terms: org.apache.solr.handler.component.SearchHandler
[junit4:junit4]   2> 8964 T760 oasc.RequestHandlers.initHandlersFromConfig created spellCheckCompRH: org.apache.solr.handler.component.SearchHandler
[junit4:junit4]   2> 8964 T760 oasc.RequestHandlers.initHandlersFromConfig created spellCheckCompRH_Direct: org.apache.solr.handler.component.SearchHandler
[junit4:junit4]   2> 8965 T760 oasc.RequestHandlers.initHandlersFromConfig created spellCheckWithWordbreak: org.apache.solr.handler.component.SearchHandler
[junit4:junit4]   2> 8965 T760 oasc.RequestHandlers.initHandlersFromConfig created spellCheckWithWordbreak_Direct: org.apache.solr.handler.component.SearchHandler
[junit4:junit4]   2> 8966 T760 oasc.RequestHandlers.initHandlersFromConfig created spellCheckCompRH1: org.apache.solr.handler.component.SearchHandler
[junit4:junit4]   2> 8966 T760 oasc.RequestHandlers.initHandlersFromConfig created tvrh: org.apache.solr.handler.component.SearchHandler
[junit4:junit4]   2> 8967 T760 oasc.RequestHandlers.initHandlersFromConfig created /mlt: solr.MoreLikeThisHandler
[junit4:junit4]   2> 8967 T760 oasc.RequestHandlers.initHandlersFromConfig created /debug/dump: solr.DumpRequestHandler
[junit4:junit4]   2> 8976 T760 oashl.XMLLoader.init xsltCacheLifetimeSeconds=60
[junit4:junit4]   2> 8980 T760 oasc.SolrCore.initDeprecatedSupport WARNING solrconfig.xml uses deprecated <admin/gettableFiles>, Please update your config to use the ShowFileRequestHandler.
[junit4:junit4]   2> 8981 T760 oasc.SolrCore.initDeprecatedSupport WARNING adding ShowFileRequestHandler with hidden files: [SCHEMA.XML, OLD_SYNONYMS.TXT, STOPWORDS.TXT, PROTWORDS.TXT, OPEN-EXCHANGE-RATES.JSON, SYNONYMS.TXT, CURRENCY.XML, MAPPING-ISOLATIN1ACCENT.TXT]
[junit4:junit4]   2> 8985 T760 oass.SolrIndexSearcher.<init> Opening Searcher@3ca2ce9e main
[junit4:junit4]   2> 8986 T760 oasu.CommitTracker.<init> Hard AutoCommit: disabled
[junit4:junit4]   2> 8986 T760 oasu.CommitTracker.<init> Soft AutoCommit: disabled
[junit4:junit4]   2> 8987 T760 oashc.SpellCheckComponent.inform Initializing spell checkers
[junit4:junit4]   2> 8993 T760 oass.DirectSolrSpellChecker.init init: {name=direct,classname=DirectSolrSpellChecker,field=lowerfilt,minQueryLength=3}
[junit4:junit4]   2> 9165 T807 oasc.SolrCore.registerSearcher [collection1] Registered new searcher Searcher@3ca2ce9e main{StandardDirectoryReader(segments_1:1)}
[junit4:junit4]   2> 9477 T781 oascc.ZkStateReader.updateClusterState Updating cloud state from ZooKeeper... 
[junit4:junit4]   2> 9501 T794 oascc.ZkStateReader$2.process A cluster state change has occurred - updating...
[junit4:junit4]   2> 9502 T806 oascc.ZkStateReader$2.process A cluster state change has occurred - updating...
[junit4:junit4]   2> 9502 T780 oascc.ZkStateReader$2.process A cluster state change has occurred - updating...
[junit4:junit4]   2> 9674 T760 oasc.CoreContainer.register registering core: collection1
[junit4:junit4]   2> 9674 T760 oasc.ZkController.register Register shard - core:collection1 address:http://127.0.0.1:49428/solr shardId:shard2
[junit4:junit4]   2> 9676 T760 oascc.SolrZkClient.makePath makePath: /collections/collection1/leader_elect/shard2/election
[junit4:junit4]   2> 9691 T767 oazs.PrepRequestProcessor.pRequest Got user-level KeeperException when processing sessionid:0x13a1f9a6c480004 type:delete cxid:0x42 zxid:0xfffffffffffffffe txntype:unknown reqpath:n/a Error Path:/solr/collections/collection1/leaders/shard2 Error:KeeperErrorCode = NoNode for /solr/collections/collection1/leaders/shard2
[junit4:junit4]   2> 9692 T760 oasc.ShardLeaderElectionContext.runLeaderProcess Running the leader process.
[junit4:junit4]   2> 9693 T767 oazs.PrepRequestProcessor.pRequest Got user-level KeeperException when processing sessionid:0x13a1f9a6c480004 type:create cxid:0x43 zxid:0xfffffffffffffffe txntype:unknown reqpath:n/a Error Path:/solr/overseer Error:KeeperErrorCode = NodeExists for /solr/overseer
[junit4:junit4]   2> 9704 T760 oasc.ShardLeaderElectionContext.waitForReplicasToComeUp Enough replicas found to continue.
[junit4:junit4]   2> 9704 T760 oasc.ShardLeaderElectionContext.runLeaderProcess I may be the new leader - try and sync
[junit4:junit4]   2> 9705 T760 oasc.SyncStrategy.sync Sync replicas to http://127.0.0.1:49428/solr/collection1/
[junit4:junit4]   2> 9705 T760 oasc.SyncStrategy.syncReplicas Sync Success - now sync replicas to me
[junit4:junit4]   2> 9706 T760 oasc.SyncStrategy.syncToMe http://127.0.0.1:49428/solr/collection1/ has no replicas
[junit4:junit4]   2> 9706 T760 oasc.ShardLeaderElectionContext.runLeaderProcess I am the new leader: http://127.0.0.1:49428/solr/collection1/
[junit4:junit4]   2> 9707 T760 oascc.SolrZkClient.makePath makePath: /collections/collection1/leaders/shard2
[junit4:junit4]   2> 9711 T767 oazs.PrepRequestProcessor.pRequest Got user-level KeeperException when processing sessionid:0x13a1f9a6c480004 type:create cxid:0x4c zxid:0xfffffffffffffffe txntype:unknown reqpath:n/a Error Path:/solr/overseer Error:KeeperErrorCode = NodeExists for /solr/overseer
[junit4:junit4]   2> 10007 T781 oascc.ZkStateReader.updateClusterState Updating cloud state from ZooKeeper... 
[junit4:junit4]   2> 10018 T794 oascc.ZkStateReader$2.process A cluster state change has occurred - updating...
[junit4:junit4]   2> 10018 T806 oascc.ZkStateReader$2.process A cluster state change has occurred - updating...
[junit4:junit4]   2> 10019 T780 oascc.ZkStateReader$2.process A cluster state change has occurred - updating...
[junit4:junit4]   2> 10026 T760 oasc.ZkController.register We are http://127.0.0.1:49428/solr/collection1/ and leader is http://127.0.0.1:49428/solr/collection1/
[junit4:junit4]   2> 10026 T760 oasc.ZkController.register No LogReplay needed for core=collection1 baseURL=http://127.0.0.1:49428/solr
[junit4:junit4]   2> 10027 T760 oasc.ZkController.checkRecovery I am the leader, no recovery necessary
[junit4:junit4]   2> 10029 T760 oascc.ZkStateReader.updateClusterState Updating cloud state from ZooKeeper... 
[junit4:junit4]   2> 10037 T760 oass.SolrDispatchFilter.init user.dir=/usr/home/hudson/hudson-slave/workspace/Lucene-Solr-Tests-4.x-java7/solr/build/solr-core/test/J0
[junit4:junit4]   2> 10038 T760 oass.SolrDispatchFilter.init SolrDispatchFilter.init() done
[junit4:junit4]   2> 10038 T760 oascsi.HttpClientUtil.createClient Creating new http client, config:maxConnections=128&maxConnectionsPerHost=32&followRedirects=false
[junit4:junit4]   2> 10174 T760 oejs.Server.doStart jetty-8.1.2.v20120308
[junit4:junit4]   2> 10176 T760 oejs.AbstractConnector.doStart Started SocketConnector@0.0.0.0:49435
[junit4:junit4]   2> 10177 T760 oasc.SolrResourceLoader.locateSolrHome JNDI not configured for solr (NoInitialContextEx)
[junit4:junit4]   2> 10177 T760 oasc.SolrResourceLoader.locateSolrHome using system property solr.solr.home: /usr/home/hudson/hudson-slave/workspace/Lucene-Solr-Tests-4.x-java7/solr/build/solr-core/test/J0/./solrtest-jetty3-1349149954508
[junit4:junit4]   2> 10177 T760 oasc.SolrResourceLoader.<init> new SolrResourceLoader for deduced Solr Home: '/usr/home/hudson/hudson-slave/workspace/Lucene-Solr-Tests-4.x-java7/solr/build/solr-core/test/J0/./solrtest-jetty3-1349149954508/'
[junit4:junit4]   2> 10205 T760 oass.SolrDispatchFilter.init SolrDispatchFilter.init()
[junit4:junit4]   2> 10205 T760 oasc.SolrResourceLoader.locateSolrHome JNDI not configured for solr (NoInitialContextEx)
[junit4:junit4]   2> 10206 T760 oasc.SolrResourceLoader.locateSolrHome using system property solr.solr.home: /usr/home/hudson/hudson-slave/workspace/Lucene-Solr-Tests-4.x-java7/solr/build/solr-core/test/J0/./solrtest-jetty3-1349149954508
[junit4:junit4]   2> 10206 T760 oasc.CoreContainer$Initializer.initialize looking for solr.xml: /usr/home/hudson/hudson-slave/workspace/Lucene-Solr-Tests-4.x-java7/solr/build/solr-core/test/J0/./solrtest-jetty3-1349149954508/solr.xml
[junit4:junit4]   2> 10206 T760 oasc.CoreContainer.<init> New CoreContainer 726738874
[junit4:junit4]   2> 10207 T760 oasc.CoreContainer.load Loading CoreContainer using Solr Home: '/usr/home/hudson/hudson-slave/workspace/Lucene-Solr-Tests-4.x-java7/solr/build/solr-core/test/J0/./solrtest-jetty3-1349149954508/'
[junit4:junit4]   2> 10207 T760 oasc.SolrResourceLoader.<init> new SolrResourceLoader for directory: '/usr/home/hudson/hudson-slave/workspace/Lucene-Solr-Tests-4.x-java7/solr/build/solr-core/test/J0/./solrtest-jetty3-1349149954508/'
[junit4:junit4]   2> 10230 T760 oasc.CoreContainer.load Registering Log Listener
[junit4:junit4]   2> 10241 T760 oasc.CoreContainer.initZooKeeper Zookeeper client=127.0.0.1:49410/solr
[junit4:junit4]   2> 10241 T760 oaz.ZooKeeper.<init> Initiating client connection, connectString=127.0.0.1:49410/solr sessionTimeout=5000 watcher=org.apache.solr.common.cloud.ConnectionManager@16e73b25
[junit4:junit4]   2> 10242 T817 oaz.ClientCnxn$SendThread.startConnect Opening socket connection to server /127.0.0.1:49410
[junit4:junit4]   2> 10242 T760 oascc.ConnectionManager.waitForConnected Waiting for client to connect to ZooKeeper
[junit4:junit4]   2> 10243 T817 oaz.ClientCnxn$SendThread.primeConnection Socket connection established to localhost/127.0.0.1:49410, initiating session
[junit4:junit4]   2> 10244 T762 oazs.NIOServerCnxn$Factory.run Accepted socket connection from /140.211.11.196:49436
[junit4:junit4]   2> 10244 T762 oazs.NIOServerCnxn.readConnectRequest Client attempting to establish new session at /140.211.11.196:49436
[junit4:junit4]   2> 10251 T764 oazs.NIOServerCnxn.finishSessionInit Established session 0x13a1f9a6c480005 with negotiated timeout 5000 for client /140.211.11.196:49436
[junit4:junit4]   2> 10251 T817 oaz.ClientCnxn$SendThread.readConnectResult Session establishment complete on server localhost/127.0.0.1:49410, sessionid = 0x13a1f9a6c480005, negotiated timeout = 5000
[junit4:junit4]   2> 10251 T818 oascc.ConnectionManager.process Watcher org.apache.solr.common.cloud.ConnectionManager@16e73b25 name:ZooKeeperConnection Watcher:127.0.0.1:49410/solr got event WatchedEvent state:SyncConnected type:None path:null path:null type:None
[junit4:junit4]   2> 10251 T760 oascc.ConnectionManager.waitForConnected Client is connected to ZooKeeper
[junit4:junit4]   2> 10252 T767 oazs.PrepRequestProcessor.pRequest Got user-level KeeperException when processing sessionid:0x13a1f9a6c480005 type:create cxid:0x1 zxid:0xfffffffffffffffe txntype:unknown reqpath:n/a Error Path:/solr/overseer Error:KeeperErrorCode = NodeExists for /solr/overseer
[junit4:junit4]   2> 10278 T767 oazs.PrepRequestProcessor.pRequest Got user-level KeeperException when processing sessionid:0x13a1f9a6c480005 type:create cxid:0x2 zxid:0xfffffffffffffffe txntype:unknown reqpath:n/a Error Path:/solr/overseer Error:KeeperErrorCode = NodeExists for /solr/overseer
[junit4:junit4]   2> 10292 T760 oasc.ZkController.createEphemeralLiveNode Register node as live in ZooKeeper:/live_nodes/127.0.0.1:49435_solr
[junit4:junit4]   2> 10293 T767 oazs.PrepRequestProcessor.pRequest Got user-level KeeperException when processing sessionid:0x13a1f9a6c480005 type:delete cxid:0x4 zxid:0xfffffffffffffffe txntype:unknown reqpath:n/a Error Path:/solr/live_nodes/127.0.0.1:49435_solr Error:KeeperErrorCode = NoNode for /solr/live_nodes/127.0.0.1:49435_solr
[junit4:junit4]   2> 10294 T760 oascc.SolrZkClient.makePath makePath: /live_nodes/127.0.0.1:49435_solr
[junit4:junit4]   2> 10297 T780 oascc.ZkStateReader$3.process Updating live nodes
[junit4:junit4]   2> 10297 T794 oascc.ZkStateReader$3.process Updating live nodes
[junit4:junit4]   2> 10297 T806 oascc.ZkStateReader$3.process Updating live nodes
[junit4:junit4]   2> 10298 T760 oashc.HttpShardHandlerFactory.getParameter Setting socketTimeout to: 0
[junit4:junit4]   2> 10298 T760 oashc.HttpShardHandlerFactory.getParameter Setting urlScheme to: http://
[junit4:junit4]   2> 10299 T760 oashc.HttpShardHandlerFactory.getParameter Setting connTimeout to: 0
[junit4:junit4]   2> 10299 T760 oashc.HttpShardHandlerFactory.getParameter Setting maxConnectionsPerHost to: 20
[junit4:junit4]   2> 10299 T760 oashc.HttpShardHandlerFactory.getParameter Setting corePoolSize to: 0
[junit4:junit4]   2> 10300 T760 oashc.HttpShardHandlerFactory.getParameter Setting maximumPoolSize to: 2147483647
[junit4:junit4]   2> 10300 T760 oashc.HttpShardHandlerFactory.getParameter Setting maxThreadIdleTime to: 5
[junit4:junit4]   2> 10300 T760 oashc.HttpShardHandlerFactory.getParameter Setting sizeOfQueue to: -1
[junit4:junit4]   2> 10301 T760 oashc.HttpShardHandlerFactory.getParameter Setting fairnessPolicy to: false
[junit4:junit4]   2> 10301 T760 oascsi.HttpClientUtil.createClient Creating new http client, config:maxConnectionsPerHost=20&maxConnections=10000&socketTimeout=0&connTimeout=0&retry=false
[junit4:junit4]   2> 10315 T760 oascc.ZkStateReader.createClusterStateWatchersAndUpdate Updating cluster state from ZooKeeper... 
[junit4:junit4]   2> 10321 T760 oasc.CoreContainer.create Creating SolrCore 'collection1' using instanceDir: /usr/home/hudson/hudson-slave/workspace/Lucene-Solr-Tests-4.x-java7/solr/build/solr-core/test/J0/./solrtest-jetty3-1349149954508/collection1
[junit4:junit4]   2> 10322 T760 oasc.ZkController.createCollectionZkNode Check for collection zkNode:collection1
[junit4:junit4]   2> 10322 T760 oasc.ZkController.createCollectionZkNode Collection zkNode exists
[junit4:junit4]   2> 10323 T760 oasc.ZkController.readConfigName Load collection config from:/collections/collection1
[junit4:junit4]   2> 10324 T760 oasc.SolrResourceLoader.<init> new SolrResourceLoader for directory: '/usr/home/hudson/hudson-slave/workspace/Lucene-Solr-Tests-4.x-java7/solr/build/solr-core/test/J0/./solrtest-jetty3-1349149954508/collection1/'
[junit4:junit4]   2> 10325 T760 oasc.SolrResourceLoader.replaceClassLoader Adding 'file:/usr/home/hudson/hudson-slave/workspace/Lucene-Solr-Tests-4.x-java7/solr/build/solr-core/test/J0/solrtest-jetty3-1349149954508/collection1/lib/README' to classloader
[junit4:junit4]   2> 10326 T760 oasc.SolrResourceLoader.replaceClassLoader Adding 'file:/usr/home/hudson/hudson-slave/workspace/Lucene-Solr-Tests-4.x-java7/solr/build/solr-core/test/J0/solrtest-jetty3-1349149954508/collection1/lib/classes/' to classloader
[junit4:junit4]   2> 10362 T760 oasc.SolrConfig.<init> Using Lucene MatchVersion: LUCENE_41
[junit4:junit4]   2> 10410 T760 oasc.SolrConfig.<init> Loaded SolrConfig: solrconfig.xml
[junit4:junit4]   2> 10511 T760 oass.IndexSchema.readSchema Reading Solr Schema
[junit4:junit4]   2> 10516 T760 oass.IndexSchema.readSchema Schema name=test
[junit4:junit4]   2> 10542 T781 oascc.ZkStateReader.updateClusterState Updating cloud state from ZooKeeper... 
[junit4:junit4]   2> 10563 T818 oascc.ZkStateReader$2.process A cluster state change has occurred - updating...
[junit4:junit4]   2> 10563 T794 oascc.ZkStateReader$2.process A cluster state change has occurred - updating...
[junit4:junit4]   2> 10563 T806 oascc.ZkStateReader$2.process A cluster state change has occurred - updating...
[junit4:junit4]   2> 10563 T780 oascc.ZkStateReader$2.process A cluster state change has occurred - updating...
[junit4:junit4]   2> 11003 T760 oass.OpenExchangeRatesOrgProvider.init Initialized with rates=open-exchange-rates.json, refreshInterval=1440.
[junit4:junit4]   2> 11013 T760 oass.IndexSchema.readSchema default search field in schema is text
[junit4:junit4]   2> 11016 T760 oass.IndexSchema.readSchema unique key field: id
[junit4:junit4]   2> 11037 T760 oass.FileExchangeRateProvider.reload Reloading exchange rates from file currency.xml
[junit4:junit4]   2> 11043 T760 oass.FileExchangeRateProvider.reload Reloading exchange rates from file currency.xml
[junit4:junit4]   2> 11048 T760 oass.OpenExchangeRatesOrgProvider.reload Reloading exchange rates from open-exchange-rates.json
[junit4:junit4]   2> 11050 T760 oass.OpenExchangeRatesOrgProvider.reload Reloading exchange rates from open-exchange-rates.json
[junit4:junit4]   2> 11052 T760 oasc.SolrCore.<init> [collection1] Opening new SolrCore at /usr/home/hudson/hudson-slave/workspace/Lucene-Solr-Tests-4.x-java7/solr/build/solr-core/test/J0/./solrtest-jetty3-1349149954508/collection1/, dataDir=./org.apache.solr.cloud.BasicDistributedZkTest-1349149944493/jetty3/
[junit4:junit4]   2> 11052 T760 oasc.JmxMonitoredMap.<init> JMX monitoring is enabled. Adding Solr mbeans to JMX Server: com.sun.jmx.mbeanserver.JmxMBeanServer@184ce1cd
[junit4:junit4]   2> 11057 T760 oasc.SolrCore.getNewIndexDir New index directory detected: old=null new=./org.apache.solr.cloud.BasicDistributedZkTest-1349149944493/jetty3/index/
[junit4:junit4]   2> 11058 T760 oasc.SolrCore.initIndex WARNING [collection1] Solr index directory './org.apache.solr.cloud.BasicDistributedZkTest-1349149944493/jetty3/index' doesn't exist. Creating new index...
[junit4:junit4]   2> 11059 T760 oasc.CachingDirectoryFactory.get return new directory for /usr/home/hudson/hudson-slave/workspace/Lucene-Solr-Tests-4.x-java7/solr/build/solr-core/test/J0/./org.apache.solr.cloud.BasicDistributedZkTest-1349149944493/jetty3/index forceNew:false
[junit4:junit4]   2> 11079 T760 oasc.SolrDeletionPolicy.onCommit SolrDeletionPolicy.onCommit: commits:num=1
[junit4:junit4]   2> 		commit{dir=NRTCachingDirectory(org.apache.lucene.store.NIOFSDirectory@/usr/home/hudson/hudson-slave/workspace/Lucene-Solr-Tests-4.x-java7/solr/build/solr-core/test/J0/org.apache.solr.cloud.BasicDistributedZkTest-1349149944493/jetty3/index lockFactory=org.apache.lucene.store.NativeFSLockFactory@1e89b09a; maxCacheMB=48.0 maxMergeSizeMB=4.0),segFN=segments_1,generation=1,filenames=[segments_1]
[junit4:junit4]   2> 11080 T760 oasc.SolrDeletionPolicy.updateCommits newest commit = 1
[junit4:junit4]   2> 11081 T760 oasc.SolrCore.initWriters created xml: solr.XMLResponseWriter
[junit4:junit4]   2> 11084 T760 oasup.UpdateRequestProcessorChain.init inserting DistributedUpdateProcessorFactory into updateRequestProcessorChain "dedupe"
[junit4:junit4]   2> 11084 T760 oasup.UpdateRequestProcessorChain.init inserting DistributedUpdateProcessorFactory into updateRequestProcessorChain "dedupe-allfields"
[junit4:junit4]   2> 11085 T760 oasup.UpdateRequestProcessorChain.init inserting DistributedUpdateProcessorFactory into updateRequestProcessorChain "stored_sig"
[junit4:junit4]   2> 11085 T760 oasup.UpdateRequestProcessorChain.init inserting DistributedUpdateProcessorFactory into updateRequestProcessorChain "uniq-fields"
[junit4:junit4]   2> 11086 T760 oasup.UpdateRequestProcessorChain.init inserting DistributedUpdateProcessorFactory into updateRequestProcessorChain "distrib-dup-test-chain-implicit"
[junit4:junit4]   2> 11086 T760 oasc.RequestHandlers.initHandlersFromConfig adding lazy requestHandler: solr.ReplicationHandler
[junit4:junit4]   2> 11087 T760 oasc.RequestHandlers.initHandlersFromConfig created /replication: solr.ReplicationHandler
[junit4:junit4]   2> 11087 T760 oasc.RequestHandlers.initHandlersFromConfig created standard: solr.StandardRequestHandler
[junit4:junit4]   2> 11088 T760 oasc.RequestHandlers.initHandlersFromConfig created /get: solr.RealTimeGetHandler
[junit4:junit4]   2> 11089 T760 oasc.RequestHandlers.initHandlersFromConfig created dismax: solr.SearchHandler
[junit4:junit4]   2> 11089 T760 oasc.RequestHandlers.initHandlersFromConfig created mock: org.apache.solr.core.MockQuerySenderListenerReqHandler
[junit4:junit4]   2> 11090 T760 oasc.RequestHandlers.initHandlersFromConfig created /admin/: org.apache.solr.handler.admin.AdminHandlers
[junit4:junit4]   2> 11091 T760 oasc.RequestHandlers.initHandlersFromConfig created defaults: solr.StandardRequestHandler
[junit4:junit4]   2> 11091 T760 oasc.RequestHandlers.initHandlersFromConfig adding lazy requestHandler: solr.StandardRequestHandler
[junit4:junit4]   2> 11092 T760 oasc.RequestHandlers.initHandlersFromConfig created lazy: solr.StandardRequestHandler
[junit4:junit4]   2> 11092 T760 oasc.RequestHandlers.initHandlersFromConfig created /update: solr.UpdateRequestHandler
[junit4:junit4]   2> 11093 T760 oasc.RequestHandlers.initHandlersFromConfig created /terms: org.apache.solr.handler.component.SearchHandler
[junit4:junit4]   2> 11094 T760 oasc.RequestHandlers.initHandlersFromConfig created spellCheckCompRH: org.apache.solr.handler.component.SearchHandler
[junit4:junit4]   2> 11094 T760 oasc.RequestHandlers.initHandlersFromConfig created spellCheckCompRH_Direct: org.apache.solr.handler.component.SearchHandler
[junit4:junit4]   2> 11095 T760 oasc.RequestHandlers.initHandlersFromConfig created spellCheckWithWordbreak: org.apache.solr.handler.component.SearchHandler
[junit4:junit4]   2> 11096 T760 oasc.RequestHandlers.initHandlersFromConfig created spellCheckWithWordbreak_Direct: org.apache.solr.handler.component.SearchHandler
[junit4:junit4]   2> 11096 T760 oasc.RequestHandlers.initHandlersFromConfig created spellCheckCompRH1: org.apache.solr.handler.component.SearchHandler
[junit4:junit4]   2> 11097 T760 oasc.RequestHandlers.initHandlersFromConfig created tvrh: org.apache.solr.handler.component.SearchHandler
[junit4:junit4]   2> 11098 T760 oasc.RequestHandlers.initHandlersFromConfig created /mlt: solr.MoreLikeThisHandler
[junit4:junit4]   2> 11098 T760 oasc.RequestHandlers.initHandlersFromConfig created /debug/dump: solr.DumpRequestHandler
[junit4:junit4]   2> 11109 T760 oashl.XMLLoader.init xsltCacheLifetimeSeconds=60
[junit4:junit4]   2> 11113 T760 oasc.SolrCore.initDeprecatedSupport WARNING solrconfig.xml uses deprecated <admin/gettableFiles>, Please update your config to use the ShowFileRequestHandler.
[junit4:junit4]   2> 11115 T760 oasc.SolrCore.initDeprecatedSupport WARNING adding ShowFileRequestHandler with hidden files: [SCHEMA.XML, OLD_SYNONYMS.TXT, STOPWORDS.TXT, PROTWORDS.TXT, OPEN-EXCHANGE-RATES.JSON, SYNONYMS.TXT, CURRENCY.XML, MAPPING-ISOLATIN1ACCENT.TXT]
[junit4:junit4]   2> 11119 T760 oass.SolrIndexSearcher.<init> Opening Searcher@18cebd04 main
[junit4:junit4]   2> 11121 T760 oasu.CommitTracker.<init> Hard AutoCommit: disabled
[junit4:junit4]   2> 11121 T760 oasu.CommitTracker.<init> Soft AutoCommit: disabled
[junit4:junit4]   2> 11122 T760 oashc.SpellCheckComponent.inform Initializing spell checkers
[junit4:junit4]   2> 11136 T760 oass.DirectSolrSpellChecker.init init: {name=direct,classname=DirectSolrSpellChecker,field=lowerfilt,minQueryLength=3}
[junit4:junit4]   2> 11223 T819 oasc.SolrCore.registerSearcher [collection1] Registered new searcher Searcher@18cebd04 main{StandardDirectoryReader(segments_1:1)}
[junit4:junit4]   2> 11576 T781 oascc.ZkStateReader.updateClusterState Updating cloud state from ZooKeeper... 
[junit4:junit4]   2> 11649 T806 oascc.ZkStateReader$2.process A cluster state change has occurred - updating...
[junit4:junit4]   2> 11649 T794 oascc.ZkStateReader$2.process A cluster state change has occurred - updating...
[junit4:junit4]   2> 11649 T780 oascc.ZkStateReader$2.process A cluster state change has occurred - updating...
[junit4:junit4]   2> 11649 T818 oascc.ZkStateReader$2.process A cluster state change has occurred - updating...
[junit4:junit4]   2> 11732 T760 oasc.CoreContainer.register registering core: collection1
[junit4:junit4]   2> 11732 T760 oasc.ZkController.register Register shard - core:collection1 address:http://127.0.0.1:49435/solr shardId:shard1
[junit4:junit4]   2> 11738 T760 oasc.ZkController.register We are http://127.0.0.1:49435/solr/collection1/ and leader is http://127.0.0.1:49425/solr/collection1/
[junit4:junit4]   2> 11739 T760 oasc.ZkController.register No LogReplay needed for core=collection1 baseURL=http://127.0.0.1:49435/solr
[junit4:junit4]   2> 11739 T760 oasc.ZkController.checkRecovery Core needs to recover:collection1
[junit4:junit4]   2> 11740 T760 oasu.DefaultSolrCoreState.doRecovery Running recovery - first canceling any ongoing recovery
[junit4:junit4]   2> ASYNC  NEW_CORE C81 name=collection1 org.apache.solr.core.SolrCore@610cacb2 url=http://127.0.0.1:49435/solr/collection1 node=127.0.0.1:49435_solr
[junit4:junit4]   2> 11746 T820 C81 P49435 oasc.RecoveryStrategy.run Starting recovery process.  core=collection1 recoveringAfterStartup=true
[junit4:junit4]   2> 11746 T760 oascc.ZkStateReader.updateClusterState Updating cloud state from ZooKeeper... 
[junit4:junit4]   2> 11747 T820 C81 P49435 oasc.RecoveryStrategy.doRecovery ###### startupVersions=[]
[junit4:junit4]   2> 11748 T760 oass.SolrDispatchFilter.init user.dir=/usr/home/hudson/hudson-slave/workspace/Lucene-Solr-Tests-4.x-java7/solr/build/solr-core/test/J0
[junit4:junit4]   2> 11748 T760 oass.SolrDispatchFilter.init SolrDispatchFilter.init() done
[junit4:junit4]   2> 11749 T820 C81 P49435 oasc.RecoveryStrategy.doRecovery Attempting to PeerSync from http://127.0.0.1:49425/solr/collection1/ core=collection1 - recoveringAfterStartup=true
[junit4:junit4]   2> 11749 T760 oascsi.HttpClientUtil.createClient Creating new http client, config:maxConnections=128&maxConnectionsPerHost=32&followRedirects=false
[junit4:junit4]   2> 11761 T820 C81 P49435 oascsi.HttpClientUtil.createClient Creating new http client, config:maxConnectionsPerHost=20&maxConnections=10000&connTimeout=30000&socketTimeout=30000&retry=false
[junit4:junit4]   2> 11766 T760 oaz.ZooKeeper.<init> Initiating client connection, connectString=127.0.0.1:49410/solr sessionTimeout=10000 watcher=org.apache.solr.common.cloud.ConnectionManager@351a7ac
[junit4:junit4]   2> 11767 T760 oascc.ConnectionManager.waitForConnected Waiting for client to connect to ZooKeeper
[junit4:junit4]   2> 11767 T821 oaz.ClientCnxn$SendThread.startConnect Opening socket connection to server /127.0.0.1:49410
[junit4:junit4]   2> 11769 T821 oaz.ClientCnxn$SendThread.primeConnection Socket connection established to localhost/127.0.0.1:49410, initiating session
[junit4:junit4]   2> 11769 T762 oazs.NIOServerCnxn$Factory.run Accepted socket connection from /140.211.11.196:49444
[junit4:junit4]   2> 11769 T762 oazs.NIOServerCnxn.readConnectRequest Client attempting to establish new session at /140.211.11.196:49444
[junit4:junit4]   2> 11771 T764 oazs.NIOServerCnxn.finishSessionInit Established session 0x13a1f9a6c480006 with negotiated timeout 10000 for client /140.211.11.196:49444
[junit4:junit4]   2> 11771 T821 oaz.ClientCnxn$SendThread.readConnectResult Session establishment complete on server localhost/127.0.0.1:49410, sessionid = 0x13a1f9a6c480006, negotiated timeout = 10000
[junit4:junit4]   2> 11771 T822 oascc.ConnectionManager.process Watcher org.apache.solr.common.cloud.ConnectionManager@351a7ac name:ZooKeeperConnection Watcher:127.0.0.1:49410/solr got event WatchedEvent state:SyncConnected type:None path:null path:null type:None
[junit4:junit4]   2> 11772 T760 oascc.ConnectionManager.waitForConnected Client is connected to ZooKeeper
[junit4:junit4]   2> 11773 T760 oascc.ZkStateReader.createClusterStateWatchersAndUpdate Updating cluster state from ZooKeeper... 
[junit4:junit4]   2> 11781 T820 C81 P49435 oasu.PeerSync.sync PeerSync: core=collection1 url=http://127.0.0.1:49435/solr START replicas=[http://127.0.0.1:49425/solr/collection1/] nUpdates=100
[junit4:junit4]   2> 11782 T820 C81 P49435 oasu.PeerSync.sync WARNING no frame of reference to tell of we've missed updates
[junit4:junit4]   2> 11783 T820 C81 P49435 oasc.RecoveryStrategy.doRecovery PeerSync Recovery was not successful - trying replication. core=collection1
[junit4:junit4]   2> 11783 T820 C81 P49435 oasc.RecoveryStrategy.doRecovery Starting Replication Recovery. core=collection1
[junit4:junit4]   2> 11784 T820 C81 P49435 oascsi.HttpClientUtil.createClient Creating new http client, config:maxConnections=128&maxConnectionsPerHost=32&followRedirects=false
[junit4:junit4]   2> 11787 T760 oasc.ChaosMonkey.monkeyLog monkey: init - expire sessions:true cause connection loss:true
[junit4:junit4]   2> 11788 T760 oascsi.HttpClientUtil.createClient Creating new http client, config:
[junit4:junit4]   2> ASYNC  NEW_CORE C82 name=collection1 org.apache.solr.core.SolrCore@78ad3482 url=http://127.0.0.1:49425/solr/collection1 node=127.0.0.1:49425_solr
[junit4:junit4]   2> 11796 T786 C82 P49425 REQ /get {distrib=false&qt=/get&wt=javabin&version=2&getVersions=100} status=0 QTime=0 
[junit4:junit4]   2> 11802 T760 oascc.ZkStateReader.updateClusterState Updating cloud state from ZooKeeper... 
[junit4:junit4]   2> 11804 T760 oasc.AbstractDistribZkTestBase.waitForRecoveriesToFinish Wait for recoveries to finish - collection: collection1 failOnTimeout:true timeout (sec):1800
[junit4:junit4]   2> 11805 T760 oascc.ZkStateReader.updateClusterState Updating cloud state from ZooKeeper... 
[junit4:junit4]   2> 12227 T781 oascc.ZkStateReader.updateClusterState Updating cloud state from ZooKeeper... 
[junit4:junit4]   2> 12243 T818 oascc.ZkStateReader$2.process A cluster state change has occurred - updating...
[junit4:junit4]   2> 12243 T806 oascc.ZkStateReader$2.process A cluster state change has occurred - updating...
[junit4:junit4]   2> 12243 T780 oascc.ZkStateReader$2.process A cluster state change has occurred - updating...
[junit4:junit4]   2> 12243 T794 oascc.ZkStateReader$2.process A cluster state change has occurred - updating...
[junit4:junit4]   2> 12243 T822 oascc.ZkStateReader$2.process A cluster state change has occurred - updating...
[junit4:junit4]   2> 12808 T760 oascc.ZkStateReader.updateClusterState Updating cloud state from ZooKeeper... 
[junit4:junit4]   2> 13811 T760 oascc.ZkStateReader.updateClusterState Updating cloud state from ZooKeeper... 
[junit4:junit4]   2>  C81_STATE=coll:collection1 core:collection1 props:{shard=shard1, roles=null, state=recovering, core=collection1, collection=collection1, node_name=127.0.0.1:49435_solr, base_url=http://127.0.0.1:49435/solr}
[junit4:junit4]   2> 14813 T820 C81 P49435 oasc.RecoveryStrategy.doRecovery Begin buffering updates. core=collection1
[junit4:junit4]   2> 14813 T820 C81 P49435 oasu.UpdateLog.bufferUpdates Starting to buffer updates. FSUpdateLog{state=ACTIVE, tlog=null}
[junit4:junit4]   2> 14813 T820 C81 P49435 oasc.RecoveryStrategy.replicate Attempting to replicate from http://127.0.0.1:49425/solr/collection1/. core=collection1
[junit4:junit4]   2> 14814 T820 C81 P49435 oascsi.HttpClientUtil.createClient Creating new http client, config:maxConnections=128&maxConnectionsPerHost=32&followRedirects=false
[junit4:junit4]   2> 14813 T760 oascc.ZkStateReader.updateClusterState Updating cloud state from ZooKeeper... 
[junit4:junit4]   2> 14833 T788 C82 P49425 oascsi.HttpClientUtil.createClient Creating new http client, config:maxConnections=500&maxConnectionsPerHost=16
[junit4:junit4]   2> 14843 T788 C82 P49425 oasu.DirectUpdateHandler2.commit start commit{flags=0,_version_=0,optimize=false,openSearcher=true,waitSearcher=true,expungeDeletes=false,softCommit=false}
[junit4:junit4]   2> 14855 T788 C82 P49425 oasc.SolrDeletionPolicy.onInit SolrDeletionPolicy.onInit: commits:num=1
[junit4:junit4]   2> 		commit{dir=NRTCachingDirectory(org.apache.lucene.store.NIOFSDirectory@/usr/home/hudson/hudson-slave/workspace/Lucene-Solr-Tests-4.x-java7/solr/build/solr-core/test/J0/org.apache.solr.cloud.BasicDistributedZkTest-1349149944493/jetty1/index lockFactory=org.apache.lucene.store.NativeFSLockFactory@3623e183; maxCacheMB=48.0 maxMergeSizeMB=4.0),segFN=segments_1,generation=1,filenames=[segments_1]
[junit4:junit4]   2> 14856 T788 C82 P49425 oasc.SolrDeletionPolicy.updateCommits newest commit = 1
[junit4:junit4]   2> 14857 T788 C82 P49425 oass.SolrIndexSearcher.<init> Opening Searcher@7660454e main
[junit4:junit4]   2> 14858 T788 C82 P49425 oasu.DirectUpdateHandler2.commit end_commit_flush
[junit4:junit4]   2> 14859 T795 oasc.SolrCore.registerSearcher [collection1] Registered new searcher Searcher@7660454e main{StandardDirectoryReader(segments_1:1)}
[junit4:junit4]   2> 14859 T788 C82 P49425 /update {waitSearcher=true&commit=true&commit_end_point=true&wt=javabin&softCommit=false&version=2} {commit=} 0 36
[junit4:junit4]   2> 14860 T820 C81 P49435 oash.ReplicationHandler.inform Commits will be reserved for  10000
[junit4:junit4]   2> 14861 T820 C81 P49435 oascsi.HttpClientUtil.createClient Creating new http client, config:connTimeout=5000&socketTimeout=20000&allowCompression=false&maxConnections=10000&maxConnectionsPerHost=10000
[junit4:junit4]   2> 14877 T820 C81 P49435 oash.SnapPuller.<init>  No value set for 'pollInterval'. Timer Task not started.
[junit4:junit4]   2> 14880 T789 C82 P49425 oash.ReplicationHandler.inform Commits will be reserved for  10000
[junit4:junit4]   2> 14880 T789 C82 P49425 REQ /replication {command=indexversion&wt=javabin&qt=/replication&version=2} status=0 QTime=1 
[junit4:junit4]   2> 14891 T820 C81 P49435 oasc.SolrDeletionPolicy.onInit SolrDeletionPolicy.onInit: commits:num=1
[junit4:junit4]   2> 		commit{dir=NRTCachingDirectory(org.apache.lucene.store.NIOFSDirectory@/usr/home/hudson/hudson-slave/workspace/Lucene-Solr-Tests-4.x-java7/solr/build/solr-core/test/J0/org.apache.solr.cloud.BasicDistributedZkTest-1349149944493/jetty3/index lockFactory=org.apache.lucene.store.NativeFSLockFactory@1e89b09a; maxCacheMB=48.0 maxMergeSizeMB=4.0),segFN=segments_1,generation=1,filenames=[segments_1]
[junit4:junit4]   2> 14891 T820 C81 P49435 oasc.SolrDeletionPolicy.updateCommits newest commit = 1
[junit4:junit4]   2> 14892 T820 C81 P49435 oasu.DirectUpdateHandler2.commit start commit{flags=0,_version_=0,optimize=false,openSearcher=true,waitSearcher=true,expungeDeletes=false,softCommit=false}
[junit4:junit4]   2> 14906 T820 C81 P49435 oasc.SolrDeletionPolicy.onCommit SolrDeletionPolicy.onCommit: commits:num=2
[junit4:junit4]   2> 		commit{dir=NRTCachingDirectory(org.apache.lucene.store.NIOFSDirectory@/usr/home/hudson/hudson-slave/workspace/Lucene-Solr-Tests-4.x-java7/solr/build/solr-core/test/J0/org.apache.solr.cloud.BasicDistributedZkTest-1349149944493/jetty3/index lockFactory=org.apache.lucene.store.NativeFSLockFactory@1e89b09a; maxCacheMB=48.0 maxMergeSizeMB=4.0),segFN=segments_1,generation=1,filenames=[segments_1]
[junit4:junit4]   2> 		commit{dir=NRTCachingDirectory(org.apache.lucene.store.NIOFSDirectory@/usr/home/hudson/hudson-slave/workspace/Lucene-Solr-Tests-4.x-java7/solr/build/solr-core/test/J0/org.apache.solr.cloud.BasicDistributedZkTest-1349149944493/jetty3/index lockFactory=org.apache.lucene.store.NativeFSLockFactory@1e89b09a; maxCacheMB=48.0 maxMergeSizeMB=4.0),segFN=segments_2,generation=2,filenames=[segments_2]
[junit4:junit4]   2> 14906 T820 C81 P49435 oasc.SolrDeletionPolicy.updateCommits newest commit = 2
[junit4:junit4]   2> 14927 T820 C81 P49435 oass.SolrIndexSearcher.<init> Opening Searcher@16374952 main
[junit4:junit4]   2> 14927 T820 C81 P49435 oasu.DirectUpdateHandler2.commit end_commit_flush
[junit4:junit4]   2> 14929 T819 oasc.SolrCore.registerSearcher [collection1] Registered new searcher Searcher@16374952 main{StandardDirectoryReader(segments_2:2)}
[junit4:junit4]   2> 14930 T820 C81 P49435 oasc.RecoveryStrategy.replay No replay needed. core=collection1
[junit4:junit4]   2> 14930 T820 C81 P49435 oasc.RecoveryStrategy.doRecovery Replication Recovery was successful - registering as Active. core=collection1
[junit4:junit4]   2> 14932 T820 C81 P49435 oasc.RecoveryStrategy.doRecovery Finished recovery process. core=collection1
[junit4:junit4]   2> 15265 T781 oascc.ZkStateReader.updateClusterState Updating cloud state from ZooKeeper... 
[junit4:junit4]   2> 15271 T806 oascc.ZkStateReader$2.process A cluster state change has occurred - updating...
[junit4:junit4]   2> 15271 T818 oascc.ZkStateReader$2.process A cluster state change has occurred - updating...
[junit4:junit4]   2> 15271 T794 oascc.ZkStateReader$2.process A cluster state change has occurred - updating...
[junit4:junit4]   2> 15271 T780 oascc.ZkStateReader$2.process A cluster state change has occurred - updating...
[junit4:junit4]   2> 15271 T822 oascc.ZkStateReader$2.process A cluster state change has occurred - updating...
[junit4:junit4]   2> 15816 T760 oascc.ZkStateReader.updateClusterState Updating cloud state from ZooKeeper... 
[junit4:junit4]   2> ASYNC  NEW_CORE C83 name=collection1 org.apache.solr.core.SolrCore@1659f78e url=http://127.0.0.1:49417/solr/collection1 node=127.0.0.1:49417_solr
[junit4:junit4]   2> 15836 T772 C83 P49417 oasc.SolrDeletionPolicy.onInit SolrDeletionPolicy.onInit: commits:num=1
[junit4:junit4]   2> 		commit{dir=NRTCachingDirectory(org.apache.lucene.store.NIOFSDirectory@/usr/home/hudson/hudson-slave/workspace/Lucene-Solr-Tests-4.x-java7/solr/build/solr-core/test/J0/org.apache.solr.cloud.BasicDistributedZkTest-1349149944493/control/data/index lockFactory=org.apache.lucene.store.NativeFSLockFactory@2003a6d0; maxCacheMB=48.0 maxMergeSizeMB=4.0),segFN=segments_1,generation=1,filenames=[segments_1]
[junit4:junit4]   2> 15837 T772 C83 P49417 oasc.SolrDeletionPolicy.updateCommits newest commit = 1
[junit4:junit4]   2> 15842 T772 C83 P49417 oass.SolrIndexSearcher.<init> Opening Searcher@32a3ccf3 realtime
[junit4:junit4]   2> 15843 T772 C83 P49417 /update {wt=javabin&version=2} {deleteByQuery=*:* (-1414686268758949888)} 0 17
[junit4:junit4]   2> 15844 T760 oaz.ZooKeeper.<init> Initiating client connection, connectString=127.0.0.1:49410/solr sessionTimeout=10000 watcher=org.apache.solr.common.cloud.ConnectionManager@1fe47f7e
[junit4:junit4]   2> 15845 T824 oaz.ClientCnxn$SendThread.startConnect Opening socket connection to server /127.0.0.1:49410
[junit4:junit4]   2> 15845 T760 oascc.ConnectionManager.waitForConnected Waiting for client to connect to ZooKeeper
[junit4:junit4]   2> 15846 T824 oaz.ClientCnxn$SendThread.primeConnection Socket connection established to localhost/127.0.0.1:49410, initiating session
[junit4:junit4]   2> 15846 T762 oazs.NIOServerCnxn$Factory.run Accepted socket connection from /140.211.11.196:49454
[junit4:junit4]   2> 15847 T762 oazs.NIOServerCnxn.readConnectRequest Client attempting to establish new session at /140.211.11.196:49454
[junit4:junit4]   2> 15850 T764 oazs.NIOServerCnxn.finishSessionInit Established session 0x13a1f9a6c480007 with negotiated timeout 10000 for client /140.211.11.196:49454
[junit4:junit4]   2> 15850 T824 oaz.ClientCnxn$SendThread.readConnectResult Session establishment complete on server localhost/127.0.0.1:49410, sessionid = 0x13a1f9a6c480007, negotiated timeout = 10000
[junit4:junit4]   2> 15851 T825 oascc.ConnectionManager.process Watcher org.apache.solr.common.cloud.ConnectionManager@1fe47f7e name:ZooKeeperConnection Watcher:127.0.0.1:49410/solr got event WatchedEvent state:SyncConnected type:None path:null path:null type:None
[junit4:junit4]   2> 15852 T760 oascc.ConnectionManager.waitForConnected Client is connected to ZooKeeper
[junit4:junit4]   2> 15854 T760 oascc.ZkStateReader.createClusterStateWatchersAndUpdate Updating cluster state from ZooKeeper... 
[junit4:junit4]   2> 15875 T790 C82 P49425 oass.SolrIndexSearcher.<init> Opening Searcher@4860efff realtime
[junit4:junit4]   2>  C81_STATE=coll:collection1 core:collection1 props:{shard=shard1, roles=null, state=active, core=collection1, collection=collection1, node_name=127.0.0.1:49435_solr, base_url=http://127.0.0.1:49435/solr}
[junit4:junit4]   2> 15910 T810 C81 P49435 oass.SolrIndexSearcher.<init> Opening Searcher@76ee54cc realtime
[junit4:junit4]   2> 15910 T810 C81 P49435 REQ /update {update.distrib=FROMLEADER&_version_=-1414686268801941504&update.from=http://127.0.0.1:49425/solr/collection1/&wt=javabin&version=2} status=0 QTime=3 
[junit4:junit4]   2> ASYNC  NEW_CORE C84 name=collection1 org.apache.solr.core.SolrCore@4cedc252 url=http://127.0.0.1:49428/solr/collection1 node=127.0.0.1:49428_solr
[junit4:junit4]   2> 15921 T798 C84 P49428 oasc.SolrDeletionPolicy.onInit SolrDeletionPolicy.onInit: commits:num=1
[junit4:junit4]   2> 		commit{dir=NRTCachingDirectory(org.apache.lucene.store.NIOFSDirectory@/usr/home/hudson/hudson-slave/workspace/Lucene-Solr-Tests-4.x-java7/solr/build/solr-core/test/J0/org.apache.solr.cloud.BasicDistributedZkTest-1349149944493/jetty2/index lockFactory=org.apache.lucene.store.NativeFSLockFactory@5f604505; maxCacheMB=48.0 maxMergeSizeMB=4.0),segFN=segments_1,generation=1,filenames=[segments_1]
[junit4:junit4]   2> 15921 T798 C84 P49428 oasc.SolrDeletionPolicy.updateCommits newest commit = 1
[junit4:junit4]   2> 15926 T798 C84 P49428 oass.SolrIndexSearcher.<init> Opening Searcher@6e0db262 realtime
[junit4:junit4]   2> 15926 T798 C84 P49428 REQ /update {update.distrib=TOLEADER&wt=javabin&version=2} status=0 QTime=14 
[junit4:junit4]   2> 15927 T790 C82 P49425 /update {wt=javabin&version=2} {deleteByQuery=*:* (-1414686268801941504)} 0 68
[junit4:junit4]   2> 15935 T772 C83 P49417 /update {wt=javabin&version=2} {add=[1 (1414686268866953216)]} 0 3
[junit4:junit4]   2> 15969 T810 C81 P49435 REQ /update {distrib.from=http://127.0.0.1:49425/solr/collection1/&update.distrib=FROMLEADER&wt=javabin&version=2} status=0 QTime=3 
[junit4:junit4]   2> 15970 T791 C82 P49425 REQ /update {distrib.from=http://127.0.0.1:49428/solr/collection1/&update.distrib=TOLEADER&wt=javabin&version=2} status=0 QTime=11 
[junit4:junit4]   2> 15971 T799 C84 P49428 /update {wt=javabin&version=2} {add=[1]} 0 32
[junit4:junit4]   2> 15976 T772 C83 P49417 /update {wt=javabin&version=2} {add=[2 (1414686268912041984)]} 0 1
[junit4:junit4]   2> 15986 T798 C84 P49428 REQ /update {distrib.from=http://127.0.0.1:49425/solr/collection1/&update.distrib=TOLEADER&wt=javabin&version=2} status=0 QTime=3 
[junit4:junit4]   2> 15987 T790 C82 P49425 /update {wt=javabin&version=2} {add=[2]} 0 7
[junit4:junit4]   2> 15992 T772 C83 P49417 /update {wt=javabin&version=2} {add=[3 (1414686268928819200)]} 0 2
[junit4:junit4]   2> 15999 T798 C84 P49428 REQ /update {distrib.from=http://127.0.0.1:49425/solr/collection1/&update.distrib=TOLEADER&wt=javabin&version=2} status=0 QTime=1 
[junit4:junit4]   2> 16000 T790 C82 P49425 /update {wt=javabin&version=2} {add=[3]} 0 5
[junit4:junit4]   2> 16004 T772 C83 P49417 /update {wt=javabin&version=2} {add=[4 (1414686268941402112)]} 0 1
[junit4:junit4]   2> 16016 T810 C81 P49435 REQ /update {distrib.from=http://127.0.0.1:49425/solr/collection1/&update.distrib=FROMLEADER&wt=javabin&version=2} status=0 QTime=2 
[junit4:junit4]   2> 16017 T791 C82 P49425 REQ /update {distrib.from=http://127.0.0.1:49428/solr/collection1/&update.distrib=TOLEADER&wt=javabin&version=2} status=0 QTime=7 
[junit4:junit4]   2> 16018 T799 C84 P49428 /update {wt=javabin&version=2} {add=[4]} 0 11
[junit4:junit4]   2> 16022 T772 C83 P49417 /update {wt=javabin&version=2} {add=[5 (1414686268960276480)]} 0 1
[junit4:junit4]   2> 16027 T799 C84 P49428 /update {wt=javabin&version=2} {add=[5 (1414686268965519360)]} 0 2
[junit4:junit4]   2> 16031 T772 C83 P49417 /update {wt=javabin&version=2} {add=[6 (1414686268969713664)]} 0 1
[junit4:junit4]   2> 16035 T799 C84 P49428 /update {wt=javabin&version=2} {add=[6 (1414686268973907968)]} 0 1
[junit4:junit4]   2> 16039 T772 C83 P49417 /update {wt=javabin&version=2} {add=[7 (1414686268978102272)]} 0 1
[junit4:junit4]   2> 16043 T799 C84 P49428 /update {wt=javabin&version=2} {add=[7 (1414686268982296576)]} 0 1
[junit4:junit4]   2> 16048 T772 C83 P49417 /update {wt=javabin&version=2} {add=[8 (1414686268987539456)]} 0 2
[junit4:junit4]   2> 16060 T810 C81 P49435 REQ /update {distrib.from=http://127.0.0.1:49425/solr/collection1/&update.distrib=FROMLEADER&wt=javabin&version=2} status=0 QTime=2 
[junit4:junit4]   2> 16061 T791 C82 P49425 REQ /update {distrib.from=http://127.0.0.1:49428/solr/collection1/&update.distrib=TOLEADER&wt=javabin&version=2} status=0 QTime=7 
[junit4:junit4]   2> 16062 T799 C84 P49428 /update {wt=javabin&version=2} {add=[8]} 0 11
[junit4:junit4]   2> 16067 T772 C83 P49417 /update {wt=javabin&version=2} {add=[9 (1414686269007462400)]} 0 2
[junit4:junit4]   2> 16074 T798 C84 P49428 REQ /update {distrib.from=http://127.0.0.1:49425/solr/collection1/&update.distrib=TOLEADER&wt=javabin&version=2} status=0 QTime=1 
[junit4:junit4]   2> 16075 T790 C82 P49425 /update {wt=javabin&version=2} {add=[9]} 0 5
[junit4:junit4]   2> 16090 T772 C83 P49417 /update {wt=javabin&version=2} {add=[10 (1414686269020045312)]} 0 12
[junit4:junit4]   2> 16102 T810 C81 P49435 REQ /update {distrib.from=http://127.0.0.1:49425/solr/collection1/&update.distrib=FROMLEADER&wt=javabin&version=2} status=0 QTime=2 
[junit4:junit4]   2> 16103 T791 C82 P49425 REQ /update {distrib.from=http://127.0.0.1:49428/solr/collection1/&update.distrib=TOLEADER&wt=javabin&version=2} status=0 QTime=7 
[junit4:junit4]   2> 16103 T799 C84 P49428 /update {wt=javabin&version=2} {add=[10]} 0 10
[junit4:junit4]   2> 16109 T772 C83 P49417 /update {wt=javabin&version=2} {add=[11 (1414686269050454016)]} 0 2
[junit4:junit4]   2> 16120 T810 C81 P49435 REQ /update {distrib.from=http://127.0.0.1:49425/solr/collection1/&update.distrib=FROMLEADER&wt=javabin&version=2} status=0 QTime=1 
[junit4:junit4]   2> 16121 T791 C82 P49425 REQ /update {distrib.from=http://127.0.0.1:49428/solr/collection1/&update.distrib=TOLEADER&wt=javabin&version=2} status=0 QTime=6 
[junit4:junit4]   2> 16122 T799 C84 P49428 /update {wt=javabin&version=2} {add=[11]} 0 10
[junit4:junit4]   2> 16126 T772 C83 P49417 /update {wt=javabin&version=2} {add=[12 (1414686269068279808)]} 0 2
[junit4:junit4]   2> 16138 T810 C81 P49435 REQ /update {distrib.from=http://127.0.0.1:49425/solr/collection1/&update.distrib=FROMLEADER&wt=javabin&version=2} status=0 QTime=2 
[junit4:junit4]   2> 16139 T791 C82 P49425 REQ /update {distrib.from=http://127.0.0.1:49428/solr/collection1/&update.distrib=TOLEADER&wt=javabin&version=2} status=0 QTime=7 
[junit4:junit4]   2> 16140 T799 C84 P49428 /update {wt=javabin&version=2} {add=[12]} 0 11
[junit4:junit4]   2> 16145 T772 C83 P49417 /update {wt=javabin&version=2} {add=[13 (1414686269089251328)]} 0 2
[junit4:junit4]   2> 16157 T810 C81 P49435 REQ /update {distrib.from=http://127.0.0.1:49425/solr/collection1/&update.distrib=FROMLEADER&wt=javabin&version=2} status=0 QTime=2 
[junit4:junit4]   2> 16159 T791 C82 P49425 REQ /update {distrib.from=http://127.0.0.1:49428/solr/collection1/&update.distrib=TOLEADER&wt=javabin&version=2} status=0 QTime=8 
[junit4:junit4]   2> 16159 T799 C84 P49428 /update {wt=javabin&version=2} {add=[13]} 0 11
[junit4:junit4]   2> 16165 T772 C83 P49417 /update {wt=javabin&version=2} {add=[14 (1414686269110222848)]} 0 2
[junit4:junit4]   2> 16176 T810 C81 P49435 REQ /update {distrib.from=http://127.0.0.1:49425/solr/collection1/&update.distrib=FROMLEADER&wt=javabin&version=2} status=0 QTime=2 
[junit4:junit4]   2> 16177 T790 C82 P49425 /update {wt=javabin&version=2} {add=[14 (1414686269116514304)]} 0 7
[junit4:junit4]   2> 16182 T772 C83 P49417 /update {wt=javabin&version=2} {add=[15 (1414686269128048640)]} 0 2
[junit4:junit4]   2> 16194 T810 C81 P49435 REQ /update {distrib.from=http://127.0.0.1:49425/solr/collection1/&update.distrib=FROMLEADER&wt=javabin&version=2} status=0 QTime=2 
[junit4:junit4]   2> 16196 T791 C82 P49425 REQ /update {distrib.from=http://127.0.0.1:49428/solr/collection1/&update.distrib=TOLEADER&wt=javabin&version=2} status=0 QTime=8 
[junit4:junit4]   2> 16197 T799 C84 P49428 /update {wt=javabin&version=2} {add=[15]} 0 12
[junit4:junit4]   2> 16202 T772 C83 P49417 /update {wt=javabin&version=2} {add=[16 (1414686269149020160)]} 0 2
[junit4:junit4]   2> 16245 T810 C81 P49435 REQ /update {distrib.from=http://127.0.0.1:49425/solr/collection1/&update.distrib=FROMLEADER&wt=javabin&version=2} status=0 QTime=19 
[junit4:junit4]   2> 16247 T791 C82 P49425 REQ /update {distrib.from=http://127.0.0.1:49428/solr/collection1/&update.distrib=TOLEADER&wt=javabin&version=2} status=0 QTime=38 
[junit4:junit4]   2> 16248 T799 C84 P49428 /update {wt=javabin&version=2} {add=[16]} 0 41
[junit4:junit4]   2> 16255 T772 C83 P49417 /update {wt=javabin&version=2} {add=[17 (1414686269202497536)]} 0 4
[junit4:junit4]   2> 16265 T798 C84 P49428 REQ /update {distrib.from=http://127.0.0.1:49425/solr/collection1/&update.distrib=TOLEADER&wt=javabin&version=2} status=0 QTime=3 
[junit4:junit4]   2> 16266 T790 C82 P49425 /update {wt=javabin&version=2} {add=[17]} 0 7
[junit4:junit4]   2> 16271 T772 C83 P49417 /update {wt=javabin&version=2} {add=[100 (1414686269221371904)]} 0 2
[junit4:junit4]   2> 16285 T810 C81 P49435 REQ /update {distrib.from=http://127.0.0.1:49425/solr/collection1/&update.distrib=FROMLEADER&wt=javabin&version=2} status=0 QTime=4 
[junit4:junit4]   2> 16286 T791 C82 P49425 REQ /update {distrib.from=http://127.0.0.1:49428/solr/collection1/&update.distrib=TOLEADER&wt=javabin&version=2} status=0 QTime=9 
[junit4:junit4]   2> 16287 T799 C84 P49428 /update {wt=javabin&version=2} {add=[100]} 0 13
[junit4:junit4]   2> 16291 T772 C83 P49417 /update {wt=javabin&version=2} {add=[101 (1414686269242343424)]} 0 2
[junit4:junit4]   2> 16300 T810 C81 P49435 REQ /update {distrib.from=http://127.0.0.1:49425/solr/collection1/&update.distrib=FROMLEADER&wt=javabin&version=2} status=0 QTime=2 
[junit4:junit4]   2> 16301 T790 C82 P49425 /update {wt=javabin&version=2} {add=[101 (1414686269247586304)]} 0 7
[junit4:junit4]   2> 16319 T772 C83 P49417 /update {wt=javabin&version=2} {add=[102 (1414686269258072064)]} 0 15
[junit4:junit4]   2> 16328 T810 C81 P49435 REQ /update {distrib.from=http://127.0.0.1:49425/solr/collection1/&update.distrib=FROMLEADER&wt=javabin&version=2} status=0 QTime=1 
[junit4:junit4]   2> 16330 T790 C82 P49425 /update {wt=javabin&version=2} {add=[102 (1414686269276946432)]} 0 8
[junit4:junit4]   2> 16335 T772 C83 P49417 /update {wt=javabin&version=2} {add=[103 (1414686269288480768)]} 0 2
[junit4:junit4]   2> 16340 T799 C84 P49428 /update {wt=javabin&version=2} {add=[103 (1414686269293723648)]} 0 1
[junit4:junit4]   2> 16344 T772 C83 P49417 /update {wt=javabin&version=2} {add=[104 (1414686269297917952)]} 0 1
[junit4:junit4]   2> 16348 T799 C84 P49428 /update {wt=javabin&version=2} {add=[104 (1414686269302112256)]} 0 1
[junit4:junit4]   2> 16352 T772 C83 P49417 /update {wt=javabin&version=2} {add=[105 (1414686269306306560)]} 0 1
[junit4:junit4]   2> 16368 T798 C84 P49428 REQ /update {distrib.from=http://127.0.0.1:49425/solr/collection1/&update.distrib=TOLEADER&wt=javabin&version=2} status=0 QTime=10 
[junit4:junit4]   2> 16369 T790 C82 P49425 /update {wt=javabin&version=2} {add=[105]} 0 14
[junit4:junit4]   2> 16373 T772 C83 P49417 /update {wt=javabin&version=2} {add=[106 (1414686269328326656)]} 0 1
[junit4:junit4]   2> 16381 T798 C84 P49428 REQ /update {distrib.from=http://127.0.0.1:49425/solr/collection1/&update.distrib=TOLEADER&wt=javabin&version=2} status=0 QTime=2 
[junit4:junit4]   2> 16382 T790 C82 P49425 /update {wt=javabin&version=2} {add=[106]} 0 5
[junit4:junit4]   2> 16387 T772 C83 P49417 /update {wt=javabin&version=2} {add=[107 (1414686269343006720)]} 0 2
[junit4:junit4]   2> 16396 T810 C81 P49435 REQ /update {distrib.from=http://127.0.0.1:49425/solr/collection1/&update.distrib=FROMLEADER&wt=javabin&version=2} status=0 QTime=2 
[junit4:junit4]   2> 16398 T790 C82 P49425 /update {wt=javabin&version=2} {add=[107 (1414686269348249600)]} 0 8
[junit4:junit4]   2> 16403 T772 C83 P49417 /update {wt=javabin&version=2} {add=[108 (1414686269359783936)]} 0 2
[junit4:junit4]   2> 16415 T810 C81 P49435 REQ /update {distrib.from=http://127.0.0.1:49425/solr/collection1/&update.distrib=FROMLEADER&wt=javabin&version=2} status=0 QTime=2 
[junit4:junit4]   2> 16416 T791 C82 P49425 REQ /update {distrib.from=http://127.0.0.1:49428/solr/collection1/&update.distrib=TOLEADER&wt=javabin&version=2} status=0 QTime=7 
[junit4:junit4]   2> 16417 T799 C84 P49428 /update {wt=javabin&version=2} {add=[108]} 0 11
[junit4:junit4]   2> 16421 T772 C83 P49417 /update {wt=javabin&version=2} {add=[109 (1414686269379706880)]} 0 1
[junit4:junit4]   2> 16432 T810 C81 P49435 REQ /update {distrib.from=http://127.0.0.1:49425/solr/collection1/&update.distrib=FROMLEADER&wt=javabin&version=2} status=0 QTime=2 
[junit4:junit4]   2> 16433 T791 C82 P49425 REQ /update {distrib.from=http://127.0.0.1:49428/solr/collection1/&update.distrib=TOLEADER&wt=javabin&version=2} status=0 QTime=6 
[junit4:junit4]   2> 16434 T799 C84 P49428 /update {wt=javabin&version=2} {add=[109]} 0 10
[junit4:junit4]   2> 16437 T772 C83 P49417 /update {wt=javabin&version=2} {add=[110 (1414686269395435520)]} 0 1
[junit4:junit4]   2> 16446 T810 C81 P49435 REQ /update {distrib.from=http://127.0.0.1:49425/solr/collection1/&update.distrib=FROMLEADER&wt=javabin&version=2} status=0 QTime=2 
[junit4:junit4]   2> 16447 T790 C82 P49425 /update {wt=javabin&version=2} {add=[110 (1414686269400678400)]} 0 7
[junit4:junit4]   2> 16450 T772 C83 P49417 /update {wt=javabin&version=2} {add=[111 (1414686269410115584)]} 0 1
[junit4:junit4]   2> 16460 T810 C81 P49435 REQ /update {distrib.from=http://127.0.0.1:49425/solr/collection1/&update.distrib=FROMLEADER&wt=javabin&version=2} status=0 QTime=2 
[junit4:junit4]   2> 16461 T791 C82 P49425 REQ /update {distrib.from=http://127.0.0.1:49428/solr/collection1/&update.distrib=TOLEADER&wt=javabin&version=2} status=0 QTime=6 
[junit4:junit4]   2> 16461 T799 C84 P49428 /update {wt=javabin&version=2} {add=[111]} 0 8
[junit4:junit4]   2> 16473 T772 C83 P49417 /update {wt=javabin&version=2} {add=[112 (1414686269424795648)]} 0 9
[junit4:junit4]   2> 16481 T798 C84 P49428 REQ /update {distrib.from=http://127.0.0.1:49425/solr/collection1/&update.distrib=TOLEADER&wt=javabin&version=2} status=0 QTime=1 
[junit4:junit4]   2> 16482 T790 C82 P49425 /update {wt=javabin&version=2} {add=[112]} 0 5
[junit4:junit4]   2> 16487 T772 C83 P49417 /update {wt=javabin&version=2} {add=[113 (1414686269446815744)]} 0 2
[junit4:junit4]   2> 16494 T810 C81 P49435 REQ /update {distrib.from=http://127.0.0.1:49425/solr/collection1/&update.distrib=FROMLEADER&wt=javabin&version=2} status=0 QTime=1 
[junit4:junit4]   2> 16495 T790 C82 P49425 /update {wt=javabin&version=2} {add=[113 (1414686269452058624)]} 0 5
[junit4:junit4]   2> 16499 T772 C83 P49417 /update {wt=javabin&version=2} {add=[114 (1414686269460447232)]} 0 1
[junit4:junit4]   2> 16526 T810 C81 P49435 REQ /update {distrib.from=http://127.0.0.1:49425/solr/collection1/&update.distrib=FROMLEADER&wt=javabin&version=2} status=0 QTime=9 
[junit4:junit4]   2> 16527 T790 C82 P49425 /update {wt=javabin&version=2} {add=[114 (1414686269465690112)]} 0 25
[junit4:junit4]   2> 16532 T772 C83 P49417 /update {wt=javabin&version=2} {add=[115 (1414686269496098816)]} 0 1
[junit4:junit4]   2> 16536 T799 C84 P49428 /update {wt=javabin&version=2} {add=[115 (1414686269499244544)]} 0 1
[junit4:junit4]   2> 16540 T772 C83 P49417 /update {wt=javabin&version=2} {add=[116 (1414686269503438848)]} 0 1
[junit4:junit4]   2> 16547 T798 C84 P49428 REQ /update {distrib.from=http://127.0.0.1:49425/solr/collection1/&update.distrib=TOLEADER&wt=javabin&version=2} status=0 QTime=1 
[junit4:junit4]   2> 16548 T790 C82 P49425 /update {wt=javabin&version=2} {add=[116]} 0 5
[junit4:junit4]   2> 16552 T772 C83 P49417 /update {wt=javabin&version=2} {add=[117 (1414686269517070336)]} 0 1
[junit4:junit4]   2> 16559 T798 C84 P49428 REQ /update {distrib.from=http://127.0.0.1:49425/solr/collection1/&update.distrib=TOLEADER&wt=javabin&version=2} status=0 QTime=1 
[junit4:junit4]   2> 16560 T790 C82 P49425 /update {wt=javabin&version=2} {add=[117]} 0 5
[junit4:junit4]   2> 16565 T772 C83 P49417 /update {wt=javabin&version=2} {add=[118 (1414686269529653248)]} 0 2
[junit4:junit4]   2> 16576 T810 C81 P49435 REQ /update {distrib.from=http://127.0.0.1:49425/solr/collection1/&update.distrib=FROMLEADER&wt=javabin&version=2} status=0 QTime=2 
[junit4:junit4]   2> 16576 T791 C82 P49425 REQ /update {distrib.from=http://127.0.0.1:49428/solr/collection1/&update.distrib=TOLEADER&wt=javabin&version=2} status=0 QTime=6 
[junit4:junit4]   2> 16577 T799 C84 P49428 /update {wt=javabin&version=2} {add=[118]} 0 10
[junit4:junit4]   2> 16581 T772 C83 P49417 /update {wt=javabin&version=2} {add=[119 (1414686269546430464)]} 0 1
[junit4:junit4]   2> 16585 T799 C84 P49428 /update {wt=javabin&version=2} {add=[119 (1414686269550624768)]} 0 1
[junit4:junit4]   2> 16589 T772 C83 P49417 /update {wt=javabin&version=2} {add=[120 (1414686269554819072)]} 0 1
[junit4:junit4]   2> 16596 T798 C84 P49428 REQ /update {distrib.from=http://127.0.0.1:49425/solr/collection1/&update.distrib=TOLEADER&wt=javabin&version=2} status=0 QTime=1 
[junit4:junit4]   2> 16596 T790 C82 P49425 /update {wt=javabin&version=2} {add=[120]} 0 4
[junit4:junit4]   2> 16600 T772 C83 P49417 /update {wt=javabin&version=2} {add=[121 (1414686269566353408)]} 0 1
[junit4:junit4]   2> 16607 T798 C84 P49428 REQ /update {distrib.from=http://127.0.0.1:49425/solr/collection1/&update.distrib=TOLEADER&wt=javabin&version=2} status=0 QTime=1 
[junit4:junit4]   2> 16608 T790 C82 P49425 /update {wt=javabin&version=2} {add=[121]} 0 5
[junit4:junit4]   2> 16619 T772 C83 P49417 /update {wt=javabin&version=2} {add=[122 (1414686269577887744)]} 0 9
[junit4:junit4]   2> 16629 T810 C81 P49435 REQ /update {distrib.from=http://127.0.0.1:49425/solr/collection1/&update.distrib=FROMLEADER&wt=javabin&version=2} status=0 QTime=1 
[junit4:junit4]   2> 16630 T791 C82 P49425 REQ /update {distrib.from=http://127.0.0.1:49428/solr/collection1/&update.distrib=TOLEADER&wt=javabin&version=2} status=0 QTime=5 
[junit4:junit4]   2> 16630 T799 C84 P49428 /update {wt=javabin&version=2} {add=[122]} 0 8
[junit4:junit4]   2> 16635 T772 C83 P49417 /update {wt=javabin&version=2} {add=[123 (1414686269602004992)]} 0 2
[junit4:junit4]   2> 16645 T810 C81 P49435 REQ /update {distrib.from=http://127.0.0.1:49425/solr/collection1/&update.distrib=FROMLEADER&wt=javabin&version=2} status=0 QTime=1 
[junit4:junit4]   2> 16646 T791 C82 P49425 REQ /update {distrib.from=http://127.0.0.1:49428/solr/collection1/&update.distrib=TOLEADER&wt=javabin&version=2} status=0 QTime=5 
[junit4:junit4]   2> 16647 T799 C84 P49428 /update {wt=javabin&version=2} {add=[123]} 0 9
[junit4:junit4]   2> 16652 T772 C83 P49417 /update {wt=javabin&version=2} {add=[124 (1414686269620879360)]} 0 1
[junit4:junit4]   2> 16659 T810 C81 P49435 REQ /update {distrib.from=http://127.0.0.1:49425/solr/collection1/&update.distrib=FROMLEADER&wt=javabin&version=2} status=0 QTime=1 
[junit4:junit4]   2> 16660 T791 C82 P49425 REQ /update {distrib.from=http://127.0.0.1:49428/solr/collection1/&update.distrib=TOLEADER&wt=javabin&version=2} status=0 QTime=5 
[junit4:junit4]   2> 16661 T799 C84 P49428 /update {wt=javabin&version=2} {add=[124]} 0 7
[junit4:junit4]   2> 16664 T772 C83 P49417 /update {wt=javabin&version=2} {add=[125 (1414686269633462272)]} 0 1
[junit4:junit4]   2> 16674 T810 C81 P49435 REQ /update {distrib.from=http://127.0.0.1:49425/solr/collection1/&update.distrib=FROMLEADER&wt=javabin&version=2} status=0 QTime=1 
[junit4:junit4]   2> 16675 T791 C82 P49425 REQ /update {distrib.from=http://127.0.0.1:49428/solr/collection1/&update.distrib=TOLEADER&wt=javabin&version=2} status=0 QTime=5 
[junit4:junit4]   2> 16676 T799 C84 P49428 /update {wt=javabin&version=2} {add=[125]} 0 9
[junit4:junit4]   2> 16680 T772 C83 P49417 /update {wt=javabin&version=2} {add=[126 (1414686269650239488)]} 0 1
[junit4:junit4]   2> 16685 T798 C84 P49428 REQ /update {distrib.from=http://127.0.0.1:49425/solr/collection1/&update.distrib=TOLEADER&wt=javabin&version=2} status=0 QTime=1 
[junit4:junit4]   2> 16685 T790 C82 P49425 /update {wt=javabin&version=2} {add=[126]} 0 2
[junit4:junit4]   2> 16689 T772 C83 P49417 /update {wt=javabin&version=2} {add=[127 (1414686269659676672)]} 0 1
[junit4:junit4]   2> 16703 T798 C84 P49428 REQ /update {distrib.from=http://127.0.0.1:49425/solr/collection1/&update.distrib=TOLEADER&wt=javabin&version=2} status=0 QTime=9 
[junit4:junit4]   2> 16703 T790 C82 P49425 /update {wt=javabin&version=2} {add=[127]} 0 11
[junit4:junit4]   2> 16707 T772 C83 P49417 /update {wt=javabin&version=2} {add=[128 (1414686269679599616)]} 0 1
[junit4:junit4]   2> 16712 T799 C84 P49428 /update {wt=javabin&version=2} {add=[128 (1414686269682745344)]} 0 2
[junit4:junit4]   2> 16716 T772 C83 P49417 /update {wt=javabin&version=2} {add=[129 (1414686269687988224)]} 0 1
[junit4:junit4]   2> 16726 T810 C81 P49435 REQ /update {distrib.from=http://127.0.0.1:49425/solr/collection1/&update.distrib=FROMLEADER&wt=javabin&version=2} status=0 QTime=1 
[junit4:junit4]   2> 16727 T791 C82 P49425 REQ /update {distrib.from=http://127.0.0.1:49428/solr/collection1/&update.distrib=TOLEADER&wt=javabin&version=2} status=0 QTime=5 
[junit4:junit4]   2> 16727 T799 C84 P49428 /update {wt=javabin&version=2} {add=[129]} 0 8
[junit4:junit4]   2> 16731 T772 C83 P49417 /update {wt=javabin&version=2} {add=[130 (1414686269703716864)]} 0 1
[junit4:junit4]   2> 16735 T799 C84 P49428 /update {wt=javabin&version=2} {add=[130 (1414686269707911168)]} 0 1
[junit4:junit4]   2> 16739 T772 C83 P49417 /update {wt=javabin&version=2} {add=[131 (1414686269712105472)]} 0 1
[junit4:junit4]   2> 16746 T798 C84 P49428 REQ /update {distrib.from=http://127.0.0.1:49425/solr/collection1/&update.distrib=TOLEADER&wt=javabin&version=2} status=0 QTime=1 
[junit4:junit4]   2> 16747 T790 C82 P49425 /update {wt=javabin&version=2} {add=[131]} 0 5
[junit4:junit4]   2> 16760 T772 C83 P49417 /update {wt=javabin&version=2} {add=[132 (1414686269724688384)]} 0 10
[junit4:junit4]   2> 16768 T810 C81 P49435 REQ /update {distrib.from=http://127.0.0.1:49425/solr/collection1/&update.distrib=FROMLEADER&wt=javabin&version=2} status=0 QTime=1 
[junit4:junit4]   2> 16769 T790 C82 P49425 /update {wt=javabin&version=2} {add=[132 (1414686269739368448)]} 0 6
[junit4:junit4]   2> 16774 T772 C83 P49417 /update {wt=javabin&version=2} {add=[133 (1414686269748805632)]} 0 2
[junit4:junit4]   2> 16784 T810 C81 P49435 REQ /update {distrib.from=http://127.0.0.1:49425/solr/collection1/&update.distrib=FROMLEADER&wt=javabin&version=2} status=0 QTime=1 
[junit4:junit4]   2> 16785 T791 C82 P49425 REQ /update {distrib.from=http://127.0.0.1:49428/solr/collection1/&update.distrib=TOLEADER&wt=javabin&version=2} status=0 QTime=5 
[junit4:junit4]   2> 16786 T799 C84 P49428 /update {wt=javabin&version=2} {add=[133]} 0 9
[junit4:junit4]   2> 16790 T772 C83 P49417 /update {wt=javabin&version=2} {add=[134 (1414686269765582848)]} 0 1
[junit4:junit4]   2> 16797 T798 C84 P49428 REQ /update {distrib.from=http://127.0.0.1:49425/solr/collection1/&update.distrib=TOLEADER&wt=javabin&version=2} status=0 QTime=1 
[junit4:junit4]   2> 16798 T790 C82 P49425 /update {wt=javabin&version=2} {add=[134]} 0 5
[junit4:junit4]   2> 16802 T772 C83 P49417 /update {wt=javabin&version=2} {add=[135 (1414686269778165760)]} 0 1
[junit4:junit4]   2> 16809 T810 C81 P49435 REQ /update {distrib.from=http://127.0.0.1:49425/solr/collection1/&update.distrib=FROMLEADER&wt=javabin&version=2} status=0 QTime=1 
[junit4:junit4]   2> 16810 T790 C82 P49425 /update {wt=javabin&version=2} {add=[135 (1414686269782360064)]} 0 5
[junit4:junit4]   2> 16813 T772 C83 P49417 /update {wt=javabin&version=2} {add=[136 (1414686269789700096)]} 0 1
[junit4:junit4]   2> 16817 T799 C84 P49428 /update {wt=javabin&version=2} {add=[136 (1414686269793894400)]} 0 1
[junit4:junit4]   2> 16821 T772 C83 P49417 /update {wt=javabin&version=2} {add=[137 (1414686269798088704)]} 0 1
[junit4:junit4]   2> 16824 T799 C84 P49428 /update {wt=javabin&version=2} {add=[137 (1414686269801234432)]} 0 1
[junit4:junit4]   2> 16828 T772 C83 P49417 /update {wt=javabin&version=2} {add=[138 (1414686269805428736)]} 0 1
[junit4:junit4]   2> 16852 T810 C81 P49435 REQ /update {distrib.from=http://127.0.0.1:49425/solr/collection1/&update.distrib=FROMLEADER&wt=javabin&version=2} status=0 QTime=8 
[junit4:junit4]   2> 16853 T791 C82 P49425 REQ /update {distrib.from=http://127.0.0.1:49428/solr/collection1/&update.distrib=TOLEADER&wt=javabin&version=2} status=0 QTime=19 
[junit4:junit4]   2> 16854 T799 C84 P49428 /update {wt=javabin&version=2} {add=[138]} 0 23
[junit4:junit4]   2> 16857 T772 C83 P49417 /update {wt=javabin&version=2} {add=[139 (1414686269835837440)]} 0 1
[junit4:junit4]   2> 16864 T798 C84 P49428 REQ /update {distrib.from=http://127.0.0.1:49425/solr/collection1/&update.distrib=TOLEADER&wt=javabin&version=2} status=0 QTime=1 
[junit4:junit4]   2> 16865 T790 C82 P49425 /update {wt=javabin&version=2} {add=[139]} 0 5
[junit4:junit4]   2> 16868 T772 C83 P49417 /update {wt=javabin&version=2} {add=[140 (1414686269847371776)]} 0 1
[junit4:junit4]   2> 16872 T799 C84 P49428 /update {wt=javabin&version=2} {add=[140 (1414686269851566080)]} 0 1
[junit4:junit4]   2> 16876 T772 C83 P49417 /update {wt=javabin&version=2} {add=[141 (1414686269855760384)]} 0 1
[junit4:junit4]   2> 16880 T799 C84 P49428 /update {wt=javabin&version=2} {add=[141 (1414686269859954688)]} 0 1
[junit4:junit4]   2> 16891 T772 C83 P49417 /update {wt=javabin&version=2} {add=[142 (1414686269864148992)]} 0 8
[junit4:junit4]   2> 16903 T799 C84 P49428 /update {wt=javabin&version=2} {add=[142 (1414686269875683328)]} 0 9
[junit4:junit4]   2> 16907 T772 C83 P49417 /update {wt=javabin&version=2} {add=[143 (1414686269887217664)]} 0 2
[junit4:junit4]   2> 16912 T799 C84 P49428 /update {wt=javabin&version=2} {add=[143 (1414686269892460544)]} 0 2
[junit4:junit4]   2> 16915 T772 C83 P49417 /update {wt=javabin&version=2} {add=[144 (1414686269896654848)]} 0 1
[junit4:junit4]   2> 16921 T798 C84 P49428 REQ /update {distrib.from=http://127.0.0.1:49425/solr/collection1/&update.distrib=TOLEADER&wt=javabin&version=2} status=0 QTime=1 
[junit4:junit4]   2> 16921 T790 C82 P49425 /update {wt=javabin&version=2} {add=[144]} 0 4
[junit4:junit4]   2> 16926 T772 C83 P49417 /update {wt=javabin&version=2} {add=[145 (1414686269908189184)]} 0 1
[junit4:junit4]   2> 16932 T798 C84 P49428 REQ /update {distrib.from=http://127.0.0.1:49425/solr/collection1/&update.distrib=TOLEADER&wt=javabin&version=2} status=0 QTime=1 
[junit4:junit4]   2> 16932 T790 C82 P49425 /update {wt=javabin&version=2} {add=[145]} 0 4
[junit4:junit4]   2> 16936 T772 C83 P49417 /update {wt=javabin&version=2} {add=[146 (1414686269918674944)]} 0 1
[junit4:junit4]   2> 16946 T810 C81 P49435 REQ /update {distrib.from=http://127.0.0.1:49425/solr/collection1/&update.distrib=FROMLEADER&wt=javabin&version=2} status=0 QTime=3 
[junit4:junit4]   2> 16947 T790 C82 P49425 /update {wt=javabin&version=2} {add=[146 (1414686269922869248)]} 0 9
[junit4:junit4]   2> 16951 T772 C83 P49417 /update {wt=javabin&version=2} {add=[147 (1414686269934403584)]} 0 1
[junit4:junit4]   2> 16958 T798 C84 P49428 REQ /update {distrib.from=http://127.0.0.1:49425/solr/collection1/&update.distrib=TOLEADER&wt=javabin&version=2} status=0 QTime=1 
[junit4:junit4]   2> 16958 T790 C82 P49425 /update {wt=javabin&version=2} {add=[147]} 0 4
[junit4:junit4]   2> 16963 T772 C83 P49417 /update {wt=javabin&version=2} {add=[148 (1414686269946986496)]} 0 1
[junit4:junit4]   2> 16972 T810 C81 P49435 REQ /update {distrib.from=http://127.0.0.1:49425/solr/collection1/&update.distrib=FROMLEADER&wt=javabin&version=2} status=0 QTime=2 
[junit4:junit4]   2> 16972 T790 C82 P49425 /update {wt=javabin&version=2} {add=[148 (1414686269952229376)]} 0 6
[junit4:junit4]   2> 16976 T772 C83 P49417 /update {wt=javabin&version=2} {add=[149 (1414686269960617984)]} 0 1
[junit4:junit4]   2> 16980 T799 C84 P49428 /update {wt=javabin&version=2} {add=[149 (1414686269964812288)]} 0 1
[junit4:junit4]   2> 16982 T772 C83 P49417 oasu.DirectUpdateHandler2.commit start commit{flags=0,_version_=0,optimize=false,openSearcher=true,waitSearcher=true,expungeDeletes=false,softCommit=false}
[junit4:junit4]   2> 17884 T772 C83 P49417 oasc.SolrDeletionPolicy.onCommit SolrDeletionPolicy.onCommit: commits:num=2
[junit4:junit4]   2> 		commit{dir=NRTCachingDirectory(org.apache.lucene.store.NIOFSDirectory@/usr/home/hudson/hudson-slave/workspace/Lucene-Solr-Tests-4.x-java7/solr/build/solr-core/test/J0/org.apache.solr.cloud.BasicDistributedZkTest-1349149944493/control/data/index lockFactory=org.apache.lucene.store.NativeFSLockFactory@2003a6d0; maxCacheMB=48.0 maxMergeSizeMB=4.0),segFN=segments_1,generation=1,filenames=[segments_1]
[junit4:junit4]   2> 		commit{dir=NRTCachingDirectory(org.apache.lucene.store.NIOFSDirectory@/usr/home/hudson/hudson-slave/workspace/Lucene-Solr-Tests-4.x-java7/solr/build/solr-core/test/J0/org.apache.solr.cloud.BasicDistributedZkTest-1349149944493/control/data/index lockFactory=org.apache.lucene.store.NativeFSLockFactory@2003a6d0; maxCacheMB=48.0 maxMergeSizeMB=4.0),segFN=segments_2,generation=2,filenames=[_5_nrm.cfe, _2_Direct_0.tip, _5_Memory_0.ram, _2_Direct_0.tim, _0_MockSep_0.pos, _4_MockSep_0.tib, _4_MockSep_0.skp, _6_Direct_0.tip, _6_Direct_0.tim, _3.fdt, _3_MockSep_0.frq, _0_Pulsing40_0.frq, _2_MockSep_0.doc, _6_MockSep_0.doc, _5_MockSep_0.skp, _4_MockSep_0.doc, _5_Pulsing40_0.tip, _6_MockSep_0.frq, _5_Pulsing40_0.tim, _1_MockSep_0.pyl, _5_Direct_0.prx, _1_MockSep_0.skp, _0_Pulsing40_0.tim, _1_MockSep_0.tib, _0_Memory_0.ram, _2.fdt, _3_Pulsing40_0.tip, _5_MockSep_0.doc, _2.fdx, _3_Pulsing40_0.tim, _1_MockSep_0.tii, _1.fdx, _5_nrm.cfs, _4_MockSep_0.pyl, _1.fdt, _3_MockSep_0.pos, _3.si, _6.fdt, _4_MockSep_0.tii, _6_Memory_0.ram, _2.si, _3_Pulsing40_0.frq, _5_Direct_0.tim, _2_Pulsing40_0.tim, _6_MockSep_0.pyl, _6.fdx, _2_MockSep_0.skp, _2_Pulsing40_0.tip, _3.fnm, _5_MockSep_0.tii, _3_MockSep_0.pyl, _4_Pulsing40_0.prx, _1_Memory_0.ram, _2_nrm.cfe, _5_Pulsing40_0.frq, _6_MockSep_0.pos, _0_Pulsing40_0.tip, _2_nrm.cfs, _5_Direct_0.tip, _1_MockSep_0.pos, _6_MockSep_0.skp, _1_Direct_0.prx, _6_Direct_0.prx, _2.fnm, _3.fdx, _4_Pulsing40_0.tip, _2_MockSep_0.pyl, _4_Pulsing40_0.tim, _5_Pulsing40_0.prx, _5_MockSep_0.tib, _1.si, _6.si, _6.fnm, _0_Direct_0.tip, _0_Direct_0.prx, _3_MockSep_0.skp, _0_Direct_0.tim, _1_Direct_0.frq, _3_nrm.cfe, _3_MockSep_0.doc, _3_Direct_0.frq, _5.fdt, _5_MockSep_0.pos, _1_Pulsing40_0.tip, _6_Pulsing40_0.frq, _1_Pulsing40_0.tim, _4.fnm, _4_nrm.cfe, _0_Pulsing40_0.prx, _1.fnm, _4.fdx, _1_Pulsing40_0.frq, _4_Direct_0.frq, _0_MockSep_0.skp, _3_MockSep_0.tib, _6_Pulsing40_0.tim, _1_Pulsing40_0.prx, _6_Pulsing40_0.tip, _1_Direct_0.tim, _3_Direct_0.prx, _1_Direct_0.tip, _2_Pulsing40_0.prx, _6_MockSep_0.tii, _1_MockSep_0.doc, _3_Direct_0.tip, _6_MockSep_0.tib, _0.fnm, _4_MockSep_0.pos, _4_Direct_0.tim, _5_MockSep_0.frq, _5_Direct_0.frq, _2_MockSep_0.tii, _0_Direct_0.frq, _2_MockSep_0.tib, _3_MockSep_0.tii, _2_Pulsing40_0.frq, _5.si, _3_nrm.cfs, _6_Pulsing40_0.prx, _4_Memory_0.ram, _4_Direct_0.prx, _4_nrm.cfs, _4_Direct_0.tip, _2_MockSep_0.pos, _3_Direct_0.tim, _5_MockSep_0.pyl, _1_MockSep_0.frq, _6_nrm.cfs, _2_Memory_0.ram, _0_MockSep_0.doc, _0.si, _3_Memory_0.ram, _1_nrm.cfs, _5.fnm, _6_nrm.cfe, _2_MockSep_0.frq, _4.si, _0_nrm.cfs, _4.fdt, _1_nrm.cfe, _0_MockSep_0.tib, _2_Direct_0.prx, _4_Pulsing40_0.frq, _3_Pulsing40_0.prx, _0_nrm.cfe, _5.fdx, _4_MockSep_0.frq, segments_2, _0_MockSep_0.frq, _0.fdx, _2_Direct_0.frq, _0_MockSep_0.tii, _0_MockSep_0.pyl, _6_Direct_0.frq, _0.fdt]
[junit4:junit4]   2> 17885 T772 C83 P49417 oasc.SolrDeletionPolicy.updateCommits newest commit = 2
[junit4:junit4]   2> 17912 T772 C83 P49417 oass.SolrIndexSearcher.<init> Opening Searcher@7057767a main
[junit4:junit4]   2> 17913 T772 C83 P49417 oasu.DirectUpdateHandler2.commit end_commit_flush
[junit4:junit4]   2> 17914 T783 oasc.SolrCore.registerSearcher [collection1] Registered new searcher Searcher@7057767a main{StandardDirectoryReader(segments_2:15:nrt _0(4.1):C10 _1(4.1):C10 _2(4.1):C10 _3(4.1):C10 _4(4.1):C10 _5(4.1):C10 _6(4.1):C7)}
[junit4:junit4]   2> 17914 T772 C83 P49417 /update {waitSearcher=true&wt=javabin&commit=true&softCommit=false&version=2} {commit=} 0 932
[junit4:junit4]   2> 17917 T790 C82 P49425 oasu.DirectUpdateHandler2.commit start commit{flags=0,_version_=0,optimize=false,openSearcher=true,waitSearcher=true,expungeDeletes=false,softCommit=false}
[junit4:junit4]   2> 18336 T790 C82 P49425 oasc.SolrDeletionPolicy.onCommit SolrDeletionPolicy.onCommit: commits:num=2
[junit4:junit4]   2> 		commit{dir=NRTCachingDirectory(org.apache.lucene.store.NIOFSDirectory@/usr/home/hudson/hudson-slave/workspace/Lucene-Solr-Tests-4.x-java7/solr/build/solr-core/test/J0/org.apache.solr.cloud.BasicDistributedZkTest-1349149944493/jetty1/index lockFactory=org.apache.lucene.store.NativeFSLockFactory@3623e183; maxCacheMB=48.0 maxMergeSizeMB=4.0),segFN=segments_1,generation=1,filenames=[segments_1]
[junit4:junit4]   2> 		commit{dir=NRTCachingDirectory(org.apache.lucene.store.NIOFSDirectory@/usr/home/hudson/hudson-slave/workspace/Lucene-Solr-Tests-4.x-java7/solr/build/solr-core/test/J0/org.apache.solr.cloud.BasicDistributedZkTest-1349149944493/jetty1/index lockFactory=org.apache.lucene.store.NativeFSLockFactory@3623e183; maxCacheMB=48.0 maxMergeSizeMB=4.0),segFN=segments_2,generation=2,filenames=[_3_MockSep_0.doc, _3_nrm.cfe, _2_Direct_0.tip, _3_Direct_0.frq, _2_Direct_0.tim, _1_Pulsing40_0.tip, _0_MockSep_0.pos, _1_Pulsing40_0.tim, _3.fdt, _3_MockSep_0.frq, _0_Pulsing40_0.prx, _2_MockSep_0.doc, _0_Pulsing40_0.frq, _1.fnm, _1_Pulsing40_0.frq, _0_MockSep_0.skp, _3_MockSep_0.tib, _1_Pulsing40_0.prx, _3_Direct_0.prx, _1_Direct_0.tim, _2_Pulsing40_0.prx, _1_Direct_0.tip, _1_MockSep_0.pyl, _1_MockSep_0.doc, _3_Direct_0.tip, _1_MockSep_0.skp, _0.fnm, _0_Pulsing40_0.tim, _0_Memory_0.ram, _1_MockSep_0.tib, _3_Pulsing40_0.tip, _2.fdt, _2_MockSep_0.tii, _3_MockSep_0.tii, _2_MockSep_0.tib, _0_Direct_0.frq, _2.fdx, _3_Pulsing40_0.tim, _2_Pulsing40_0.frq, _1_MockSep_0.tii, _3_nrm.cfs, _1.fdx, _3_MockSep_0.pos, _1.fdt, _3.si, _2_MockSep_0.pos, _3_Direct_0.tim, _3_Pulsing40_0.frq, _1_MockSep_0.frq, _2.si, _2_Pulsing40_0.tim, _2_Pulsing40_0.tip, _2_MockSep_0.skp, _3.fnm, _3_MockSep_0.pyl, _2_nrm.cfe, _1_Memory_0.ram, _0_Pulsing40_0.tip, _2_Memory_0.ram, _3_Memory_0.ram, _2_nrm.cfs, _0.si, _0_MockSep_0.doc, _1_nrm.cfs, _1_MockSep_0.pos, _2_MockSep_0.frq, _0_nrm.cfs, _1_Direct_0.prx, _2.fnm, _1_nrm.cfe, _3.fdx, _0_MockSep_0.tib, _2_Direct_0.prx, _3_Pulsing40_0.prx, _2_MockSep_0.pyl, _1.si, _0_nrm.cfe, _0_MockSep_0.frq, segments_2, _2_Direct_0.frq, _0_Direct_0.tip, _0.fdx, _3_MockSep_0.skp, _0_Direct_0.prx, _0_MockSep_0.tii, _0_MockSep_0.pyl, _0_Direct_0.tim, _0.fdt, _1_Direct_0.frq]
[junit4:junit4]   2> 18337 T790 C82 P49425 oasc.SolrDeletionPolicy.updateCommits newest commit = 2
[junit4:junit4]   2> 18349 T790 C82 P49425 oass.SolrIndexSearcher.<init> Opening Searcher@68767a21 main
[junit4:junit4]   2> 18350 T790 C82 P49425 oasu.DirectUpdateHandler2.commit end_commit_flush
[junit4:junit4]   2> 18351 T795 oasc.SolrCore.registerSearcher [collection1] Registered new searcher Searcher@68767a21 main{StandardDirectoryReader(segments_2:9:nrt _0(4.1):C10 _1(4.1):C10 _2(4.1):C10 _3(4.1):C2)}
[junit4:junit4]   2> 18352 T790 C82 P49425 oasu.SolrCmdDistributor.distribCommit Distrib commit to:[StdNode: http://127.0.0.1:49435/solr/collection1/, StdNode: http://127.0.0.1:49428/solr/collection1/]
[junit4:junit4]   2> 18355 T810 C81 P49435 oasu.DirectUpdateHandler2.commit start commit{flags=0,_version_=0,optimize=false,openSearcher=true,waitSearcher=true,expungeDeletes=false,softCommit=false}
[junit4:junit4]   2> 18356 T798 C84 P49428 oasu.DirectUpdateHandler2.commit start commit{flags=0,_version_=0,optimize=false,openSearcher=true,waitSearcher=true,expungeDeletes=false,softCommit=false}
[junit4:junit4]   2> 18638 T810 C81 P49435 oasc.SolrDeletionPolicy.onCommit SolrDeletionPolicy.onCommit: commits:num=2
[junit4:junit4]   2> 		commit{dir=NRTCachingDirectory(org.apache.lucene.store.NIOFSDirectory@/usr/home/hudson/hudson-slave/workspace/Lucene-Solr-Tests-4.x-java7/solr/build/solr-core/test/J0/org.apache.solr.cloud.BasicDistributedZkTest-1349149944493/jetty3/index lockFactory=org.apache.lucene.store.NativeFSLockFactory@1e89b09a; maxCacheMB=48.0 maxMergeSizeMB=4.0),segFN=segments_2,generation=2,filenames=[segments_2]
[junit4:junit4]   2> 		commit{dir=NRTCachingDirectory(org.apache.lucene.store.NIOFSDirectory@/usr/home/hudson/hudson-slave/workspace/Lucene-Solr-Tests-4.x-java7/solr/build/solr-core/test/J0/org.apache.solr.cloud.BasicDistributedZkTest-1349149944493/jetty3/index lockFactory=org.apache.lucene.store.NativeFSLockFactory@1e89b09a; maxCacheMB=48.0 maxMergeSizeMB=4.0),segFN=segments_3,generation=3,filenames=[_3_MockSep_0.doc, _3_nrm.cfe, _2_Direct_0.tip, _3_Direct_0.frq, _2_Direct_0.tim, _1_Pulsing40_0.tip, _0_MockSep_0.pos, _1_Pulsing40_0.tim, _3.fdt, _3_MockSep_0.frq, _0_Pulsing40_0.prx, _2_MockSep_0.doc, _0_Pulsing40_0.frq, _1.fnm, _1_Pulsing40_0.frq, _0_MockSep_0.skp, _3_MockSep_0.tib, _1_Pulsing40_0.prx, _3_Direct_0.prx, _1_Direct_0.tim, _2_Pulsing40_0.prx, _1_Direct_0.tip, _1_MockSep_0.pyl, _1_MockSep_0.doc, _3_Direct_0.tip, _1_MockSep_0.skp, _0.fnm, _0_Pulsing40_0.tim, _0_Memory_0.ram, _1_MockSep_0.tib, _3_Pulsing40_0.tip, _2.fdt, _2_MockSep_0.tii, _3_MockSep_0.tii, _2_MockSep_0.tib, _0_Direct_0.frq, _2.fdx, _3_Pulsing40_0.tim, _2_Pulsing40_0.frq, _1_MockSep_0.tii, _3_nrm.cfs, _1.fdx, _3_MockSep_0.pos, _1.fdt, _3.si, _2_MockSep_0.pos, _3_Direct_0.tim, _3_Pulsing40_0.frq, _1_MockSep_0.frq, _2.si, _2_Pulsing40_0.tim, _2_Pulsing40_0.tip, _2_MockSep_0.skp, _3.fnm, _3_MockSep_0.pyl, _2_nrm.cfe, _1_Memory_0.ram, _0_Pulsing40_0.tip, _2_Memory_0.ram, _3_Memory_0.ram, _2_nrm.cfs, _0.si, _0_MockSep_0.doc, _1_nrm.cfs, _1_MockSep_0.pos, _2_MockSep_0.frq, _0_nrm.cfs, _1_Direct_0.prx, _2.fnm, _1_nrm.cfe, _3.fdx, _0_MockSep_0.tib, _2_Direct_0.prx, _3_Pulsing40_0.prx, _2_MockSep_0.pyl, _1.si, _0_nrm.cfe, _0_MockSep_0.frq, _2_Direct_0.frq, _0_Direct_0.tip, _0.fdx, _3_MockSep_0.skp, _0_Direct_0.prx, _0_MockSep_0.tii, _0_MockSep_0.pyl, _0_Direct_0.tim, _0.fdt, segments_3, _1_Direct_0.frq]
[junit4:junit4]   2> 18639 T810 C81 P49435 oasc.SolrDeletionPolicy.updateCommits newest commit = 3
[junit4:junit4]   2> 18651 T810 C81 P49435 oass.SolrIndexSearcher.<init> Opening Searcher@16d26672 main
[junit4:junit4]   2> 18652 T810 C81 P49435 oasu.DirectUpdateHandler2.commit end_commit_flush
[junit4:junit4]   2> 18653 T819 oasc.SolrCore.registerSearcher [collection1] Registered new searcher Searcher@16d26672 main{StandardDirectoryReader(segments_3:10:nrt _0(4.1):C10 _1(4.1):C10 _2(4.1):C10 _3(4.1):C2)}
[junit4:junit4]   2> 18653 T798 C84 P49428 oasc.SolrDeletionPolicy.onCommit SolrDeletionPolicy.onCommit: commits:num=2
[junit4:junit4]   2> 		commit{dir=NRTCachingDirectory(org.apache.lucene.store.NIOFSDirectory@/usr/home/hudson/hudson-slave/workspace/Lucene-Solr-Tests-4.x-java7/solr/build/solr-core/test/J0/org.apache.solr.cloud.BasicDistributedZkTest-1349149944493/jetty2/index lockFactory=org.apache.lucene.store.NativeFSLockFactory@5f604505; maxCacheMB=48.0 maxMergeSizeMB=4.0),segFN=segments_1,generation=1,filenames=[segments_1]
[junit4:junit4]   2> 		commit{dir=NRTCachingDirectory(org.apache.lucene.store.NIOFSDirectory@/usr/home/hudson/hudson-slave/workspace/Lucene-Solr-Tests-4.x-java7/solr/build/solr-core/test/J0/org.apache.solr.cloud.BasicDistributedZkTest-1349149944493/jetty2/index lockFactory=org.apache.lucene.store.NativeFSLockFactory@5f604505; maxCacheMB=48.0 maxMergeSizeMB=4.0),segFN=segments_2,generation=2,filenames=[_3_MockSep_0.doc, _3_nrm.cfe, _2_Direct_0.tip, _3_Direct_0.frq, _2_Direct_0.tim, _1_Pulsing40_0.tip, _0_MockSep_0.pos, _1_Pulsing40_0.tim, _3.fdt, _3_MockSep_0.frq, _0_Pulsing40_0.prx, _2_MockSep_0.doc, _0_Pulsing40_0.frq, _1.fnm, _1_Pulsing40_0.frq, _0_MockSep_0.skp, _3_MockSep_0.tib, _1_Pulsing40_0.prx, _3_Direct_0.prx, _1_Direct_0.tim, _2_Pulsing40_0.prx, _1_Direct_0.tip, _1_MockSep_0.pyl, _1_MockSep_0.doc, _3_Direct_0.tip, _1_MockSep_0.skp, _0.fnm, _0_Pulsing40_0.tim, _0_Memory_0.ram, _1_MockSep_0.tib, _3_Pulsing40_0.tip, _2.fdt, _2_MockSep_0.tii, _3_MockSep_0.tii, _2_MockSep_0.tib, _0_Direct_0.frq, _2.fdx, _3_Pulsing40_0.tim, _2_Pulsing40_0.frq, _1_MockSep_0.tii, _3_nrm.cfs, _1.fdx, _3_MockSep_0.pos, _1.fdt, _3.si, _2_MockSep_0.pos, _3_Direct_0.tim, _3_Pulsing40_0.frq, _1_MockSep_0.frq, _2.si, _2_Pulsing40_0.tim, _2_Pulsing40_0.tip, _2_MockSep_0.skp, _3.fnm, _3_MockSep_0.pyl, _2_nrm.cfe, _1_Memory_0.ram, _0_Pulsing40_0.tip, _2_Memory_0.ram, _3_Memory_0.ram, _2_nrm.cfs, _0.si, _0_MockSep_0.doc, _1_nrm.cfs, _1_MockSep_0.pos, _2_MockSep_0.frq, _0_nrm.cfs, _1_Direct_0.prx, _2.fnm, _1_nrm.cfe, _3.fdx, _0_MockSep_0.tib, _2_Direct_0.prx, _3_Pulsing40_0.prx, _2_MockSep_0.pyl, _1.si, _0_nrm.cfe, _0_MockSep_0.frq, segments_2, _2_Direct_0.frq, _0_Direct_0.tip, _0.fdx, _3_MockSep_0.skp, _0_Direct_0.prx, _0_MockSep_0.tii, _0_MockSep_0.pyl, _0_Direct_0.tim, _0.fdt, _1_Direct_0.frq]
[junit4:junit4]   2> 18653 T810 C81 P49435 /update {waitSearcher=true&commit=true&commit_end_point=true&expungeDeletes=false&wt=javabin&softCommit=false&version=2} {commit=} 0 298
[junit4:junit4]   2> 18653 T798 C84 P49428 oasc.SolrDeletionPolicy.updateCommits newest commit = 2
[junit4:junit4]   2> 18662 T798 C84 P49428 oass.SolrIndexSearcher.<init> Opening Searcher@6863c4cf main
[junit4:junit4]   2> 18662 T798 C84 P49428 oasu.DirectUpdateHandler2.commit end_commit_flush
[junit4:junit4]   2> 18664 T807 oasc.SolrCore.registerSearcher [collection1] Registered new searcher Searcher@6863c4cf main{StandardDirectoryReader(segments_2:9:nrt _0(4.1):C10 _1(4.1):C10 _2(4.1):C10 _3(4.1):C5)}
[junit4:junit4]   2> 18664 T798 C84 P49428 /update {waitSearcher=true&commit=true&commit_end_point=true&expungeDeletes=false&wt=javabin&softCommit=false&version=2} {commit=} 0 309
[junit4:junit4]   2> 18665 T790 C82 P49425 /update {waitSearcher=true&wt=javabin&commit=true&softCommit=false&version=2} {commit=} 0 748
[junit4:junit4]   2> 18670 T772 C83 P49417 REQ /select {distrib=false&sort=n_ti1+desc&wt=javabin&q=*:*&version=2} hits=67 status=0 QTime=2 
[junit4:junit4]   2> 18673 T760 oascsi.HttpClientUtil.createClient Creating new http client, config:
[junit4:junit4]   2> 18680 T760 oaz.ZooKeeper.<init> Initiating client connection, connectString=127.0.0.1:49410/solr sessionTimeout=10000 watcher=org.apache.solr.common.cloud.ConnectionManager@72f15f41
[junit4:junit4]   2> 18681 T829 oaz.ClientCnxn$SendThread.startConnect Opening socket connection to server /127.0.0.1:49410
[junit4:junit4]   2> 18681 T760 oascc.ConnectionManager.waitForConnected Waiting for client to connect to ZooKeeper
[junit4:junit4]   2> 18682 T829 oaz.ClientCnxn$SendThread.primeConnection Socket connection established to localhost/127.0.0.1:49410, initiating session
[junit4:junit4]   2> 18683 T762 oazs.NIOServerCnxn$Factory.run Accepted socket connection from /140.211.11.196:49477
[junit4:junit4]   2> 18683 T762 oazs.NIOServerCnxn.readConnectRequest Client attempting to establish new session at /140.211.11.196:49477
[junit4:junit4]   2> 18684 T764 oazs.NIOServerCnxn.finishSessionInit Established session 0x13a1f9a6c480008 with negotiated timeout 10000 for client /140.211.11.196:49477
[junit4:junit4]   2> 18684 T829 oaz.ClientCnxn$SendThread.readConnectResult Session establishment complete on server localhost/127.0.0.1:49410, sessionid = 0x13a1f9a6c480008, negotiated timeout = 10000
[junit4:junit4]   2> 18685 T830 oascc.ConnectionManager.process Watcher org.apache.solr.common.cloud.ConnectionManager@72f15f41 name:ZooKeeperConnection Watcher:127.0.0.1:49410/solr got event WatchedEvent state:SyncConnected type:None path:null path:null type:None
[junit4:junit4]   2> 18685 T760 oascc.ConnectionManager.waitForConnected Client is connected to ZooKeeper
[junit4:junit4]   2> 18686 T760 oascc.ZkStateReader.createClusterStateWatchersAndUpdate Updating cluster state from ZooKeeper... 
[junit4:junit4]   2> 18697 T792 C82 P49425 REQ /select {sort=n_ti1+desc&distrib=false&collection=collection1&wt=javabin&rows=10&version=2&NOW=1349149963151&shard.url=127.0.0.1:49425/solr/collection1/|127.0.0.1:49435/solr/collection1/&fl=id&start=0&q=*:*&isShard=true&fsv=true} hits=32 status=0 QTime=1 
[junit4:junit4]   2> 18697 T801 C84 P49428 REQ /select {sort=n_ti1+desc&distrib=false&collection=collection1&wt=javabin&rows=10&version=2&NOW=1349149963151&shard.url=127.0.0.1:49428/solr/collection1/&fl=id&start=0&q=*:*&isShard=true&fsv=true} hits=35 status=0 QTime=1 
[junit4:junit4]   2> 18710 T792 C82 P49425 REQ /select {shard.url=127.0.0.1:49425/solr/collection1/|127.0.0.1:49435/solr/collection1/&NOW=1349149963151&q=*:*&ids=10,123,16,13,12&distrib=false&collection=collection1&isShard=true&wt=javabin&version=2} status=0 QTime=1 
[junit4:junit4]   2> 18710 T801 C84 P49428 REQ /select {shard.url=127.0.0.1:49428/solr/collection1/&NOW=1349149963151&q=*:*&ids=143,145,127,103,131&distrib=false&collection=collection1&isShard=true&wt=javabin&version=2} status=0 QTime=1 
[junit4:junit4]   2> 18712 T800 C84 P49428 REQ /select {collection=collection1&sort=n_ti1+desc&wt=javabin&q=*:*&version=2} hits=67 status=0 QTime=20 
[junit4:junit4]   2> 18725 T772 C83 P49417 REQ /select {distrib=false&sort=n_ti1+asc&wt=javabin&q=*:*&version=2} hits=67 status=0 QTime=1 
[junit4:junit4]   2> 18735 T787 C82 P49425 REQ /select {sort=n_ti1+asc&distrib=false&wt=javabin&rows=10&version=2&fl=id&shard.url=127.0.0.1:49425/solr/collection1/|127.0.0.1:49435/solr/collection1/&NOW=1349149963188&start=0&q=*:*&isShard=true&fsv=true} hits=32 status=0 QTime=1 
[junit4:junit4]   2> 18735 T802 C84 P49428 REQ /select {sort=n_ti1+asc&distrib=false&wt=javabin&rows=10&version=2&fl=id&shard.url=127.0.0.1:49428/solr/collection1/&NOW=1349149963188&start=0&q=*:*&isShard=true&fsv=true} hits=35 status=0 QTime=1 
[junit4:junit4]   2> 18741 T802 C84 P49428 REQ /select {shard.url=127.0.0.1:49428/solr/collection1/&NOW=1349149963188&q=*:*&ids=115,112,136,142&distrib=false&isShard=true&wt=javabin&version=2} status=0 QTime=0 
[junit4:junit4]   2> 18742 T787 C82 P49425 REQ /select {shard.url=127.0.0.1:49425/solr/collection1/|127.0.0.1:49435/solr/collection1/&NOW=1349149963188&q=*:*&ids=132,114,122,148,110,118&distrib=false&isShard=true&wt=javabin&version=2} status=0 QTime=1 
[junit4:junit4]   2> 18744 T790 C82 P49425 REQ /select {sort=n_ti1+asc&wt=javabin&q=*:*&version=2} hits=67 status=0 QTime=15 
[junit4:junit4]   2> 18752 T772 C83 P49417 REQ /select {distrib=false&sort=n_f1+desc&wt=javabin&q=*:*&version=2} hits=67 status=0 QTime=2 
[junit4:junit4]   2> 18761 T801 C84 P49428 REQ /select {sort=n_f1+desc&distrib=false&wt=javabin&rows=10&version=2&fl=id&shard.url=127.0.0.1:49428/solr/collection1/&NOW=1349149963215&start=0&q=*:*&isShard=true&fsv=true} hits=35 status=0 QTime=1 
[junit4:junit4]   2> 18761 T811 C81 P49435 REQ /select {sort=n_f1+desc&distrib=false&wt=javabin&rows=10&version=2&fl=id&shard.url=127.0.0.1:49425/solr/collection1/|127.0.0.1:49435/solr/collection1/&NOW=1349149963215&start=0&q=*:*&isShard=true&fsv=true} hits=32 status=0 QTime=1 
[junit4:junit4]   2> 18767 T811 C81 P49435 REQ /select {shard.url=127.0.0.1:49425/solr/collection1/|127.0.0.1:49435/solr/collection1/&NOW=1349149963215&q=*:*&ids=109,108,111,4,101&distrib=false&isShard=true&wt=javabin&version=2} status=0 QTime=1 
[junit4:junit4]   2> 18767 T801 C84 P49428 REQ /select {shard.url=127.0.0.1:49428/solr/collection1/&NOW=1349149963215&q=*:*&ids=134,115,139,17,104&distrib=false&isShard=true&wt=javabin&version=2} status=0 QTime=0 
[junit4:junit4]   2> 18771 T800 C84 P49428 REQ /select {sort=n_f1+desc&wt=javabin&q=*:*&version=2} hits=67 status=0 QTime=15 
[junit4:junit4]   2> 18782 T772 C83 P49417 REQ /select {distrib=false&sort=n_f1+asc&wt=javabin&q=*:*&version=2} hits=67 status=0 QTime=1 
[junit4:junit4]   2> 18790 T788 C82 P49425 REQ /select {sort=n_f1+asc&distrib=false&wt=javabin&rows=10&version=2&fl=id&shard.url=127.0.0.1:49425/solr/collection1/|127.0.0.1:49435/solr/collection1/&NOW=1349149963245&start=0&q=*:*&isShard=true&fsv=true} hits=32 status=0 QTime=0 
[junit4:junit4]   2> 18792 T803 C84 P49428 REQ /select {sort=n_f1+asc&distrib=false&wt=javabin&rows=10&version=2&fl=id&shard.url=127.0.0.1:49428/solr/collection1/&NOW=1349149963245&start=0&q=*:*&isShard=true&fsv=true} hits=35 status=0 QTime=1 
[junit4:junit4]   2> 18796 T803 C84 P49428 REQ /select {shard.url=127.0.0.1:49428/solr/collection1/&NOW=1349149963245&q=*:*&ids=117,128,6,106,9&distrib=false&isShard=true&wt=javabin&version=2} status=0 QTime=1 
[junit4:junit4]   2> 18796 T788 C82 P49425 REQ /select {shard.url=127.0.0.1:49425/solr/collection1/|127.0.0.1:49435/solr/collection1/&NOW=1349149963245&q=*:*&ids=125,138,110,123,107&distrib=false&isShard=true&wt=javabin&version=2} status=0 QTime=1 
[junit4:junit4]   2> 18799 T812 C81 P49435 REQ /select {sort=n_f1+asc&wt=javabin&q=*:*&version=2} hits=67 status=0 QTime=13 
[junit4:junit4]   2> 18806 T772 C83 P49417 REQ /select {distrib=false&sort=n_tf1+desc&wt=javabin&q=*:*&version=2} hits=67 status=0 QTime=1 
[junit4:junit4]   2> 18812 T813 C81 P49435 REQ /select {sort=n_tf1+desc&distrib=false&wt=javabin&rows=10&version=2&fl=id&shard.url=127.0.0.1:49425/solr/collection1/|127.0.0.1:49435/solr/collection1/&NOW=1349149963269&start=0&q=*:*&isShard=true&fsv=true} hits=32 status=0 QTime=0 
[junit4:junit4]   2> 18814 T802 C84 P49428 REQ /select {sort=n_tf1+desc&distrib=false&wt=javabin&rows=10&version=2&fl=id&shard.url=127.0.0.1:49428/solr/collection1/&NOW=1349149963269&start=0&q=*:*&isShard=true&fsv=true} hits=35 status=0 QTime=1 
[junit4:junit4]   2> 18819 T813 C81 P49435 REQ /select {shard.url=127.0.0.1:49425/solr/collection1/|127.0.0.1:49435/solr/collection1/&NOW=1349149963269&q=*:*&ids=146,138,122,13,118&distrib=false&isShard=true&wt=javabin&version=2} status=0 QTime=1 
[junit4:junit4]   2> 18819 T802 C84 P49428 REQ /select {shard.url=127.0.0.1:49428/solr/collection1/&NOW=1349149963269&q=*:*&ids=143,2,137,130,141&distrib=false&isShard=true&wt=javabin&version=2} status=0 QTime=1 
[junit4:junit4]   2> 18821 T837 C82 P49425 REQ /select {sort=n_tf1+desc&wt=javabin&q=*:*&version=2} hits=67 status=0 QTime=11 
[junit4:junit4]   2> 18826 T772 C83 P49417 REQ /select {distrib=false&sort=n_tf1+asc&wt=javabin&q=*:*&version=2} hits=67 status=0 QTime=0 
[junit4:junit4]   2> 18835 T803 C84 P49428 REQ /select {sort=n_tf1+asc&distrib=false&wt=javabin&rows=10&version=2&fl=id&shard.url=127.0.0.1:49428/solr/collection1/&NOW=1349149963290&start=0&q=*:*&isShard=true&fsv=true} hits=35 status=0 QTime=1 
[junit4:junit4]   2> 18835 T788 C82 P49425 REQ /select {sort=n_tf1+asc&distrib=false&wt=javabin&rows=10&version=2&fl=id&shard.url=127.0.0.1:49425/solr/collection1/|127.0.0.1:49435/solr/collection1/&NOW=1349149963290&start=0&q=*:*&isShard=true&fsv=true} hits=32 status=0 QTime=1 
[junit4:junit4]   2> 18840 T788 C82 P49425 REQ /select {shard.url=127.0.0.1:49425/solr/collection1/|127.0.0.1:49435/solr/collection1/&NOW=1349149963290&q=*:*&ids=10,113,110,8,14&distrib=false&isShard=true&wt=javabin&version=2} status=0 QTime=1 
[junit4:junit4]   2> 18840 T803 C84 P49428 REQ /select {shard.url=127.0.0.1:49428/solr/collection1/&NOW=1349149963290&q=*:*&ids=3,134,144,139,142&distrib=false&isShard=true&wt=javabin&version=2} status=0 QTime=1 
[junit4:junit4]   2> 18842 T812 C81 P49435 REQ /select {sort=n_tf1+asc&wt=javabin&q=*:*&version=2} hits=67 status=0 QTime=11 
[junit4:junit4]   2> 18848 T772 C83 P49417 REQ /select {distrib=false&sort=n_d1+desc&wt=javabin&q=*:*&version=2} hits=67 status=0 QTime=1 
[junit4:junit4]   2> 18856 T813 C81 P49435 REQ /select {sort=n_d1+desc&distrib=false&wt=javabin&rows=10&version=2&fl=id&shard.url=127.0.0.1:49425/solr/collection1/|127.0.0.1:49435/solr/collection1/&NOW=1349149963311&start=0&q=*:*&isShard=true&fsv=true} hits=32 status=0 QTime=1 
[junit4:junit4]   2> 18856 T802 C84 P49428 REQ /select {sort=n_d1+desc&distrib=false&wt=javabin&rows=10&version=2&fl=id&shard.url=127.0.0.1:49428/solr/collection1/&NOW=1349149963311&start=0&q=*:*&isShard=true&fsv=true} hits=35 status=0 QTime=1 
[junit4:junit4]   2> 18861 T813 C81 P49435 REQ /select {shard.url=127.0.0.1:49425/solr/collection1/|127.0.0.1:49435/solr/collection1/&NOW=1349149963311&q=*:*&ids=1,124,101&distrib=false&isShard=true&wt=javabin&version=2} status=0 QTime=1 
[junit4:junit4]   2> 18861 T802 C84 P49428 REQ /select {shard.url=127.0.0.1:49428/solr/collection1/&NOW=1349149963311&q=*:*&ids=3,116,127,147,137,17,105&distrib=false&isShard=true&wt=javabin&version=2} status=0 QTime=1 
[junit4:junit4]   2> 18864 T837 C82 P49425 REQ /select {sort=n_d1+desc&wt=javabin&q=*:*&version=2} hits=67 status=0 QTime=12 
[junit4:junit4]   2> 18870 T772 C83 P49417 REQ /select {distrib=false&sort=n_d1+asc&wt=javabin&q=*:*&version=2} hits=67 status=0 QTime=1 
[junit4:junit4]   2> 18878 T801 C84 P49428 REQ /select {sort=n_d1+asc&distrib=false&collection=collection1&wt=javabin&rows=10&version=2&fl=id&shard.url=127.0.0.1:49428/solr/collection1/&NOW=1349149963333&start=0&q=*:*&isShard=true&fsv=true} hits=35 status=0 QTime=1 
[junit4:junit4]   2> 18878 T811 C81 P49435 REQ /select {sort=n_d1+asc&distrib=false&collection=collection1&wt=javabin&rows=10&version=2&NOW=1349149963333&shard.url=127.0.0.1:49425/solr/collection1/|127.0.0.1:49435/solr/collection1/&fl=id&start=0&q=*:*&isShard=true&fsv=true} hits=32 status=0 QTime=1 
[junit4:junit4]   2> 18883 T801 C84 P49428 REQ /select {shard.url=127.0.0.1:49428/solr/collection1/&NOW=1349149963333&q=*:*&ids=143,134,144,6,130&distrib=false&collection=collection1&isShard=true&wt=javabin&version=2} status=0 QTime=1 
[junit4:junit4]   2> 18883 T811 C81 P49435 REQ /select {shard.url=127.0.0.1:49425/solr/collection1/|127.0.0.1:49435/solr/collection1/&NOW=1349149963333&q=*:*&ids=125,10,122,110,102&distrib=false&collection=collection1&isShard=true&wt=javabin&version=2} status=0 QTime=1 
[junit4:junit4]   2> 18886 T799 C84 P49428 REQ /select {collection=collection1&sort=n_d1+asc&wt=javabin&q=*:*&version=2} hits=67 status=0 QTime=12 
[junit4:junit4]   2> 18892 T772 C83 P49417 REQ /select {distrib=false&sort=n_td1+desc&wt=javabin&q=*:*&version=2} hits=67 status=0 QTime=1 
[junit4:junit4]   2> 18901 T802 C84 P49428 REQ /select {sort=n_td1+desc&distrib=false&collection=collection1&wt=javabin&rows=10&version=2&NOW=1349149963356&shard.url=127.0.0.1:49428/solr/collection1/&fl=id&start=0&q=*:*&isShard=true&fsv=true} hits=35 status=0 QTime=1 
[junit4:junit4]   2> 18901 T787 C82 P49425 REQ /select {sort=n_td1+desc&distrib=false&collection=collection1&wt=javabin&rows=10&version=2&NOW=1349149963356&shard.url=127.0.0.1:49425/solr/collection1/|127.0.0.1:49435/solr/collection1/&fl=id&start=0&q=*:*&isShard=true&fsv=true} hits=32 status=0 QTime=0 
[junit4:junit4]   2> 18906 T787 C82 P49425 REQ /select {shard.url=127.0.0.1:49425/solr/collection1/|127.0.0.1:49435/solr/collection1/&NOW=1349149963356&q=*:*&ids=132,146,108,123,107,12&distrib=false&collection=collection1&isShard=true&wt=javabin&version=2} status=0 QTime=1 
[junit4:junit4]   2> 18906 T802 C84 P49428 REQ /select {shard.url=127.0.0.1:49428/solr/collection1/&NOW=1349149963356&q=*:*&ids=3,144,9,142&distrib=false&collection=collection1&isShard=true&wt=javabin&version=2} status=0 QTime=1 
[junit4:junit4]   2> 18909 T790 C82 P49425 REQ /select {collection=collection1&sort=n_td1+desc&wt=javabin&q=*:*&version=2} hits=67 status=0 QTime=12 
[junit4:junit4]   2> 18915 T772 C83 P49417 REQ /select {distrib=false&sort=n_td1+asc&wt=javabin&q=*:*&version=2} hits=67 status=0 QTime=1 
[junit4:junit4]   2> 18922 T788 C82 P49425 REQ /select {sort=n_td1+asc&distrib=false&collection=collection1&wt=javabin&rows=10&version=2&NOW=1349149963377&shard.url=127.0.0.1:49425/solr/collection1/|127.0.0.1:49435/solr/collection1/&fl=id&start=0&q=*:*&isShard=true&fsv=true} hits=32 status=0 QTime=1 
[junit4:junit4]   2> 18922 T803 C84 P49428 REQ /select {sort=n_td1+asc&distrib=false&collection=collection1&wt=javabin&rows=10&version=2&NOW=1349149963377&shard.url=127.0.0.1:49428/solr/collection1/&fl=id&start=0&q=*:*&isShard=true&fsv=true} hits=35 status=0 QTime=1 
[junit4:junit4]   2> 18928 T788 C82 P49425 REQ /select {shard.url=127.0.0.1:49425/solr/collection1/|127.0.0.1:49435/solr/collection1/&NOW=1349149963377&q=*:*&ids=113,102,14,11&distrib=false&collection=collection1&isShard=true&wt=javabin&version=2} status=0 QTime=1 
[junit4:junit4]   2> 18928 T803 C84 P49428 REQ /select {shard.url=127.0.0.1:49428/solr/collection1/&NOW=1349149963377&q=*:*&ids=116,126,137,106,131,141&distrib=false&collection=collection1&isShard=true&wt=javabin&version=2} status=0 QTime=1 
[junit4:junit4]   2> 18931 T814 C81 P49435 REQ /select {collection=collection1&sort=n_td1+asc&wt=javabin&q=*:*&version=2} hits=67 status=0 QTime=13 
[junit4:junit4]   2> 18937 T772 C83 P49417 REQ /select {distrib=false&sort=n_l1+desc&wt=javabin&q=*:*&version=2} hits=67 status=0 QTime=1 
[junit4:junit4]   2> 18944 T815 C81 P49435 REQ /select {sort=n_l1+desc&distrib=false&wt=javabin&rows=10&version=2&fl=id&shard.url=127.0.0.1:49425/solr/collection1/|127.0.0.1:49435/solr/collection1/&NOW=1349149963400&start=0&q=*:*&isShard=true&fsv=true} hits=32 status=0 QTime=1 
[junit4:junit4]   2> 18945 T803 C84 P49428 REQ /select {sort=n_l1+desc&distrib=false&wt=javabin&rows=10&version=2&fl=id&shard.url=127.0.0.1:49428/solr/collection1/&NOW=1349149963400&start=0&q=*:*&isShard=true&fsv=true} hits=35 status=0 QTime=1 
[junit4:junit4]   2> 18949 T803 C84 P49428 REQ /select {shard.url=127.0.0.1:49428/solr/collection1/&NOW=1349149963400&q=*:*&ids=143,2,126&distrib=false&isShard=true&wt=javabin&version=2} status=0 QTime=1 
[junit4:junit4]   2> 18949 T815 C81 P49435 REQ /select {shard.url=127.0.0.1:49425/solr/collection1/|127.0.0.1:49435/solr/collection1/&NOW=1349149963400&q=*:*&ids=133,122,109,108,124,8,102&distrib=false&isShard=true&wt=javabin&version=2} status=0 QTime=1 
[junit4:junit4]   2> 18951 T814 C81 P49435 REQ /select {sort=n_l1+desc&wt=javabin&q=*:*&version=2} hits=67 status=0 QTime=10 
[junit4:junit4]   2> 18957 T772 C83 P49417 REQ /select {distrib=false&sort=n_l1+asc&wt=javabin&q=*:*&version=2} hits=67 status=0 QTime=1 
[junit4:junit4]   2> 18964 T803 C84 P49428 REQ /select {sort=n_l1+asc&distrib=false&wt=javabin&rows=10&version=2&fl=id&shard.url=127.0.0.1:49428/solr/collection1/&NOW=1349149963419&start=0&q=*:*&isShard=true&fsv=true} hits=35 status=0 QTime=1 
[junit4:junit4]   2> 18964 T788 C82 P49425 REQ /select {sort=n_l1+asc&distrib=false&wt=javabin&rows=10&version=2&fl=id&shard.url=127.0.0.1:49425/solr/collection1/|127.0.0.1:49435/solr/collection1/&NOW=1349149963419&start=0&q=*:*&isShard=true&fsv=true} hits=32 status=0 QTime=1 
[junit4:junit4]   2> 18967 T788 C82 P49425 REQ /select {shard.url=127.0.0.1:49425/solr/collection1/|127.0.0.1:49435/solr/collection1/&NOW=1349149963419&q=*:*&ids=1,129,14&distrib=false&isShard=true&wt=javabin&version=2} status=0 QTime=1 
[junit4:junit4]   2> 18968 T803 C84 P49428 REQ /select {shard.url=127.0.0.1:49428/solr/collection1/&NOW=1349149963419&q=*:*&ids=3,115,6,139,9,103,131&distrib=false&isShard=true&wt=javabin&version=2} status=0 QTime=1 
[junit4:junit4]   2> 18969 T814 C81 P49435 REQ /select {sort=n_l1+asc&wt=javabin&q=*:*&version=2} hits=67 status=0 QTime=9 
[junit4:junit4]   2> 18975 T772 C83 P49417 REQ /select {distrib=false&sort=n_tl1+desc&wt=javabin&q=*:*&version=2} hits=67 status=0 QTime=1 
[junit4:junit4]   2> 18983 T803 C84 P49428 REQ /select {sort=n_tl1+desc&distrib=false&collection=collection1&wt=javabin&rows=10&version=2&fl=id&shard.url=127.0.0.1:49428/solr/collection1/&NOW=1349149963438&start=0&q=*:*&isShard=true&fsv=true} hits=35 status=0 QTime=1 
[junit4:junit4]   2> 18983 T815 C81 P49435 REQ /select {sort=n_tl1+desc&distrib=false&collection=collection1&wt=javabin&rows=10&version=2&NOW=1349149963438&shard.url=127.0.0.1:49425/solr/collection1/|127.0.0.1:49435/solr/collection1/&fl=id&start=0&q=*:*&isShard=true&fsv=true} hits=32 status=0 QTime=1 
[junit4:junit4]   2> 18988 T803 C84 P49428 REQ /select {shard.url=127.0.0.1:49428/solr/collection1/&NOW=1349149963438&q=*:*&ids=134,145,115,121,140&distrib=false&collection=collection1&isShard=true&wt=javabin&version=2} status=0 QTime=1 
[junit4:junit4]   2> 18988 T815 C81 P49435 REQ /select {shard.url=127.0.0.1:49425/solr/collection1/|127.0.0.1:49435/solr/collection1/&NOW=1349149963438&q=*:*&ids=10,1,146,14,100&distrib=false&collection=collection1&isShard=true&wt=javabin&version=2} status=0 QTime=1 
[junit4:junit4]   2> 18990 T814 C81 P49435 REQ /select {collection=collection1&sort=n_tl1+desc&wt=javabin&q=*:*&version=2} hits=67 status=0 QTime=11 
[junit4:junit4]   2> 18996 T772 C83 P49417 REQ /select {distrib=false&sort=n_tl1+asc&wt=javabin&q=*:*&version=2} hits=67 status=0 QTime=1 
[junit4:junit4]   2> 19003 T803 C84 P49428 REQ /select {sort=n_tl1+asc&distrib=false&wt=javabin&rows=10&version=2&fl=id&shard.url=127.0.0.1:49428/solr/collection1/&NOW=1349149963458&start=0&q=*:*&isShard=true&fsv=true} hits=35 status=0 QTime=1 
[junit4:junit4]   2> 19003 T788 C82 P49425 REQ /select {sort=n_tl1+asc&distrib=false&wt=javabin&rows=10&version=2&fl=id&shard.url=127.0.0.1:49425/solr/collection1/|127.0.0.1:49435/solr/collection1/&NOW=1349149963458&start=0&q=*:*&isShard=true&fsv=true} hits=32 status=0 QTime=1 
[junit4:junit4]   2> 19008 T788 C82 P49425 REQ /select {shard.url=127.0.0.1:49425/solr/collection1/|127.0.0.1:49435/solr/collection1/&NOW=1349149963458&q=*:*&ids=138,109,108&distrib=false&isShard=true&wt=javabin&version=2} status=0 QTime=1 
[junit4:junit4]   2> 19008 T803 C84 P49428 REQ /select {shard.url=127.0.0.1:49428/solr/collection1/&NOW=1349149963458&q=*:*&ids=126,144,127,147,120,131,119&distrib=false&isShard=true&wt=javabin&version=2} status=0 QTime=1 
[junit4:junit4]   2> 19010 T812 C81 P49435 REQ /select {sort=n_tl1+asc&wt=javabin&q=*:*&version=2} hits=67 status=0 QTime=11 
[junit4:junit4]   2> 19022 T772 C83 P49417 REQ /select {distrib=false&sort=n_dt1+desc&wt=javabin&q=*:*&version=2} hits=67 status=0 QTime=1 
[junit4:junit4]   2> 19047 T788 C82 P49425 REQ /select {sort=n_dt1+desc&distrib=false&wt=javabin&rows=10&version=2&fl=id&shard.url=127.0.0.1:49425/solr/collection1/|127.0.0.1:49435/solr/collection1/&NOW=1349149963500&start=0&q=*:*&isShard=true&fsv=true} hits=32 status=0 QTime=2 
[junit4:junit4]   2> 19048 T803 C84 P49428 REQ /select {sort=n_dt1+desc&distrib=false&wt=javabin&rows=10&version=2&fl=id&shard.url=127.0.0.1:49428/solr/collection1/&NOW=1349149963500&start=0&q=*:*&isShard=true&fsv=true} hits=35 status=0 QTime=0 
[junit4:junit4]   2> 19055 T803 C84 P49428 REQ /select {shard.url=127.0.0.1:49428/solr/collection1/&NOW=1349149963500&q=*:*&ids=144,127,149,17,9,131&distrib=false&isShard=true&wt=javabin&version=2} status=0 QTime=1 
[junit4:junit4]   2> 19055 T788 C82 P49425 REQ /select {shard.url=127.0.0.1:49425/solr/collection1/|127.0.0.1:49435/solr/collection1/&NOW=1349149963500&q=*:*&ids=125,135,122,107&distrib=false&isShard=true&wt=javabin&version=2} status=0 QTime=1 
[junit4:junit4]   2> 19057 T814 C81 P49435 REQ /select {sort=n_dt1+desc&wt=javabin&q=*:*&version=2} hits=67 status=0 QTime=16 
[junit4:junit4]   2> 19063 T772 C83 P49417 REQ /select {distrib=false&sort=n_dt1+asc&wt=javabin&q=*:*&version=2} hits=67 status=0 QTime=1 
[junit4:junit4]   2> 19071 T803 C84 P49428 REQ /select {sort=n_dt1+asc&distrib=false&collection=collection1&wt=javabin&rows=10&version=2&fl=id&sha

[...truncated too long message...]

ction called awholynewcollection_4
[junit4:junit4]    > 	at __randomizedtesting.SeedInfo.seed([E953C32319CFEBBC:68B54D3B6E908B80]:0)
[junit4:junit4]    > 	at org.junit.Assert.fail(Assert.java:93)
[junit4:junit4]    > 	at org.apache.solr.cloud.BasicDistributedZkTest.checkForCollection(BasicDistributedZkTest.java:590)
[junit4:junit4]    > 	at org.apache.solr.cloud.BasicDistributedZkTest.testCollectionsAPI(BasicDistributedZkTest.java:379)
[junit4:junit4]    > 	at org.apache.solr.cloud.BasicDistributedZkTest.doTest(BasicDistributedZkTest.java:331)
[junit4:junit4]    > 	at org.apache.solr.BaseDistributedSearchTestCase.testDistribSearch(BaseDistributedSearchTestCase.java:695)
[junit4:junit4]    > 	at sun.reflect.NativeMethodAccessorImpl.invoke0(Native Method)
[junit4:junit4]    > 	at sun.reflect.NativeMethodAccessorImpl.invoke(NativeMethodAccessorImpl.java:57)
[junit4:junit4]    > 	at sun.reflect.DelegatingMethodAccessorImpl.invoke(DelegatingMethodAccessorImpl.java:43)
[junit4:junit4]    > 	at java.lang.reflect.Method.invoke(Method.java:601)
[junit4:junit4]    > 	at com.carrotsearch.randomizedtesting.RandomizedRunner.invoke(RandomizedRunner.java:1559)
[junit4:junit4]    > 	at com.carrotsearch.randomizedtesting.RandomizedRunner.access$600(RandomizedRunner.java:79)
[junit4:junit4]    > 	at com.carrotsearch.randomizedtesting.RandomizedRunner$6.evaluate(RandomizedRunner.java:737)
[junit4:junit4]    > 	at com.carrotsearch.randomizedtesting.RandomizedRunner$7.evaluate(RandomizedRunner.java:773)
[junit4:junit4]    > 	at com.carrotsearch.randomizedtesting.RandomizedRunner$8.evaluate(RandomizedRunner.java:787)
[junit4:junit4]    > 	at com.carrotsearch.randomizedtesting.rules.SystemPropertiesRestoreRule$1.evaluate(SystemPropertiesRestoreRule.java:53)
[junit4:junit4]    > 	at org.apache.lucene.util.TestRuleSetupTeardownChained$1.evaluate(TestRuleSetupTeardownChained.java:50)
[junit4:junit4]    > 	at org.apache.lucene.util.TestRuleFieldCacheSanity$1.evaluate(TestRuleFieldCacheSanity.java:51)
[junit4:junit4]    > 	at org.apache.lucene.util.AbstractBeforeAfterRule$1.evaluate(AbstractBeforeAfterRule.java:45)
[junit4:junit4]    > 	at com.carrotsearch.randomizedtesting.rules.SystemPropertiesInvariantRule$1.evaluate(SystemPropertiesInvariantRule.java:55)
[junit4:junit4]    > 	at org.apache.lucene.util.TestRuleThreadAndTestName$1.evaluate(TestRuleThreadAndTestName.java:48)
[junit4:junit4]    > 	at org.apache.lucene.util.TestRuleIgnoreAfterMaxFailures$1.evaluate(TestRuleIgnoreAfterMaxFailures.java:70)
[junit4:junit4]    > 	at org.apache.lucene.util.TestRuleMarkFailure$1.evaluate(TestRuleMarkFailure.java:48)
[junit4:junit4]    > 	at com.carrotsearch.randomizedtesting.rules.StatementAdapter.evaluate(StatementAdapter.java:36)
[junit4:junit4]    > 	at com.carrotsearch.randomizedtesting.ThreadLeakControl$StatementRunner.run(ThreadLeakControl.java:358)
[junit4:junit4]    > 	at com.carrotsearch.randomizedtesting.ThreadLeakControl.forkTimeoutingTask(ThreadLeakControl.java:782)
[junit4:junit4]    > 	at com.carrotsearch.randomizedtesting.ThreadLeakControl$3.evaluate(ThreadLeakControl.java:442)
[junit4:junit4]    > 	at com.carrotsearch.randomizedtesting.RandomizedRunner.runSingleTest(RandomizedRunner.java:746)
[junit4:junit4]    > 	at com.carrotsearch.randomizedtesting.RandomizedRunner$3.evaluate(RandomizedRunner.java:648)
[junit4:junit4]    > 	at com.carrotsearch.randomizedtesting.RandomizedRunner$4.evaluate(RandomizedRunner.java:682)
[junit4:junit4]    > 	at com.carrotsearch.randomizedtesting.RandomizedRunner$5.evaluate(RandomizedRunner.java:693)
[junit4:junit4]    > 	at com.carrotsearch.randomizedtesting.rules.StatementAdapter.evaluate(StatementAdapter.java:36)
[junit4:junit4]    > 	at com.carrotsearch.randomizedtesting.rules.SystemPropertiesRestoreRule$1.evaluate(SystemPropertiesRestoreRule.java:53)
[junit4:junit4]    > 	at org.apache.lucene.util.AbstractBeforeAfterRule$1.evaluate(AbstractBeforeAfterRule.java:45)
[junit4:junit4]    > 	at org.apache.lucene.util.TestRuleStoreClassName$1.evaluate(TestRuleStoreClassName.java:42)
[junit4:junit4]    > 	at com.carrotsearch.randomizedtesting.rules.SystemPropertiesInvariantRule$1.evaluate(SystemPropertiesInvariantRule.java:55)
[junit4:junit4]    > 	at com.carrotsearch.randomizedtesting.rules.NoShadowingOrOverridesOnMethodsRule$1.evaluate(NoShadowingOrOverridesOnMethodsRule.java:39)
[junit4:junit4]    > 	at com.carrotsearch.randomizedtesting.rules.NoShadowingOrOverridesOnMethodsRule$1.evaluate(NoShadowingOrOverridesOnMethodsRule.java:39)
[junit4:junit4]    > 	at com.carrotsearch.randomizedtesting.rules.StatementAdapter.evaluate(StatementAdapter.java:36)
[junit4:junit4]    > 	at org.apache.lucene.util.TestRuleAssertionsRequired$1.evaluate(TestRuleAssertionsRequired.java:43)
[junit4:junit4]    > 	at org.apache.lucene.util.TestRuleMarkFailure$1.evaluate(TestRuleMarkFailure.java:48)
[junit4:junit4]    > 	at org.apache.lucene.util.TestRuleIgnoreAfterMaxFailures$1.evaluate(TestRuleIgnoreAfterMaxFailures.java:70)
[junit4:junit4]    > 	at org.apache.lucene.util.TestRuleIgnoreTestSuites$1.evaluate(TestRuleIgnoreTestSuites.java:55)
[junit4:junit4]    > 	at com.carrotsearch.randomizedtesting.rules.StatementAdapter.evaluate(StatementAdapter.java:36)
[junit4:junit4]    > 	at com.carrotsearch.randomizedtesting.ThreadLeakControl$StatementRunner.run(ThreadLeakControl.java:358)
[junit4:junit4]    > 	at java.lang.Thread.run(Thread.java:722)
[junit4:junit4]   2> 391481 T760 oas.SolrTestCaseJ4.deleteCore ###deleteCore
[junit4:junit4]   2> NOTE: test params are: codec=Lucene40: {n_f1=Pulsing40(freqCutoff=15 minBlockSize=16 maxBlockSize=46), foo_b=PostingsFormat(name=MockSep), cat=PostingsFormat(name=Direct), foo_d=PostingsFormat(name=Memory doPackFST= false), foo_f=PostingsFormat(name=MockSep), n_tl1=Pulsing40(freqCutoff=15 minBlockSize=16 maxBlockSize=46), n_d1=PostingsFormat(name=Direct), rnd_b=PostingsFormat(name=Memory doPackFST= false), intDefault=PostingsFormat(name=Direct), n_td1=Pulsing40(freqCutoff=15 minBlockSize=16 maxBlockSize=46), timestamp=PostingsFormat(name=Direct), id=PostingsFormat(name=Memory doPackFST= false), range_facet_sl=PostingsFormat(name=MockSep), range_facet_si=Pulsing40(freqCutoff=15 minBlockSize=16 maxBlockSize=46), oddField_s=PostingsFormat(name=MockSep), sequence_i=PostingsFormat(name=MockSep), name=PostingsFormat(name=Memory doPackFST= false), foo_i=Pulsing40(freqCutoff=15 minBlockSize=16 maxBlockSize=46), regex_dup_B_s=PostingsFormat(name=Direct), multiDefault=Pulsing40(freqCutoff=15 minBlockSize=16 maxBlockSize=46), n_tf1=PostingsFormat(name=Direct), n_dt1=Pulsing40(freqCutoff=15 minBlockSize=16 maxBlockSize=46), genre_s=PostingsFormat(name=MockSep), author_t=Pulsing40(freqCutoff=15 minBlockSize=16 maxBlockSize=46), n_ti1=PostingsFormat(name=Memory doPackFST= false), range_facet_l=PostingsFormat(name=Direct), text=PostingsFormat(name=MockSep), _version_=PostingsFormat(name=Direct), val_i=PostingsFormat(name=Memory doPackFST= false), SubjectTerms_mfacet=PostingsFormat(name=Direct), series_t=Pulsing40(freqCutoff=15 minBlockSize=16 maxBlockSize=46), a_t=PostingsFormat(name=Direct), n_tdt1=PostingsFormat(name=Direct), regex_dup_A_s=PostingsFormat(name=MockSep), price=PostingsFormat(name=MockSep), other_tl1=PostingsFormat(name=Direct), n_l1=PostingsFormat(name=Direct), a_si=Pulsing40(freqCutoff=15 minBlockSize=16 maxBlockSize=46), inStock=PostingsFormat(name=MockSep)}, sim=RandomSimilarityProvider(queryNorm=false,coord=yes): {}, locale=de_CH, timezone=Europe/Volgograd
[junit4:junit4]   2> NOTE: FreeBSD 9.0-RELEASE amd64/Oracle Corporation 1.7.0_06 (64-bit)/cpus=16,threads=1,free=111690624,total=536870912
[junit4:junit4]   2> NOTE: All tests run in this JVM: [SystemInfoHandlerTest, TestCollationField, TestQueryTypes, TestPseudoReturnFields, BinaryUpdateRequestHandlerTest, TestXIncludeConfig, IndexBasedSpellCheckerTest, DirectUpdateHandlerOptimizeTest, TestIBSimilarityFactory, TestSolrQueryParser, SolrRequestParserTest, TestStressReorder, TestReload, FieldAnalysisRequestHandlerTest, MinimalSchemaTest, SearchHandlerTest, TestSolrJ, SolrCoreCheckLockOnStartupTest, FileBasedSpellCheckerTest, SortByFunctionTest, UniqFieldsUpdateProcessorFactoryTest, SOLR749Test, TestDefaultSimilarityFactory, TestWordDelimiterFilterFactory, NotRequiredUniqueKeyTest, TestQuerySenderNoQuery, TestGroupingSearch, BadComponentTest, AlternateDirectoryTest, CurrencyFieldTest, TestLFUCache, TestJoin, TestLMJelinekMercerSimilarityFactory, TestBinaryResponseWriter, TestFiltering, NoCacheHeaderTest, TestFaceting, SimplePostToolTest, JSONWriterTest, TestBadConfig, TestCoreContainer, PluginInfoTest, SolrPluginUtilsTest, DefaultValueUpdateProcessorTest, TestSearchPerf, SimpleFacetsTest, CircularListTest, TestElisionMultitermQuery, DateFieldTest, SpellPossibilityIteratorTest, TestRandomFaceting, DistributedSpellCheckComponentTest, TermsComponentTest, SampleTest, BasicDistributedZkTest]
[junit4:junit4] Completed on J0 in 392.32s, 1 test, 1 failure <<< FAILURES!

[...truncated 183 lines...]
BUILD FAILED
/usr/home/hudson/hudson-slave/workspace/Lucene-Solr-Tests-4.x-java7/build.xml:38: The following error occurred while executing this line:
/usr/home/hudson/hudson-slave/workspace/Lucene-Solr-Tests-4.x-java7/solr/build.xml:180: The following error occurred while executing this line:
/usr/home/hudson/hudson-slave/workspace/Lucene-Solr-Tests-4.x-java7/lucene/module-build.xml:61: The following error occurred while executing this line:
/usr/home/hudson/hudson-slave/workspace/Lucene-Solr-Tests-4.x-java7/lucene/common-build.xml:1143: The following error occurred while executing this line:
/usr/home/hudson/hudson-slave/workspace/Lucene-Solr-Tests-4.x-java7/lucene/common-build.xml:816: There were test failures: 231 suites, 958 tests, 1 failure, 21 ignored (3 assumptions)

Total time: 35 minutes 46 seconds
Build step 'Invoke Ant' marked build as failure
Recording test results
Email was triggered for: Failure
Sending email for trigger: Failure



Mime
View raw message