lucene-dev mailing list archives

Site index · List index
Message view « Date » · « Thread »
Top « Date » · « Thread »
From Apache Jenkins Server <jenk...@builds.apache.org>
Subject [JENKINS] Lucene-Solr-Tests-trunk-Java6 - Build # 15359 - Failure
Date Mon, 15 Oct 2012 02:38:46 GMT
Build: https://builds.apache.org/job/Lucene-Solr-Tests-trunk-Java6/15359/

1 tests failed.
REGRESSION:  org.apache.solr.cloud.LeaderElectionIntegrationTest.testLeaderElectionAfterClientTimeout

Error Message:
expected:<7000> but was:<7001>

Stack Trace:
java.lang.AssertionError: expected:<7000> but was:<7001>
	at __randomizedtesting.SeedInfo.seed([E7D36FA933F3B4D:A74A9359B41AB3A6]:0)
	at org.junit.Assert.fail(Assert.java:93)
	at org.junit.Assert.failNotEquals(Assert.java:647)
	at org.junit.Assert.assertEquals(Assert.java:128)
	at org.junit.Assert.assertEquals(Assert.java:472)
	at org.junit.Assert.assertEquals(Assert.java:456)
	at org.apache.solr.cloud.LeaderElectionIntegrationTest.testLeaderElectionAfterClientTimeout(LeaderElectionIntegrationTest.java:252)
	at sun.reflect.NativeMethodAccessorImpl.invoke0(Native Method)
	at sun.reflect.NativeMethodAccessorImpl.invoke(NativeMethodAccessorImpl.java:57)
	at sun.reflect.DelegatingMethodAccessorImpl.invoke(DelegatingMethodAccessorImpl.java:43)
	at java.lang.reflect.Method.invoke(Method.java:616)
	at com.carrotsearch.randomizedtesting.RandomizedRunner.invoke(RandomizedRunner.java:1559)
	at com.carrotsearch.randomizedtesting.RandomizedRunner.access$600(RandomizedRunner.java:79)
	at com.carrotsearch.randomizedtesting.RandomizedRunner$6.evaluate(RandomizedRunner.java:737)
	at com.carrotsearch.randomizedtesting.RandomizedRunner$7.evaluate(RandomizedRunner.java:773)
	at com.carrotsearch.randomizedtesting.RandomizedRunner$8.evaluate(RandomizedRunner.java:787)
	at com.carrotsearch.randomizedtesting.rules.SystemPropertiesRestoreRule$1.evaluate(SystemPropertiesRestoreRule.java:53)
	at org.apache.lucene.util.TestRuleSetupTeardownChained$1.evaluate(TestRuleSetupTeardownChained.java:50)
	at org.apache.lucene.util.TestRuleFieldCacheSanity$1.evaluate(TestRuleFieldCacheSanity.java:51)
	at org.apache.lucene.util.AbstractBeforeAfterRule$1.evaluate(AbstractBeforeAfterRule.java:45)
	at com.carrotsearch.randomizedtesting.rules.SystemPropertiesInvariantRule$1.evaluate(SystemPropertiesInvariantRule.java:55)
	at org.apache.lucene.util.TestRuleThreadAndTestName$1.evaluate(TestRuleThreadAndTestName.java:48)
	at org.apache.lucene.util.TestRuleIgnoreAfterMaxFailures$1.evaluate(TestRuleIgnoreAfterMaxFailures.java:70)
	at org.apache.lucene.util.TestRuleMarkFailure$1.evaluate(TestRuleMarkFailure.java:48)
	at com.carrotsearch.randomizedtesting.rules.StatementAdapter.evaluate(StatementAdapter.java:36)
	at com.carrotsearch.randomizedtesting.ThreadLeakControl$StatementRunner.run(ThreadLeakControl.java:358)
	at com.carrotsearch.randomizedtesting.ThreadLeakControl.forkTimeoutingTask(ThreadLeakControl.java:782)
	at com.carrotsearch.randomizedtesting.ThreadLeakControl$3.evaluate(ThreadLeakControl.java:442)
	at com.carrotsearch.randomizedtesting.RandomizedRunner.runSingleTest(RandomizedRunner.java:746)
	at com.carrotsearch.randomizedtesting.RandomizedRunner$3.evaluate(RandomizedRunner.java:648)
	at com.carrotsearch.randomizedtesting.RandomizedRunner$4.evaluate(RandomizedRunner.java:682)
	at com.carrotsearch.randomizedtesting.RandomizedRunner$5.evaluate(RandomizedRunner.java:693)
	at com.carrotsearch.randomizedtesting.rules.StatementAdapter.evaluate(StatementAdapter.java:36)
	at com.carrotsearch.randomizedtesting.rules.SystemPropertiesRestoreRule$1.evaluate(SystemPropertiesRestoreRule.java:53)
	at org.apache.lucene.util.AbstractBeforeAfterRule$1.evaluate(AbstractBeforeAfterRule.java:45)
	at org.apache.lucene.util.TestRuleStoreClassName$1.evaluate(TestRuleStoreClassName.java:42)
	at com.carrotsearch.randomizedtesting.rules.SystemPropertiesInvariantRule$1.evaluate(SystemPropertiesInvariantRule.java:55)
	at com.carrotsearch.randomizedtesting.rules.NoShadowingOrOverridesOnMethodsRule$1.evaluate(NoShadowingOrOverridesOnMethodsRule.java:39)
	at com.carrotsearch.randomizedtesting.rules.NoShadowingOrOverridesOnMethodsRule$1.evaluate(NoShadowingOrOverridesOnMethodsRule.java:39)
	at com.carrotsearch.randomizedtesting.rules.StatementAdapter.evaluate(StatementAdapter.java:36)
	at org.apache.lucene.util.TestRuleAssertionsRequired$1.evaluate(TestRuleAssertionsRequired.java:43)
	at org.apache.lucene.util.TestRuleMarkFailure$1.evaluate(TestRuleMarkFailure.java:48)
	at org.apache.lucene.util.TestRuleIgnoreAfterMaxFailures$1.evaluate(TestRuleIgnoreAfterMaxFailures.java:70)
	at org.apache.lucene.util.TestRuleIgnoreTestSuites$1.evaluate(TestRuleIgnoreTestSuites.java:55)
	at com.carrotsearch.randomizedtesting.rules.StatementAdapter.evaluate(StatementAdapter.java:36)
	at com.carrotsearch.randomizedtesting.ThreadLeakControl$StatementRunner.run(ThreadLeakControl.java:358)
	at java.lang.Thread.run(Thread.java:679)




Build Log:
[...truncated 8102 lines...]
[junit4:junit4] Suite: org.apache.solr.cloud.LeaderElectionIntegrationTest
[junit4:junit4]   2> 4 T1630 oas.SolrTestCaseJ4.setUp ###Starting testLeaderElectionAfterClientTimeout
[junit4:junit4]   2> Creating dataDir: /usr/home/hudson/hudson-slave/workspace/Lucene-Solr-Tests-trunk-Java6/solr/build/solr-core/test/J1/./solrtest-LeaderElectionIntegrationTest-1350268370670
[junit4:junit4]   2> 4 T1630 oasc.ZkTestServer.run STARTING ZK TEST SERVER
[junit4:junit4]   2> 8 T1631 oazs.ZooKeeperServer.setTickTime tickTime set to 1000
[junit4:junit4]   2> 8 T1631 oazs.NIOServerCnxn$Factory.<init> binding to port 0.0.0.0/0.0.0.0:0
[junit4:junit4]   2> 9 T1631 oazsp.FileTxnSnapLog.save Snapshotting: 0
[junit4:junit4]   2> 106 T1630 oasc.ZkTestServer.run start zk server on port:50467
[junit4:junit4]   2> 106 T1630 oaz.ZooKeeper.<init> Initiating client connection, connectString=127.0.0.1:50467 sessionTimeout=10000 watcher=org.apache.solr.common.cloud.ConnectionManager@371db01b
[junit4:junit4]   2> 107 T1636 oaz.ClientCnxn$SendThread.startConnect Opening socket connection to server /127.0.0.1:50467
[junit4:junit4]   2> 107 T1630 oascc.ConnectionManager.waitForConnected Waiting for client to connect to ZooKeeper
[junit4:junit4]   2> 108 T1636 oaz.ClientCnxn$SendThread.primeConnection Socket connection established to localhost/127.0.0.1:50467, initiating session
[junit4:junit4]   2> 108 T1632 oazs.NIOServerCnxn$Factory.run Accepted socket connection from /140.211.11.196:50468
[junit4:junit4]   2> 109 T1632 oazs.NIOServerCnxn.readConnectRequest Client attempting to establish new session at /140.211.11.196:50468
[junit4:junit4]   2> 109 T1634 oazsp.FileTxnLog.append Creating new log file: log.1
[junit4:junit4]   2> 111 T1634 oazs.NIOServerCnxn.finishSessionInit Established session 0x13a62443ef40000 with negotiated timeout 10000 for client /140.211.11.196:50468
[junit4:junit4]   2> 111 T1636 oaz.ClientCnxn$SendThread.readConnectResult Session establishment complete on server localhost/127.0.0.1:50467, sessionid = 0x13a62443ef40000, negotiated timeout = 10000
[junit4:junit4]   2> 112 T1637 oascc.ConnectionManager.process Watcher org.apache.solr.common.cloud.ConnectionManager@371db01b name:ZooKeeperConnection Watcher:127.0.0.1:50467 got event WatchedEvent state:SyncConnected type:None path:null path:null type:None
[junit4:junit4]   2> 112 T1630 oascc.ConnectionManager.waitForConnected Client is connected to ZooKeeper
[junit4:junit4]   2> 112 T1630 oascc.SolrZkClient.makePath makePath: /solr
[junit4:junit4]   2> 115 T1635 oazs.PrepRequestProcessor.pRequest Processed session termination for sessionid: 0x13a62443ef40000
[junit4:junit4]   2> 123 T1637 oaz.ClientCnxn$EventThread.run EventThread shut down
[junit4:junit4]   2> 123 T1630 oaz.ZooKeeper.close Session: 0x13a62443ef40000 closed
[junit4:junit4]   2> 124 T1632 oazs.NIOServerCnxn.closeSock Closed socket connection for client /140.211.11.196:50468 which had sessionid 0x13a62443ef40000
[junit4:junit4]   2> 124 T1630 oaz.ZooKeeper.<init> Initiating client connection, connectString=127.0.0.1:50467/solr sessionTimeout=10000 watcher=org.apache.solr.common.cloud.ConnectionManager@5de28c04
[junit4:junit4]   2> 125 T1638 oaz.ClientCnxn$SendThread.startConnect Opening socket connection to server /127.0.0.1:50467
[junit4:junit4]   2> 125 T1630 oascc.ConnectionManager.waitForConnected Waiting for client to connect to ZooKeeper
[junit4:junit4]   2> 126 T1638 oaz.ClientCnxn$SendThread.primeConnection Socket connection established to localhost/127.0.0.1:50467, initiating session
[junit4:junit4]   2> 126 T1632 oazs.NIOServerCnxn$Factory.run Accepted socket connection from /140.211.11.196:50469
[junit4:junit4]   2> 126 T1632 oazs.NIOServerCnxn.readConnectRequest Client attempting to establish new session at /140.211.11.196:50469
[junit4:junit4]   2> 128 T1634 oazs.NIOServerCnxn.finishSessionInit Established session 0x13a62443ef40001 with negotiated timeout 10000 for client /140.211.11.196:50469
[junit4:junit4]   2> 128 T1638 oaz.ClientCnxn$SendThread.readConnectResult Session establishment complete on server localhost/127.0.0.1:50467, sessionid = 0x13a62443ef40001, negotiated timeout = 10000
[junit4:junit4]   2> 128 T1639 oascc.ConnectionManager.process Watcher org.apache.solr.common.cloud.ConnectionManager@5de28c04 name:ZooKeeperConnection Watcher:127.0.0.1:50467/solr got event WatchedEvent state:SyncConnected type:None path:null path:null type:None
[junit4:junit4]   2> 128 T1630 oascc.ConnectionManager.waitForConnected Client is connected to ZooKeeper
[junit4:junit4]   2> 129 T1630 oascc.SolrZkClient.makePath makePath: /collections/collection1
[junit4:junit4]   2> 131 T1630 oascc.SolrZkClient.makePath makePath: /collections/collection1/shards
[junit4:junit4]   2> 139 T1630 oascc.SolrZkClient.makePath makePath: /collections/control_collection
[junit4:junit4]   2> 146 T1630 oascc.SolrZkClient.makePath makePath: /collections/control_collection/shards
[junit4:junit4]   2> 156 T1630 oasc.AbstractZkTestCase.putConfig put /usr/home/hudson/hudson-slave/workspace/Lucene-Solr-Tests-trunk-Java6/solr/build/solr-core/test-files/solr/collection1/conf/solrconfig.xml to /configs/conf1/solrconfig.xml
[junit4:junit4]   2> 157 T1630 oascc.SolrZkClient.makePath makePath: /configs/conf1/solrconfig.xml
[junit4:junit4]   2> 169 T1630 oasc.AbstractZkTestCase.putConfig put /usr/home/hudson/hudson-slave/workspace/Lucene-Solr-Tests-trunk-Java6/solr/build/solr-core/test-files/solr/collection1/conf/schema.xml to /configs/conf1/schema.xml
[junit4:junit4]   2> 170 T1630 oascc.SolrZkClient.makePath makePath: /configs/conf1/schema.xml
[junit4:junit4]   2> 273 T1630 oasc.AbstractZkTestCase.putConfig put /usr/home/hudson/hudson-slave/workspace/Lucene-Solr-Tests-trunk-Java6/solr/build/solr-core/test-files/solr/collection1/conf/solrconfig.xml to /configs/conf1/solrconfig.xml
[junit4:junit4]   2> 274 T1630 oascc.SolrZkClient.makePath makePath: /configs/conf1/solrconfig.xml
[junit4:junit4]   2> 277 T1630 oasc.AbstractZkTestCase.putConfig put /usr/home/hudson/hudson-slave/workspace/Lucene-Solr-Tests-trunk-Java6/solr/build/solr-core/test-files/solr/collection1/conf/stopwords.txt to /configs/conf1/stopwords.txt
[junit4:junit4]   2> 278 T1630 oascc.SolrZkClient.makePath makePath: /configs/conf1/stopwords.txt
[junit4:junit4]   2> 287 T1630 oasc.AbstractZkTestCase.putConfig put /usr/home/hudson/hudson-slave/workspace/Lucene-Solr-Tests-trunk-Java6/solr/build/solr-core/test-files/solr/collection1/conf/protwords.txt to /configs/conf1/protwords.txt
[junit4:junit4]   2> 287 T1630 oascc.SolrZkClient.makePath makePath: /configs/conf1/protwords.txt
[junit4:junit4]   2> 290 T1630 oasc.AbstractZkTestCase.putConfig put /usr/home/hudson/hudson-slave/workspace/Lucene-Solr-Tests-trunk-Java6/solr/build/solr-core/test-files/solr/collection1/conf/currency.xml to /configs/conf1/currency.xml
[junit4:junit4]   2> 290 T1630 oascc.SolrZkClient.makePath makePath: /configs/conf1/currency.xml
[junit4:junit4]   2> 293 T1630 oasc.AbstractZkTestCase.putConfig put /usr/home/hudson/hudson-slave/workspace/Lucene-Solr-Tests-trunk-Java6/solr/build/solr-core/test-files/solr/collection1/conf/open-exchange-rates.json to /configs/conf1/open-exchange-rates.json
[junit4:junit4]   2> 294 T1630 oascc.SolrZkClient.makePath makePath: /configs/conf1/open-exchange-rates.json
[junit4:junit4]   2> 297 T1630 oasc.AbstractZkTestCase.putConfig put /usr/home/hudson/hudson-slave/workspace/Lucene-Solr-Tests-trunk-Java6/solr/build/solr-core/test-files/solr/collection1/conf/mapping-ISOLatin1Accent.txt to /configs/conf1/mapping-ISOLatin1Accent.txt
[junit4:junit4]   2> 298 T1630 oascc.SolrZkClient.makePath makePath: /configs/conf1/mapping-ISOLatin1Accent.txt
[junit4:junit4]   2> 301 T1630 oasc.AbstractZkTestCase.putConfig put /usr/home/hudson/hudson-slave/workspace/Lucene-Solr-Tests-trunk-Java6/solr/build/solr-core/test-files/solr/collection1/conf/old_synonyms.txt to /configs/conf1/old_synonyms.txt
[junit4:junit4]   2> 302 T1630 oascc.SolrZkClient.makePath makePath: /configs/conf1/old_synonyms.txt
[junit4:junit4]   2> 305 T1630 oasc.AbstractZkTestCase.putConfig put /usr/home/hudson/hudson-slave/workspace/Lucene-Solr-Tests-trunk-Java6/solr/build/solr-core/test-files/solr/collection1/conf/synonyms.txt to /configs/conf1/synonyms.txt
[junit4:junit4]   2> 306 T1630 oascc.SolrZkClient.makePath makePath: /configs/conf1/synonyms.txt
[junit4:junit4]   2> 308 T1635 oazs.PrepRequestProcessor.pRequest Processed session termination for sessionid: 0x13a62443ef40001
[junit4:junit4]   2> 316 T1639 oaz.ClientCnxn$EventThread.run EventThread shut down
[junit4:junit4]   2> 316 T1630 oaz.ZooKeeper.close Session: 0x13a62443ef40001 closed
[junit4:junit4]   2> 316 T1632 oazs.NIOServerCnxn.closeSock Closed socket connection for client /140.211.11.196:50469 which had sessionid 0x13a62443ef40001
[junit4:junit4]   2> 316 T1630 oasc.LeaderElectionIntegrationTest.setUp ####SETUP_START testLeaderElectionAfterClientTimeout
[junit4:junit4]   2> 320 T1630 oasc.SolrResourceLoader.locateSolrHome JNDI not configured for solr (NoInitialContextEx)
[junit4:junit4]   2> 320 T1630 oasc.SolrResourceLoader.locateSolrHome using system property solr.solr.home: /usr/home/hudson/hudson-slave/workspace/Lucene-Solr-Tests-trunk-Java6/solr/build/solr-core/test-files/solr
[junit4:junit4]   2> 321 T1630 oasc.CoreContainer$Initializer.initialize looking for solr.xml: /usr/home/hudson/hudson-slave/workspace/Lucene-Solr-Tests-trunk-Java6/solr/build/solr-core/test-files/solr/solr.xml
[junit4:junit4]   2> 321 T1630 oasc.CoreContainer.<init> New CoreContainer 1963148461
[junit4:junit4]   2> 322 T1630 oasc.CoreContainer.load Loading CoreContainer using Solr Home: '/usr/home/hudson/hudson-slave/workspace/Lucene-Solr-Tests-trunk-Java6/solr/build/solr-core/test-files/solr/'
[junit4:junit4]   2> 322 T1630 oasc.SolrResourceLoader.<init> new SolrResourceLoader for directory: '/usr/home/hudson/hudson-slave/workspace/Lucene-Solr-Tests-trunk-Java6/solr/build/solr-core/test-files/solr/'
[junit4:junit4]   2> 366 T1630 oasc.CoreContainer.load Registering Log Listener
[junit4:junit4]   2> 381 T1630 oasc.CoreContainer.initZooKeeper Zookeeper client=127.0.0.1:50467/solr
[junit4:junit4]   2> 381 T1630 oaz.ZooKeeper.<init> Initiating client connection, connectString=127.0.0.1:50467/solr sessionTimeout=3000 watcher=org.apache.solr.common.cloud.ConnectionManager@2da518cb
[junit4:junit4]   2> 382 T1640 oaz.ClientCnxn$SendThread.startConnect Opening socket connection to server /127.0.0.1:50467
[junit4:junit4]   2> 382 T1630 oascc.ConnectionManager.waitForConnected Waiting for client to connect to ZooKeeper
[junit4:junit4]   2> 383 T1640 oaz.ClientCnxn$SendThread.primeConnection Socket connection established to localhost/127.0.0.1:50467, initiating session
[junit4:junit4]   2> 384 T1632 oazs.NIOServerCnxn$Factory.run Accepted socket connection from /140.211.11.196:50471
[junit4:junit4]   2> 384 T1632 oazs.NIOServerCnxn.readConnectRequest Client attempting to establish new session at /140.211.11.196:50471
[junit4:junit4]   2> 385 T1634 oazs.NIOServerCnxn.finishSessionInit Established session 0x13a62443ef40002 with negotiated timeout 3000 for client /140.211.11.196:50471
[junit4:junit4]   2> 386 T1640 oaz.ClientCnxn$SendThread.readConnectResult Session establishment complete on server localhost/127.0.0.1:50467, sessionid = 0x13a62443ef40002, negotiated timeout = 3000
[junit4:junit4]   2> 386 T1641 oascc.ConnectionManager.process Watcher org.apache.solr.common.cloud.ConnectionManager@2da518cb name:ZooKeeperConnection Watcher:127.0.0.1:50467/solr got event WatchedEvent state:SyncConnected type:None path:null path:null type:None
[junit4:junit4]   2> 386 T1630 oascc.ConnectionManager.waitForConnected Client is connected to ZooKeeper
[junit4:junit4]   2> 388 T1635 oazs.PrepRequestProcessor.pRequest Got user-level KeeperException when processing sessionid:0x13a62443ef40002 type:create cxid:0x2 zxid:0xfffffffffffffffe txntype:unknown reqpath:n/a Error Path:/solr/overseer Error:KeeperErrorCode = NodeExists for /solr/overseer
[junit4:junit4]   2> 396 T1630 oascc.SolrZkClient.makePath makePath: /live_nodes
[junit4:junit4]   2> 397 T1630 oasc.ZkController.createEphemeralLiveNode Register node as live in ZooKeeper:/live_nodes/127.0.0.1:7000_solr
[junit4:junit4]   2> 398 T1635 oazs.PrepRequestProcessor.pRequest Got user-level KeeperException when processing sessionid:0x13a62443ef40002 type:delete cxid:0x7 zxid:0xfffffffffffffffe txntype:unknown reqpath:n/a Error Path:/solr/live_nodes/127.0.0.1:7000_solr Error:KeeperErrorCode = NoNode for /solr/live_nodes/127.0.0.1:7000_solr
[junit4:junit4]   2> 403 T1630 oascc.SolrZkClient.makePath makePath: /live_nodes/127.0.0.1:7000_solr
[junit4:junit4]   2> 406 T1630 oashc.HttpShardHandlerFactory.getParameter Setting socketTimeout to: 0
[junit4:junit4]   2> 406 T1630 oashc.HttpShardHandlerFactory.getParameter Setting urlScheme to: http://
[junit4:junit4]   2> 406 T1630 oashc.HttpShardHandlerFactory.getParameter Setting connTimeout to: 0
[junit4:junit4]   2> 407 T1630 oashc.HttpShardHandlerFactory.getParameter Setting maxConnectionsPerHost to: 20
[junit4:junit4]   2> 407 T1630 oashc.HttpShardHandlerFactory.getParameter Setting corePoolSize to: 0
[junit4:junit4]   2> 407 T1630 oashc.HttpShardHandlerFactory.getParameter Setting maximumPoolSize to: 2147483647
[junit4:junit4]   2> 408 T1630 oashc.HttpShardHandlerFactory.getParameter Setting maxThreadIdleTime to: 5
[junit4:junit4]   2> 408 T1630 oashc.HttpShardHandlerFactory.getParameter Setting sizeOfQueue to: -1
[junit4:junit4]   2> 408 T1630 oashc.HttpShardHandlerFactory.getParameter Setting fairnessPolicy to: false
[junit4:junit4]   2> 409 T1630 oascsi.HttpClientUtil.createClient Creating new http client, config:maxConnectionsPerHost=20&maxConnections=10000&socketTimeout=0&connTimeout=0&retry=false
[junit4:junit4]   2> 423 T1630 oascc.SolrZkClient.makePath makePath: /overseer_elect/election
[junit4:junit4]   2> 438 T1635 oazs.PrepRequestProcessor.pRequest Got user-level KeeperException when processing sessionid:0x13a62443ef40002 type:delete cxid:0x15 zxid:0xfffffffffffffffe txntype:unknown reqpath:n/a Error Path:/solr/overseer_elect/leader Error:KeeperErrorCode = NoNode for /solr/overseer_elect/leader
[junit4:junit4]   2> 447 T1630 oascc.SolrZkClient.makePath makePath: /overseer_elect/leader
[junit4:junit4]   2> 449 T1630 oasc.Overseer.start Overseer (id=88491187940622338-127.0.0.1:7000_solr-n_0000000000) starting
[junit4:junit4]   2> 450 T1635 oazs.PrepRequestProcessor.pRequest Got user-level KeeperException when processing sessionid:0x13a62443ef40002 type:create cxid:0x1a zxid:0xfffffffffffffffe txntype:unknown reqpath:n/a Error Path:/solr/overseer Error:KeeperErrorCode = NodeExists for /solr/overseer
[junit4:junit4]   2> 451 T1635 oazs.PrepRequestProcessor.pRequest Got user-level KeeperException when processing sessionid:0x13a62443ef40002 type:create cxid:0x1b zxid:0xfffffffffffffffe txntype:unknown reqpath:n/a Error Path:/solr/overseer Error:KeeperErrorCode = NodeExists for /solr/overseer
[junit4:junit4]   2> 452 T1635 oazs.PrepRequestProcessor.pRequest Got user-level KeeperException when processing sessionid:0x13a62443ef40002 type:create cxid:0x1c zxid:0xfffffffffffffffe txntype:unknown reqpath:n/a Error Path:/solr/overseer Error:KeeperErrorCode = NodeExists for /solr/overseer
[junit4:junit4]   2> 463 T1635 oazs.PrepRequestProcessor.pRequest Got user-level KeeperException when processing sessionid:0x13a62443ef40002 type:create cxid:0x1d zxid:0xfffffffffffffffe txntype:unknown reqpath:n/a Error Path:/solr/overseer Error:KeeperErrorCode = NodeExists for /solr/overseer
[junit4:junit4]   2> 464 T1643 oasc.OverseerCollectionProcessor.run Process current queue of collection creations
[junit4:junit4]   2> 465 T1630 oascc.SolrZkClient.makePath makePath: /clusterstate.json
[junit4:junit4]   2> 474 T1630 oascc.ZkStateReader.createClusterStateWatchersAndUpdate Updating cluster state from ZooKeeper... 
[junit4:junit4]   2> 476 T1642 oasc.Overseer$ClusterStateUpdater.run Starting to work on the main queue
[junit4:junit4]   2> 481 T1630 oasc.CoreContainer.create Creating SolrCore 'collection1' using instanceDir: /usr/home/hudson/hudson-slave/workspace/Lucene-Solr-Tests-trunk-Java6/solr/build/solr-core/test-files/solr/collection1
[junit4:junit4]   2> 482 T1630 oasc.ZkController.createCollectionZkNode Check for collection zkNode:collection1
[junit4:junit4]   2> 483 T1630 oasc.ZkController.createCollectionZkNode Collection zkNode exists
[junit4:junit4]   2> 483 T1630 oasc.ZkController.readConfigName Load collection config from:/collections/collection1
[junit4:junit4]   2> 485 T1630 oasc.SolrResourceLoader.<init> new SolrResourceLoader for directory: '/usr/home/hudson/hudson-slave/workspace/Lucene-Solr-Tests-trunk-Java6/solr/build/solr-core/test-files/solr/collection1/'
[junit4:junit4]   2> 487 T1630 oasc.SolrResourceLoader.replaceClassLoader Adding 'file:/usr/home/hudson/hudson-slave/workspace/Lucene-Solr-Tests-trunk-Java6/solr/build/solr-core/test-files/solr/collection1/lib/classes/' to classloader
[junit4:junit4]   2> 488 T1630 oasc.SolrResourceLoader.replaceClassLoader Adding 'file:/usr/home/hudson/hudson-slave/workspace/Lucene-Solr-Tests-trunk-Java6/solr/build/solr-core/test-files/solr/collection1/lib/README' to classloader
[junit4:junit4]   2> 545 T1630 oasc.SolrConfig.<init> Using Lucene MatchVersion: LUCENE_50
[junit4:junit4]   2> 624 T1630 oasc.SolrConfig.<init> Loaded SolrConfig: solrconfig.xml
[junit4:junit4]   2> 725 T1630 oass.IndexSchema.readSchema Reading Solr Schema
[junit4:junit4]   2> 730 T1630 oass.IndexSchema.readSchema Schema name=test
[junit4:junit4]   2> 1166 T1630 oass.OpenExchangeRatesOrgProvider.init Initialized with rates=open-exchange-rates.json, refreshInterval=1440.
[junit4:junit4]   2> 1175 T1630 oass.IndexSchema.readSchema default search field in schema is text
[junit4:junit4]   2> 1178 T1630 oass.IndexSchema.readSchema unique key field: id
[junit4:junit4]   2> 1187 T1630 oass.FileExchangeRateProvider.reload Reloading exchange rates from file currency.xml
[junit4:junit4]   2> 1190 T1630 oass.FileExchangeRateProvider.reload Reloading exchange rates from file currency.xml
[junit4:junit4]   2> 1194 T1630 oass.OpenExchangeRatesOrgProvider.reload Reloading exchange rates from open-exchange-rates.json
[junit4:junit4]   2> 1194 T1630 oass.OpenExchangeRatesOrgProvider.reload Reloading exchange rates from open-exchange-rates.json
[junit4:junit4]   2> 1195 T1630 oasc.SolrCore.<init> [collection1] Opening new SolrCore at /usr/home/hudson/hudson-slave/workspace/Lucene-Solr-Tests-trunk-Java6/solr/build/solr-core/test-files/solr/collection1/, dataDir=/usr/home/hudson/hudson-slave/workspace/Lucene-Solr-Tests-trunk-Java6/solr/build/solr-core/test/J1/./solrtest-LeaderElectionIntegrationTest-1350268370670/data_7000/
[junit4:junit4]   2> 1196 T1630 oasc.JmxMonitoredMap.<init> JMX monitoring is enabled. Adding Solr mbeans to JMX Server: com.sun.jmx.mbeanserver.JmxMBeanServer@7d0c3a08
[junit4:junit4]   2> 1196 T1630 oasc.SolrCore.getNewIndexDir New index directory detected: old=null new=/usr/home/hudson/hudson-slave/workspace/Lucene-Solr-Tests-trunk-Java6/solr/build/solr-core/test/J1/./solrtest-LeaderElectionIntegrationTest-1350268370670/data_7000/index/
[junit4:junit4]   2> 1197 T1630 oasc.SolrCore.initIndex WARNING [collection1] Solr index directory '/usr/home/hudson/hudson-slave/workspace/Lucene-Solr-Tests-trunk-Java6/solr/build/solr-core/test/J1/./solrtest-LeaderElectionIntegrationTest-1350268370670/data_7000/index' doesn't exist. Creating new index...
[junit4:junit4]   2> 1198 T1630 oasc.CachingDirectoryFactory.get return new directory for /usr/home/hudson/hudson-slave/workspace/Lucene-Solr-Tests-trunk-Java6/solr/build/solr-core/test/J1/./solrtest-LeaderElectionIntegrationTest-1350268370670/data_7000/index forceNew:false
[junit4:junit4]   2> 1199 T1630 oasc.SolrDeletionPolicy.onCommit SolrDeletionPolicy.onCommit: commits:num=1
[junit4:junit4]   2> 		commit{dir=MockDirWrapper(org.apache.lucene.store.RAMDirectory@59893abc lockFactory=org.apache.lucene.store.NativeFSLockFactory@466de4fc),segFN=segments_1,generation=1,filenames=[segments_1]
[junit4:junit4]   2> 1199 T1630 oasc.SolrDeletionPolicy.updateCommits newest commit = 1
[junit4:junit4]   2> 1200 T1630 oasc.SolrCore.initWriters created xml: solr.XMLResponseWriter
[junit4:junit4]   2> 1201 T1630 oasup.UpdateRequestProcessorChain.init inserting DistributedUpdateProcessorFactory into updateRequestProcessorChain "dedupe"
[junit4:junit4]   2> 1202 T1630 oasup.UpdateRequestProcessorChain.init inserting DistributedUpdateProcessorFactory into updateRequestProcessorChain "dedupe-allfields"
[junit4:junit4]   2> 1202 T1630 oasup.UpdateRequestProcessorChain.init inserting DistributedUpdateProcessorFactory into updateRequestProcessorChain "stored_sig"
[junit4:junit4]   2> 1202 T1630 oasup.UpdateRequestProcessorChain.init inserting DistributedUpdateProcessorFactory into updateRequestProcessorChain "uniq-fields"
[junit4:junit4]   2> 1203 T1630 oasup.UpdateRequestProcessorChain.init inserting DistributedUpdateProcessorFactory into updateRequestProcessorChain "distrib-dup-test-chain-implicit"
[junit4:junit4]   2> 1203 T1630 oasc.RequestHandlers.initHandlersFromConfig adding lazy requestHandler: solr.ReplicationHandler
[junit4:junit4]   2> 1203 T1630 oasc.RequestHandlers.initHandlersFromConfig created /replication: solr.ReplicationHandler
[junit4:junit4]   2> 1204 T1630 oasc.RequestHandlers.initHandlersFromConfig created standard: solr.StandardRequestHandler
[junit4:junit4]   2> 1204 T1630 oasc.RequestHandlers.initHandlersFromConfig created /get: solr.RealTimeGetHandler
[junit4:junit4]   2> 1204 T1630 oasc.RequestHandlers.initHandlersFromConfig created dismax: solr.SearchHandler
[junit4:junit4]   2> 1205 T1630 oasc.RequestHandlers.initHandlersFromConfig created mock: org.apache.solr.core.MockQuerySenderListenerReqHandler
[junit4:junit4]   2> 1205 T1630 oasc.RequestHandlers.initHandlersFromConfig created /admin/: org.apache.solr.handler.admin.AdminHandlers
[junit4:junit4]   2> 1205 T1630 oasc.RequestHandlers.initHandlersFromConfig created defaults: solr.StandardRequestHandler
[junit4:junit4]   2> 1206 T1630 oasc.RequestHandlers.initHandlersFromConfig adding lazy requestHandler: solr.StandardRequestHandler
[junit4:junit4]   2> 1206 T1630 oasc.RequestHandlers.initHandlersFromConfig created lazy: solr.StandardRequestHandler
[junit4:junit4]   2> 1206 T1630 oasc.RequestHandlers.initHandlersFromConfig created /update: solr.UpdateRequestHandler
[junit4:junit4]   2> 1207 T1630 oasc.RequestHandlers.initHandlersFromConfig created /terms: org.apache.solr.handler.component.SearchHandler
[junit4:junit4]   2> 1207 T1630 oasc.RequestHandlers.initHandlersFromConfig created spellCheckCompRH: org.apache.solr.handler.component.SearchHandler
[junit4:junit4]   2> 1207 T1630 oasc.RequestHandlers.initHandlersFromConfig created spellCheckCompRH_Direct: org.apache.solr.handler.component.SearchHandler
[junit4:junit4]   2> 1208 T1630 oasc.RequestHandlers.initHandlersFromConfig created spellCheckWithWordbreak: org.apache.solr.handler.component.SearchHandler
[junit4:junit4]   2> 1208 T1630 oasc.RequestHandlers.initHandlersFromConfig created spellCheckWithWordbreak_Direct: org.apache.solr.handler.component.SearchHandler
[junit4:junit4]   2> 1208 T1630 oasc.RequestHandlers.initHandlersFromConfig created spellCheckCompRH1: org.apache.solr.handler.component.SearchHandler
[junit4:junit4]   2> 1209 T1630 oasc.RequestHandlers.initHandlersFromConfig created tvrh: org.apache.solr.handler.component.SearchHandler
[junit4:junit4]   2> 1209 T1630 oasc.RequestHandlers.initHandlersFromConfig created /mlt: solr.MoreLikeThisHandler
[junit4:junit4]   2> 1209 T1630 oasc.RequestHandlers.initHandlersFromConfig created /debug/dump: solr.DumpRequestHandler
[junit4:junit4]   2> 1215 T1630 oashl.XMLLoader.init xsltCacheLifetimeSeconds=60
[junit4:junit4]   2> 1219 T1630 oasc.SolrCore.initDeprecatedSupport WARNING solrconfig.xml uses deprecated <admin/gettableFiles>, Please update your config to use the ShowFileRequestHandler.
[junit4:junit4]   2> 1220 T1630 oasc.SolrCore.initDeprecatedSupport WARNING adding ShowFileRequestHandler with hidden files: [SCHEMA.XML, OLD_SYNONYMS.TXT, STOPWORDS.TXT, PROTWORDS.TXT, OPEN-EXCHANGE-RATES.JSON, SYNONYMS.TXT, CURRENCY.XML, MAPPING-ISOLATIN1ACCENT.TXT]
[junit4:junit4]   2> 1222 T1630 oass.SolrIndexSearcher.<init> Opening Searcher@2323368c main
[junit4:junit4]   2> 1222 T1630 oass.SolrIndexSearcher.getIndexDir WARNING WARNING: Directory impl does not support setting indexDir: org.apache.lucene.store.MockDirectoryWrapper
[junit4:junit4]   2> 1223 T1630 oasu.CommitTracker.<init> Hard AutoCommit: disabled
[junit4:junit4]   2> 1223 T1630 oasu.CommitTracker.<init> Soft AutoCommit: disabled
[junit4:junit4]   2> 1223 T1630 oashc.SpellCheckComponent.inform Initializing spell checkers
[junit4:junit4]   2> 1245 T1630 oass.DirectSolrSpellChecker.init init: {name=direct,classname=DirectSolrSpellChecker,field=lowerfilt,minQueryLength=3}
[junit4:junit4]   2> 1292 T1644 oasc.SolrCore.registerSearcher [collection1] Registered new searcher Searcher@2323368c main{StandardDirectoryReader(segments_1:1)}
[junit4:junit4]   2> 1295 T1635 oazs.PrepRequestProcessor.pRequest Got user-level KeeperException when processing sessionid:0x13a62443ef40002 type:create cxid:0x53 zxid:0xfffffffffffffffe txntype:unknown reqpath:n/a Error Path:/solr/overseer/queue Error:KeeperErrorCode = NoNode for /solr/overseer/queue
[junit4:junit4]   2> 1307 T1630 oasc.CoreContainer.register registering core: collection1
[junit4:junit4]   2> 1308 T1630 oasc.ZkController.register Register shard - core:collection1 address:http://127.0.0.1:7000/solr shardId:shard1
[junit4:junit4]   2> 1308 T1630 oascc.SolrZkClient.makePath makePath: /collections/collection1/leader_elect/shard1/election
[junit4:junit4]   2> 1328 T1635 oazs.PrepRequestProcessor.pRequest Got user-level KeeperException when processing sessionid:0x13a62443ef40002 type:delete cxid:0x62 zxid:0xfffffffffffffffe txntype:unknown reqpath:n/a Error Path:/solr/collections/collection1/leaders Error:KeeperErrorCode = NoNode for /solr/collections/collection1/leaders
[junit4:junit4]   2> 1329 T1630 oasc.ShardLeaderElectionContext.runLeaderProcess Running the leader process.
[junit4:junit4]   2> 1330 T1635 oazs.PrepRequestProcessor.pRequest Got user-level KeeperException when processing sessionid:0x13a62443ef40002 type:create cxid:0x63 zxid:0xfffffffffffffffe txntype:unknown reqpath:n/a Error Path:/solr/overseer Error:KeeperErrorCode = NodeExists for /solr/overseer
[junit4:junit4]   2> 1480 T1642 oascc.ZkStateReader.updateClusterState Updating cloud state from ZooKeeper... 
[junit4:junit4]   2> 1480 T1635 oazs.PrepRequestProcessor.pRequest Got user-level KeeperException when processing sessionid:0x13a62443ef40002 type:create cxid:0x6a zxid:0xfffffffffffffffe txntype:unknown reqpath:n/a Error Path:/solr/overseer/queue-work Error:KeeperErrorCode = NoNode for /solr/overseer/queue-work
[junit4:junit4]   2> 1498 T1641 oascc.ZkStateReader$2.process A cluster state change has occurred - updating...
[junit4:junit4]   2> 1841 T1630 oasc.ShardLeaderElectionContext.waitForReplicasToComeUp Enough replicas found to continue.
[junit4:junit4]   2> 1841 T1630 oasc.ShardLeaderElectionContext.runLeaderProcess I may be the new leader - try and sync
[junit4:junit4]   2> 1842 T1630 oasc.ShardLeaderElectionContext.runLeaderProcess I am the new leader: http://127.0.0.1:7000/solr/collection1/
[junit4:junit4]   2> 1842 T1630 oascc.SolrZkClient.makePath makePath: /collections/collection1/leaders/shard1
[junit4:junit4]   2> 1862 T1635 oazs.PrepRequestProcessor.pRequest Got user-level KeeperException when processing sessionid:0x13a62443ef40002 type:create cxid:0x88 zxid:0xfffffffffffffffe txntype:unknown reqpath:n/a Error Path:/solr/overseer Error:KeeperErrorCode = NodeExists for /solr/overseer
[junit4:junit4]   2> 2002 T1642 oascc.ZkStateReader.updateClusterState Updating cloud state from ZooKeeper... 
[junit4:junit4]   2> 2015 T1641 oascc.ZkStateReader$2.process A cluster state change has occurred - updating...
[junit4:junit4]   2> 2024 T1630 oasc.ZkController.register We are http://127.0.0.1:7000/solr/collection1/ and leader is http://127.0.0.1:7000/solr/collection1/
[junit4:junit4]   2> 2025 T1630 oasc.ZkController.checkRecovery WARNING Skipping recovery according to sys prop solrcloud.skip.autorecovery
[junit4:junit4]   2> 2027 T1630 oascc.ZkStateReader.updateClusterState Updating cloud state from ZooKeeper... 
[junit4:junit4]   2> 2029 T1630 oasc.SolrResourceLoader.locateSolrHome JNDI not configured for solr (NoInitialContextEx)
[junit4:junit4]   2> 2029 T1630 oasc.SolrResourceLoader.locateSolrHome using system property solr.solr.home: /usr/home/hudson/hudson-slave/workspace/Lucene-Solr-Tests-trunk-Java6/solr/build/solr-core/test-files/solr
[junit4:junit4]   2> 2030 T1630 oasc.CoreContainer$Initializer.initialize looking for solr.xml: /usr/home/hudson/hudson-slave/workspace/Lucene-Solr-Tests-trunk-Java6/solr/build/solr-core/test-files/solr/solr.xml
[junit4:junit4]   2> 2030 T1630 oasc.CoreContainer.<init> New CoreContainer 1771114209
[junit4:junit4]   2> 2030 T1630 oasc.CoreContainer.load Loading CoreContainer using Solr Home: '/usr/home/hudson/hudson-slave/workspace/Lucene-Solr-Tests-trunk-Java6/solr/build/solr-core/test-files/solr/'
[junit4:junit4]   2> 2031 T1630 oasc.SolrResourceLoader.<init> new SolrResourceLoader for directory: '/usr/home/hudson/hudson-slave/workspace/Lucene-Solr-Tests-trunk-Java6/solr/build/solr-core/test-files/solr/'
[junit4:junit4]   2> 2065 T1630 oasc.CoreContainer.load Registering Log Listener
[junit4:junit4]   2> 2077 T1630 oasc.CoreContainer.initZooKeeper Zookeeper client=127.0.0.1:50467/solr
[junit4:junit4]   2> 2078 T1630 oaz.ZooKeeper.<init> Initiating client connection, connectString=127.0.0.1:50467/solr sessionTimeout=3000 watcher=org.apache.solr.common.cloud.ConnectionManager@4ce6ccce
[junit4:junit4]   2> 2078 T1645 oaz.ClientCnxn$SendThread.startConnect Opening socket connection to server /127.0.0.1:50467
[junit4:junit4]   2> 2078 T1630 oascc.ConnectionManager.waitForConnected Waiting for client to connect to ZooKeeper
[junit4:junit4]   2> 2080 T1645 oaz.ClientCnxn$SendThread.primeConnection Socket connection established to localhost/127.0.0.1:50467, initiating session
[junit4:junit4]   2> 2080 T1632 oazs.NIOServerCnxn$Factory.run Accepted socket connection from /140.211.11.196:50477
[junit4:junit4]   2> 2080 T1632 oazs.NIOServerCnxn.readConnectRequest Client attempting to establish new session at /140.211.11.196:50477
[junit4:junit4]   2> 2081 T1634 oazs.NIOServerCnxn.finishSessionInit Established session 0x13a62443ef40003 with negotiated timeout 3000 for client /140.211.11.196:50477
[junit4:junit4]   2> 2081 T1645 oaz.ClientCnxn$SendThread.readConnectResult Session establishment complete on server localhost/127.0.0.1:50467, sessionid = 0x13a62443ef40003, negotiated timeout = 3000
[junit4:junit4]   2> 2082 T1646 oascc.ConnectionManager.process Watcher org.apache.solr.common.cloud.ConnectionManager@4ce6ccce name:ZooKeeperConnection Watcher:127.0.0.1:50467/solr got event WatchedEvent state:SyncConnected type:None path:null path:null type:None
[junit4:junit4]   2> 2082 T1630 oascc.ConnectionManager.waitForConnected Client is connected to ZooKeeper
[junit4:junit4]   2> 2082 T1635 oazs.PrepRequestProcessor.pRequest Got user-level KeeperException when processing sessionid:0x13a62443ef40003 type:create cxid:0x1 zxid:0xfffffffffffffffe txntype:unknown reqpath:n/a Error Path:/solr/overseer Error:KeeperErrorCode = NodeExists for /solr/overseer
[junit4:junit4]   2> 2083 T1635 oazs.PrepRequestProcessor.pRequest Got user-level KeeperException when processing sessionid:0x13a62443ef40003 type:create cxid:0x2 zxid:0xfffffffffffffffe txntype:unknown reqpath:n/a Error Path:/solr/overseer Error:KeeperErrorCode = NodeExists for /solr/overseer
[junit4:junit4]   2> 2091 T1630 oasc.ZkController.createEphemeralLiveNode Register node as live in ZooKeeper:/live_nodes/127.0.0.1:7001_solr
[junit4:junit4]   2> 2091 T1635 oazs.PrepRequestProcessor.pRequest Got user-level KeeperException when processing sessionid:0x13a62443ef40003 type:delete cxid:0x4 zxid:0xfffffffffffffffe txntype:unknown reqpath:n/a Error Path:/solr/live_nodes/127.0.0.1:7001_solr Error:KeeperErrorCode = NoNode for /solr/live_nodes/127.0.0.1:7001_solr
[junit4:junit4]   2> 2092 T1630 oascc.SolrZkClient.makePath makePath: /live_nodes/127.0.0.1:7001_solr
[junit4:junit4]   2> 2099 T1641 oascc.ZkStateReader$3.process Updating live nodes
[junit4:junit4]   2> 2099 T1630 oashc.HttpShardHandlerFactory.getParameter Setting socketTimeout to: 0
[junit4:junit4]   2> 2100 T1630 oashc.HttpShardHandlerFactory.getParameter Setting urlScheme to: http://
[junit4:junit4]   2> 2100 T1630 oashc.HttpShardHandlerFactory.getParameter Setting connTimeout to: 0
[junit4:junit4]   2> 2100 T1630 oashc.HttpShardHandlerFactory.getParameter Setting maxConnectionsPerHost to: 20
[junit4:junit4]   2> 2100 T1630 oashc.HttpShardHandlerFactory.getParameter Setting corePoolSize to: 0
[junit4:junit4]   2> 2100 T1630 oashc.HttpShardHandlerFactory.getParameter Setting maximumPoolSize to: 2147483647
[junit4:junit4]   2> 2101 T1630 oashc.HttpShardHandlerFactory.getParameter Setting maxThreadIdleTime to: 5
[junit4:junit4]   2> 2101 T1630 oashc.HttpShardHandlerFactory.getParameter Setting sizeOfQueue to: -1
[junit4:junit4]   2> 2101 T1630 oashc.HttpShardHandlerFactory.getParameter Setting fairnessPolicy to: false
[junit4:junit4]   2> 2101 T1630 oascsi.HttpClientUtil.createClient Creating new http client, config:maxConnectionsPerHost=20&maxConnections=10000&socketTimeout=0&connTimeout=0&retry=false
[junit4:junit4]   2> 2114 T1630 oascc.ZkStateReader.createClusterStateWatchersAndUpdate Updating cluster state from ZooKeeper... 
[junit4:junit4]   2> 2119 T1630 oasc.CoreContainer.create Creating SolrCore 'collection1' using instanceDir: /usr/home/hudson/hudson-slave/workspace/Lucene-Solr-Tests-trunk-Java6/solr/build/solr-core/test-files/solr/collection1
[junit4:junit4]   2> 2119 T1630 oasc.ZkController.createCollectionZkNode Check for collection zkNode:collection1
[junit4:junit4]   2> 2120 T1630 oasc.ZkController.createCollectionZkNode Collection zkNode exists
[junit4:junit4]   2> 2120 T1630 oasc.ZkController.readConfigName Load collection config from:/collections/collection1
[junit4:junit4]   2> 2121 T1630 oasc.SolrResourceLoader.<init> new SolrResourceLoader for directory: '/usr/home/hudson/hudson-slave/workspace/Lucene-Solr-Tests-trunk-Java6/solr/build/solr-core/test-files/solr/collection1/'
[junit4:junit4]   2> 2122 T1630 oasc.SolrResourceLoader.replaceClassLoader Adding 'file:/usr/home/hudson/hudson-slave/workspace/Lucene-Solr-Tests-trunk-Java6/solr/build/solr-core/test-files/solr/collection1/lib/classes/' to classloader
[junit4:junit4]   2> 2122 T1630 oasc.SolrResourceLoader.replaceClassLoader Adding 'file:/usr/home/hudson/hudson-slave/workspace/Lucene-Solr-Tests-trunk-Java6/solr/build/solr-core/test-files/solr/collection1/lib/README' to classloader
[junit4:junit4]   2> 2162 T1630 oasc.SolrConfig.<init> Using Lucene MatchVersion: LUCENE_50
[junit4:junit4]   2> 2213 T1630 oasc.SolrConfig.<init> Loaded SolrConfig: solrconfig.xml
[junit4:junit4]   2> 2314 T1630 oass.IndexSchema.readSchema Reading Solr Schema
[junit4:junit4]   2> 2319 T1630 oass.IndexSchema.readSchema Schema name=test
[junit4:junit4]   2> 2519 T1642 oascc.ZkStateReader.updateClusterState Updating cloud state from ZooKeeper... 
[junit4:junit4]   2> 2537 T1641 oascc.ZkStateReader$2.process A cluster state change has occurred - updating...
[junit4:junit4]   2> 2537 T1646 oascc.ZkStateReader$2.process A cluster state change has occurred - updating...
[junit4:junit4]   2> 2782 T1630 oass.OpenExchangeRatesOrgProvider.init Initialized with rates=open-exchange-rates.json, refreshInterval=1440.
[junit4:junit4]   2> 2790 T1630 oass.IndexSchema.readSchema default search field in schema is text
[junit4:junit4]   2> 2794 T1630 oass.IndexSchema.readSchema unique key field: id
[junit4:junit4]   2> 2802 T1630 oass.FileExchangeRateProvider.reload Reloading exchange rates from file currency.xml
[junit4:junit4]   2> 2805 T1630 oass.FileExchangeRateProvider.reload Reloading exchange rates from file currency.xml
[junit4:junit4]   2> 2809 T1630 oass.OpenExchangeRatesOrgProvider.reload Reloading exchange rates from open-exchange-rates.json
[junit4:junit4]   2> 2810 T1630 oass.OpenExchangeRatesOrgProvider.reload Reloading exchange rates from open-exchange-rates.json
[junit4:junit4]   2> 2810 T1630 oasc.SolrCore.<init> [collection1] Opening new SolrCore at /usr/home/hudson/hudson-slave/workspace/Lucene-Solr-Tests-trunk-Java6/solr/build/solr-core/test-files/solr/collection1/, dataDir=/usr/home/hudson/hudson-slave/workspace/Lucene-Solr-Tests-trunk-Java6/solr/build/solr-core/test/J1/./solrtest-LeaderElectionIntegrationTest-1350268370670/data_7001/
[junit4:junit4]   2> 2810 T1630 oasc.JmxMonitoredMap.<init> JMX monitoring is enabled. Adding Solr mbeans to JMX Server: com.sun.jmx.mbeanserver.JmxMBeanServer@7d0c3a08
[junit4:junit4]   2> 2811 T1630 oasc.SolrCore.getNewIndexDir New index directory detected: old=null new=/usr/home/hudson/hudson-slave/workspace/Lucene-Solr-Tests-trunk-Java6/solr/build/solr-core/test/J1/./solrtest-LeaderElectionIntegrationTest-1350268370670/data_7001/index/
[junit4:junit4]   2> 2812 T1630 oasc.SolrCore.initIndex WARNING [collection1] Solr index directory '/usr/home/hudson/hudson-slave/workspace/Lucene-Solr-Tests-trunk-Java6/solr/build/solr-core/test/J1/./solrtest-LeaderElectionIntegrationTest-1350268370670/data_7001/index' doesn't exist. Creating new index...
[junit4:junit4]   2> 2812 T1630 oasc.CachingDirectoryFactory.get return new directory for /usr/home/hudson/hudson-slave/workspace/Lucene-Solr-Tests-trunk-Java6/solr/build/solr-core/test/J1/./solrtest-LeaderElectionIntegrationTest-1350268370670/data_7001/index forceNew:false
[junit4:junit4]   2> 2814 T1630 oasc.SolrDeletionPolicy.onCommit SolrDeletionPolicy.onCommit: commits:num=1
[junit4:junit4]   2> 		commit{dir=MockDirWrapper(org.apache.lucene.store.RAMDirectory@7c44d9b4 lockFactory=org.apache.lucene.store.NativeFSLockFactory@62f451ff),segFN=segments_1,generation=1,filenames=[segments_1]
[junit4:junit4]   2> 2814 T1630 oasc.SolrDeletionPolicy.updateCommits newest commit = 1
[junit4:junit4]   2> 2815 T1630 oasc.SolrCore.initWriters created xml: solr.XMLResponseWriter
[junit4:junit4]   2> 2816 T1630 oasup.UpdateRequestProcessorChain.init inserting DistributedUpdateProcessorFactory into updateRequestProcessorChain "dedupe"
[junit4:junit4]   2> 2817 T1630 oasup.UpdateRequestProcessorChain.init inserting DistributedUpdateProcessorFactory into updateRequestProcessorChain "dedupe-allfields"
[junit4:junit4]   2> 2817 T1630 oasup.UpdateRequestProcessorChain.init inserting DistributedUpdateProcessorFactory into updateRequestProcessorChain "stored_sig"
[junit4:junit4]   2> 2817 T1630 oasup.UpdateRequestProcessorChain.init inserting DistributedUpdateProcessorFactory into updateRequestProcessorChain "uniq-fields"
[junit4:junit4]   2> 2818 T1630 oasup.UpdateRequestProcessorChain.init inserting DistributedUpdateProcessorFactory into updateRequestProcessorChain "distrib-dup-test-chain-implicit"
[junit4:junit4]   2> 2818 T1630 oasc.RequestHandlers.initHandlersFromConfig adding lazy requestHandler: solr.ReplicationHandler
[junit4:junit4]   2> 2818 T1630 oasc.RequestHandlers.initHandlersFromConfig created /replication: solr.ReplicationHandler
[junit4:junit4]   2> 2819 T1630 oasc.RequestHandlers.initHandlersFromConfig created standard: solr.StandardRequestHandler
[junit4:junit4]   2> 2819 T1630 oasc.RequestHandlers.initHandlersFromConfig created /get: solr.RealTimeGetHandler
[junit4:junit4]   2> 2819 T1630 oasc.RequestHandlers.initHandlersFromConfig created dismax: solr.SearchHandler
[junit4:junit4]   2> 2820 T1630 oasc.RequestHandlers.initHandlersFromConfig created mock: org.apache.solr.core.MockQuerySenderListenerReqHandler
[junit4:junit4]   2> 2820 T1630 oasc.RequestHandlers.initHandlersFromConfig created /admin/: org.apache.solr.handler.admin.AdminHandlers
[junit4:junit4]   2> 2821 T1630 oasc.RequestHandlers.initHandlersFromConfig created defaults: solr.StandardRequestHandler
[junit4:junit4]   2> 2821 T1630 oasc.RequestHandlers.initHandlersFromConfig adding lazy requestHandler: solr.StandardRequestHandler
[junit4:junit4]   2> 2821 T1630 oasc.RequestHandlers.initHandlersFromConfig created lazy: solr.StandardRequestHandler
[junit4:junit4]   2> 2822 T1630 oasc.RequestHandlers.initHandlersFromConfig created /update: solr.UpdateRequestHandler
[junit4:junit4]   2> 2822 T1630 oasc.RequestHandlers.initHandlersFromConfig created /terms: org.apache.solr.handler.component.SearchHandler
[junit4:junit4]   2> 2822 T1630 oasc.RequestHandlers.initHandlersFromConfig created spellCheckCompRH: org.apache.solr.handler.component.SearchHandler
[junit4:junit4]   2> 2823 T1630 oasc.RequestHandlers.initHandlersFromConfig created spellCheckCompRH_Direct: org.apache.solr.handler.component.SearchHandler
[junit4:junit4]   2> 2823 T1630 oasc.RequestHandlers.initHandlersFromConfig created spellCheckWithWordbreak: org.apache.solr.handler.component.SearchHandler
[junit4:junit4]   2> 2824 T1630 oasc.RequestHandlers.initHandlersFromConfig created spellCheckWithWordbreak_Direct: org.apache.solr.handler.component.SearchHandler
[junit4:junit4]   2> 2824 T1630 oasc.RequestHandlers.initHandlersFromConfig created spellCheckCompRH1: org.apache.solr.handler.component.SearchHandler
[junit4:junit4]   2> 2824 T1630 oasc.RequestHandlers.initHandlersFromConfig created tvrh: org.apache.solr.handler.component.SearchHandler
[junit4:junit4]   2> 2825 T1630 oasc.RequestHandlers.initHandlersFromConfig created /mlt: solr.MoreLikeThisHandler
[junit4:junit4]   2> 2825 T1630 oasc.RequestHandlers.initHandlersFromConfig created /debug/dump: solr.DumpRequestHandler
[junit4:junit4]   2> 2831 T1630 oashl.XMLLoader.init xsltCacheLifetimeSeconds=60
[junit4:junit4]   2> 2835 T1630 oasc.SolrCore.initDeprecatedSupport WARNING solrconfig.xml uses deprecated <admin/gettableFiles>, Please update your config to use the ShowFileRequestHandler.
[junit4:junit4]   2> 2836 T1630 oasc.SolrCore.initDeprecatedSupport WARNING adding ShowFileRequestHandler with hidden files: [SCHEMA.XML, OLD_SYNONYMS.TXT, STOPWORDS.TXT, PROTWORDS.TXT, OPEN-EXCHANGE-RATES.JSON, SYNONYMS.TXT, CURRENCY.XML, MAPPING-ISOLATIN1ACCENT.TXT]
[junit4:junit4]   2> 2838 T1630 oass.SolrIndexSearcher.<init> Opening Searcher@45d45314 main
[junit4:junit4]   2> 2838 T1630 oass.SolrIndexSearcher.getIndexDir WARNING WARNING: Directory impl does not support setting indexDir: org.apache.lucene.store.MockDirectoryWrapper
[junit4:junit4]   2> 2839 T1630 oasu.CommitTracker.<init> Hard AutoCommit: disabled
[junit4:junit4]   2> 2839 T1630 oasu.CommitTracker.<init> Soft AutoCommit: disabled
[junit4:junit4]   2> 2840 T1630 oashc.SpellCheckComponent.inform Initializing spell checkers
[junit4:junit4]   2> 2846 T1630 oass.DirectSolrSpellChecker.init init: {name=direct,classname=DirectSolrSpellChecker,field=lowerfilt,minQueryLength=3}
[junit4:junit4]   2> 2896 T1647 oasc.SolrCore.registerSearcher [collection1] Registered new searcher Searcher@45d45314 main{StandardDirectoryReader(segments_1:1)}
[junit4:junit4]   2> 2901 T1630 oasc.CoreContainer.register registering core: collection1
[junit4:junit4]   2> 2901 T1630 oasc.ZkController.register Register shard - core:collection1 address:http://127.0.0.1:7001/solr shardId:shard1
[junit4:junit4]   2> 2904 T1630 oasc.ZkController.register We are http://127.0.0.1:7001/solr/collection1/ and leader is http://127.0.0.1:7000/solr/collection1/
[junit4:junit4]   2> 2904 T1630 oasc.ZkController.checkRecovery WARNING Skipping recovery according to sys prop solrcloud.skip.autorecovery
[junit4:junit4]   2> 2912 T1630 oascc.ZkStateReader.updateClusterState Updating cloud state from ZooKeeper... 
[junit4:junit4]   2> 2915 T1630 oasc.SolrResourceLoader.locateSolrHome JNDI not configured for solr (NoInitialContextEx)
[junit4:junit4]   2> 2915 T1630 oasc.SolrResourceLoader.locateSolrHome using system property solr.solr.home: /usr/home/hudson/hudson-slave/workspace/Lucene-Solr-Tests-trunk-Java6/solr/build/solr-core/test-files/solr
[junit4:junit4]   2> 2915 T1630 oasc.CoreContainer$Initializer.initialize looking for solr.xml: /usr/home/hudson/hudson-slave/workspace/Lucene-Solr-Tests-trunk-Java6/solr/build/solr-core/test-files/solr/solr.xml
[junit4:junit4]   2> 2915 T1630 oasc.CoreContainer.<init> New CoreContainer 252280818
[junit4:junit4]   2> 2916 T1630 oasc.CoreContainer.load Loading CoreContainer using Solr Home: '/usr/home/hudson/hudson-slave/workspace/Lucene-Solr-Tests-trunk-Java6/solr/build/solr-core/test-files/solr/'
[junit4:junit4]   2> 2916 T1630 oasc.SolrResourceLoader.<init> new SolrResourceLoader for directory: '/usr/home/hudson/hudson-slave/workspace/Lucene-Solr-Tests-trunk-Java6/solr/build/solr-core/test-files/solr/'
[junit4:junit4]   2> 2946 T1630 oasc.CoreContainer.load Registering Log Listener
[junit4:junit4]   2> 2957 T1630 oasc.CoreContainer.initZooKeeper Zookeeper client=127.0.0.1:50467/solr
[junit4:junit4]   2> 2957 T1630 oaz.ZooKeeper.<init> Initiating client connection, connectString=127.0.0.1:50467/solr sessionTimeout=3000 watcher=org.apache.solr.common.cloud.ConnectionManager@6534a19e
[junit4:junit4]   2> 2958 T1648 oaz.ClientCnxn$SendThread.startConnect Opening socket connection to server /127.0.0.1:50467
[junit4:junit4]   2> 2958 T1630 oascc.ConnectionManager.waitForConnected Waiting for client to connect to ZooKeeper
[junit4:junit4]   2> 2959 T1648 oaz.ClientCnxn$SendThread.primeConnection Socket connection established to localhost/127.0.0.1:50467, initiating session
[junit4:junit4]   2> 2959 T1632 oazs.NIOServerCnxn$Factory.run Accepted socket connection from /140.211.11.196:50482
[junit4:junit4]   2> 2959 T1632 oazs.NIOServerCnxn.readConnectRequest Client attempting to establish new session at /140.211.11.196:50482
[junit4:junit4]   2> 2961 T1634 oazs.NIOServerCnxn.finishSessionInit Established session 0x13a62443ef40004 with negotiated timeout 3000 for client /140.211.11.196:50482
[junit4:junit4]   2> 2961 T1648 oaz.ClientCnxn$SendThread.readConnectResult Session establishment complete on server localhost/127.0.0.1:50467, sessionid = 0x13a62443ef40004, negotiated timeout = 3000
[junit4:junit4]   2> 2961 T1649 oascc.ConnectionManager.process Watcher org.apache.solr.common.cloud.ConnectionManager@6534a19e name:ZooKeeperConnection Watcher:127.0.0.1:50467/solr got event WatchedEvent state:SyncConnected type:None path:null path:null type:None
[junit4:junit4]   2> 2961 T1630 oascc.ConnectionManager.waitForConnected Client is connected to ZooKeeper
[junit4:junit4]   2> 2962 T1635 oazs.PrepRequestProcessor.pRequest Got user-level KeeperException when processing sessionid:0x13a62443ef40004 type:create cxid:0x1 zxid:0xfffffffffffffffe txntype:unknown reqpath:n/a Error Path:/solr/overseer Error:KeeperErrorCode = NodeExists for /solr/overseer
[junit4:junit4]   2> 2963 T1635 oazs.PrepRequestProcessor.pRequest Got user-level KeeperException when processing sessionid:0x13a62443ef40004 type:create cxid:0x2 zxid:0xfffffffffffffffe txntype:unknown reqpath:n/a Error Path:/solr/overseer Error:KeeperErrorCode = NodeExists for /solr/overseer
[junit4:junit4]   2> 2964 T1630 oasc.ZkController.createEphemeralLiveNode Register node as live in ZooKeeper:/live_nodes/127.0.0.1:7002_solr
[junit4:junit4]   2> 2964 T1635 oazs.PrepRequestProcessor.pRequest Got user-level KeeperException when processing sessionid:0x13a62443ef40004 type:delete cxid:0x4 zxid:0xfffffffffffffffe txntype:unknown reqpath:n/a Error Path:/solr/live_nodes/127.0.0.1:7002_solr Error:KeeperErrorCode = NoNode for /solr/live_nodes/127.0.0.1:7002_solr
[junit4:junit4]   2> 2965 T1630 oascc.SolrZkClient.makePath makePath: /live_nodes/127.0.0.1:7002_solr
[junit4:junit4]   2> 2977 T1641 oascc.ZkStateReader$3.process Updating live nodes
[junit4:junit4]   2> 2977 T1646 oascc.ZkStateReader$3.process Updating live nodes
[junit4:junit4]   2> 2978 T1630 oashc.HttpShardHandlerFactory.getParameter Setting socketTimeout to: 0
[junit4:junit4]   2> 2978 T1630 oashc.HttpShardHandlerFactory.getParameter Setting urlScheme to: http://
[junit4:junit4]   2> 2978 T1630 oashc.HttpShardHandlerFactory.getParameter Setting connTimeout to: 0
[junit4:junit4]   2> 2978 T1630 oashc.HttpShardHandlerFactory.getParameter Setting maxConnectionsPerHost to: 20
[junit4:junit4]   2> 2979 T1630 oashc.HttpShardHandlerFactory.getParameter Setting corePoolSize to: 0
[junit4:junit4]   2> 2979 T1630 oashc.HttpShardHandlerFactory.getParameter Setting maximumPoolSize to: 2147483647
[junit4:junit4]   2> 2979 T1630 oashc.HttpShardHandlerFactory.getParameter Setting maxThreadIdleTime to: 5
[junit4:junit4]   2> 2979 T1630 oashc.HttpShardHandlerFactory.getParameter Setting sizeOfQueue to: -1
[junit4:junit4]   2> 2980 T1630 oashc.HttpShardHandlerFactory.getParameter Setting fairnessPolicy to: false
[junit4:junit4]   2> 2980 T1630 oascsi.HttpClientUtil.createClient Creating new http client, config:maxConnectionsPerHost=20&maxConnections=10000&socketTimeout=0&connTimeout=0&retry=false
[junit4:junit4]   2> 2990 T1630 oascc.ZkStateReader.createClusterStateWatchersAndUpdate Updating cluster state from ZooKeeper... 
[junit4:junit4]   2> 2995 T1630 oasc.CoreContainer.create Creating SolrCore 'collection1' using instanceDir: /usr/home/hudson/hudson-slave/workspace/Lucene-Solr-Tests-trunk-Java6/solr/build/solr-core/test-files/solr/collection1
[junit4:junit4]   2> 2995 T1630 oasc.ZkController.createCollectionZkNode Check for collection zkNode:collection1
[junit4:junit4]   2> 2995 T1630 oasc.ZkController.createCollectionZkNode Collection zkNode exists
[junit4:junit4]   2> 2996 T1630 oasc.ZkController.readConfigName Load collection config from:/collections/collection1
[junit4:junit4]   2> 2996 T1630 oasc.SolrResourceLoader.<init> new SolrResourceLoader for directory: '/usr/home/hudson/hudson-slave/workspace/Lucene-Solr-Tests-trunk-Java6/solr/build/solr-core/test-files/solr/collection1/'
[junit4:junit4]   2> 2997 T1630 oasc.SolrResourceLoader.replaceClassLoader Adding 'file:/usr/home/hudson/hudson-slave/workspace/Lucene-Solr-Tests-trunk-Java6/solr/build/solr-core/test-files/solr/collection1/lib/classes/' to classloader
[junit4:junit4]   2> 2998 T1630 oasc.SolrResourceLoader.replaceClassLoader Adding 'file:/usr/home/hudson/hudson-slave/workspace/Lucene-Solr-Tests-trunk-Java6/solr/build/solr-core/test-files/solr/collection1/lib/README' to classloader
[junit4:junit4]   2> 3032 T1630 oasc.SolrConfig.<init> Using Lucene MatchVersion: LUCENE_50
[junit4:junit4]   2> 3040 T1642 oascc.ZkStateReader.updateClusterState Updating cloud state from ZooKeeper... 
[junit4:junit4]   2> 3055 T1641 oascc.ZkStateReader$2.process A cluster state change has occurred - updating...
[junit4:junit4]   2> 3055 T1646 oascc.ZkStateReader$2.process A cluster state change has occurred - updating...
[junit4:junit4]   2> 3055 T1649 oascc.ZkStateReader$2.process A cluster state change has occurred - updating...
[junit4:junit4]   2> 3079 T1630 oasc.SolrConfig.<init> Loaded SolrConfig: solrconfig.xml
[junit4:junit4]   2> 3180 T1630 oass.IndexSchema.readSchema Reading Solr Schema
[junit4:junit4]   2> 3185 T1630 oass.IndexSchema.readSchema Schema name=test
[junit4:junit4]   2> 3622 T1630 oass.OpenExchangeRatesOrgProvider.init Initialized with rates=open-exchange-rates.json, refreshInterval=1440.
[junit4:junit4]   2> 3629 T1630 oass.IndexSchema.readSchema default search field in schema is text
[junit4:junit4]   2> 3632 T1630 oass.IndexSchema.readSchema unique key field: id
[junit4:junit4]   2> 3640 T1630 oass.FileExchangeRateProvider.reload Reloading exchange rates from file currency.xml
[junit4:junit4]   2> 3644 T1630 oass.FileExchangeRateProvider.reload Reloading exchange rates from file currency.xml
[junit4:junit4]   2> 3647 T1630 oass.OpenExchangeRatesOrgProvider.reload Reloading exchange rates from open-exchange-rates.json
[junit4:junit4]   2> 3647 T1630 oass.OpenExchangeRatesOrgProvider.reload Reloading exchange rates from open-exchange-rates.json
[junit4:junit4]   2> 3648 T1630 oasc.SolrCore.<init> [collection1] Opening new SolrCore at /usr/home/hudson/hudson-slave/workspace/Lucene-Solr-Tests-trunk-Java6/solr/build/solr-core/test-files/solr/collection1/, dataDir=/usr/home/hudson/hudson-slave/workspace/Lucene-Solr-Tests-trunk-Java6/solr/build/solr-core/test/J1/./solrtest-LeaderElectionIntegrationTest-1350268370670/data_7002/
[junit4:junit4]   2> 3648 T1630 oasc.JmxMonitoredMap.<init> JMX monitoring is enabled. Adding Solr mbeans to JMX Server: com.sun.jmx.mbeanserver.JmxMBeanServer@7d0c3a08
[junit4:junit4]   2> 3649 T1630 oasc.SolrCore.getNewIndexDir New index directory detected: old=null new=/usr/home/hudson/hudson-slave/workspace/Lucene-Solr-Tests-trunk-Java6/solr/build/solr-core/test/J1/./solrtest-LeaderElectionIntegrationTest-1350268370670/data_7002/index/
[junit4:junit4]   2> 3649 T1630 oasc.SolrCore.initIndex WARNING [collection1] Solr index directory '/usr/home/hudson/hudson-slave/workspace/Lucene-Solr-Tests-trunk-Java6/solr/build/solr-core/test/J1/./solrtest-LeaderElectionIntegrationTest-1350268370670/data_7002/index' doesn't exist. Creating new index...
[junit4:junit4]   2> 3650 T1630 oasc.CachingDirectoryFactory.get return new directory for /usr/home/hudson/hudson-slave/workspace/Lucene-Solr-Tests-trunk-Java6/solr/build/solr-core/test/J1/./solrtest-LeaderElectionIntegrationTest-1350268370670/data_7002/index forceNew:false
[junit4:junit4]   2> 3651 T1630 oasc.SolrDeletionPolicy.onCommit SolrDeletionPolicy.onCommit: commits:num=1
[junit4:junit4]   2> 		commit{dir=MockDirWrapper(org.apache.lucene.store.RAMDirectory@594e067c lockFactory=org.apache.lucene.store.NativeFSLockFactory@77536b1d),segFN=segments_1,generation=1,filenames=[segments_1]
[junit4:junit4]   2> 3652 T1630 oasc.SolrDeletionPolicy.updateCommits newest commit = 1
[junit4:junit4]   2> 3652 T1630 oasc.SolrCore.initWriters created xml: solr.XMLResponseWriter
[junit4:junit4]   2> 3654 T1630 oasup.UpdateRequestProcessorChain.init inserting DistributedUpdateProcessorFactory into updateRequestProcessorChain "dedupe"
[junit4:junit4]   2> 3654 T1630 oasup.UpdateRequestProcessorChain.init inserting DistributedUpdateProcessorFactory into updateRequestProcessorChain "dedupe-allfields"
[junit4:junit4]   2> 3654 T1630 oasup.UpdateRequestProcessorChain.init inserting DistributedUpdateProcessorFactory into updateRequestProcessorChain "stored_sig"
[junit4:junit4]   2> 3655 T1630 oasup.UpdateRequestProcessorChain.init inserting DistributedUpdateProcessorFactory into updateRequestProcessorChain "uniq-fields"
[junit4:junit4]   2> 3655 T1630 oasup.UpdateRequestProcessorChain.init inserting DistributedUpdateProcessorFactory into updateRequestProcessorChain "distrib-dup-test-chain-implicit"
[junit4:junit4]   2> 3655 T1630 oasc.RequestHandlers.initHandlersFromConfig adding lazy requestHandler: solr.ReplicationHandler
[junit4:junit4]   2> 3656 T1630 oasc.RequestHandlers.initHandlersFromConfig created /replication: solr.ReplicationHandler
[junit4:junit4]   2> 3656 T1630 oasc.RequestHandlers.initHandlersFromConfig created standard: solr.StandardRequestHandler
[junit4:junit4]   2> 3657 T1630 oasc.RequestHandlers.initHandlersFromConfig created /get: solr.RealTimeGetHandler
[junit4:junit4]   2> 3657 T1630 oasc.RequestHandlers.initHandlersFromConfig created dismax: solr.SearchHandler
[junit4:junit4]   2> 3657 T1630 oasc.RequestHandlers.initHandlersFromConfig created mock: org.apache.solr.core.MockQuerySenderListenerReqHandler
[junit4:junit4]   2> 3658 T1630 oasc.RequestHandlers.initHandlersFromConfig created /admin/: org.apache.solr.handler.admin.AdminHandlers
[junit4:junit4]   2> 3658 T1630 oasc.RequestHandlers.initHandlersFromConfig created defaults: solr.StandardRequestHandler
[junit4:junit4]   2> 3658 T1630 oasc.RequestHandlers.initHandlersFromConfig adding lazy requestHandler: solr.StandardRequestHandler
[junit4:junit4]   2> 3659 T1630 oasc.RequestHandlers.initHandlersFromConfig created lazy: solr.StandardRequestHandler
[junit4:junit4]   2> 3659 T1630 oasc.RequestHandlers.initHandlersFromConfig created /update: solr.UpdateRequestHandler
[junit4:junit4]   2> 3660 T1630 oasc.RequestHandlers.initHandlersFromConfig created /terms: org.apache.solr.handler.component.SearchHandler
[junit4:junit4]   2> 3660 T1630 oasc.RequestHandlers.initHandlersFromConfig created spellCheckCompRH: org.apache.solr.handler.component.SearchHandler
[junit4:junit4]   2> 3660 T1630 oasc.RequestHandlers.initHandlersFromConfig created spellCheckCompRH_Direct: org.apache.solr.handler.component.SearchHandler
[junit4:junit4]   2> 3661 T1630 oasc.RequestHandlers.initHandlersFromConfig created spellCheckWithWordbreak: org.apache.solr.handler.component.SearchHandler
[junit4:junit4]   2> 3661 T1630 oasc.RequestHandlers.initHandlersFromConfig created spellCheckWithWordbreak_Direct: org.apache.solr.handler.component.SearchHandler
[junit4:junit4]   2> 3661 T1630 oasc.RequestHandlers.initHandlersFromConfig created spellCheckCompRH1: org.apache.solr.handler.component.SearchHandler
[junit4:junit4]   2> 3662 T1630 oasc.RequestHandlers.initHandlersFromConfig created tvrh: org.apache.solr.handler.component.SearchHandler
[junit4:junit4]   2> 3662 T1630 oasc.RequestHandlers.initHandlersFromConfig created /mlt: solr.MoreLikeThisHandler
[junit4:junit4]   2> 3663 T1630 oasc.RequestHandlers.initHandlersFromConfig created /debug/dump: solr.DumpRequestHandler
[junit4:junit4]   2> 3668 T1630 oashl.XMLLoader.init xsltCacheLifetimeSeconds=60
[junit4:junit4]   2> 3672 T1630 oasc.SolrCore.initDeprecatedSupport WARNING solrconfig.xml uses deprecated <admin/gettableFiles>, Please update your config to use the ShowFileRequestHandler.
[junit4:junit4]   2> 3672 T1630 oasc.SolrCore.initDeprecatedSupport WARNING adding ShowFileRequestHandler with hidden files: [SCHEMA.XML, OLD_SYNONYMS.TXT, STOPWORDS.TXT, PROTWORDS.TXT, OPEN-EXCHANGE-RATES.JSON, SYNONYMS.TXT, CURRENCY.XML, MAPPING-ISOLATIN1ACCENT.TXT]
[junit4:junit4]   2> 3674 T1630 oass.SolrIndexSearcher.<init> Opening Searcher@39e2173f main
[junit4:junit4]   2> 3675 T1630 oass.SolrIndexSearcher.getIndexDir WARNING WARNING: Directory impl does not support setting indexDir: org.apache.lucene.store.MockDirectoryWrapper
[junit4:junit4]   2> 3675 T1630 oasu.CommitTracker.<init> Hard AutoCommit: disabled
[junit4:junit4]   2> 3675 T1630 oasu.CommitTracker.<init> Soft AutoCommit: disabled
[junit4:junit4]   2> 3676 T1630 oashc.SpellCheckComponent.inform Initializing spell checkers
[junit4:junit4]   2> 3681 T1630 oass.DirectSolrSpellChecker.init init: {name=direct,classname=DirectSolrSpellChecker,field=lowerfilt,minQueryLength=3}
[junit4:junit4]   2> 3750 T1650 oasc.SolrCore.registerSearcher [collection1] Registered new searcher Searcher@39e2173f main{StandardDirectoryReader(segments_1:1)}
[junit4:junit4]   2> 3760 T1630 oasc.CoreContainer.register registering core: collection1
[junit4:junit4]   2> 3761 T1630 oasc.ZkController.register Register shard - core:collection1 address:http://127.0.0.1:7002/solr shardId:shard1
[junit4:junit4]   2> 3770 T1630 oasc.ZkController.register We are http://127.0.0.1:7002/solr/collection1/ and leader is http://127.0.0.1:7000/solr/collection1/
[junit4:junit4]   2> 3770 T1630 oasc.ZkController.checkRecovery WARNING Skipping recovery according to sys prop solrcloud.skip.autorecovery
[junit4:junit4]   2> 3777 T1630 oascc.ZkStateReader.updateClusterState Updating cloud state from ZooKeeper... 
[junit4:junit4]   2> 3779 T1630 oasc.SolrResourceLoader.locateSolrHome JNDI not configured for solr (NoInitialContextEx)
[junit4:junit4]   2> 3779 T1630 oasc.SolrResourceLoader.locateSolrHome using system property solr.solr.home: /usr/home/hudson/hudson-slave/workspace/Lucene-Solr-Tests-trunk-Java6/solr/build/solr-core/test-files/solr
[junit4:junit4]   2> 3779 T1630 oasc.CoreContainer$Initializer.initialize looking for solr.xml: /usr/home/hudson/hudson-slave/workspace/Lucene-Solr-Tests-trunk-Java6/solr/build/solr-core/test-files/solr/solr.xml
[junit4:junit4]   2> 3780 T1630 oasc.CoreContainer.<init> New CoreContainer 223243871
[junit4:junit4]   2> 3780 T1630 oasc.CoreContainer.load Loading CoreContainer using Solr Home: '/usr/home/hudson/hudson-slave/workspace/Lucene-Solr-Tests-trunk-Java6/solr/build/solr-core/test-files/solr/'
[junit4:junit4]   2> 3780 T1630 oasc.SolrResourceLoader.<init> new SolrResourceLoader for directory: '/usr/home/hudson/hudson-slave/workspace/Lucene-Solr-Tests-trunk-Java6/solr/build/solr-core/test-files/solr/'
[junit4:junit4]   2> 3810 T1630 oasc.CoreContainer.load Registering Log Listener
[junit4:junit4]   2> 3822 T1630 oasc.CoreContainer.initZooKeeper Zookeeper client=127.0.0.1:50467/solr
[junit4:junit4]   2> 3823 T1630 oaz.ZooKeeper.<init> Initiating client connection, connectString=127.0.0.1:50467/solr sessionTimeout=3000 watcher=org.apache.solr.common.cloud.ConnectionManager@101807c
[junit4:junit4]   2> 3827 T1651 oaz.ClientCnxn$SendThread.startConnect Opening socket connection to server /127.0.0.1:50467
[junit4:junit4]   2> 3827 T1630 oascc.ConnectionManager.waitForConnected Waiting for client to connect to ZooKeeper
[junit4:junit4]   2> 3829 T1651 oaz.ClientCnxn$SendThread.primeConnection Socket connection established to localhost/127.0.0.1:50467, initiating session
[junit4:junit4]   2> 3829 T1632 oazs.NIOServerCnxn$Factory.run Accepted socket connection from /140.211.11.196:50486
[junit4:junit4]   2> 3829 T1632 oazs.NIOServerCnxn.readConnectRequest Client attempting to establish new session at /140.211.11.196:50486
[junit4:junit4]   2> 3831 T1634 oazs.NIOServerCnxn.finishSessionInit Established session 0x13a62443ef40005 with negotiated timeout 3000 for client /140.211.11.196:50486
[junit4:junit4]   2> 3831 T1651 oaz.ClientCnxn$SendThread.readConnectResult Session establishment complete on server localhost/127.0.0.1:50467, sessionid = 0x13a62443ef40005, negotiated timeout = 3000
[junit4:junit4]   2> 3831 T1652 oascc.ConnectionManager.process Watcher org.apache.solr.common.cloud.ConnectionManager@101807c name:ZooKeeperConnection Watcher:127.0.0.1:50467/solr got event WatchedEvent state:SyncConnected type:None path:null path:null type:None
[junit4:junit4]   2> 3832 T1630 oascc.ConnectionManager.waitForConnected Client is connected to ZooKeeper
[junit4:junit4]   2> 3832 T1635 oazs.PrepRequestProcessor.pRequest Got user-level KeeperException when processing sessionid:0x13a62443ef40005 type:create cxid:0x1 zxid:0xfffffffffffffffe txntype:unknown reqpath:n/a Error Path:/solr/overseer Error:KeeperErrorCode = NodeExists for /solr/overseer
[junit4:junit4]   2> 3842 T1635 oazs.PrepRequestProcessor.pRequest Got user-level KeeperException when processing sessionid:0x13a62443ef40005 type:create cxid:0x2 zxid:0xfffffffffffffffe txntype:unknown reqpath:n/a Error Path:/solr/overseer Error:KeeperErrorCode = NodeExists for /solr/overseer
[junit4:junit4]   2> 3850 T1630 oasc.ZkController.createEphemeralLiveNode Register node as live in ZooKeeper:/live_nodes/127.0.0.1:7003_solr
[junit4:junit4]   2> 3862 T1635 oazs.PrepRequestProcessor.pRequest Got user-level KeeperException when processing sessionid:0x13a62443ef40005 type:delete cxid:0x4 zxid:0xfffffffffffffffe txntype:unknown reqpath:n/a Error Path:/solr/live_nodes/127.0.0.1:7003_solr Error:KeeperErrorCode = NoNode for /solr/live_nodes/127.0.0.1:7003_solr
[junit4:junit4]   2> 3874 T1630 oascc.SolrZkClient.makePath makePath: /live_nodes/127.0.0.1:7003_solr
[junit4:junit4]   2> 3880 T1646 oascc.ZkStateReader$3.process Updating live nodes
[junit4:junit4]   2> 3880 T1641 oascc.ZkStateReader$3.process Updating live nodes
[junit4:junit4]   2> 3880 T1649 oascc.ZkStateReader$3.process Updating live nodes
[junit4:junit4]   2> 3881 T1630 oashc.HttpShardHandlerFactory.getParameter Setting socketTimeout to: 0
[junit4:junit4]   2> 3881 T1630 oashc.HttpShardHandlerFactory.getParameter Setting urlScheme to: http://
[junit4:junit4]   2> 3881 T1630 oashc.HttpShardHandlerFactory.getParameter Setting connTimeout to: 0
[junit4:junit4]   2> 3881 T1630 oashc.HttpShardHandlerFactory.getParameter Setting maxConnectionsPerHost to: 20
[junit4:junit4]   2> 3882 T1630 oashc.HttpShardHandlerFactory.getParameter Setting corePoolSize to: 0
[junit4:junit4]   2> 3882 T1630 oashc.HttpShardHandlerFactory.getParameter Setting maximumPoolSize to: 2147483647
[junit4:junit4]   2> 3882 T1630 oashc.HttpShardHandlerFactory.getParameter Setting maxThreadIdleTime to: 5
[junit4:junit4]   2> 3882 T1630 oashc.HttpShardHandlerFactory.getParameter Setting sizeOfQueue to: -1
[junit4:junit4]   2> 3883 T1630 oashc.HttpShardHandlerFactory.getParameter Setting fairnessPolicy to: false
[junit4:junit4]   2> 3883 T1630 oascsi.HttpClientUtil.createClient Creating new http client, config:maxConnectionsPerHost=20&maxConnections=10000&socketTimeout=0&connTimeout=0&retry=false
[junit4:junit4]   2> 3903 T1630 oascc.ZkStateReader.createClusterStateWatchersAndUpdate Updating cluster state from ZooKeeper... 
[junit4:junit4]   2> 3907 T1630 oasc.CoreContainer.create Creating SolrCore 'collection1' using instanceDir: /usr/home/hudson/hudson-slave/workspace/Lucene-Solr-Tests-trunk-Java6/solr/build/solr-core/test-files/solr/collection1
[junit4:junit4]   2> 3907 T1630 oasc.ZkController.createCollectionZkNode Check for collection zkNode:collection1
[junit4:junit4]   2> 3907 T1630 oasc.ZkController.createCollectionZkNode Collection zkNode exists
[junit4:junit4]   2> 3908 T1630 oasc.ZkController.readConfigName Load collection config from:/collections/collection1
[junit4:junit4]   2> 3908 T1630 oasc.SolrResourceLoader.<init> new SolrResourceLoader for directory: '/usr/home/hudson/hudson-slave/workspace/Lucene-Solr-Tests-trunk-Java6/solr/build/solr-core/test-files/solr/collection1/'
[junit4:junit4]   2> 3909 T1630 oasc.SolrResourceLoader.replaceClassLoader Adding 'file:/usr/home/hudson/hudson-slave/workspace/Lucene-Solr-Tests-trunk-Java6/solr/build/solr-core/test-files/solr/collection1/lib/classes/' to classloader
[junit4:junit4]   2> 3910 T1630 oasc.SolrResourceLoader.replaceClassLoader Adding 'file:/usr/home/hudson/hudson-slave/workspace/Lucene-Solr-Tests-trunk-Java6/solr/build/solr-core/test-files/solr/collection1/lib/README' to classloader
[junit4:junit4]   2> 3953 T1630 oasc.SolrConfig.<init> Using Lucene MatchVersion: LUCENE_50
[junit4:junit4]   2> 4008 T1630 oasc.SolrConfig.<init> Loaded SolrConfig: solrconfig.xml
[junit4:junit4]   2> 4069 T1642 oascc.ZkStateReader.updateClusterState Updating cloud state from ZooKeeper... 
[junit4:junit4]   2> 4109 T1630 oass.IndexSchema.readSchema Reading Solr Schema
[junit4:junit4]   2> 4114 T1649 oascc.ZkStateReader$2.process A cluster state change has occurred - updating...
[junit4:junit4]   2> 4114 T1641 oascc.ZkStateReader$2.process A cluster state change has occurred - updating...
[junit4:junit4]   2> 4114 T1652 oascc.ZkStateReader$2.process A cluster state change has occurred - updating...
[junit4:junit4]   2> 4114 T1646 oascc.ZkStateReader$2.process A cluster state change has occurred - updating...
[junit4:junit4]   2> 4115 T1630 oass.IndexSchema.readSchema Schema name=test
[junit4:junit4]   2> 4543 T1630 oass.OpenExchangeRatesOrgProvider.init Initialized with rates=open-exchange-rates.json, refreshInterval=1440.
[junit4:junit4]   2> 4553 T1630 oass.IndexSchema.readSchema default search field in schema is text
[junit4:junit4]   2> 4556 T1630 oass.IndexSchema.readSchema unique key field: id
[junit4:junit4]   2> 4566 T1630 oass.FileExchangeRateProvider.reload Reloading exchange rates from file currency.xml
[junit4:junit4]   2> 4570 T1630 oass.FileExchangeRateProvider.reload Reloading exchange rates from file currency.xml
[junit4:junit4]   2> 4573 T1630 oass.OpenExchangeRatesOrgProvider.reload Reloading exchange rates from open-exchange-rates.json
[junit4:junit4]   2> 4574 T1630 oass.OpenExchangeRatesOrgProvider.reload Reloading exchange rates from open-exchange-rates.json
[junit4:junit4]   2> 4575 T1630 oasc.SolrCore.<init> [collection1] Opening new SolrCore at /usr/home/hudson/hudson-slave/workspace/Lucene-Solr-Tests-trunk-Java6/solr/build/solr-core/test-files/solr/collection1/, dataDir=/usr/home/hudson/hudson-slave/workspace/Lucene-Solr-Tests-trunk-Java6/solr/build/solr-core/test/J1/./solrtest-LeaderElectionIntegrationTest-1350268370670/data_7003/
[junit4:junit4]   2> 4575 T1630 oasc.JmxMonitoredMap.<init> JMX monitoring is enabled. Adding Solr mbeans to JMX Server: com.sun.jmx.mbeanserver.JmxMBeanServer@7d0c3a08
[junit4:junit4]   2> 4576 T1630 oasc.SolrCore.getNewIndexDir New index directory detected: old=null new=/usr/home/hudson/hudson-slave/workspace/Lucene-Solr-Tests-trunk-Java6/solr/build/solr-core/test/J1/./solrtest-LeaderElectionIntegrationTest-1350268370670/data_7003/index/
[junit4:junit4]   2> 4577 T1630 oasc.SolrCore.initIndex WARNING [collection1] Solr index directory '/usr/home/hudson/hudson-slave/workspace/Lucene-Solr-Tests-trunk-Java6/solr/build/solr-core/test/J1/./solrtest-LeaderElectionIntegrationTest-1350268370670/data_7003/index' doesn't exist. Creating new index...
[junit4:junit4]   2> 4577 T1630 oasc.CachingDirectoryFactory.get return new directory for /usr/home/hudson/hudson-slave/workspace/Lucene-Solr-Tests-trunk-Java6/solr/build/solr-core/test/J1/./solrtest-LeaderElectionIntegrationTest-1350268370670/data_7003/index forceNew:false
[junit4:junit4]   2> 4579 T1630 oasc.SolrDeletionPolicy.onCommit SolrDeletionPolicy.onCommit: commits:num=1
[junit4:junit4]   2> 		commit{dir=MockDirWrapper(org.apache.lucene.store.RAMDirectory@4952633a lockFactory=org.apache.lucene.store.NativeFSLockFactory@4d2b9182),segFN=segments_1,generation=1,filenames=[segments_1]
[junit4:junit4]   2> 4579 T1630 oasc.SolrDeletionPolicy.updateCommits newest commit = 1
[junit4:junit4]   2> 4580 T1630 oasc.SolrCore.initWriters created xml: solr.XMLResponseWriter
[junit4:junit4]   2> 4581 T1630 oasup.UpdateRequestProcessorChain.init inserting DistributedUpdateProcessorFactory into updateRequestProcessorChain "dedupe"
[junit4:junit4]   2> 4581 T1630 oasup.UpdateRequestProcessorChain.init inserting DistributedUpdateProcessorFactory into updateRequestProcessorChain "dedupe-allfields"
[junit4:junit4]   2> 4582 T1630 oasup.UpdateRequestProcessorChain.init inserting DistributedUpdateProcessorFactory into updateRequestProcessorChain "stored_sig"
[junit4:junit4]   2> 4582 T1630 oasup.UpdateRequestProcessorChain.init inserting DistributedUpdateProcessorFactory into updateRequestProcessorChain "uniq-fields"
[junit4:junit4]   2> 4583 T1630 oasup.UpdateRequestProcessorChain.init inserting DistributedUpdateProcessorFactory into updateRequestProcessorChain "distrib-dup-test-chain-implicit"
[junit4:junit4]   2> 4583 T1630 oasc.RequestHandlers.initHandlersFromConfig adding lazy requestHandler: solr.ReplicationHandler
[junit4:junit4]   2> 4583 T1630 oasc.RequestHandlers.initHandlersFromConfig created /replication: solr.ReplicationHandler
[junit4:junit4]   2> 4584 T1630 oasc.RequestHandlers.initHandlersFromConfig created standard: solr.StandardRequestHandler
[junit4:junit4]   2> 4584 T1630 oasc.RequestHandlers.initHandlersFromConfig created /get: solr.RealTimeGetHandler
[junit4:junit4]   2> 4584 T1630 oasc.RequestHandlers.initHandlersFromConfig created dismax: solr.SearchHandler
[junit4:junit4]   2> 4585 T1630 oasc.RequestHandlers.initHandlersFromConfig created mock: org.apache.solr.core.MockQuerySenderListenerReqHandler
[junit4:junit4]   2> 4585 T1630 oasc.RequestHandlers.initHandlersFromConfig created /admin/: org.apache.solr.handler.admin.AdminHandlers
[junit4:junit4]   2> 4586 T1630 oasc.RequestHandlers.initHandlersFromConfig created defaults: solr.StandardRequestHandler
[junit4:junit4]   2> 4586 T1630 oasc.RequestHandlers.initHandlersFromConfig adding lazy requestHandler: solr.StandardRequestHandler
[junit4:junit4]   2> 4586 T1630 oasc.RequestHandlers.initHandlersFromConfig created lazy: solr.StandardRequestHandler
[junit4:junit4]   2> 4586 T1630 oasc.RequestHandlers.initHandlersFromConfig created /update: solr.UpdateRequestHandler
[junit4:junit4]   2> 4587 T1630 oasc.RequestHandlers.initHandlersFromConfig created /terms: org.apache.solr.handler.component.SearchHandler
[junit4:junit4]   2> 4587 T1630 oasc.RequestHandlers.initHandlersFromConfig created spellCheckCompRH: org.apache.solr.handler.component.SearchHandler
[junit4:junit4]   2> 4588 T1630 oasc.RequestHandlers.initHandlersFromConfig created spellCheckCompRH_Direct: org.apache.solr.handler.component.SearchHandler
[junit4:junit4]   2> 4588 T1630 oasc.RequestHandlers.initHandlersFromConfig created spellCheckWithWordbreak: org.apache.solr.handler.component.SearchHandler
[junit4:junit4]   2> 4588 T1630 oasc.RequestHandlers.initHandlersFromConfig created spellCheckWithWordbreak_Direct: org.apache.solr.handler.component.SearchHandler
[junit4:junit4]   2> 4589 T1630 oasc.RequestHandlers.initHandlersFromConfig created spellCheckCompRH1: org.apache.solr.handler.component.SearchHandler
[junit4:junit4]   2> 4589 T1630 oasc.RequestHandlers.initHandlersFromConfig created tvrh: org.apache.solr.handler.component.SearchHandler
[junit4:junit4]   2> 4590 T1630 oasc.RequestHandlers.initHandlersFromConfig created /mlt: solr.MoreLikeThisHandler
[junit4:junit4]   2> 4590 T1630 oasc.RequestHandlers.initHandlersFromConfig created /debug/dump: solr.DumpRequestHandler
[junit4:junit4]   2> 4596 T1630 oashl.XMLLoader.init xsltCacheLifetimeSeconds=60
[junit4:junit4]   2> 4601 T1630 oasc.SolrCore.initDeprecatedSupport WARNING solrconfig.xml uses deprecated <admin/gettableFiles>, Please update your config to use the ShowFileRequestHandler.
[junit4:junit4]   2> 4602 T1630 oasc.SolrCore.initDeprecatedSupport WARNING adding ShowFileRequestHandler with hidden files: [SCHEMA.XML, OLD_SYNONYMS.TXT, STOPWORDS.TXT, PROTWORDS.TXT, OPEN-EXCHANGE-RATES.JSON, SYNONYMS.TXT, CURRENCY.XML, MAPPING-ISOLATIN1ACCENT.TXT]
[junit4:junit4]   2> 4604 T1630 oass.SolrIndexSearcher.<init> Opening Searcher@18e108d2 main
[junit4:junit4]   2> 4604 T1630 oass.SolrIndexSearcher.getIndexDir WARNING WARNING: Directory impl does not support setting indexDir: org.apache.lucene.store.MockDirectoryWrapper
[junit4:junit4]   2> 4605 T1630 oasu.CommitTracker.<init> Hard AutoCommit: disabled
[junit4:junit4]   2> 4605 T1630 oasu.CommitTracker.<init> Soft AutoCommit: disabled
[junit4:junit4]   2> 4605 T1630 oashc.SpellCheckComponent.inform Initializing spell checkers
[junit4:junit4]   2> 4627 T1630 oass.DirectSolrSpellChecker.init init: {name=direct,classname=DirectSolrSpellChecker,field=lowerfilt,minQueryLength=3}
[junit4:junit4]   2> 4681 T1653 oasc.SolrCore.registerSearcher [collection1] Registered new searcher Searcher@18e108d2 main{StandardDirectoryReader(segments_1:1)}
[junit4:junit4]   2> 4685 T1630 oasc.CoreContainer.register registering core: collection1
[junit4:junit4]   2> 4685 T1630 oasc.ZkController.register Register shard - core:collection1 address:http://127.0.0.1:7003/solr shardId:shard1
[junit4:junit4]   2> 4688 T1630 oasc.ZkController.register We are http://127.0.0.1:7003/solr/collection1/ and leader is http://127.0.0.1:7000/solr/collection1/
[junit4:junit4]   2> 4688 T1630 oasc.ZkController.checkRecovery WARNING Skipping recovery according to sys prop solrcloud.skip.autorecovery
[junit4:junit4]   2> 4696 T1630 oascc.ZkStateReader.updateClusterState Updating cloud state from ZooKeeper... 
[junit4:junit4]   2> 4699 T1630 oasc.SolrResourceLoader.locateSolrHome JNDI not configured for solr (NoInitialContextEx)
[junit4:junit4]   2> 4699 T1630 oasc.SolrResourceLoader.locateSolrHome using system property solr.solr.home: /usr/home/hudson/hudson-slave/workspace/Lucene-Solr-Tests-trunk-Java6/solr/build/solr-core/test-files/solr
[junit4:junit4]   2> 4699 T1630 oasc.CoreContainer$Initializer.initialize looking for solr.xml: /usr/home/hudson/hudson-slave/workspace/Lucene-Solr-Tests-trunk-Java6/solr/build/solr-core/test-files/solr/solr.xml
[junit4:junit4]   2> 4699 T1630 oasc.CoreContainer.<init> New CoreContainer 822200379
[junit4:junit4]   2> 4700 T1630 oasc.CoreContainer.load Loading CoreContainer using Solr Home: '/usr/home/hudson/hudson-slave/workspace/Lucene-Solr-Tests-trunk-Java6/solr/build/solr-core/test-files/solr/'
[junit4:junit4]   2> 4700 T1630 oasc.SolrResourceLoader.<init> new SolrResourceLoader for directory: '/usr/home/hudson/hudson-slave/workspace/Lucene-Solr-Tests-trunk-Java6/solr/build/solr-core/test-files/solr/'
[junit4:junit4]   2> 4737 T1630 oasc.CoreContainer.load Registering Log Listener
[junit4:junit4]   2> 4749 T1630 oasc.CoreContainer.initZooKeeper Zookeeper client=127.0.0.1:50467/solr
[junit4:junit4]   2> 4750 T1630 oaz.ZooKeeper.<init> Initiating client connection, connectString=127.0.0.1:50467/solr sessionTimeout=3000 watcher=org.apache.solr.common.cloud.ConnectionManager@21cf1c1e
[junit4:junit4]   2> 4750 T1654 oaz.ClientCnxn$SendThread.startConnect Opening socket connection to server /127.0.0.1:50467
[junit4:junit4]   2> 4750 T1630 oascc.ConnectionManager.waitForConnected Waiting for client to connect to ZooKeeper
[junit4:junit4]   2> 4752 T1654 oaz.ClientCnxn$SendThread.primeConnection Socket connection established to localhost/127.0.0.1:50467, initiating session
[junit4:junit4]   2> 4752 T1632 oazs.NIOServerCnxn$Factory.run Accepted socket connection from /140.211.11.196:50493
[junit4:junit4]   2> 4752 T1632 oazs.NIOServerCnxn.readConnectRequest Client attempting to establish new session at /140.211.11.196:50493
[junit4:junit4]   2> 4754 T1634 oazs.NIOServerCnxn.finishSessionInit Established session 0x13a62443ef40006 with negotiated timeout 3000 for client /140.211.11.196:50493
[junit4:junit4]   2> 4754 T1654 oaz.ClientCnxn$SendThread.readConnectResult Session establishment complete on server localhost/127.0.0.1:50467, sessionid = 0x13a62443ef40006, negotiated timeout = 3000
[junit4:junit4]   2> 4754 T1655 oascc.ConnectionManager.process Watcher org.apache.solr.common.cloud.ConnectionManager@21cf1c1e name:ZooKeeperConnection Watcher:127.0.0.1:50467/solr got event WatchedEvent state:SyncConnected type:None path:null path:null type:None
[junit4:junit4]   2> 4754 T1630 oascc.ConnectionManager.waitForConnected Client is connected to ZooKeeper
[junit4:junit4]   2> 4755 T1635 oazs.PrepRequestProcessor.pRequest Got user-level KeeperException when processing sessionid:0x13a62443ef40006 type:create cxid:0x1 zxid:0xfffffffffffffffe txntype:unknown reqpath:n/a Error Path:/solr/overseer Error:KeeperErrorCode = NodeExists for /solr/overseer
[junit4:junit4]   2> 4756 T1635 oazs.PrepRequestProcessor.pRequest Got user-level KeeperException when processing sessionid:0x13a62443ef40006 type:create cxid:0x2 zxid:0xfffffffffffffffe txntype:unknown reqpath:n/a Error Path:/solr/overseer Error:KeeperErrorCode = NodeExists for /solr/overseer
[junit4:junit4]   2> 4757 T1630 oasc.ZkController.createEphemeralLiveNode Register node as live in ZooKeeper:/live_nodes/127.0.0.1:7004_solr
[junit4:junit4]   2> 4758 T1635 oazs.PrepRequestProcessor.pRequest Got user-level KeeperException when processing sessionid:0x13a62443ef40006 type:delete cxid:0x4 zxid:0xfffffffffffffffe txntype:unknown reqpath:n/a Error Path:/solr/live_nodes/127.0.0.1:7004_solr Error:KeeperErrorCode = NoNode for /solr/live_nodes/127.0.0.1:7004_solr
[junit4:junit4]   2> 4768 T1630 oascc.SolrZkClient.makePath makePath: /live_nodes/127.0.0.1:7004_solr
[junit4:junit4]   2> 4770 T1641 oascc.ZkStateReader$3.process Updating live nodes
[junit4:junit4]   2> 4770 T1649 oascc.ZkStateReader$3.process Updating live nodes
[junit4:junit4]   2> 4770 T1646 oascc.ZkStateReader$3.process Updating live nodes
[junit4:junit4]   2> 4770 T1652 oascc.ZkStateReader$3.process Updating live nodes
[junit4:junit4]   2> 4770 T1630 oashc.HttpShardHandlerFactory.getParameter Setting socketTimeout to: 0
[junit4:junit4]   2> 4770 T1630 oashc.HttpShardHandlerFactory.getParameter Setting urlScheme to: http://
[junit4:junit4]   2> 4771 T1630 oashc.HttpShardHandlerFactory.getParameter Setting connTimeout to: 0
[junit4:junit4]   2> 4771 T1630 oashc.HttpShardHandlerFactory.getParameter Setting maxConnectionsPerHost to: 20
[junit4:junit4]   2> 4771 T1630 oashc.HttpShardHandlerFactory.getParameter Setting corePoolSize to: 0
[junit4:junit4]   2> 4771 T1630 oashc.HttpShardHandlerFactory.getParameter Setting maximumPoolSize to: 2147483647
[junit4:junit4]   2> 4772 T1630 oashc.HttpShardHandlerFactory.getParameter Setting maxThreadIdleTime to: 5
[junit4:junit4]   2> 4772 T1630 oashc.HttpShardHandlerFactory.getParameter Setting sizeOfQueue to: -1
[junit4:junit4]   2> 4772 T1630 oashc.HttpShardHandlerFactory.getParameter Setting fairnessPolicy to: false
[junit4:junit4]   2> 4772 T1630 oascsi.HttpClientUtil.createClient Creating new http client, config:maxConnectionsPerHost=20&maxConnections=10000&socketTimeout=0&connTimeout=0&retry=false
[junit4:junit4]   2> 4784 T1630 oascc.ZkStateReader.createClusterStateWatchersAndUpdate Updating cluster state from ZooKeeper... 
[junit4:junit4]   2> 4789 T1630 oasc.CoreContainer.create Creating SolrCore 'collection1' using instanceDir: /usr/home/hudson/hudson-slave/workspace/Lucene-Solr-Tests-trunk-Java6/solr/build/solr-core/test-files/solr/collection1
[junit4:junit4]   2> 4789 T1630 oasc.ZkController.createCollectionZkNode Check for collection zkNode:collection1
[junit4:junit4]   2> 4790 T1630 oasc.ZkController.createCollectionZkNode Collection zkNode exists
[junit4:junit4]   2> 4790 T1630 oasc.ZkController.readConfigName Load collection config from:/collections/collection1
[junit4:junit4]   2> 4791 T1630 oasc.SolrResourceLoader.<init> new SolrResourceLoader for directory: '/usr/home/hudson/hudson-slave/workspace/Lucene-Solr-Tests-trunk-Java6/solr/build/solr-core/test-files/solr/collection1/'
[junit4:junit4]   2> 4792 T1630 oasc.SolrResourceLoader.replaceClassLoader Adding 'file:/usr/home/hudson/hudson-slave/workspace/Lucene-Solr-Tests-trunk-Java6/solr/build/solr-core/test-files/solr/collection1/lib/classes/' to classloader
[junit4:junit4]   2> 4792 T1630 oasc.SolrResourceLoader.replaceClassLoader Adding 'file:/usr/home/hudson/hudson-slave/workspace/Lucene-Solr-Tests-trunk-Java6/solr/build/solr-core/test-files/solr/collection1/lib/README' to classloader
[junit4:junit4]   2> 4831 T1630 oasc.SolrConfig.<init> Using Lucene MatchVersion: LUCENE_50
[junit4:junit4]   2> 4887 T1630 oasc.SolrConfig.<init> Loaded SolrConfig: solrconfig.xml
[junit4:junit4]   2> 4988 T1630 oass.IndexSchema.readSchema Reading Solr Schema
[junit4:junit4]   2> 4993 T1630 oass.IndexSchema.readSchema Schema name=test
[junit4:junit4]   2> 5148 T1642 oascc.ZkStateReader.updateClusterState Updating cloud state from ZooKeeper... 
[junit4:junit4]   2> 5172 T1646 oascc.ZkStateReader$2.process A cluster state change has occurred - updating...
[junit4:junit4]   2> 5172 T1641 oascc.ZkStateReader$2.process A cluster state change has occurred - updating...
[junit4:junit4]   2> 5172 T1655 oascc.ZkStateReader$2.process A cluster state change has occurred - updating...
[junit4:junit4]   2> 5172 T1652 oascc.ZkStateReader$2.process A cluster state change has occurred - updating...
[junit4:junit4]   2> 5172 T1649 oascc.ZkStateReader$2.process A cluster state change has occurred - updating...
[junit4:junit4]   2> 5576 T1630 oass.OpenExchangeRatesOrgProvider.init Initialized with rates=open-exchange-rates.json, refreshInterval=1440.
[junit4:junit4]   2> 5587 T1630 oass.IndexSchema.readSchema default search field in schema is text
[junit4:junit4]   2> 5592 T1630 oass.IndexSchema.readSchema unique key field: id
[junit4:junit4]   2> 5602 T1630 oass.FileExchangeRateProvider.reload Reloading exchange rates from file currency.xml
[junit4:junit4]   2> 5607 T1630 oass.FileExchangeRateProvider.reload Reloading exchange rates from file currency.xml
[junit4:junit4]   2> 5611 T1630 oass.OpenExchangeRatesOrgProvider.reload Reloading exchange rates from open-exchange-rates.json
[junit4:junit4]   2> 5612 T1630 oass.OpenExchangeRatesOrgProvider.reload Reloading exchange rates from open-exchange-rates.json
[junit4:junit4]   2> 5613 T1630 oasc.SolrCore.<init> [collection1] Opening new SolrCore at /usr/home/hudson/hudson-slave/workspace/Lucene-Solr-Tests-trunk-Java6/solr/build/solr-core/test-files/solr/collection1/, dataDir=/usr/home/hudson/hudson-slave/workspace/Lucene-Solr-Tests-trunk-Java6/solr/build/solr-core/test/J1/./solrtest-LeaderElectionIntegrationTest-1350268370670/data_7004/
[junit4:junit4]   2> 5613 T1630 oasc.JmxMonitoredMap.<init> JMX monitoring is enabled. Adding Solr mbeans to JMX Server: com.sun.jmx.mbeanserver.JmxMBeanServer@7d0c3a08
[junit4:junit4]   2> 5614 T1630 oasc.SolrCore.getNewIndexDir New index directory detected: old=null new=/usr/home/hudson/hudson-slave/workspace/Lucene-Solr-Tests-trunk-Java6/solr/build/solr-core/test/J1/./solrtest-LeaderElectionIntegrationTest-1350268370670/data_7004/index/
[junit4:junit4]   2> 5615 T1630 oasc.SolrCore.initIndex WARNING [collection1] Solr index directory '/usr/home/hudson/hudson-slave/workspace/Lucene-Solr-Tests-trunk-Java6/solr/build/solr-core/test/J1/./solrtest-LeaderElectionIntegrationTest-1350268370670/data_7004/index' doesn't exist. Creating new index...
[junit4:junit4]   2> 5615 T1630 oasc.CachingDirectoryFactory.get return new directory for /usr/home/hudson/hudson-slave/workspace/Lucene-Solr-Tests-trunk-Java6/solr/build/solr-core/test/J1/./solrtest-LeaderElectionIntegrationTest-1350268370670/data_7004/index forceNew:false
[junit4:junit4]   2> 5617 T1630 oasc.SolrDeletionPolicy.onCommit SolrDeletionPolicy.onCommit: commits:num=1
[junit4:junit4]   2> 		commit{dir=MockDirWrapper(org.apache.lucene.store.RAMDirectory@30f11251 lockFactory=org.apache.lucene.store.NativeFSLockFactory@173ea41f),segFN=segments_1,generation=1,filenames=[segments_1]
[junit4:junit4]   2> 5618 T1630 oasc.SolrDeletionPolicy.updateCommits newest commit = 1
[junit4:junit4]   2> 5618 T1630 oasc.SolrCore.initWriters created xml: solr.XMLResponseWriter
[junit4:junit4]   2> 5620 T1630 oasup.UpdateRequestProcessorChain.init inserting DistributedUpdateProcessorFactory into updateRequestProcessorChain "dedupe"
[junit4:junit4]   2> 5621 T1630 oasup.UpdateRequestProcessorChain.init inserting DistributedUpdateProcessorFactory into updateRequestProcessorChain "dedupe-allfields"
[junit4:junit4]   2> 5621 T1630 oasup.UpdateRequestProcessorChain.init inserting DistributedUpdateProcessorFactory into updateRequestProcessorChain "stored_sig"
[junit4:junit4]   2> 5622 T1630 oasup.UpdateRequestProcessorChain.init inserting DistributedUpdateProcessorFactory into updateRequestProcessorChain "uniq-fields"
[junit4:junit4]   2> 5622 T1630 oasup.UpdateRequestProcessorChain.init inserting DistributedUpdateProcessorFactory into updateRequestProcessorChain "distrib-dup-test-chain-implicit"
[junit4:junit4]   2> 5623 T1630 oasc.RequestHandlers.initHandlersFromConfig adding lazy requestHandler: solr.ReplicationHandler
[junit4:junit4]   2> 5623 T1630 oasc.RequestHandlers.initHandlersFromConfig created /replication: solr.ReplicationHandler
[junit4:junit4]   2> 5624 T1630 oasc.RequestHandlers.initHandlersFromConfig created standard: solr.StandardRequestHandler
[junit4:junit4]   2> 5624 T1630 oasc.RequestHandlers.initHandlersFromConfig created /get: solr.RealTimeGetHandler
[junit4:junit4]   2> 5625 T1630 oasc.RequestHandlers.initHandlersFromConfig created dismax: solr.SearchHandler
[junit4:junit4]   2> 5625 T1630 oasc.RequestHandlers.initHandlersFromConfig created mock: org.apache.solr.core.MockQuerySenderListenerReqHandler
[junit4:junit4]   2> 5626 T1630 oasc.RequestHandlers.initHandlersFromConfig created /admin/: org.apache.solr.handler.admin.AdminHandlers
[junit4:junit4]   2> 5626 T1630 oasc.RequestHandlers.initHandlersFromConfig created defaults: solr.StandardRequestHandler
[junit4:junit4]   2> 5627 T1630 oasc.RequestHandlers.initHandlersFromConfig adding lazy requestHandler: solr.StandardRequestHandler
[junit4:junit4]   2> 5627 T1630 oasc.RequestHandlers.initHandlersFromConfig created lazy: solr.StandardRequestHandler
[junit4:junit4]   2> 5628 T1630 oasc.RequestHandlers.initHandlersFromConfig created /update: solr.UpdateRequestHandler
[junit4:junit4]   2> 5628 T1630 oasc.RequestHandlers.initHandlersFromConfig created /terms: org.apache.solr.handler.component.SearchHandler
[junit4:junit4]   2> 5629 T1630 oasc.RequestHandlers.initHandlersFromConfig created spellCheckCompRH: org.apache.solr.handler.component.SearchHandler
[junit4:junit4]   2> 5629 T1630 oasc.RequestHandlers.initHandlersFromConfig created spellCheckCompRH_Direct: org.apache.solr.handler.component.SearchHandler
[junit4:junit4]   2> 5630 T1630 oasc.RequestHandlers.initHandlersFromConfig created spellCheckWithWordbreak: org.apache.solr.handler.component.SearchHandler
[junit4:junit4]   2> 5630 T1630 oasc.RequestHandlers.initHandlersFromConfig created spellCheckWithWordbreak_Direct: org.apache.solr.handler.component.SearchHandler
[junit4:junit4]   2> 5631 T1630 oasc.RequestHandlers.initHandlersFromConfig created spellCheckCompRH1: org.apache.solr.handler.component.SearchHandler
[junit4:junit4]   2> 5631 T1630 oasc.RequestHandlers.initHandlersFromConfig created tvrh: org.apache.solr.handler.component.SearchHandler
[junit4:junit4]   2> 5632 T1630 oasc.RequestHandlers.initHandlersFromConfig created /mlt: solr.MoreLikeThisHandler
[junit4:junit4]   2> 5633 T1630 oasc.RequestHandlers.initHandlersFromConfig created /debug/dump: solr.DumpRequestHandler
[junit4:junit4]   2> 5640 T1630 oashl.XMLLoader.init xsltCacheLifetimeSeconds=60
[junit4:junit4]   2> 5645 T1630 oasc.SolrCore.initDeprecatedSupport WARNING solrconfig.xml uses deprecated <admin/gettableFiles>, Please update your config to use the ShowFileRequestHandler.
[junit4:junit4]   2> 5646 T1630 oasc.SolrCore.initDeprecatedSupport WARNING adding ShowFileRequestHandler with hidden files: [SCHEMA.XML, OLD_SYNONYMS.TXT, STOPWORDS.TXT, PROTWORDS.TXT, OPEN-EXCHANGE-RATES.JSON, SYNONYMS.TXT, CURRENCY.XML, MAPPING-ISOLATIN1ACCENT.TXT]
[junit4:junit4]   2> 5648 T1630 oass.SolrIndexSearcher.<init> Opening Searcher@4fde0ff6 main
[junit4:junit4]   2> 5649 T1630 oass.SolrIndexSearcher.getIndexDir WARNING WARNING: Directory impl does not support setting indexDir: org.apache.lucene.store.MockDirectoryWrapper
[junit4:junit4]   2> 5649 T1630 oasu.CommitTracker.<init> Hard AutoCommit: disabled
[junit4:junit4]   2> 5650 T1630 oasu.CommitTracker.<init> Soft AutoCommit: disabled
[junit4:junit4]   2> 5650 T1630 oashc.SpellCheckComponent.inform Initializing spell checkers
[junit4:junit4]   2> 5658 T1630 oass.DirectSolrSpellChecker.init init: {name=direct,classname=DirectSolrSpellChecker,field=lowerfilt,minQueryLength=3}
[junit4:junit4]   2> 5720 T1656 oasc.SolrCore.registerSearcher [collection1] Registered new searcher Searcher@4fde0ff6 main{StandardDirectoryReader(segments_1:1)}
[junit4:junit4]   2> 5726 T1630 oasc.CoreContainer.register registering core: collection1
[junit4:junit4]   2> 5726 T1630 oasc.ZkController.register Register shard - core:collection1 address:http://127.0.0.1:7004/solr shardId:shard1
[junit4:junit4]   2> 5728 T1630 oasc.ZkController.register We are http://127.0.0.1:7004/solr/collection1/ and leader is http://127.0.0.1:7000/solr/collection1/
[junit4:junit4]   2> 5728 T1630 oasc.ZkController.checkRecovery WARNING Skipping recovery according to sys prop solrcloud.skip.autorecovery
[junit4:junit4]   2> 5730 T1630 oascc.ZkStateReader.updateClusterState Updating cloud state from ZooKeeper... 
[junit4:junit4]   2> 5732 T1630 oasc.SolrResourceLoader.locateSolrHome JNDI not configured for solr (NoInitialContextEx)
[junit4:junit4]   2> 5732 T1630 oasc.SolrResourceLoader.locateSolrHome using system property solr.solr.home: /usr/home/hudson/hudson-slave/workspace/Lucene-Solr-Tests-trunk-Java6/solr/build/solr-core/test-files/solr
[junit4:junit4]   2> 5733 T1630 oasc.CoreContainer$Initializer.initialize looking for solr.xml: /usr/home/hudson/hudson-slave/workspace/Lucene-Solr-Tests-trunk-Java6/solr/build/solr-core/test-files/solr/solr.xml
[junit4:junit4]   2> 5733 T1630 oasc.CoreContainer.<init> New CoreContainer 627824429
[junit4:junit4]   2> 5734 T1630 oasc.CoreContainer.load Loading CoreContainer using Solr Home: '/usr/home/hudson/hudson-slave/workspace/Lucene-Solr-Tests-trunk-Java6/solr/build/solr-core/test-files/solr/'
[junit4:junit4]   2> 5734 T1630 oasc.SolrResourceLoader.<init> new SolrResourceLoader for directory: '/usr/home/hudson/hudson-slave/workspace/Lucene-Solr-Tests-trunk-Java6/solr/build/solr-core/test-files/solr/'
[junit4:junit4]   2> 5777 T1630 oasc.CoreContainer.load Registering Log Listener
[junit4:junit4]   2> 5798 T1630 oasc.CoreContainer.initZooKeeper Zookeeper client=127.0.0.1:50467/solr
[junit4:junit4]   2> 5799 T1630 oaz.ZooKeeper.<init> Initiating client connection, connectString=127.0.0.1:50467/solr sessionTimeout=3000 watcher=org.apache.solr.common.cloud.ConnectionManager@5dcfdfc9
[junit4:junit4]   2> 5800 T1657 oaz.ClientCnxn$SendThread.startConnect Opening socket connection to server /127.0.0.1:50467
[junit4:junit4]   2> 5800 T1630 oascc.ConnectionManager.waitForConnected Waiting for client to connect to ZooKeeper
[junit4:junit4]   2> 5801 T1657 oaz.ClientCnxn$SendThread.primeConnection Socket connection established to localhost/127.0.0.1:50467, initiating session
[junit4:junit4]   2> 5801 T1632 oazs.NIOServerCnxn$Factory.run Accepted socket connection from /140.211.11.196:50497
[junit4:junit4]   2> 5801 T1632 oazs.NIOServerCnxn.readConnectRequest Client attempting to establish new session at /140.211.11.196:50497
[junit4:junit4]   2> 5803 T1634 oazs.NIOServerCnxn.finishSessionInit Established session 0x13a62443ef40007 with negotiated timeout 3000 for client /140.211.11.196:50497
[junit4:junit4]   2> 5803 T1657 oaz.ClientCnxn$SendThread.readConnectResult Session establishment complete on server localhost/127.0.0.1:50467, sessionid = 0x13a62443ef40007, negotiated timeout = 3000
[junit4:junit4]   2> 5803 T1658 oascc.ConnectionManager.process Watcher org.apache.solr.common.cloud.ConnectionManager@5dcfdfc9 name:ZooKeeperConnection Watcher:127.0.0.1:50467/solr got event WatchedEvent state:SyncConnected type:None path:null path:null type:None
[junit4:junit4]   2> 5803 T1630 oascc.ConnectionManager.waitForConnected Client is connected to ZooKeeper
[junit4:junit4]   2> 5804 T1635 oazs.PrepRequestProcessor.pRequest Got user-level KeeperException when processing sessionid:0x13a62443ef40007 type:create cxid:0x1 zxid:0xfffffffffffffffe txntype:unknown reqpath:n/a Error Path:/solr/overseer Error:KeeperErrorCode = NodeExists for /solr/overseer
[junit4:junit4]   2> 5805 T1635 oazs.PrepRequestProcessor.pRequest Got user-level KeeperException when processing sessionid:0x13a62443ef40007 type:create cxid:0x2 zxid:0xfffffffffffffffe txntype:unknown reqpath:n/a Error Path:/solr/overseer Error:KeeperErrorCode = NodeExists for /solr/overseer
[junit4:junit4]   2> 5806 T1630 oasc.ZkController.createEphemeralLiveNode Register node as live in ZooKeeper:/live_nodes/127.0.0.1:3333_solr
[junit4:junit4]   2> 5806 T1635 oazs.PrepRequestProcessor.pRequest Got user-level KeeperException when processing sessionid:0x13a62443ef40007 type:delete cxid:0x4 zxid:0xfffffffffffffffe txntype:unknown reqpath:n/a Error Path:/solr/live_nodes/127.0.0.1:3333_solr Error:KeeperErrorCode = NoNode for /solr/live_nodes/127.0.0.1:3333_solr
[junit4:junit4]   2> 5818 T1630 oascc.SolrZkClient.makePath makePath: /live_nodes/127.0.0.1:3333_solr
[junit4:junit4]   2> 5820 T1655 oascc.ZkStateReader$3.process Updating live nodes
[junit4:junit4]   2> 5820 T1649 oascc.ZkStateReader$3.process Updating live nodes
[junit4:junit4]   2> 5820 T1646 oascc.ZkStateReader$3.process Updating live nodes
[junit4:junit4]   2> 5820 T1652 oascc.ZkStateReader$3.process Updating live nodes
[junit4:junit4]   2> 5820 T1641 oascc.ZkStateReader$3.process Updating live nodes
[junit4:junit4]   2> 5821 T1630 oashc.HttpShardHandlerFactory.getParameter Setting socketTimeout to: 0
[junit4:junit4]   2> 5821 T1630 oashc.HttpShardHandlerFactory.getParameter Setting urlScheme to: http://
[junit4:junit4]   2> 5821 T1630 oashc.HttpShardHandlerFactory.getParameter Setting connTimeout to: 0
[junit4:junit4]   2> 5822 T1630 oashc.HttpShardHandlerFactory.getParameter Setting maxConnectionsPerHost to: 20
[junit4:junit4]   2> 5822 T1630 oashc.HttpShardHandlerFactory.getParameter Setting corePoolSize to: 0
[junit4:junit4]   2> 5822 T1630 oashc.HttpShardHandlerFactory.getParameter Setting maximumPoolSize to: 2147483647
[junit4:junit4]   2> 5823 T1630 oashc.HttpShardHandlerFactory.getParameter Setting maxThreadIdleTime to: 5
[junit4:junit4]   2> 5823 T1630 oashc.HttpShardHandlerFactory.getParameter Setting sizeOfQueue to: -1
[junit4:junit4]   2> 5823 T1630 oashc.HttpShardHandlerFactory.getParameter Setting fairnessPolicy to: false
[junit4:junit4]   2> 5824 T1630 oascsi.HttpClientUtil.createClient Creating new http client, config:maxConnectionsPerHost=20&maxConnections=10000&socketTimeout=0&connTimeout=0&retry=false
[junit4:junit4]   2> 5843 T1630 oascc.ZkStateReader.createClusterStateWatchersAndUpdate Updating cluster state from ZooKeeper... 
[junit4:junit4]   2> 5849 T1630 oasc.CoreContainer.create Creating SolrCore 'collection1' using instanceDir: /usr/home/hudson/hudson-slave/workspace/Lucene-Solr-Tests-trunk-Java6/solr/build/solr-core/test-files/solr/collection1
[junit4:junit4]   2> 5849 T1630 oasc.ZkController.createCollectionZkNode Check for collection zkNode:collection1
[junit4:junit4]   2> 5850 T1630 oasc.ZkController.createCollectionZkNode Collection zkNode exists
[junit4:junit4]   2> 5850 T1630 oasc.ZkController.readConfigName Load collection config from:/collections/collection1
[junit4:junit4]   2> 5851 T1630 oasc.SolrResourceLoader.<init> new SolrResourceLoader for directory: '/usr/home/hudson/hudson-slave/workspace/Lucene-Solr-Tests-trunk-Java6/solr/build/solr-core/test-files/solr/collection1/'
[junit4:junit4]   2> 5852 T1630 oasc.SolrResourceLoader.replaceClassLoader Adding 'file:/usr/home/hudson/hudson-slave/workspace/Lucene-Solr-Tests-trunk-Java6/solr/build/solr-core/test-files/solr/collection1/lib/classes/' to classloader
[junit4:junit4]   2> 5853 T1630 oasc.SolrResourceLoader.replaceClassLoader Adding 'file:/usr/home/hudson/hudson-slave/workspace/Lucene-Solr-Tests-trunk-Java6/solr/build/solr-core/test-files/solr/collection1/lib/README' to classloader
[junit4:junit4]   2> 5904 T1630 oasc.SolrConfig.<init> Using Lucene MatchVersion: LUCENE_50
[junit4:junit4]   2> 5995 T1630 oasc.SolrConfig.<init> Loaded SolrConfig: solrconfig.xml
[junit4:junit4]   2> 6096 T1630 oass.IndexSchema.readSchema Reading Solr Schema
[junit4:junit4]   2> 6102 T1630 oass.IndexSchema.readSchema Schema name=test
[junit4:junit4]   2> 6183 T1642 oascc.ZkStateReader.updateClusterState Updating cloud state from ZooKeeper... 
[junit4:junit4]   2> 6204 T1649 oascc.ZkStateReader$2.process A cluster state change has occurred - updating...
[junit4:junit4]   2> 6204 T1641 oascc.ZkStateReader$2.process A cluster state change has occurred - updating...
[junit4:junit4]   2> 6204 T1655 oascc.ZkStateReader$2.process A cluster state change has occurred - updating...
[junit4:junit4]   2> 6204 T1646 oascc.ZkStateReader$2.process A cluster state change has occurred - updating...
[junit4:junit4]   2> 6204 T1652 oascc.ZkStateReader$2.process A cluster state change has occurred - updating...
[junit4:junit4]   2> 6204 T1658 oascc.ZkStateReader$2.process A cluster state change has occurred - updating...
[junit4:junit4]   2> 6737 T1630 oass.OpenExchangeRatesOrgProvider.init Initialized with rates=open-exchange-rates.json, refreshInterval=1440.
[junit4:junit4]   2> 6745 T1630 oass.IndexSchema.readSchema default search field in schema is text
[junit4:junit4]   2> 6749 T1630 oass.IndexSchema.readSchema unique key field: id
[junit4:junit4]   2> 6769 T1630 oass.FileExchangeRateProvider.reload Reloading exchange rates from file currency.xml
[junit4:junit4]   2> 6772 T1630 oass.FileExchangeRateProvider.reload Reloading exchange rates from file currency.xml
[junit4:junit4]   2> 6775 T1630 oass.OpenExchangeRatesOrgProvider.reload Reloading exchange rates from open-exchange-rates.json
[junit4:junit4]   2> 6776 T1630 oass.OpenExchangeRatesOrgProvider.reload Reloading exchange rates from open-exchange-rates.json
[junit4:junit4]   2> 6777 T1630 oasc.SolrCore.<init> [collection1] Opening new SolrCore at /usr/home/hudson/hudson-slave/workspace/Lucene-Solr-Tests-trunk-Java6/solr/build/solr-core/test-files/solr/collection1/, dataDir=/usr/home/hudson/hudson-slave/workspace/Lucene-Solr-Tests-trunk-Java6/solr/build/solr-core/test/J1/./solrtest-LeaderElectionIntegrationTest-1350268370670/data_3333/
[junit4:junit4]   2> 6777 T1630 oasc.JmxMonitoredMap.<init> JMX monitoring is enabled. Adding Solr mbeans to JMX Server: com.sun.jmx.mbeanserver.JmxMBeanServer@7d0c3a08
[junit4:junit4]   2> 6778 T1630 oasc.SolrCore.getNewIndexDir New index directory detected: old=null new=/usr/home/hudson/hudson-slave/workspace/Lucene-Solr-Tests-trunk-Java6/solr/build/solr-core/test/J1/./solrtest-LeaderElectionIntegrationTest-1350268370670/data_3333/index/
[junit4:junit4]   2> 6778 T1630 oasc.SolrCore.initIndex WARNING [collection1] Solr index directory '/usr/home/hudson/hudson-slave/workspace/Lucene-Solr-Tests-trunk-Java6/solr/build/solr-core/test/J1/./solrtest-LeaderElectionIntegrationTest-1350268370670/data_3333/index' doesn't exist. Creating new index...
[junit4:junit4]   2> 6779 T1630 oasc.CachingDirectoryFactory.get return new directory for /usr/home/hudson/hudson-slave/workspace/Lucene-Solr-Tests-trunk-Java6/solr/build/solr-core/test/J1/./solrtest-LeaderElectionIntegrationTest-1350268370670/data_3333/index forceNew:false
[junit4:junit4]   2> 6780 T1630 oasc.SolrDeletionPolicy.onCommit SolrDeletionPolicy.onCommit: commits:num=1
[junit4:junit4]   2> 		commit{dir=MockDirWrapper(org.apache.lucene.store.RAMDirectory@2e7083c1 lockFactory=org.apache.lucene.store.NativeFSLockFactory@6f378ca7),segFN=segments_1,generation=1,filenames=[segments_1]
[junit4:junit4]   2> 6780 T1630 oasc.SolrDeletionPolicy.updateCommits newest commit = 1
[junit4:junit4]   2> 6781 T1630 oasc.SolrCore.initWriters created xml: solr.XMLResponseWriter
[junit4:junit4]   2> 6782 T1630 oasup.UpdateRequestProcessorChain.init inserting DistributedUpdateProcessorFactory into updateRequestProcessorChain "dedupe"
[junit4:junit4]   2> 6783 T1630 oasup.UpdateRequestProcessorChain.init inserting DistributedUpdateProcessorFactory into updateRequestProcessorChain "dedupe-allfields"
[junit4:junit4]   2> 6783 T1630 oasup.UpdateRequestProcessorChain.init inserting DistributedUpdateProcessorFactory into updateRequestProcessorChain "stored_sig"
[junit4:junit4]   2> 6783 T1630 oasup.UpdateRequestProcessorChain.init inserting DistributedUpdateProcessorFactory into updateRequestProcessorChain "uniq-fields"
[junit4:junit4]   2> 6784 T1630 oasup.UpdateRequestProcessorChain.init inserting DistributedUpdateProcessorFactory into updateRequestProcessorChain "distrib-dup-test-chain-implicit"
[junit4:junit4]   2> 6784 T1630 oasc.RequestHandlers.initHandlersFromConfig adding lazy requestHandler: solr.ReplicationHandler
[junit4:junit4]   2> 6784 T1630 oasc.RequestHandlers.initHandlersFromConfig created /replication: solr.ReplicationHandler
[junit4:junit4]   2> 6785 T1630 oasc.RequestHandlers.initHandlersFromConfig created standard: solr.StandardRequestHandler
[junit4:junit4]   2> 6785 T1630 oasc.RequestHandlers.initHandlersFromConfig created /get: solr.RealTimeGetHandler
[junit4:junit4]   2> 6785 T1630 oasc.RequestHandlers.initHandlersFromConfig created dismax: solr.SearchHandler
[junit4:junit4]   2> 6786 T1630 oasc.RequestHandlers.initHandlersFromConfig created mock: org.apache.solr.core.MockQuerySenderListenerReqHandler
[junit4:junit4]   2> 6786 T1630 oasc.RequestHandlers.initHandlersFromConfig created /admin/: org.apache.solr.handler.admin.AdminHandlers
[junit4:junit4]   2> 6787 T1630 oasc.RequestHandlers.initHandlersFromConfig created defaults: solr.StandardRequestHandler
[junit4:junit4]   2> 6787 T1630 oasc.RequestHandlers.initHandlersFromConfig adding lazy requestHandler: solr.StandardRequestHandler
[junit4:junit4]   2> 6787 T1630 oasc.RequestHandlers.initHandlersFromConfig created lazy: solr.StandardRequestHandler
[junit4:junit4]   2> 6788 T1630 oasc.RequestHandlers.initHandlersFromConfig created /update: solr.UpdateRequestHandler
[junit4:junit4]   2> 6788 T1630 oasc.RequestHandlers.initHandlersFromConfig created /terms: org.apache.solr.handler.component.SearchHandler
[junit4:junit4]   2> 6788 T1630 oasc.RequestHandlers.initHandlersFromConfig created spellCheckCompRH: org.apache.solr.handler.component.SearchHandler
[junit4:junit4]   2> 6789 T1630 oasc.RequestHandlers.initHandlersFromConfig created spellCheckCompRH_Direct: org.apache.solr.handler.component.SearchHandler
[junit4:junit4]   2> 6789 T1630 oasc.RequestHandlers.initHandlersFromConfig created spellCheckWithWordbreak: org.apache.solr.handler.component.SearchHandler
[junit4:junit4]   2> 6789 T1630 oasc.RequestHandlers.initHandlersFromConfig created spellCheckWithWordbreak_Direct: org.apache.solr.handler.component.SearchHandler
[junit4:junit4]   2> 6790 T1630 oasc.RequestHandlers.initHandlersFromConfig created spellCheckCompRH1: org.apache.solr.handler.component.SearchHandler
[junit4:junit4]   2> 6790 T1630 oasc.RequestHandlers.initHandlersFromConfig created tvrh: org.apache.solr.handler.component.SearchHandler
[junit4:junit4]   2> 6791 T1630 oasc.RequestHandlers.initHandlersFromConfig created /mlt: solr.MoreLikeThisHandler
[junit4:junit4]   2> 6791 T1630 oasc.RequestHandlers.initHandlersFromConfig created /debug/dump: solr.DumpRequestHandler
[junit4:junit4]   2> 6796 T1630 oashl.XMLLoader.init xsltCacheLifetimeSeconds=60
[junit4:junit4]   2> 6799 T1630 oasc.SolrCore.initDeprecatedSupport WARNING solrconfig.xml uses deprecated <admin/gettableFiles>, Please update your config to use the ShowFileRequestHandler.
[junit4:junit4]   2> 6800 T1630 oasc.SolrCore.initDeprecatedSupport WARNING adding ShowFileRequestHandler with hidden files: [SCHEMA.XML, OLD_SYNONYMS.TXT, STOPWORDS.TXT, PROTWORDS.TXT, OPEN-EXCHANGE-RATES.JSON, SYNONYMS.TXT, CURRENCY.XML, MAPPING-ISOLATIN1ACCENT.TXT]
[junit4:junit4]   2> 6802 T1630 oass.SolrIndexSearcher.<init> Opening Searcher@46417f28 main
[junit4:junit4]   2> 6802 T1630 oass.SolrIndexSearcher.getIndexDir WARNING WARNING: Directory impl does not support setting indexDir: org.apache.lucene.store.MockDirectoryWrapper
[junit4:junit4]   2> 6803 T1630 oasu.CommitTracker.<init> Hard AutoCommit: disabled
[junit4:junit4]   2> 6803 T1630 oasu.CommitTracker.<init> Soft AutoCommit: disabled
[junit4:junit4]   2> 6804 T1630 oashc.SpellCheckComponent.inform Initializing spell checkers
[junit4:junit4]   2> 6809 T1630 oass.DirectSolrSpellChecker.init init: {name=direct,classname=DirectSolrSpellChecker,field=lowerfilt,minQueryLength=3}
[junit4:junit4]   2> 6855 T1659 oasc.SolrCore.registerSearcher [collection1] Registered new searcher Searcher@46417f28 main{StandardDirectoryReader(segments_1:1)}
[junit4:junit4]   2> 6862 T1630 oasc.CoreContainer.register registering core: collection1
[junit4:junit4]   2> 6863 T1630 oasc.ZkController.register Register shard - core:collection1 address:http://127.0.0.1:3333/solr shardId:shard2
[junit4:junit4]   2> 6863 T1630 oascc.SolrZkClient.makePath makePath: /collections/collection1/leader_elect/shard2/election
[junit4:junit4]   2> 6874 T1635 oazs.PrepRequestProcessor.pRequest Got user-level KeeperException when processing sessionid:0x13a62443ef40007 type:delete cxid:0x41 zxid:0xfffffffffffffffe txntype:unknown reqpath:n/a Error Path:/solr/collections/collection1/leaders/shard2 Error:KeeperErrorCode = NoNode for /solr/collections/collection1/leaders/shard2
[junit4:junit4]   2> 6875 T1630 oasc.ShardLeaderElectionContext.runLeaderProcess Running the leader process.
[junit4:junit4]   2> 6876 T1635 oazs.PrepRequestProcessor.pRequest Got user-level KeeperException when processing sessionid:0x13a62443ef40007 type:create cxid:0x42 zxid:0xfffffffffffffffe txntype:unknown reqpath:n/a Error Path:/solr/overseer Error:KeeperErrorCode = NodeExists for /solr/overseer
[junit4:junit4]   2> 7208 T1642 oascc.ZkStateReader.updateClusterState Updating cloud state from ZooKeeper... 
[junit4:junit4]   2> 7224 T1641 oascc.ZkStateReader$2.process A cluster state change has occurred - updating...
[junit4:junit4]   2> 7224 T1658 oascc.ZkStateReader$2.process A cluster state change has occurred - updating...
[junit4:junit4]   2> 7224 T1652 oascc.ZkStateReader$2.process A cluster state change has occurred - updating...
[junit4:junit4]   2> 7224 T1649 oascc.ZkStateReader$2.process A cluster state change has occurred - updating...
[junit4:junit4]   2> 7224 T1655 oascc.ZkStateReader$2.process A cluster state change has occurred - updating...
[junit4:junit4]   2> 7224 T1646 oascc.ZkStateReader$2.process A cluster state change has occurred - updating...
[junit4:junit4]   2> 7388 T1630 oasc.ShardLeaderElectionContext.waitForReplicasToComeUp Enough replicas found to continue.
[junit4:junit4]   2> 7388 T1630 oasc.ShardLeaderElectionContext.runLeaderProcess I may be the new leader - try and sync
[junit4:junit4]   2> 7389 T1630 oasc.ShardLeaderElectionContext.runLeaderProcess I am the new leader: http://127.0.0.1:3333/solr/collection1/
[junit4:junit4]   2> 7389 T1630 oascc.SolrZkClient.makePath makePath: /collections/collection1/leaders/shard2
[junit4:junit4]   2> 7391 T1635 oazs.PrepRequestProcessor.pRequest Got user-level KeeperException when processing sessionid:0x13a62443ef40007 type:create cxid:0x4c zxid:0xfffffffffffffffe txntype:unknown reqpath:n/a Error Path:/solr/overseer Error:KeeperErrorCode = NodeExists for /solr/overseer
[junit4:junit4]   2> 7728 T1642 oascc.ZkStateReader.updateClusterState Updating cloud state from ZooKeeper... 
[junit4:junit4]   2> 7741 T1649 oascc.ZkStateReader$2.process A cluster state change has occurred - updating...
[junit4:junit4]   2> 7741 T1646 oascc.ZkStateReader$2.process A cluster state change has occurred - updating...
[junit4:junit4]   2> 7741 T1652 oascc.ZkStateReader$2.process A cluster state change has occurred - updating...
[junit4:junit4]   2> 7741 T1655 oascc.ZkStateReader$2.process A cluster state change has occurred - updating...
[junit4:junit4]   2> 7741 T1658 oascc.ZkStateReader$2.process A cluster state change has occurred - updating...
[junit4:junit4]   2> 7741 T1641 oascc.ZkStateReader$2.process A cluster state change has occurred - updating...
[junit4:junit4]   2> 7759 T1630 oasc.ZkController.register We are http://127.0.0.1:3333/solr/collection1/ and leader is http://127.0.0.1:3333/solr/collection1/
[junit4:junit4]   2> 7759 T1630 oasc.ZkController.checkRecovery WARNING Skipping recovery according to sys prop solrcloud.skip.autorecovery
[junit4:junit4]   2> 7761 T1630 oascc.ZkStateReader.updateClusterState Updating cloud state from ZooKeeper... 
[junit4:junit4]   2> 7761 T1630 oaz.ZooKeeper.<init> Initiating client connection, connectString=127.0.0.1:50467/solr sessionTimeout=10000 watcher=org.apache.solr.common.cloud.ConnectionManager@2ec959a4
[junit4:junit4]   2> 7762 T1660 oaz.ClientCnxn$SendThread.startConnect Opening socket connection to server /127.0.0.1:50467
[junit4:junit4]   2> 7762 T1630 oascc.ConnectionManager.waitForConnected Waiting for client to connect to ZooKeeper
[junit4:junit4]   2> 7762 T1660 oaz.ClientCnxn$SendThread.primeConnection Socket connection established to localhost/127.0.0.1:50467, initiating session
[junit4:junit4]   2> 7763 T1632 oazs.NIOServerCnxn$Factory.run Accepted socket connection from /140.211.11.196:50504
[junit4:junit4]   2> 7763 T1632 oazs.NIOServerCnxn.readConnectRequest Client attempting to establish new session at /140.211.11.196:50504
[junit4:junit4]   2> 7764 T1634 oazs.NIOServerCnxn.finishSessionInit Established session 0x13a62443ef40008 with negotiated timeout 10000 for client /140.211.11.196:50504
[junit4:junit4]   2> 7764 T1660 oaz.ClientCnxn$SendThread.readConnectResult Session establishment complete on server localhost/127.0.0.1:50467, sessionid = 0x13a62443ef40008, negotiated timeout = 10000
[junit4:junit4]   2> 7764 T1661 oascc.ConnectionManager.process Watcher org.apache.solr.common.cloud.ConnectionManager@2ec959a4 name:ZooKeeperConnection Watcher:127.0.0.1:50467/solr got event WatchedEvent state:SyncConnected type:None path:null path:null type:None
[junit4:junit4]   2> 7764 T1630 oascc.ConnectionManager.waitForConnected Client is connected to ZooKeeper
[junit4:junit4]   2> 7764 T1630 oascc.ZkStateReader.createClusterStateWatchersAndUpdate Updating cluster state from ZooKeeper... 
[junit4:junit4]   2> 7765 T1630 oasc.LeaderElectionIntegrationTest.setUp ####SETUP_END testLeaderElectionAfterClientTimeout
[junit4:junit4]   2> 7766 T1632 oazs.NIOServerCnxn.doIO WARNING EndOfStreamException: Unable to read additional data from client sessionid 0x13a62443ef40002, likely client has closed socket
[junit4:junit4]   2> 7767 T1632 oazs.NIOServerCnxn.closeSock Closed socket connection for client /140.211.11.196:50471 which had sessionid 0x13a62443ef40002
[junit4:junit4]   2> 8746 T1640 oaz.ClientCnxn$SendThread.run WARNING Session 0x13a62443ef40002 for server null, unexpected error, closing socket connection and attempting reconnect java.nio.channels.CancelledKeyException
[junit4:junit4]   2> 	at sun.nio.ch.SelectionKeyImpl.ensureValid(SelectionKeyImpl.java:73)
[junit4:junit4]   2> 	at sun.nio.ch.SelectionKeyImpl.interestOps(SelectionKeyImpl.java:77)
[junit4:junit4]   2> 	at org.apache.zookeeper.ClientCnxn$SendThread.disableWrite(ClientCnxn.java:919)
[junit4:junit4]   2> 	at org.apache.zookeeper.ClientCnxn$SendThread.run(ClientCnxn.java:1163)
[junit4:junit4]   2> 
[junit4:junit4]   2> 10867 T1641 oascc.ConnectionManager.process Watcher org.apache.solr.common.cloud.ConnectionManager@2da518cb name:ZooKeeperConnection Watcher:127.0.0.1:50467/solr got event WatchedEvent state:Disconnected type:None path:null path:null type:None
[junit4:junit4]   2> 10868 T1641 oascc.ConnectionManager.process zkClient has disconnected
[junit4:junit4]   2> 11335 T1633 oazs.ZooKeeperServer.expire Expiring session 0x13a62443ef40002, timeout of 3000ms exceeded
[junit4:junit4]   2> 11335 T1635 oazs.PrepRequestProcessor.pRequest Processed session termination for sessionid: 0x13a62443ef40002
[junit4:junit4]   2> 11361 T1661 oascc.ZkStateReader$3.process Updating live nodes
[junit4:junit4]   2> 11361 T1658 oascc.ZkStateReader$3.process Updating live nodes
[junit4:junit4]   2> 11361 T1649 oascc.ZkStateReader$3.process Updating live nodes
[junit4:junit4]   2> 11361 T1655 oascc.ZkStateReader$3.process Updating live nodes
[junit4:junit4]   2> 11361 T1652 oascc.ZkStateReader$3.process Updating live nodes
[junit4:junit4]   2> 11362 T1635 oazs.PrepRequestProcessor.pRequest Got user-level KeeperException when processing sessionid:0x13a62443ef40003 type:delete cxid:0x49 zxid:0xfffffffffffffffe txntype:unknown reqpath:n/a Error Path:/solr/overseer_elect/leader Error:KeeperErrorCode = NoNode for /solr/overseer_elect/leader
[junit4:junit4]   2> 11374 T1646 oascc.SolrZkClient.makePath makePath: /overseer_elect/leader
[junit4:junit4]   2> 11376 T1646 oasc.Overseer.start Overseer (id=88491187940622339-127.0.0.1:7001_solr-n_0000000001) starting
[junit4:junit4]   2> 11376 T1635 oazs.PrepRequestProcessor.pRequest Got user-level KeeperException when processing sessionid:0x13a62443ef40003 type:create cxid:0x4e zxid:0xfffffffffffffffe txntype:unknown reqpath:n/a Error Path:/solr/overseer Error:KeeperErrorCode = NodeExists for /solr/overseer
[junit4:junit4]   2> 11377 T1635 oazs.PrepRequestProcessor.pRequest Got user-level KeeperException when processing sessionid:0x13a62443ef40003 type:create cxid:0x4f zxid:0xfffffffffffffffe txntype:unknown reqpath:n/a Error Path:/solr/overseer Error:KeeperErrorCode = NodeExists for /solr/overseer
[junit4:junit4]   2> 11387 T1635 oazs.PrepRequestProcessor.pRequest Got user-level KeeperException when processing sessionid:0x13a62443ef40003 type:create cxid:0x50 zxid:0xfffffffffffffffe txntype:unknown reqpath:n/a Error Path:/solr/overseer Error:KeeperErrorCode = NodeExists for /solr/overseer
[junit4:junit4]   2> 11388 T1635 oazs.PrepRequestProcessor.pRequest Got user-level KeeperException when processing sessionid:0x13a62443ef40003 type:create cxid:0x51 zxid:0xfffffffffffffffe txntype:unknown reqpath:n/a Error Path:/solr/overseer Error:KeeperErrorCode = NodeExists for /solr/overseer
[junit4:junit4]   2> 11395 T1664 oasc.OverseerCollectionProcessor.run Process current queue of collection creations
[junit4:junit4]   2> 11395 T1635 oazs.PrepRequestProcessor.pRequest Got user-level KeeperException when processing sessionid:0x13a62443ef40003 type:delete cxid:0x56 zxid:0xfffffffffffffffe txntype:unknown reqpath:n/a Error Path:/solr/collections/collection1/leaders/shard1 Error:KeeperErrorCode = NoNode for /solr/collections/collection1/leaders/shard1
[junit4:junit4]   2> 11395 T1663 oasc.Overseer$ClusterStateUpdater.run Starting to work on the main queue
[junit4:junit4]   2> 11396 T1646 oasc.ShardLeaderElectionContext.runLeaderProcess Running the leader process.
[junit4:junit4]   2> 11396 T1635 oazs.PrepRequestProcessor.pRequest Got user-level KeeperException when processing sessionid:0x13a62443ef40003 type:create cxid:0x5a zxid:0xfffffffffffffffe txntype:unknown reqpath:n/a Error Path:/solr/overseer Error:KeeperErrorCode = NodeExists for /solr/overseer
[junit4:junit4]   2> 11397 T1663 oascc.ZkStateReader.updateClusterState Updating cloud state from ZooKeeper... 
[junit4:junit4]   2> 11408 T1646 oasc.ShardLeaderElectionContext.shouldIBeLeader Checking if I should try and be the leader.
[junit4:junit4]   2> 11408 T1646 oasc.ShardLeaderElectionContext.shouldIBeLeader My last published State was Active, it's okay to be the leader.
[junit4:junit4]   2> 11408 T1646 oasc.ShardLeaderElectionContext.runLeaderProcess I may be the new leader - try and sync
[junit4:junit4]   2> 11408 T1646 oasc.ShardLeaderElectionContext.runLeaderProcess I am the new leader: http://127.0.0.1:7001/solr/collection1/
[junit4:junit4]   2> 11408 T1646 oascc.SolrZkClient.makePath makePath: /collections/collection1/leaders/shard1
[junit4:junit4]   2> 11419 T1635 oazs.PrepRequestProcessor.pRequest Got user-level KeeperException when processing sessionid:0x13a62443ef40003 type:create cxid:0x6c zxid:0xfffffffffffffffe txntype:unknown reqpath:n/a Error Path:/solr/overseer Error:KeeperErrorCode = NodeExists for /solr/overseer
[junit4:junit4]   2> 11431 T1646 oascc.ZkStateReader$3.process Updating live nodes
[junit4:junit4]   2> 11443 T1661 oascc.ZkStateReader$2.process A cluster state change has occurred - updating...
[junit4:junit4]   2> 11443 T1655 oascc.ZkStateReader$2.process A cluster state change has occurred - updating...
[junit4:junit4]   2> 11443 T1658 oascc.ZkStateReader$2.process A cluster state change has occurred - updating...
[junit4:junit4]   2> 11443 T1649 oascc.ZkStateReader$2.process A cluster state change has occurred - updating...
[junit4:junit4]   2> 11443 T1652 oascc.ZkStateReader$2.process A cluster state change has occurred - updating...
[junit4:junit4]   2> 11456 T1646 oascc.ZkStateReader$2.process A cluster state change has occurred - updating...
[junit4:junit4]   2> 12104 T1640 oaz.ClientCnxn$SendThread.startConnect Opening socket connection to server localhost/127.0.0.1:50467
[junit4:junit4]   2> 12104 T1640 oaz.ClientCnxn$SendThread.primeConnection Socket connection established to localhost/127.0.0.1:50467, initiating session
[junit4:junit4]   2> 12104 T1632 oazs.NIOServerCnxn$Factory.run Accepted socket connection from /140.211.11.196:50541
[junit4:junit4]   2> 12105 T1632 oazs.NIOServerCnxn.readConnectRequest Client attempting to renew session 0x13a62443ef40002 at /140.211.11.196:50541
[junit4:junit4]   2> 12105 T1632 oazs.NIOServerCnxn.finishSessionInit Invalid session 0x13a62443ef40002 for client /140.211.11.196:50541, probably expired
[junit4:junit4]   2> 12106 T1632 oazs.NIOServerCnxn.closeSock Closed socket connection for client /140.211.11.196:50541 which had sessionid 0x13a62443ef40002
[junit4:junit4]   2> 13606 T1630 oasc.CoreContainer.shutdown Shutting down CoreContainer instance=252280818
[junit4:junit4]   2> 13606 T1630 oasc.SolrCore.close [collection1]  CLOSING SolrCore org.apache.solr.core.SolrCore@25431da0
[junit4:junit4]   2> 13609 T1630 oasu.DirectUpdateHandler2.close closing DirectUpdateHandler2{commits=0,autocommits=0,soft autocommits=0,optimizes=0,rollbacks=0,expungeDeletes=0,docsPending=0,adds=0,deletesById=0,deletesByQuery=0,errors=0,cumulative_adds=0,cumulative_deletesById=0,cumulative_deletesByQuery=0,cumulative_errors=0}
[junit4:junit4]   2> 13609 T1630 oasc.SolrCore.decrefSolrCoreState Closing SolrCoreState
[junit4:junit4]   2> 13610 T1630 oasu.DefaultSolrCoreState.closeIndexWriter SolrCoreState ref count has reached 0 - closing IndexWriter
[junit4:junit4]   2> 13610 T1630 oasu.DefaultSolrCoreState.closeIndexWriter closing IndexWriter with IndexWriterCloser
[junit4:junit4]   2> 13610 T1630 oasc.SolrCore.closeSearcher [collection1] Closing main searcher on request.
[junit4:junit4]   2> 13611 T1635 oazs.PrepRequestProcessor.pRequest Processed session termination for sessionid: 0x13a62443ef40004
[junit4:junit4]   2> 13637 T1649 oascc.ZkStateReader$3.process Updating live nodes
[junit4:junit4]   2> 13637 T1658 oascc.ZkStateReader$3.process Updating live nodes
[junit4:junit4]   2> 13637 T1630 oaz.ZooKeeper.close Session: 0x13a62443ef40004 closed
[junit4:junit4]   2> 13638 T1649 oascc.ZkStateReader$3.process WARNING ZooKeeper watch triggered, but Solr cannot talk to ZK
[junit4:junit4]   2> 13637 T1661 oascc.ZkStateReader$3.process Updating live nodes
[junit4:junit4]   2> 13637 T1646 oascc.ZkStateReader$3.process Updating live nodes
[junit4:junit4]   2> 13637 T1655 oascc.ZkStateReader$3.process Updating live nodes
[junit4:junit4]   2> 13638 T1649 oaz.ClientCnxn$EventThread.run EventThread shut down
[junit4:junit4]   2> 13638 T1632 oazs.NIOServerCnxn.closeSock Closed socket connection for client /140.211.11.196:50482 which had sessionid 0x13a62443ef40004
[junit4:junit4]   2> 13638 T1630 oasc.CoreContainer.shutdown Shutting down CoreContainer instance=223243871
[junit4:junit4]   2> 13639 T1630 oasc.SolrCore.close [collection1]  CLOSING SolrCore org.apache.solr.core.SolrCore@56c1bccd
[junit4:junit4]   2> 13639 T1652 oascc.ZkStateReader$3.process Updating live nodes
[junit4:junit4]   2> 13642 T1630 oasu.DirectUpdateHandler2.close closing DirectUpdateHandler2{commits=0,autocommits=0,soft autocommits=0,optimizes=0,rollbacks=0,expungeDeletes=0,docsPending=0,adds=0,deletesById=0,deletesByQuery=0,errors=0,cumulative_adds=0,cumulative_deletesById=0,cumulative_deletesByQuery=0,cumulative_errors=0}
[junit4:junit4]   2> 13642 T1630 oasc.SolrCore.decrefSolrCoreState Closing SolrCoreState
[junit4:junit4]   2> 13642 T1630 oasu.DefaultSolrCoreState.closeIndexWriter SolrCoreState ref count has reached 0 - closing IndexWriter
[junit4:junit4]   2> 13642 T1630 oasu.DefaultSolrCoreState.closeIndexWriter closing IndexWriter with IndexWriterCloser
[junit4:junit4]   2> 13643 T1630 oasc.SolrCore.closeSearcher [collection1] Closing main searcher on request.
[junit4:junit4]   2> 13643 T1635 oazs.PrepRequestProcessor.pRequest Processed session termination for sessionid: 0x13a62443ef40005
[junit4:junit4]   2> 13644 T1658 oascc.ZkStateReader$3.process Updating live nodes
[junit4:junit4]   2> 13644 T1661 oascc.ZkStateReader$3.process Updating live nodes
[junit4:junit4]   2> 13645 T1632 oazs.NIOServerCnxn.closeSock Closed socket connection for client /140.211.11.196:50486 which had sessionid 0x13a62443ef40005
[junit4:junit4]   2> 13644 T1646 oascc.ZkStateReader$3.process Updating live nodes
[junit4:junit4]   2> 13644 T1652 oascc.ZkStateReader$3.process Updating live nodes
[junit4:junit4]   2> 13644 T1630 oaz.ZooKeeper.close Session: 0x13a62443ef40005 closed
[junit4:junit4]   2> 13645 T1652 oascc.ZkStateReader$3.process WARNING ZooKeeper watch triggered, but Solr cannot talk to ZK
[junit4:junit4]   2> 13645 T1630 oasc.CoreContainer.shutdown Shutting down CoreContainer instance=1771114209
[junit4:junit4]   2> 13645 T1652 oaz.ClientCnxn$EventThread.run EventThread shut down
[junit4:junit4]   2> 13645 T1655 oascc.ZkStateReader$3.process Updating live nodes
[junit4:junit4]   2> 13645 T1630 oasc.SolrCore.close [collection1]  CLOSING SolrCore org.apache.solr.core.SolrCore@3b30baff
[junit4:junit4]   2> 13648 T1630 oasu.DirectUpdateHandler2.close closing DirectUpdateHandler2{commits=0,autocommits=0,soft autocommits=0,optimizes=0,rollbacks=0,expungeDeletes=0,docsPending=0,adds=0,deletesById=0,deletesByQuery=0,errors=0,cumulative_adds=0,cumulative_deletesById=0,cumulative_deletesByQuery=0,cumulative_errors=0}
[junit4:junit4]   2> 13649 T1630 oasc.SolrCore.decrefSolrCoreState Closing SolrCoreState
[junit4:junit4]   2> 13649 T1630 oasu.DefaultSolrCoreState.closeIndexWriter SolrCoreState ref count has reached 0 - closing IndexWriter
[junit4:junit4]   2> 13649 T1630 oasu.DefaultSolrCoreState.closeIndexWriter closing IndexWriter with IndexWriterCloser
[junit4:junit4]   2> 13649 T1630 oasc.SolrCore.closeSearcher [collection1] Closing main searcher on request.
[junit4:junit4]   2> 13650 T1663 oasc.Overseer$ClusterStateUpdater.amILeader According to ZK I (id=88491187940622339-127.0.0.1:7001_solr-n_0000000001) am no longer a leader.
[junit4:junit4]   2> 13650 T1635 oazs.PrepRequestProcessor.pRequest Processed session termination for sessionid: 0x13a62443ef40003
[junit4:junit4]   2> 13651 T1655 oascc.ZkStateReader$3.process Updating live nodes
[junit4:junit4]   2> 13651 T1646 oascc.ZkStateReader$3.process Updating live nodes
[junit4:junit4]   2> 13651 T1658 oascc.ZkStateReader$3.process Updating live nodes
[junit4:junit4]   2> 13651 T1661 oascc.ZkStateReader$3.process Updating live nodes
[junit4:junit4]   2> 13652 T1646 oascc.ZkStateReader$3.process WARNING ZooKeeper watch triggered, but Solr cannot talk to ZK
[junit4:junit4]   2> 13651 T1630 oaz.ZooKeeper.close Session: 0x13a62443ef40003 closed
[junit4:junit4]   2> 13651 T1632 oazs.NIOServerCnxn.closeSock Closed socket connection for client /140.211.11.196:50477 which had sessionid 0x13a62443ef40003
[junit4:junit4]   2> 13652 T1646 oaz.ClientCnxn$EventThread.run EventThread shut down
[junit4:junit4]   2> 13652 T1630 oasc.CoreContainer.shutdown Shutting down CoreContainer instance=822200379
[junit4:junit4]   2> 13652 T1630 oasc.SolrCore.close [collection1]  CLOSING SolrCore org.apache.solr.core.SolrCore@821096a
[junit4:junit4]   2> 13653 T1635 oazs.PrepRequestProcessor.pRequest Got user-level KeeperException when processing sessionid:0x13a62443ef40006 type:delete cxid:0x4c zxid:0xfffffffffffffffe txntype:unknown reqpath:n/a Error Path:/solr/overseer_elect/leader Error:KeeperErrorCode = NoNode for /solr/overseer_elect/leader
[junit4:junit4]   2> 13653 T1655 oascc.SolrZkClient.makePath makePath: /overseer_elect/leader
[junit4:junit4]   2> 13655 T1630 oasu.DirectUpdateHandler2.close closing DirectUpdateHandler2{commits=0,autocommits=0,soft autocommits=0,optimizes=0,rollbacks=0,expungeDeletes=0,docsPending=0,adds=0,deletesById=0,deletesByQuery=0,errors=0,cumulative_adds=0,cumulative_deletesById=0,cumulative_deletesByQuery=0,cumulative_errors=0}
[junit4:junit4]   2> 13655 T1630 oasc.SolrCore.decrefSolrCoreState Closing SolrCoreState
[junit4:junit4]   2> 13656 T1630 oasu.DefaultSolrCoreState.closeIndexWriter SolrCoreState ref count has reached 0 - closing IndexWriter
[junit4:junit4]   2> 13656 T1630 oasu.DefaultSolrCoreState.closeIndexWriter closing IndexWriter with IndexWriterCloser
[junit4:junit4]   2> 13656 T1630 oasc.SolrCore.closeSearcher [collection1] Closing main searcher on request.
[junit4:junit4]   2> 13657 T1635 oazs.PrepRequestProcessor.pRequest Processed session termination for sessionid: 0x13a62443ef40006
[junit4:junit4]   2> 13663 T1661 oascc.ZkStateReader$3.process Updating live nodes
[junit4:junit4]   2> 13663 T1632 oazs.NIOServerCnxn.closeSock Closed socket connection for client /140.211.11.196:50493 which had sessionid 0x13a62443ef40006
[junit4:junit4]   2> 13663 T1630 oaz.ZooKeeper.close Session: 0x13a62443ef40006 closed
[junit4:junit4]   2> 13663 T1630 oasc.CoreContainer.shutdown Shutting down CoreContainer instance=627824429
[junit4:junit4]   2> 13664 T1630 oasc.SolrCore.close [collection1]  CLOSING SolrCore org.apache.solr.core.SolrCore@3ee8ee3b
[junit4:junit4]   2> 13669 T1630 oasu.DirectUpdateHandler2.close closing DirectUpdateHandler2{commits=0,autocommits=0,soft autocommits=0,optimizes=0,rollbacks=0,expungeDeletes=0,docsPending=0,adds=0,deletesById=0,deletesByQuery=0,errors=0,cumulative_adds=0,cumulative_deletesById=0,cumulative_deletesByQuery=0,cumulative_errors=0}
[junit4:junit4]   2> 13669 T1630 oasc.SolrCore.decrefSolrCoreState Closing SolrCoreState
[junit4:junit4]   2> 13670 T1630 oasu.DefaultSolrCoreState.closeIndexWriter SolrCoreState ref count has reached 0 - closing IndexWriter
[junit4:junit4]   2> 13670 T1630 oasu.DefaultSolrCoreState.closeIndexWriter closing IndexWriter with IndexWriterCloser
[junit4:junit4]   2> 13670 T1630 oasc.SolrCore.closeSearcher [collection1] Closing main searcher on request.
[junit4:junit4]   2> 13670 T1635 oazs.PrepRequestProcessor.pRequest Got user-level KeeperException when processing sessionid:0x13a62443ef40007 type:delete cxid:0x59 zxid:0xfffffffffffffffe txntype:unknown reqpath:n/a Error Path:/solr/overseer_elect/leader Error:KeeperErrorCode = NoNode for /solr/overseer_elect/leader
[junit4:junit4]   2> 13671 T1635 oazs.PrepRequestProcessor.pRequest Processed session termination for sessionid: 0x13a62443ef40007
[junit4:junit4]   2> 13671 T1658 oascc.SolrZkClient.makePath makePath: /overseer_elect/leader
[junit4:junit4]   2> 13672 T1661 oascc.ZkStateReader$3.process Updating live nodes
[junit4:junit4]   2> 13672 T1630 oaz.ZooKeeper.close Session: 0x13a62443ef40007 closed
[junit4:junit4]   2> 13672 T1632 oazs.NIOServerCnxn.closeSock Closed socket connection for client /140.211.11.196:50497 which had sessionid 0x13a62443ef40007
[junit4:junit4]   2> 13868 T1640 oaz.ClientCnxn$SendThread.run Client session timed out, have not heard from server in 3001ms for sessionid 0x13a62443ef40002, closing socket connection and attempting reconnect
[junit4:junit4]   2> 14663 T1655 oasc.LeaderElector$1.process WARNING  org.apache.zookeeper.KeeperException$SessionExpiredException: KeeperErrorCode = Session expired for /overseer_elect/leader
[junit4:junit4]   2> 	at org.apache.zookeeper.KeeperException.create(KeeperException.java:118)
[junit4:junit4]   2> 	at org.apache.zookeeper.KeeperException.create(KeeperException.java:42)
[junit4:junit4]   2> 	at org.apache.zookeeper.ZooKeeper.exists(ZooKeeper.java:815)
[junit4:junit4]   2> 	at org.apache.solr.common.cloud.SolrZkClient$3.execute(SolrZkClient.java:176)
[junit4:junit4]   2> 	at org.apache.solr.common.cloud.SolrZkClient$3.execute(SolrZkClient.java:173)
[junit4:junit4]   2> 	at org.apache.solr.common.cloud.ZkCmdExecutor.retryOperation(ZkCmdExecutor.java:63)
[junit4:junit4]   2> 	at org.apache.solr.common.cloud.SolrZkClient.exists(SolrZkClient.java:173)
[junit4:junit4]   2> 	at org.apache.solr.common.cloud.SolrZkClient.makePath(SolrZkClient.java:423)
[junit4:junit4]   2> 	at org.apache.solr.common.cloud.SolrZkClient.makePath(SolrZkClient.java:353)
[junit4:junit4]   2> 	at org.apache.solr.common.cloud.SolrZkClient.makePath(SolrZkClient.java:340)
[junit4:junit4]   2> 	at org.apache.solr.cloud.OverseerElectionContext.runLeaderProcess(ElectionContext.java:370)
[junit4:junit4]   2> 	at org.apache.solr.cloud.LeaderElector.runIamLeaderProcess(LeaderElector.java:151)
[junit4:junit4]   2> 	at org.apache.solr.cloud.LeaderElector.checkIfIamLeader(LeaderElector.java:95)
[junit4:junit4]   2> 	at org.apache.solr.cloud.LeaderElector.access$000(LeaderElector.java:55)
[junit4:junit4]   2> 	at org.apache.solr.cloud.LeaderElector$1.process(LeaderElector.java:124)
[junit4:junit4]   2> 	at org.apache.zookeeper.ClientCnxn$EventThread.processEvent(ClientCnxn.java:526)
[junit4:junit4]   2> 	at org.apache.zookeeper.ClientCnxn$EventThread.run(ClientCnxn.java:502)
[junit4:junit4]   2> 
[junit4:junit4]   2> 14663 T1655 oasc.LeaderElector$1.process WARNING  org.apache.zookeeper.KeeperException$SessionExpiredException: KeeperErrorCode = Session expired for /collections/collection1/leader_elect/shard1/election
[junit4:junit4]   2> 	at org.apache.zookeeper.KeeperException.create(KeeperException.java:118)
[junit4:junit4]   2> 	at org.apache.zookeeper.KeeperException.create(KeeperException.java:42)
[junit4:junit4]   2> 	at org.apache.zookeeper.ZooKeeper.getChildren(ZooKeeper.java:1249)
[junit4:junit4]   2> 	at org.apache.solr.common.cloud.SolrZkClient$6.execute(SolrZkClient.java:227)
[junit4:junit4]   2> 	at org.apache.solr.common.cloud.SolrZkClient$6.execute(SolrZkClient.java:224)
[junit4:junit4]   2> 	at org.apache.solr.common.cloud.ZkCmdExecutor.retryOperation(ZkCmdExecutor.java:63)
[junit4:junit4]   2> 	at org.apache.solr.common.cloud.SolrZkClient.getChildren(SolrZkClient.java:224)
[junit4:junit4]   2> 	at org.apache.solr.cloud.LeaderElector.checkIfIamLeader(LeaderElector.java:83)
[junit4:junit4]   2> 	at org.apache.solr.cloud.LeaderElector.access$000(LeaderElector.java:55)
[junit4:junit4]   2> 	at org.apache.solr.cloud.LeaderElector$1.process(LeaderElector.java:124)
[junit4:junit4]   2> 	at org.apache.zookeeper.ClientCnxn$EventThread.processEvent(ClientCnxn.java:526)
[junit4:junit4]   2> 	at org.apache.zookeeper.ClientCnxn$EventThread.run(ClientCnxn.java:502)
[junit4:junit4]   2> 
[junit4:junit4]   2> 14664 T1655 oascc.ZkStateReader$3.process Updating live nodes
[junit4:junit4]   2> 14664 T1655 oascc.ZkStateReader$3.process WARNING ZooKeeper watch triggered, but Solr cannot talk to ZK
[junit4:junit4]   2> 14664 T1655 oaz.ClientCnxn$EventThread.run EventThread shut down
[junit4:junit4]   2> 14672 T1658 oasc.LeaderElector$1.process WARNING  org.apache.zookeeper.KeeperException$SessionExpiredException: KeeperErrorCode = Session expired for /overseer_elect
[junit4:junit4]   2> 	at org.apache.zookeeper.KeeperException.create(KeeperException.java:118)
[junit4:junit4]   2> 	at org.apache.zookeeper.KeeperException.create(KeeperException.java:42)
[junit4:junit4]   2> 	at org.apache.zookeeper.ZooKeeper.exists(ZooKeeper.java:815)
[junit4:junit4]   2> 	at org.apache.solr.common.cloud.SolrZkClient$3.execute(SolrZkClient.java:176)
[junit4:junit4]   2> 	at org.apache.solr.common.cloud.SolrZkClient$3.execute(SolrZkClient.java:173)
[junit4:junit4]   2> 	at org.apache.solr.common.cloud.ZkCmdExecutor.retryOperation(ZkCmdExecutor.java:63)
[junit4:junit4]   2> 	at org.apache.solr.common.cloud.SolrZkClient.exists(SolrZkClient.java:173)
[junit4:junit4]   2> 	at org.apache.solr.common.cloud.SolrZkClient.makePath(SolrZkClient.java:384)
[junit4:junit4]   2> 	at org.apache.solr.common.cloud.SolrZkClient.makePath(SolrZkClient.java:353)
[junit4:junit4]   2> 	at org.apache.solr.common.cloud.SolrZkClient.makePath(SolrZkClient.java:340)
[junit4:junit4]   2> 	at org.apache.solr.cloud.OverseerElectionContext.runLeaderProcess(ElectionContext.java:370)
[junit4:junit4]   2> 	at org.apache.solr.cloud.LeaderElector.runIamLeaderProcess(LeaderElector.java:151)
[junit4:junit4]   2> 	at org.apache.solr.cloud.LeaderElector.checkIfIamLeader(LeaderElector.java:95)
[junit4:junit4]   2> 	at org.apache.solr.cloud.LeaderElector.access$000(LeaderElector.java:55)
[junit4:junit4]   2> 	at org.apache.solr.cloud.LeaderElector$1.process(LeaderElector.java:124)
[junit4:junit4]   2> 	at org.apache.zookeeper.ClientCnxn$EventThread.processEvent(ClientCnxn.java:526)
[junit4:junit4]   2> 	at org.apache.zookeeper.ClientCnxn$EventThread.run(ClientCnxn.java:502)
[junit4:junit4]   2> 
[junit4:junit4]   2> 14672 T1658 oascc.ZkStateReader$3.process Updating live nodes
[junit4:junit4]   2> 14672 T1658 oascc.ZkStateReader$3.process WARNING ZooKeeper watch triggered, but Solr cannot talk to ZK
[junit4:junit4]   2> 14673 T1658 oaz.ClientCnxn$EventThread.run EventThread shut down
[junit4:junit4]   2> 15857 T1640 oaz.ClientCnxn$SendThread.startConnect Opening socket connection to server localhost/127.0.0.1:50467
[junit4:junit4]   2> 15857 T1640 oaz.ClientCnxn$SendThread.primeConnection Socket connection established to localhost/127.0.0.1:50467, initiating session
[junit4:junit4]   2> 15858 T1632 oazs.NIOServerCnxn$Factory.run Accepted socket connection from /140.211.11.196:50546
[junit4:junit4]   2> 15858 T1632 oazs.NIOServerCnxn.readConnectRequest Client attempting to renew session 0x13a62443ef40002 at /140.211.11.196:50546
[junit4:junit4]   2> 15858 T1632 oazs.NIOServerCnxn.finishSessionInit Invalid session 0x13a62443ef40002 for client /140.211.11.196:50546, probably expired
[junit4:junit4]   2> 15859 T1641 oascc.ConnectionManager.process Watcher org.apache.solr.common.cloud.ConnectionManager@2da518cb name:ZooKeeperConnection Watcher:127.0.0.1:50467/solr got event WatchedEvent state:Expired type:None path:null path:null type:None
[junit4:junit4]   2> 15859 T1640 oaz.ClientCnxn$SendThread.run Unable to reconnect to ZooKeeper service, session 0x13a62443ef40002 has expired, closing socket connection
[junit4:junit4]   2> 15859 T1632 oazs.NIOServerCnxn.closeSock Closed socket connection for client /140.211.11.196:50546 which had sessionid 0x13a62443ef40002
[junit4:junit4]   2> 15859 T1641 oascc.ConnectionManager.process Our previous ZooKeeper session was expired. Attempting to reconnect to recover relationship with ZooKeeper...
[junit4:junit4]   2> 15859 T1641 oascc.DefaultConnectionStrategy.reconnect Connection expired - starting a new one...
[junit4:junit4]   2> 15859 T1641 oaz.ZooKeeper.<init> Initiating client connection, connectString=127.0.0.1:50467/solr sessionTimeout=3000 watcher=org.apache.solr.common.cloud.ConnectionManager@2da518cb
[junit4:junit4]   2> 15860 T1665 oaz.ClientCnxn$SendThread.startConnect Opening socket connection to server /127.0.0.1:50467
[junit4:junit4]   2> 15860 T1641 oascc.ConnectionManager.waitForConnected Waiting for client to connect to ZooKeeper
[junit4:junit4]   2> 15861 T1665 oaz.ClientCnxn$SendThread.primeConnection Socket connection established to localhost/127.0.0.1:50467, initiating session
[junit4:junit4]   2> 15861 T1632 oazs.NIOServerCnxn$Factory.run Accepted socket connection from /140.211.11.196:50547
[junit4:junit4]   2> 15861 T1632 oazs.NIOServerCnxn.readConnectRequest Client attempting to establish new session at /140.211.11.196:50547
[junit4:junit4]   2> 15889 T1634 oazs.NIOServerCnxn.finishSessionInit Established session 0x13a62443ef40009 with negotiated timeout 3000 for client /140.211.11.196:50547
[junit4:junit4]   2> 15889 T1665 oaz.ClientCnxn$SendThread.readConnectResult Session establishment complete on server localhost/127.0.0.1:50467, sessionid = 0x13a62443ef40009, negotiated timeout = 3000
[junit4:junit4]   2> 15889 T1666 oascc.ConnectionManager.process Watcher org.apache.solr.common.cloud.ConnectionManager@2da518cb name:ZooKeeperConnection Watcher:127.0.0.1:50467/solr got event WatchedEvent state:SyncConnected type:None path:null path:null type:None
[junit4:junit4]   2> 15890 T1641 oascc.ConnectionManager.waitForConnected Client is connected to ZooKeeper
[junit4:junit4]   2> 15890 T1641 oascc.ConnectionManager$1.update Connection with ZooKeeper reestablished.
[junit4:junit4]   2> 15960 T1642 oasc.Overseer$ClusterStateUpdater.amILeader WARNING  org.apache.zookeeper.KeeperException$SessionExpiredException: KeeperErrorCode = Session expired for /overseer_elect/leader
[junit4:junit4]   2> 	at org.apache.zookeeper.KeeperException.create(KeeperException.java:118)
[junit4:junit4]   2> 	at org.apache.zookeeper.KeeperException.create(KeeperException.java:42)
[junit4:junit4]   2> 	at org.apache.zookeeper.ZooKeeper.getData(ZooKeeper.java:927)
[junit4:junit4]   2> 	at org.apache.solr.common.cloud.SolrZkClient$7.execute(SolrZkClient.java:244)
[junit4:junit4]   2> 	at org.apache.solr.common.cloud.SolrZkClient$7.execute(SolrZkClient.java:241)
[junit4:junit4]   2> 	at org.apache.solr.common.cloud.ZkCmdExecutor.retryOperation(ZkCmdExecutor.java:63)
[junit4:junit4]   2> 	at org.apache.solr.common.cloud.SolrZkClient.getData(SolrZkClient.java:241)
[junit4:junit4]   2> 	at org.apache.solr.cloud.Overseer$ClusterStateUpdater.amILeader(Overseer.java:195)
[junit4:junit4]   2> 	at org.apache.solr.cloud.Overseer$ClusterStateUpdater.run(Overseer.java:119)
[junit4:junit4]   2> 	at java.lang.Thread.run(Thread.java:679)
[junit4:junit4]   2> 
[junit4:junit4]   2> 15960 T1643 oasc.OverseerCollectionProcessor.run WARNING Overseer cannot talk to ZK
[junit4:junit4]   2> 15960 T1642 oasc.Overseer$ClusterStateUpdater.amILeader According to ZK I (id=88491187940622338-127.0.0.1:7000_solr-n_0000000000) am no longer a leader.
[junit4:junit4]   2> 45952 T1641 oasc.SolrException.log SEVERE There was a problem finding the leader in zk
[junit4:junit4]   2> 45952 T1641 oasc.SolrException.log SEVERE There was a problem finding the leader in zk:org.apache.solr.common.SolrException: Could not get leader props
[junit4:junit4]   2> 		at org.apache.solr.cloud.ZkController.getLeaderProps(ZkController.java:709)
[junit4:junit4]   2> 		at org.apache.solr.cloud.ZkController.getLeaderProps(ZkController.java:673)
[junit4:junit4]   2> 		at org.apache.solr.cloud.ZkController.waitForLeaderToSeeDownState(ZkController.java:1070)
[junit4:junit4]   2> 		at org.apache.solr.cloud.ZkController.registerAllCoresAsDown(ZkController.java:273)
[junit4:junit4]   2> 		at org.apache.solr.cloud.ZkController.access$100(ZkController.java:82)
[junit4:junit4]   2> 		at org.apache.solr.cloud.ZkController$1.command(ZkController.java:190)
[junit4:junit4]   2> 		at org.apache.solr.common.cloud.ConnectionManager$1.update(ConnectionManager.java:116)
[junit4:junit4]   2> 		at org.apache.solr.common.cloud.DefaultConnectionStrategy.reconnect(DefaultConnectionStrategy.java:46)
[junit4:junit4]   2> 		at org.apache.solr.common.cloud.ConnectionManager.process(ConnectionManager.java:90)
[junit4:junit4]   2> 		at org.apache.zookeeper.ClientCnxn$EventThread.processEvent(ClientCnxn.java:526)
[junit4:junit4]   2> 		at org.apache.zookeeper.ClientCnxn$EventThread.run(ClientCnxn.java:502)
[junit4:junit4]   2> 	Caused by: org.apache.zookeeper.KeeperException$NoNodeException: KeeperErrorCode = NoNode for /collections/collection1/leaders/shard1
[junit4:junit4]   2> 		at org.apache.zookeeper.KeeperException.create(KeeperException.java:102)
[junit4:junit4]   2> 		at org.apache.zookeeper.KeeperException.create(KeeperException.java:42)
[junit4:junit4]   2> 		at org.apache.zookeeper.ZooKeeper.getData(ZooKeeper.java:927)
[junit4:junit4]   2> 		at org.apache.solr.common.cloud.SolrZkClient$7.execute(SolrZkClient.java:244)
[junit4:junit4]   2> 		at org.apache.solr.common.cloud.SolrZkClient$7.execute(SolrZkClient.java:241)
[junit4:junit4]   2> 		at org.apache.solr.common.cloud.ZkCmdExecutor.retryOperation(ZkCmdExecutor.java:63)
[junit4:junit4]   2> 		at org.apache.solr.common.cloud.SolrZkClient.getData(SolrZkClient.java:241)
[junit4:junit4]   2> 		at org.apache.solr.cloud.ZkController.getLeaderProps(ZkController.java:687)
[junit4:junit4]   2> 		... 10 more
[junit4:junit4]   2> 	
[junit4:junit4]   2> 45992 T1635 oazs.PrepRequestProcessor.pRequest Processed session termination for sessionid: 0x13a62443ef40008
[junit4:junit4]   2> 45993 T1661 oaz.ClientCnxn$EventThread.run EventThread shut down
[junit4:junit4]   2> 45993 T1630 oaz.ZooKeeper.close Session: 0x13a62443ef40008 closed
[junit4:junit4]   2> 45993 T1632 oazs.NIOServerCnxn.closeSock Closed socket connection for client /140.211.11.196:50504 which had sessionid 0x13a62443ef40008
[junit4:junit4]   2> 45994 T1630 oasc.CoreContainer.shutdown Shutting down CoreContainer instance=1963148461
[junit4:junit4]   2> 45994 T1630 oasc.SolrCore.close [collection1]  CLOSING SolrCore org.apache.solr.core.SolrCore@610c75f8
[junit4:junit4]   2> 45995 T1630 oasu.DirectUpdateHandler2.close closing DirectUpdateHandler2{commits=0,autocommits=0,soft autocommits=0,optimizes=0,rollbacks=0,expungeDeletes=0,docsPending=0,adds=0,deletesById=0,deletesByQuery=0,errors=0,cumulative_adds=0,cumulative_deletesById=0,cumulative_deletesByQuery=0,cumulative_errors=0}
[junit4:junit4]   2> 45996 T1630 oasc.SolrCore.decrefSolrCoreState Closing SolrCoreState
[junit4:junit4]   2> 45996 T1630 oasu.DefaultSolrCoreState.closeIndexWriter SolrCoreState ref count has reached 0 - closing IndexWriter
[junit4:junit4]   2> 45996 T1630 oasu.DefaultSolrCoreState.closeIndexWriter closing IndexWriter with IndexWriterCloser
[junit4:junit4]   2> 45997 T1630 oasc.SolrCore.closeSearcher [collection1] Closing main searcher on request.
[junit4:junit4]   2> 45998 T1635 oazs.PrepRequestProcessor.pRequest Processed session termination for sessionid: 0x13a62443ef40009
[junit4:junit4]   2> 45999 T1666 oaz.ClientCnxn$EventThread.run EventThread shut down
[junit4:junit4]   2> 45999 T1630 oaz.ZooKeeper.close Session: 0x13a62443ef40009 closed
[junit4:junit4]   2> 45999 T1632 oazs.NIOServerCnxn.closeSock Closed socket connection for client /140.211.11.196:50547 which had sessionid 0x13a62443ef40009
[junit4:junit4]   2> 45999 T1634 oazs.SyncRequestProcessor.run SyncRequestProcessor exited!
[junit4:junit4]   2> 45999 T1635 oazs.PrepRequestProcessor.run PrepRequestProcessor exited loop!
[junit4:junit4]   2> 46000 T1630 oazs.FinalRequestProcessor.shutdown shutdown of request processor complete
[junit4:junit4]   2> 46335 T1633 oazs.SessionTrackerImpl.run SessionTrackerImpl exited loop!
[junit4:junit4]   2> 46362 T1632 oazs.NIOServerCnxn$Factory.run NIOServerCnxn factory exited run method
[junit4:junit4]   2> 46363 T1630 oazs.FinalRequestProcessor.shutdown shutdown of request processor complete
[junit4:junit4]   2> 46363 T1630 oas.SolrTestCaseJ4.tearDown ###Ending testLeaderElectionAfterClientTimeout
[junit4:junit4]   2> NOTE: reproduce with: ant test  -Dtestcase=LeaderElectionIntegrationTest -Dtests.method=testLeaderElectionAfterClientTimeout -Dtests.seed=E7D36FA933F3B4D -Dtests.multiplier=3 -Dtests.slow=true -Dtests.locale=ar_DZ -Dtests.timezone=America/Argentina/Cordoba -Dtests.file.encoding=US-ASCII
[junit4:junit4] FAILURE 46.4s J1 | LeaderElectionIntegrationTest.testLeaderElectionAfterClientTimeout <<<
[junit4:junit4]    > Throwable #1: java.lang.AssertionError: expected:<7000> but was:<7001>
[junit4:junit4]    > 	at __randomizedtesting.SeedInfo.seed([E7D36FA933F3B4D:A74A9359B41AB3A6]:0)
[junit4:junit4]    > 	at org.junit.Assert.fail(Assert.java:93)
[junit4:junit4]    > 	at org.junit.Assert.failNotEquals(Assert.java:647)
[junit4:junit4]    > 	at org.junit.Assert.assertEquals(Assert.java:128)
[junit4:junit4]    > 	at org.junit.Assert.assertEquals(Assert.java:472)
[junit4:junit4]    > 	at org.junit.Assert.assertEquals(Assert.java:456)
[junit4:junit4]    > 	at org.apache.solr.cloud.LeaderElectionIntegrationTest.testLeaderElectionAfterClientTimeout(LeaderElectionIntegrationTest.java:252)
[junit4:junit4]    > 	at sun.reflect.NativeMethodAccessorImpl.invoke0(Native Method)
[junit4:junit4]    > 	at sun.reflect.NativeMethodAccessorImpl.invoke(NativeMethodAccessorImpl.java:57)
[junit4:junit4]    > 	at sun.reflect.DelegatingMethodAccessorImpl.invoke(DelegatingMethodAccessorImpl.java:43)
[junit4:junit4]    > 	at java.lang.reflect.Method.invoke(Method.java:616)
[junit4:junit4]    > 	at com.carrotsearch.randomizedtesting.RandomizedRunner.invoke(RandomizedRunner.java:1559)
[junit4:junit4]    > 	at com.carrotsearch.randomizedtesting.RandomizedRunner.access$600(RandomizedRunner.java:79)
[junit4:junit4]    > 	at com.carrotsearch.randomizedtesting.RandomizedRunner$6.evaluate(RandomizedRunner.java:737)
[junit4:junit4]    > 	at com.carrotsearch.randomizedtesting.RandomizedRunner$7.evaluate(RandomizedRunner.java:773)
[junit4:junit4]    > 	at com.carrotsearch.randomizedtesting.RandomizedRunner$8.evaluate(RandomizedRunner.java:787)
[junit4:junit4]    > 	at com.carrotsearch.randomizedtesting.rules.SystemPropertiesRestoreRule$1.evaluate(SystemPropertiesRestoreRule.java:53)
[junit4:junit4]    > 	at org.apache.lucene.util.TestRuleSetupTeardownChained$1.evaluate(TestRuleSetupTeardownChained.java:50)
[junit4:junit4]    > 	at org.apache.lucene.util.TestRuleFieldCacheSanity$1.evaluate(TestRuleFieldCacheSanity.java:51)
[junit4:junit4]    > 	at org.apache.lucene.util.AbstractBeforeAfterRule$1.evaluate(AbstractBeforeAfterRule.java:45)
[junit4:junit4]    > 	at com.carrotsearch.randomizedtesting.rules.SystemPropertiesInvariantRule$1.evaluate(SystemPropertiesInvariantRule.java:55)
[junit4:junit4]    > 	at org.apache.lucene.util.TestRuleThreadAndTestName$1.evaluate(TestRuleThreadAndTestName.java:48)
[junit4:junit4]    > 	at org.apache.lucene.util.TestRuleIgnoreAfterMaxFailures$1.evaluate(TestRuleIgnoreAfterMaxFailures.java:70)
[junit4:junit4]    > 	at org.apache.lucene.util.TestRuleMarkFailure$1.evaluate(TestRuleMarkFailure.java:48)
[junit4:junit4]    > 	at com.carrotsearch.randomizedtesting.rules.StatementAdapter.evaluate(StatementAdapter.java:36)
[junit4:junit4]    > 	at com.carrotsearch.randomizedtesting.ThreadLeakControl$StatementRunner.run(ThreadLeakControl.java:358)
[junit4:junit4]    > 	at com.carrotsearch.randomizedtesting.ThreadLeakControl.forkTimeoutingTask(ThreadLeakControl.java:782)
[junit4:junit4]    > 	at com.carrotsearch.randomizedtesting.ThreadLeakControl$3.evaluate(ThreadLeakControl.java:442)
[junit4:junit4]    > 	at com.carrotsearch.randomizedtesting.RandomizedRunner.runSingleTest(RandomizedRunner.java:746)
[junit4:junit4]    > 	at com.carrotsearch.randomizedtesting.RandomizedRunner$3.evaluate(RandomizedRunner.java:648)
[junit4:junit4]    > 	at com.carrotsearch.randomizedtesting.RandomizedRunner$4.evaluate(RandomizedRunner.java:682)
[junit4:junit4]    > 	at com.carrotsearch.randomizedtesting.RandomizedRunner$5.evaluate(RandomizedRunner.java:693)
[junit4:junit4]    > 	at com.carrotsearch.randomizedtesting.rules.StatementAdapter.evaluate(StatementAdapter.java:36)
[junit4:junit4]    > 	at com.carrotsearch.randomizedtesting.rules.SystemPropertiesRestoreRule$1.evaluate(SystemPropertiesRestoreRule.java:53)
[junit4:junit4]    > 	at org.apache.lucene.util.AbstractBeforeAfterRule$1.evaluate(AbstractBeforeAfterRule.java:45)
[junit4:junit4]    > 	at org.apache.lucene.util.TestRuleStoreClassName$1.evaluate(TestRuleStoreClassName.java:42)
[junit4:junit4]    > 	at com.carrotsearch.randomizedtesting.rules.SystemPropertiesInvariantRule$1.evaluate(SystemPropertiesInvariantRule.java:55)
[junit4:junit4]    > 	at com.carrotsearch.randomizedtesting.rules.NoShadowingOrOverridesOnMethodsRule$1.evaluate(NoShadowingOrOverridesOnMethodsRule.java:39)
[junit4:junit4]    > 	at com.carrotsearch.randomizedtesting.rules.NoShadowingOrOverridesOnMethodsRule$1.evaluate(NoShadowingOrOverridesOnMethodsRule.java:39)
[junit4:junit4]    > 	at com.carrotsearch.randomizedtesting.rules.StatementAdapter.evaluate(StatementAdapter.java:36)
[junit4:junit4]    > 	at org.apache.lucene.util.TestRuleAssertionsRequired$1.evaluate(TestRuleAssertionsRequired.java:43)
[junit4:junit4]    > 	at org.apache.lucene.util.TestRuleMarkFailure$1.evaluate(TestRuleMarkFailure.java:48)
[junit4:junit4]    > 	at org.apache.lucene.util.TestRuleIgnoreAfterMaxFailures$1.evaluate(TestRuleIgnoreAfterMaxFailures.java:70)
[junit4:junit4]    > 	at org.apache.lucene.util.TestRuleIgnoreTestSuites$1.evaluate(TestRuleIgnoreTestSuites.java:55)
[junit4:junit4]    > 	at com.carrotsearch.randomizedtesting.rules.StatementAdapter.evaluate(StatementAdapter.java:36)
[junit4:junit4]    > 	at com.carrotsearch.randomizedtesting.ThreadLeakControl$StatementRunner.run(ThreadLeakControl.java:358)
[junit4:junit4]    > 	at java.lang.Thread.run(Thread.java:679)
[junit4:junit4]   2> 46383 T1630 oas.SolrTestCaseJ4.setUp ###Starting testSimpleSliceLeaderElection
[junit4:junit4]   2> Creating dataDir: /usr/home/hudson/hudson-slave/workspace/Lucene-Solr-Tests-trunk-Java6/solr/build/solr-core/test/J1/./solrtest-LeaderElectionIntegrationTest-1350268417050
[junit4:junit4]   2> 46384 T1630 oasc.ZkTestServer.run STARTING ZK TEST SERVER
[junit4:junit4]   2> 46388 T1667 oazs.ZooKeeperServer.setTickTime tickTime set to 1000
[junit4:junit4]   2> 46388 T1667 oazs.NIOServerCnxn$Factory.<init> binding to port 0.0.0.0/0.0.0.0:0
[junit4:junit4]   2> 46389 T1667 oazsp.FileTxnSnapLog.save Snapshotting: 0
[junit4:junit4]   2> 46486 T1630 oasc.ZkTestServer.run start zk server on port:50604
[junit4:junit4]   2> 46486 T1630 oaz.ZooKeeper.<init> Initiating client connection, connectString=127.0.0.1:50604 sessionTimeout=10000 watcher=org.apache.solr.common.cloud.ConnectionManager@3b7e080
[junit4:junit4]   2> 46487 T1672 oaz.ClientCnxn$SendThread.startConnect Opening socket connection to server /127.0.0.1:50604
[junit4:junit4]   2> 46487 T1630 oascc.ConnectionManager.waitForConnected Waiting for client to connect to ZooKeeper
[junit4:junit4]   2> 46488 T1672 oaz.ClientCnxn$SendThread.primeConnection Socket connection established to localhost/127.0.0.1:50604, initiating session
[junit4:junit4]   2> 46488 T1668 oazs.NIOServerCnxn$Factory.run Accepted socket connection from /140.211.11.196:50605
[junit4:junit4]   2> 46489 T1668 oazs.NIOServerCnxn.readConnectRequest Client attempting to establish new session at /140.211.11.196:50605
[junit4:junit4]   2> 46489 T1670 oazsp.FileTxnLog.append Creating new log file: log.1
[junit4:junit4]   2> 46496 T1670 oazs.NIOServerCnxn.finishSessionInit Established session 0x13a6244f4200000 with negotiated timeout 10000 for client /140.211.11.196:50605
[junit4:junit4]   2> 46497 T1672 oaz.ClientCnxn$SendThread.readConnectResult Session establishment complete on server localhost/127.0.0.1:50604, sessionid = 0x13a6244f4200000, negotiated timeout = 10000
[junit4:junit4]   2> 46497 T1673 oascc.ConnectionManager.process Watcher org.apache.solr.common.cloud.ConnectionManager@3b7e080 name:ZooKeeperConnection Watcher:127.0.0.1:50604 got event WatchedEvent state:SyncConnected type:None path:null path:null type:None
[junit4:junit4]   2> 46497 T1630 oascc.ConnectionManager.waitForConnected Client is connected to ZooKeeper
[junit4:junit4]   2> 46498 T1630 oascc.SolrZkClient.makePath makePath: /solr
[junit4:junit4]   2> 46501 T1671 oazs.PrepRequestProcessor.pRequest Processed session termination for sessionid: 0x13a6244f4200000
[junit4:junit4]   2> 46502 T1673 oaz.ClientCnxn$EventThread.run EventThread shut down
[junit4:junit4]   2> 46502 T1630 oaz.ZooKeeper.close Session: 0x13a6244f4200000 closed
[junit4:junit4]   2> 46503 T1668 oazs.NIOServerCnxn.closeSock Closed socket connection for client /140.211.11.196:50605 which had sessionid 0x13a6244f4200000
[junit4:junit4]   2> 46503 T1630 oaz.ZooKeeper.<init> Initiating client connection, connectString=127.0.0.1:50604/solr sessionTimeout=10000 watcher=org.apache.solr.common.cloud.ConnectionManager@51b2f91b
[junit4:junit4]   2> 46504 T1674 oaz.ClientCnxn$SendThread.startConnect Opening socket connection to server /127.0.0.1:50604
[junit4:junit4]   2> 46504 T1630 oascc.ConnectionManager.waitForConnected Waiting for client to connect to ZooKeeper
[junit4:junit4]   2> 46504 T1674 oaz.ClientCnxn$SendThread.primeConnection Socket connection established to localhost/127.0.0.1:50604, initiating session
[junit4:junit4]   2> 46505 T1668 oazs.NIOServerCnxn$Factory.run Accepted socket connection from /140.211.11.196:50607
[junit4:junit4]   2> 46505 T1668 oazs.NIOServerCnxn.readConnectRequest Client attempting to establish new session at /140.211.11.196:50607
[junit4:junit4]   2> 46506 T1670 oazs.NIOServerCnxn.finishSessionInit Established session 0x13a6244f4200001 with negotiated timeout 10000 for client /140.211.11.196:50607
[junit4:junit4]   2> 46506 T1674 oaz.ClientCnxn$SendThread.readConnectResult Session establishment complete on server localhost/127.0.0.1:50604, sessionid = 0x13a6244f4200001, negotiated timeout = 10000
[junit4:junit4]   2> 46507 T1675 oascc.ConnectionManager.process Watcher org.apache.solr.common.cloud.ConnectionManager@51b2f91b name:ZooKeeperConnection Watcher:127.0.0.1:50604/solr got event WatchedEvent state:SyncConnected type:None path:null path:null type:None
[junit4:junit4]   2> 46507 T1630 oascc.ConnectionManager.waitForConnected Client is connected to ZooKeeper
[junit4:junit4]   2> 46507 T1630 oascc.SolrZkClient.makePath makePath: /collections/collection1
[junit4:junit4]   2> 46517 T1630 oascc.SolrZkClient.makePath makePath: /collections/collection1/shards
[junit4:junit4]   2> 46519 T1630 oascc.SolrZkClient.makePath makePath: /collections/control_collection
[junit4:junit4]   2> 46522 T1630 oascc.SolrZkClient.makePath makePath: /collections/control_collection/shards
[junit4:junit4]   2> 46531 T1630 oasc.AbstractZkTestCase.putConfig put /usr/home/hudson/hudson-slave/workspace/Lucene-Solr-Tests-trunk-Java6/solr/build/solr-core/test-files/solr/collection1/conf/solrconfig.xml to /configs/conf1/solrconfig.xml
[junit4:junit4]   2> 46531 T1630 oascc.SolrZkClient.makePath makePath: /configs/conf1/solrconfig.xml
[junit4:junit4]   2> 46536 T1630 oasc.AbstractZkTestCase.putConfig put /usr/home/hudson/hudson-slave/workspace/Lucene-Solr-Tests-trunk-Java6/solr/build/solr-core/test-files/solr/collection1/conf/schema.xml to /configs/conf1/schema.xml
[junit4:junit4]   2> 46537 T1630 oascc.SolrZkClient.makePath makePath: /configs/conf1/schema.xml
[junit4:junit4]   2> 46640 T1630 oasc.AbstractZkTestCase.putConfig put /usr/home/hudson/hudson-slave/workspace/Lucene-Solr-Tests-trunk-Java6/solr/build/solr-core/test-files/solr/collection1/conf/solrconfig.xml to /configs/conf1/solrconfig.xml
[junit4:junit4]   2> 46641 T1630 oascc.SolrZkClient.makePath makePath: /configs/conf1/solrconfig.xml
[junit4:junit4]   2> 46644 T1630 oasc.AbstractZkTestCase.putConfig put /usr/home/hudson/hudson-slave/workspace/Lucene-Solr-Tests-trunk-Java6/solr/build/solr-core/test-files/solr/collection1/conf/stopwords.txt to /configs/conf1/stopwords.txt
[junit4:junit4]   2> 46644 T1630 oascc.SolrZkClient.makePath makePath: /configs/conf1/stopwords.txt
[junit4:junit4]   2> 46655 T1630 oasc.AbstractZkTestCase.putConfig put /usr/home/hudson/hudson-slave/workspace/Lucene-Solr-Tests-trunk-Java6/solr/build/solr-core/test-files/solr/collection1/conf/protwords.txt to /configs/conf1/protwords.txt
[junit4:junit4]   2> 46655 T1630 oascc.SolrZkClient.makePath makePath: /configs/conf1/protwords.txt
[junit4:junit4]   2> 46658 T1630 oasc.AbstractZkTestCase.putConfig put /usr/home/hudson/hudson-slave/workspace/Lucene-Solr-Tests-trunk-Java6/solr/build/solr-core/test-files/solr/collection1/conf/currency.xml to /configs/conf1/currency.xml
[junit4:junit4]   2> 46658 T1630 oascc.SolrZkClient.makePath makePath: /configs/conf1/currency.xml
[junit4:junit4]   2> 46661 T1630 oasc.AbstractZkTestCase.putConfig put /usr/home/hudson/hudson-slave/workspace/Lucene-Solr-Tests-trunk-Java6/solr/build/solr-core/test-files/solr/collection1/conf/open-exchange-rates.json to /configs/conf1/open-exchange-rates.json
[junit4:junit4]   2> 46662 T1630 oascc.SolrZkClient.makePath makePath: /configs/conf1/open-exchange-rates.json
[junit4:junit4]   2> 46664 T1630 oasc.AbstractZkTestCase.putConfig put /usr/home/hudson/hudson-slave/workspace/Lucene-Solr-Tests-trunk-Java6/solr/build/solr-core/test-files/solr/collection1/conf/mapping-ISOLatin1Accent.txt to /configs/conf1/mapping-ISOLatin1Accent.txt
[junit4:junit4]   2> 46665 T1630 oascc.SolrZkClient.makePath makePath: /configs/conf1/mapping-ISOLatin1Accent.txt
[junit4:junit4]   2> 46668 T1630 oasc.AbstractZkTestCase.putConfig put /usr/home/hudson/hudson-slave/workspace/Lucene-Solr-Tests-trunk-Java6/solr/build/solr-core/test-files/solr/collection1/conf/old_synonyms.txt to /configs/conf1/old_synonyms.txt
[junit4:junit4]   2> 46669 T1630 oascc.SolrZkClient.makePath makePath: /configs/conf1/old_synonyms.txt
[junit4:junit4]   2> 46671 T1630 oasc.AbstractZkTestCase.putConfig put /usr/home/hudson/hudson-slave/workspace/Lucene-Solr-Tests-trunk-Java6/solr/build/solr-core/test-files/solr/collection1/conf/synonyms.txt to /configs/conf1/synonyms.txt
[junit4:junit4]   2> 46671 T1630 oascc.SolrZkClient.makePath makePath: /configs/conf1/synonyms.txt
[junit4:junit4]   2> 46674 T1671 oazs.PrepRequestProcessor.pRequest Processed session termination for sessionid: 0x13a6244f4200001
[junit4:junit4]   2> 46681 T1675 oaz.ClientCnxn$EventThread.run EventThread shut down
[junit4:junit4]   2> 46681 T1630 oaz.ZooKeeper.close Session: 0x13a6244f4200001 closed
[junit4:junit4]   2> 46682 T1668 oazs.NIOServerCnxn.closeSock Closed socket connection for client /140.211.11.196:50607 which had sessionid 0x13a6244f4200001
[junit4:junit4]   2> 46682 T1630 oasc.LeaderElectionIntegrationTest.setUp ####SETUP_START testSimpleSliceLeaderElection
[junit4:junit4]   2> 46684 T1630 oasc.SolrResourceLoader.locateSolrHome JNDI not configured for solr (NoInitialContextEx)
[junit4:junit4]   2> 46685 T1630 oasc.SolrResourceLoader.locateSolrHome using system property solr.solr.home: /usr/home/hudson/hudson-slave/workspace/Lucene-Solr-Tests-trunk-Java6/solr/build/solr-core/test-files/solr
[junit4:junit4]   2> 46685 T1630 oasc.CoreContainer$Initializer.initialize looking for solr.xml: /usr/home/hudson/hudson-slave/workspace/Lucene-Solr-Tests-trunk-Java6/solr/build/solr-core/test-files/solr/solr.xml
[junit4:junit4]   2> 46685 T1630 oasc.CoreContainer.<init> New CoreContainer 2029161402
[junit4:junit4]   2> 46686 T1630 oasc.CoreContainer.load Loading CoreContainer using Solr Home: '/usr/home/hudson/hudson-slave/workspace/Lucene-Solr-Tests-trunk-Java6/solr/build/solr-core/test-files/solr/'
[junit4:junit4]   2> 46686 T1630 oasc.SolrResourceLoader.<init> new SolrResourceLoader for directory: '/usr/home/hudson/hudson-slave/workspace/Lucene-Solr-Tests-trunk-Java6/solr/build/solr-core/test-files/solr/'
[junit4:junit4]   2> 46737 T1630 oasc.CoreContainer.load Registering Log Listener
[junit4:junit4]   2> 46752 T1630 oasc.CoreContainer.initZooKeeper Zookeeper client=127.0.0.1:50604/solr
[junit4:junit4]   2> 46753 T1630 oaz.ZooKeeper.<init> Initiating client connection, connectString=127.0.0.1:50604/solr sessionTimeout=3000 watcher=org.apache.solr.common.cloud.ConnectionManager@4d626cc4
[junit4:junit4]   2> 46754 T1676 oaz.ClientCnxn$SendThread.startConnect Opening socket connection to server /127.0.0.1:50604
[junit4:junit4]   2> 46754 T1630 oascc.ConnectionManager.waitForConnected Waiting for client to connect to ZooKeeper
[junit4:junit4]   2> 46755 T1676 oaz.ClientCnxn$SendThread.primeConnection Socket connection established to localhost/127.0.0.1:50604, initiating session
[junit4:junit4]   2> 46755 T1668 oazs.NIOServerCnxn$Factory.run Accepted socket connection from /140.211.11.196:50610
[junit4:junit4]   2> 46755 T1668 oazs.NIOServerCnxn.readConnectRequest Client attempting to establish new session at /140.211.11.196:50610
[junit4:junit4]   2> 46757 T1670 oazs.NIOServerCnxn.finishSessionInit Established session 0x13a6244f4200002 with negotiated timeout 3000 for client /140.211.11.196:50610
[junit4:junit4]   2> 46757 T1676 oaz.ClientCnxn$SendThread.readConnectResult Session establishment complete on server localhost/127.0.0.1:50604, sessionid = 0x13a6244f4200002, negotiated timeout = 3000
[junit4:junit4]   2> 46757 T1677 oascc.ConnectionManager.process Watcher org.apache.solr.common.cloud.ConnectionManager@4d626cc4 name:ZooKeeperConnection Watcher:127.0.0.1:50604/solr got event WatchedEvent state:SyncConnected type:None path:null path:null type:None
[junit4:junit4]   2> 46757 T1630 oascc.ConnectionManager.waitForConnected Client is connected to ZooKeeper
[junit4:junit4]   2> 46759 T1671 oazs.PrepRequestProcessor.pRequest Got user-level KeeperException when processing sessionid:0x13a6244f4200002 type:create cxid:0x2 zxid:0xfffffffffffffffe txntype:unknown reqpath:n/a Error Path:/solr/overseer Error:KeeperErrorCode = NodeExists for /solr/overseer
[junit4:junit4]   2> 46768 T1630 oascc.SolrZkClient.makePath makePath: /live_nodes
[junit4:junit4]   2> 46771 T1630 oasc.ZkController.createEphemeralLiveNode Register node as live in ZooKeeper:/live_nodes/127.0.0.1:7000_solr
[junit4:junit4]   2> 46771 T1671 oazs.PrepRequestProcessor.pRequest Got user-level KeeperException when processing sessionid:0x13a6244f4200002 type:delete cxid:0x7 zxid:0xfffffffffffffffe txntype:unknown reqpath:n/a Error Path:/solr/live_nodes/127.0.0.1:7000_solr Error:KeeperErrorCode = NoNode for /solr/live_nodes/127.0.0.1:7000_solr
[junit4:junit4]   2> 46779 T1630 oascc.SolrZkClient.makePath makePath: /live_nodes/127.0.0.1:7000_solr
[junit4:junit4]   2> 46782 T1630 oashc.HttpShardHandlerFactory.getParameter Setting socketTimeout to: 0
[junit4:junit4]   2> 46783 T1630 oashc.HttpShardHandlerFactory.getParameter Setting urlScheme to: http://
[junit4:junit4]   2> 46783 T1630 oashc.HttpShardHandlerFactory.getParameter Setting connTimeout to: 0
[junit4:junit4]   2> 46783 T1630 oashc.HttpShardHandlerFactory.getParameter Setting maxConnectionsPerHost to: 20
[junit4:junit4]   2> 46784 T1630 oashc.HttpShardHandlerFactory.getParameter Setting corePoolSize to: 0
[junit4:junit4]   2> 46784 T1630 oashc.HttpShardHandlerFactory.getParameter Setting maximumPoolSize to: 2147483647
[junit4:junit4]   2> 46784 T1630 oashc.HttpShardHandlerFactory.getParameter Setting maxThreadIdleTime to: 5
[junit4:junit4]   2> 46785 T1630 oashc.HttpShardHandlerFactory.getParameter Setting sizeOfQueue to: -1
[junit4:junit4]   2> 46785 T1630 oashc.HttpShardHandlerFactory.getParameter Setting fairnessPolicy to: false
[junit4:junit4]   2> 46785 T1630 oascsi.HttpClientUtil.createClient Creating new http client, config:maxConnectionsPerHost=20&maxConnections=10000&socketTimeout=0&connTimeout=0&retry=false
[junit4:junit4]   2> 46799 T1630 oascc.SolrZkClient.makePath makePath: /overseer_elect/election
[junit4:junit4]   2> 46810 T1671 oazs.PrepRequestProcessor.pRequest Got user-level KeeperException when processing sessionid:0x13a6244f4200002 type:delete cxid:0x15 zxid:0xfffffffffffffffe txntype:unknown reqpath:n/a Error Path:/solr/overseer_elect/leader Error:KeeperErrorCode = NoNode for /solr/overseer_elect/leader
[junit4:junit4]   2> 46811 T1630 oascc.SolrZkClient.makePath makePath: /overseer_elect/leader
[junit4:junit4]   2> 46812 T1630 oasc.Overseer.start Overseer (id=88491190980182018-127.0.0.1:7000_solr-n_0000000000) starting
[junit4:junit4]   2> 46813 T1671 oazs.PrepRequestProcessor.pRequest Got user-level KeeperException when processing sessionid:0x13a6244f4200002 type:create cxid:0x1a zxid:0xfffffffffffffffe txntype:unknown reqpath:n/a Error Path:/solr/overseer Error:KeeperErrorCode = NodeExists for /solr/overseer
[junit4:junit4]   2> 46813 T1671 oazs.PrepRequestProcessor.pRequest Got user-level KeeperException when processing sessionid:0x13a6244f4200002 type:create cxid:0x1b zxid:0xfffffffffffffffe txntype:unknown reqpath:n/a Error Path:/solr/overseer Error:KeeperErrorCode = NodeExists for /solr/overseer
[junit4:junit4]   2> 46814 T1671 oazs.PrepRequestProcessor.pRequest Got user-level KeeperException when processing sessionid:0x13a6244f4200002 type:create cxid:0x1c zxid:0xfffffffffffffffe txntype:unknown reqpath:n/a Error Path:/solr/overseer Error:KeeperErrorCode = NodeExists for /solr/overseer
[junit4:junit4]   2> 46815 T1671 oazs.PrepRequestProcessor.pRequest Got user-level KeeperException when processing sessionid:0x13a6244f4200002 type:create cxid:0x1d zxid:0xfffffffffffffffe txntype:unknown reqpath:n/a Error Path:/solr/overseer Error:KeeperErrorCode = NodeExists for /solr/overseer
[junit4:junit4]   2> 46816 T1679 oasc.OverseerCollectionProcessor.run Process current queue of collection creations
[junit4:junit4]   2> 46816 T1630 oascc.SolrZkClient.makePath makePath: /clusterstate.json
[junit4:junit4]   2> 46818 T1630 oascc.ZkStateReader.createClusterStateWatchersAndUpdate Updating cluster state from ZooKeeper... 
[junit4:junit4]   2> 46819 T1678 oasc.Overseer$ClusterStateUpdater.run Starting to work on the main queue
[junit4:junit4]   2> 46824 T1630 oasc.CoreContainer.create Creating SolrCore 'collection1' using instanceDir: /usr/home/hudson/hudson-slave/workspace/Lucene-Solr-Tests-trunk-Java6/solr/build/solr-core/test-files/solr/collection1
[junit4:junit4]   2> 46825 T1630 oasc.ZkController.createCollectionZkNode Check for collection zkNode:collection1
[junit4:junit4]   2> 46825 T1630 oasc.ZkController.createCollectionZkNode Collection zkNode exists
[junit4:junit4]   2> 46826 T1630 oasc.ZkController.readConfigName Load collection config from:/collections/collection1
[junit4:junit4]   2> 46827 T1630 oasc.SolrResourceLoader.<init> new SolrResourceLoader for directory: '/usr/home/hudson/hudson-slave/workspace/Lucene-Solr-Tests-trunk-Java6/solr/build/solr-core/test-files/solr/collection1/'
[junit4:junit4]   2> 46828 T1630 oasc.SolrResourceLoader.replaceClassLoader Adding 'file:/usr/home/hudson/hudson-slave/workspace/Lucene-Solr-Tests-trunk-Java6/solr/build/solr-core/test-files/solr/collection1/lib/classes/' to classloader
[junit4:junit4]   2> 46828 T1630 oasc.SolrResourceLoader.replaceClassLoader Adding 'file:/usr/home/hudson/hudson-slave/workspace/Lucene-Solr-Tests-trunk-Java6/solr/build/solr-core/test-files/solr/collection1/lib/README' to classloader
[junit4:junit4]   2> 46879 T1630 oasc.SolrConfig.<init> Using Lucene MatchVersion: LUCENE_50
[junit4:junit4]   2> 46949 T1630 oasc.SolrConfig.<init> Loaded SolrConfig: solrconfig.xml
[junit4:junit4]   2> 47050 T1630 oass.IndexSchema.readSchema Reading Solr Schema
[junit4:junit4]   2> 47057 T1630 oass.IndexSchema.readSchema Schema name=test
[junit4:junit4]   2> 47702 T1630 oass.OpenExchangeRatesOrgProvider.init Initialized with rates=open-exchange-rates.json, refreshInterval=1440.
[junit4:junit4]   2> 47713 T1630 oass.IndexSchema.readSchema default search field in schema is text
[junit4:junit4]   2> 47718 T1630 oass.IndexSchema.readSchema unique key field: id
[junit4:junit4]   2> 47730 T1630 oass.FileExchangeRateProvider.reload Reloading exchange rates from file currency.xml
[junit4:junit4]   2> 47733 T1630 oass.FileExchangeRateProvider.reload Reloading exchange rates from file currency.xml
[junit4:junit4]   2> 47736 T1630 oass.OpenExchangeRatesOrgProvider.reload Reloading exchange rates from open-exchange-rates.json
[junit4:junit4]   2> 47738 T1630 oass.OpenExchangeRatesOrgProvider.reload Reloading exchange rates from open-exchange-rates.json
[junit4:junit4]   2> 47738 T1630 oasc.SolrCore.<init> [collection1] Opening new SolrCore at /usr/home/hudson/hudson-slave/workspace/Lucene-Solr-Tests-trunk-Java6/solr/build/solr-core/test-files/solr/collection1/, dataDir=/usr/home/hudson/hudson-slave/workspace/Lucene-Solr-Tests-trunk-Java6/solr/build/solr-core/test/J1/./solrtest-LeaderElectionIntegrationTest-1350268417050/data_7000/
[junit4:junit4]   2> 47739 T1630 oasc.JmxMonitoredMap.<init> JMX monitoring is enabled. Adding Solr mbeans to JMX Server: com.sun.jmx.mbeanserver.JmxMBeanServer@7d0c3a08
[junit4:junit4]   2> 47740 T1630 oasc.SolrCore.getNewIndexDir New index directory detected: old=null new=/usr/home/hudson/hudson-slave/workspace/Lucene-Solr-Tests-trunk-Java6/solr/build/solr-core/test/J1/./solrtest-LeaderElectionIntegrationTest-1350268417050/data_7000/index/
[junit4:junit4]   2> 47740 T1630 oasc.SolrCore.initIndex WARNING [collection1] Solr index directory '/usr/home/hudson/hudson-slave/workspace/Lucene-Solr-Tests-trunk-Java6/solr/build/solr-core/test/J1/./solrtest-LeaderElectionIntegrationTest-1350268417050/data_7000/index' doesn't exist. Creating new index...
[junit4:junit4]   2> 47741 T1630 oasc.CachingDirectoryFactory.get return new directory for /usr/home/hudson/hudson-slave/workspace/Lucene-Solr-Tests-trunk-Java6/solr/build/solr-core/test/J1/./solrtest-LeaderElectionIntegrationTest-1350268417050/data_7000/index forceNew:false
[junit4:junit4]   2> 47743 T1630 oasc.SolrDeletionPolicy.onCommit SolrDeletionPolicy.onCommit: commits:num=1
[junit4:junit4]   2> 		commit{dir=MockDirWrapper(org.apache.lucene.store.RAMDirectory@ceabd9c lockFactory=org.apache.lucene.store.NativeFSLockFactory@1a0ccdf7),segFN=segments_1,generation=1,filenames=[segments_1]
[junit4:junit4]   2> 47744 T1630 oasc.SolrDeletionPolicy.updateCommits newest commit = 1
[junit4:junit4]   2> 47744 T1630 oasc.SolrCore.initWriters created xml: solr.XMLResponseWriter
[junit4:junit4]   2> 47747 T1630 oasup.UpdateRequestProcessorChain.init inserting DistributedUpdateProcessorFactory into updateRequestProcessorChain "dedupe"
[junit4:junit4]   2> 47747 T1630 oasup.UpdateRequestProcessorChain.init inserting DistributedUpdateProcessorFactory into updateRequestProcessorChain "dedupe-allfields"
[junit4:junit4]   2> 47748 T1630 oasup.UpdateRequestProcessorChain.init inserting DistributedUpdateProcessorFactory into updateRequestProcessorChain "stored_sig"
[junit4:junit4]   2> 47748 T1630 oasup.UpdateRequestProcessorChain.init inserting DistributedUpdateProcessorFactory into updateRequestProcessorChain "uniq-fields"
[junit4:junit4]   2> 47748 T1630 oasup.UpdateRequestProcessorChain.init inserting DistributedUpdateProcessorFactory into updateRequestProcessorChain "distrib-dup-test-chain-implicit"
[junit4:junit4]   2> 47749 T1630 oasc.RequestHandlers.initHandlersFromConfig adding lazy requestHandler: solr.ReplicationHandler
[junit4:junit4]   2> 47749 T1630 oasc.RequestHandlers.initHandlersFromConfig created /replication: solr.ReplicationHandler
[junit4:junit4]   2> 47749 T1630 oasc.RequestHandlers.initHandlersFromConfig created standard: solr.StandardRequestHandler
[junit4:junit4]   2> 47750 T1630 oasc.RequestHandlers.initHandlersFromConfig created /get: solr.RealTimeGetHandler
[junit4:junit4]   2> 47750 T1630 oasc.RequestHandlers.initHandlersFromConfig created dismax: solr.SearchHandler
[junit4:junit4]   2> 47750 T1630 oasc.RequestHandlers.initHandlersFromConfig created mock: org.apache.solr.core.MockQuerySenderListenerReqHandler
[junit4:junit4]   2> 47751 T1630 oasc.RequestHandlers.initHandlersFromConfig created /admin/: org.apache.solr.handler.admin.AdminHandlers
[junit4:junit4]   2> 47751 T1630 oasc.RequestHandlers.initHandlersFromConfig created defaults: solr.StandardRequestHandler
[junit4:junit4]   2> 47751 T1630 oasc.RequestHandlers.initHandlersFromConfig adding lazy requestHandler: solr.StandardRequestHandler
[junit4:junit4]   2> 47752 T1630 oasc.RequestHandlers.initHandlersFromConfig created lazy: solr.StandardRequestHandler
[junit4:junit4]   2> 47752 T1630 oasc.RequestHandlers.initHandlersFromConfig created /update: solr.UpdateRequestHandler
[junit4:junit4]   2> 47752 T1630 oasc.RequestHandlers.initHandlersFromConfig created /terms: org.apache.solr.handler.component.SearchHandler
[junit4:junit4]   2> 47753 T1630 oasc.RequestHandlers.initHandlersFromConfig created spellCheckCompRH: org.apache.solr.handler.component.SearchHandler
[junit4:junit4]   2> 47753 T1630 oasc.RequestHandlers.initHandlersFromConfig created spellCheckCompRH_Direct: org.apache.solr.handler.component.SearchHandler
[junit4:junit4]   2> 47753 T1630 oasc.RequestHandlers.initHandlersFromConfig created spellCheckWithWordbreak: org.apache.solr.handler.component.SearchHandler
[junit4:junit4]   2> 47754 T1630 oasc.RequestHandlers.initHandlersFromConfig created spellCheckWithWordbreak_Direct: org.apache.solr.handler.component.SearchHandler
[junit4:junit4]   2> 47754 T1630 oasc.RequestHandlers.initHandlersFromConfig created spellCheckCompRH1: org.apache.solr.handler.component.SearchHandler
[junit4:junit4]   2> 47755 T1630 oasc.RequestHandlers.initHandlersFromConfig created tvrh: org.apache.solr.handler.component.SearchHandler
[junit4:junit4]   2> 47756 T1630 oasc.RequestHandlers.initHandlersFromConfig created /mlt: solr.MoreLikeThisHandler
[junit4:junit4]   2> 47756 T1630 oasc.RequestHandlers.initHandlersFromConfig created /debug/dump: solr.DumpRequestHandler
[junit4:junit4]   2> 47763 T1630 oashl.XMLLoader.init xsltCacheLifetimeSeconds=60
[junit4:junit4]   2> 47766 T1630 oasc.SolrCore.initDeprecatedSupport WARNING solrconfig.xml uses deprecated <admin/gettableFiles>, Please update your config to use the ShowFileRequestHandler.
[junit4:junit4]   2> 47767 T1630 oasc.SolrCore.initDeprecatedSupport WARNING adding ShowFileRequestHandler with hidden files: [SCHEMA.XML, OLD_SYNONYMS.TXT, STOPWORDS.TXT, PROTWORDS.TXT, OPEN-EXCHANGE-RATES.JSON, SYNONYMS.TXT, CURRENCY.XML, MAPPING-ISOLATIN1ACCENT.TXT]
[junit4:junit4]   2> 47769 T1630 oass.SolrIndexSearcher.<init> Opening Searcher@7b2e3720 main
[junit4:junit4]   2> 47769 T1630 oass.SolrIndexSearcher.getIndexDir WARNING WARNING: Directory impl does not support setting indexDir: org.apache.lucene.store.MockDirectoryWrapper
[junit4:junit4]   2> 47770 T1630 oasu.CommitTracker.<init> Hard AutoCommit: disabled
[junit4:junit4]   2> 47770 T1630 oasu.CommitTracker.<init> Soft AutoCommit: disabled
[junit4:junit4]   2> 47771 T1630 oashc.SpellCheckComponent.inform Initializing spell checkers
[junit4:junit4]   2> 47784 T1630 oass.DirectSolrSpellChecker.init init: {name=direct,classname=DirectSolrSpellChecker,field=lowerfilt,minQueryLength=3}
[junit4:junit4]   2> 47842 T1680 oasc.SolrCore.registerSearcher [collection1] Registered new searcher Searcher@7b2e3720 main{StandardDirectoryReader(segments_1:1)}
[junit4:junit4]   2> 47846 T1671 oazs.PrepRequestProcessor.pRequest Got user-level KeeperException when processing sessionid:0x13a6244f4200002 type:create cxid:0x56 zxid:0xfffffffffffffffe txntype:unknown reqpath:n/a Error Path:/solr/overseer/queue Error:KeeperErrorCode = NoNode for /solr/overseer/queue
[junit4:junit4]   2> 47858 T1630 oasc.CoreContainer.register registering core: collection1
[junit4:junit4]   2> 47859 T1630 oasc.ZkController.register Register shard - core:collection1 address:http://127.0.0.1:7000/solr shardId:shard1
[junit4:junit4]   2> 47860 T1630 oascc.SolrZkClient.makePath makePath: /collections/collection1/leader_elect/shard1/election
[junit4:junit4]   2> 47864 T1671 oazs.PrepRequestProcessor.pRequest Got user-level KeeperException when processing sessionid:0x13a6244f4200002 type:delete cxid:0x65 zxid:0xfffffffffffffffe txntype:unknown reqpath:n/a Error Path:/solr/collections/collection1/leaders Error:KeeperErrorCode = NoNode for /solr/collections/collection1/leaders
[junit4:junit4]   2> 47865 T1630 oasc.ShardLeaderElectionContext.runLeaderProcess Running the leader process.
[junit4:junit4]   2> 47865 T1671 oazs.PrepRequestProcessor.pRequest Got user-level KeeperException when processing sessionid:0x13a6244f4200002 type:create cxid:0x66 zxid:0xfffffffffffffffe txntype:unknown reqpath:n/a Error Path:/solr/overseer Error:KeeperErrorCode = NodeExists for /solr/overseer
[junit4:junit4]   2> 48326 T1678 oascc.ZkStateReader.updateClusterState Updating cloud state from ZooKeeper... 
[junit4:junit4]   2> 48326 T1671 oazs.PrepRequestProcessor.pRequest Got user-level KeeperException when processing sessionid:0x13a6244f4200002 type:create cxid:0x6d zxid:0xfffffffffffffffe txntype:unknown reqpath:n/a Error Path:/solr/overseer/queue-work Error:KeeperErrorCode = NoNode for /solr/overseer/queue-work
[junit4:junit4]   2> 48336 T1677 oascc.ZkStateReader$2.process A cluster state change has occurred - updating...
[junit4:junit4]   2> 48368 T1630 oasc.ShardLeaderElectionContext.waitForReplicasToComeUp Enough replicas found to continue.
[junit4:junit4]   2> 48369 T1630 oasc.ShardLeaderElectionContext.runLeaderProcess I may be the new leader - try and sync
[junit4:junit4]   2> 48369 T1630 oasc.ShardLeaderElectionContext.runLeaderProcess I am the new leader: http://127.0.0.1:7000/solr/collection1/
[junit4:junit4]   2> 48369 T1630 oascc.SolrZkClient.makePath makePath: /collections/collection1/leaders/shard1
[junit4:junit4]   2> 48383 T1671 oazs.PrepRequestProcessor.pRequest Got user-level KeeperException when processing sessionid:0x13a6244f4200002 type:create cxid:0x8b zxid:0xfffffffffffffffe txntype:unknown reqpath:n/a Error Path:/solr/overseer Error:KeeperErrorCode = NodeExists for /solr/overseer
[junit4:junit4]   2> 48455 T1641 oasc.SolrException.log SEVERE There was a problem finding the leader in zk
[junit4:junit4]   2> 48456 T1641 oasc.SolrException.log SEVERE There was a problem finding the leader in zk:org.apache.solr.common.SolrException: CoreContainer is shutdown
[junit4:junit4]   2> 		at org.apache.solr.cloud.ZkController.getLeaderProps(ZkController.java:706)
[junit4:junit4]   2> 		at org.apache.solr.cloud.ZkController.getLeaderProps(ZkController.java:673)
[junit4:junit4]   2> 		at org.apache.solr.cloud.ZkController.waitForLeaderToSeeDownState(ZkController.java:1070)
[junit4:junit4]   2> 		at org.apache.solr.cloud.ZkController.registerAllCoresAsDown(ZkController.java:273)
[junit4:junit4]   2> 		at org.apache.solr.cloud.ZkController.access$100(ZkController.java:82)
[junit4:junit4]   2> 		at org.apache.solr.cloud.ZkController$1.command(ZkController.java:190)
[junit4:junit4]   2> 		at org.apache.solr.common.cloud.ConnectionManager$1.update(ConnectionManager.java:116)
[junit4:junit4]   2> 		at org.apache.solr.common.cloud.DefaultConnectionStrategy.reconnect(DefaultConnectionStrategy.java:46)
[junit4:junit4]   2> 		at org.apache.solr.common.cloud.ConnectionManager.process(ConnectionManager.java:90)
[junit4:junit4]   2> 		at org.apache.zookeeper.ClientCnxn$EventThread.processEvent(ClientCnxn.java:526)
[junit4:junit4]   2> 		at org.apache.zookeeper.ClientCnxn$EventThread.run(ClientCnxn.java:502)
[junit4:junit4]   2> 	
[junit4:junit4]   2> 48841 T1678 oascc.ZkStateReader.updateClusterState Updating cloud state from ZooKeeper... 
[junit4:junit4]   2> 48851 T1677 oascc.ZkStateReader$2.process A cluster state change has occurred - updating...
[junit4:junit4]   2> 48902 T1630 oasc.ZkController.register We are http://127.0.0.1:7000/solr/collection1/ and leader is http://127.0.0.1:7000/solr/collection1/
[junit4:junit4]   2> 48902 T1630 oasc.ZkController.checkRecovery WARNING Skipping recovery according to sys prop solrcloud.skip.autorecovery
[junit4:junit4]   2> 48904 T1630 oascc.ZkStateReader.updateClusterState Updating cloud state from ZooKeeper... 
[junit4:junit4]   2> 48906 T1630 oasc.SolrResourceLoader.locateSolrHome JNDI not configured for solr (NoInitialContextEx)
[junit4:junit4]   2> 48906 T1630 oasc.SolrResourceLoader.locateSolrHome using system property solr.solr.home: /usr/home/hudson/hudson-slave/workspace/Lucene-Solr-Tests-trunk-Java6/solr/build/solr-core/test-files/solr
[junit4:junit4]   2> 48906 T1630 oasc.CoreContainer$Initializer.initialize looking for solr.xml: /usr/home/hudson/hudson-slave/workspace/Lucene-Solr-Tests-trunk-Java6/solr/build/solr-core/test-files/solr/solr.xml
[junit4:junit4]   2> 48906 T1630 oasc.CoreContainer.<init> New CoreContainer 201358407
[junit4:junit4]   2> 48907 T1630 oasc.CoreContainer.load Loading CoreContainer using Solr Home: '/usr/home/hudson/hudson-slave/workspace/Lucene-Solr-Tests-trunk-Java6/solr/build/solr-core/test-files/solr/'
[junit4:junit4]   2> 48907 T1630 oasc.SolrResourceLoader.<init> new SolrResourceLoader for directory: '/usr/home/hudson/hudson-slave/workspace/Lucene-Solr-Tests-trunk-Java6/solr/build/solr-core/test-files/solr/'
[junit4:junit4]   2> 48936 T1630 oasc.CoreContainer.load Registering Log Listener
[junit4:junit4]   2> 48946 T1630 oasc.CoreContainer.initZooKeeper Zookeeper client=127.0.0.1:50604/solr
[junit4:junit4]   2> 48946 T1630 oaz.ZooKeeper.<init> Initiating client connection, connectString=127.0.0.1:50604/solr sessionTimeout=3000 watcher=org.apache.solr.common.cloud.ConnectionManager@3d8b3ab6
[junit4:junit4]   2> 48947 T1681 oaz.ClientCnxn$SendThread.startConnect Opening socket connection to server /127.0.0.1:50604
[junit4:junit4]   2> 48947 T1630 oascc.ConnectionManager.waitForConnected Waiting for client to connect to ZooKeeper
[junit4:junit4]   2> 48948 T1681 oaz.ClientCnxn$SendThread.primeConnection Socket connection established to localhost/127.0.0.1:50604, initiating session
[junit4:junit4]   2> 48948 T1668 oazs.NIOServerCnxn$Factory.run Accepted socket connection from /140.211.11.196:50622
[junit4:junit4]   2> 48948 T1668 oazs.NIOServerCnxn.readConnectRequest Client attempting to establish new session at /140.211.11.196:50622
[junit4:junit4]   2> 48949 T1670 oazs.NIOServerCnxn.finishSessionInit Established session 0x13a6244f4200003 with negotiated timeout 3000 for client /140.211.11.196:50622
[junit4:junit4]   2> 48949 T1681 oaz.ClientCnxn$SendThread.readConnectResult Session establishment complete on server localhost/127.0.0.1:50604, sessionid = 0x13a6244f4200003, negotiated timeout = 3000
[junit4:junit4]   2> 48949 T1682 oascc.ConnectionManager.process Watcher 

[...truncated too long message...]

4]   2> 	at org.apache.zookeeper.ClientCnxn$EventThread.processEvent(ClientCnxn.java:526)
[junit4:junit4]   2> 	at org.apache.zookeeper.ClientCnxn$EventThread.run(ClientCnxn.java:502)
[junit4:junit4]   2> 
[junit4:junit4]   2> 58912 T1694 oasc.LeaderElector$1.process WARNING  java.lang.RuntimeException: org.apache.zookeeper.KeeperException$SessionExpiredException: KeeperErrorCode = Session expired for /overseer
[junit4:junit4]   2> 	at org.apache.solr.cloud.Overseer.createOverseerNode(Overseer.java:550)
[junit4:junit4]   2> 	at org.apache.solr.cloud.Overseer.getInQueue(Overseer.java:523)
[junit4:junit4]   2> 	at org.apache.solr.cloud.Overseer$ClusterStateUpdater.<init>(Overseer.java:70)
[junit4:junit4]   2> 	at org.apache.solr.cloud.Overseer.start(Overseer.java:495)
[junit4:junit4]   2> 	at org.apache.solr.cloud.OverseerElectionContext.runLeaderProcess(ElectionContext.java:373)
[junit4:junit4]   2> 	at org.apache.solr.cloud.LeaderElector.runIamLeaderProcess(LeaderElector.java:151)
[junit4:junit4]   2> 	at org.apache.solr.cloud.LeaderElector.checkIfIamLeader(LeaderElector.java:95)
[junit4:junit4]   2> 	at org.apache.solr.cloud.LeaderElector.access$000(LeaderElector.java:55)
[junit4:junit4]   2> 	at org.apache.solr.cloud.LeaderElector$1.process(LeaderElector.java:124)
[junit4:junit4]   2> 	at org.apache.zookeeper.ClientCnxn$EventThread.processEvent(ClientCnxn.java:526)
[junit4:junit4]   2> 	at org.apache.zookeeper.ClientCnxn$EventThread.run(ClientCnxn.java:502)
[junit4:junit4]   2> Caused by: org.apache.zookeeper.KeeperException$SessionExpiredException: KeeperErrorCode = Session expired for /overseer
[junit4:junit4]   2> 	at org.apache.zookeeper.KeeperException.create(KeeperException.java:118)
[junit4:junit4]   2> 	at org.apache.zookeeper.KeeperException.create(KeeperException.java:42)
[junit4:junit4]   2> 	at org.apache.zookeeper.ZooKeeper.create(ZooKeeper.java:643)
[junit4:junit4]   2> 	at org.apache.solr.common.cloud.SolrZkClient$9.execute(SolrZkClient.java:279)
[junit4:junit4]   2> 	at org.apache.solr.common.cloud.SolrZkClient$9.execute(SolrZkClient.java:276)
[junit4:junit4]   2> 	at org.apache.solr.common.cloud.ZkCmdExecutor.retryOperation(ZkCmdExecutor.java:63)
[junit4:junit4]   2> 	at org.apache.solr.common.cloud.SolrZkClient.create(SolrZkClient.java:276)
[junit4:junit4]   2> 	at org.apache.solr.cloud.Overseer.createOverseerNode(Overseer.java:541)
[junit4:junit4]   2> 	... 10 more
[junit4:junit4]   2> 
[junit4:junit4]   2> 58912 T1694 oascc.ZkStateReader$3.process Updating live nodes
[junit4:junit4]   2> 58912 T1694 oascc.ZkStateReader$3.process WARNING ZooKeeper watch triggered, but Solr cannot talk to ZK
[junit4:junit4]   2> 58912 T1694 oaz.ClientCnxn$EventThread.run EventThread shut down
[junit4:junit4]   2> 60108 T1630 oas.SolrTestCaseJ4.deleteCore ###deleteCore
[junit4:junit4]   2> 60173 T1629 ccr.ThreadLeakControl.checkThreadLeaks WARNING Will linger awaiting termination of 1 leaked thread(s).
[junit4:junit4]   2> 60467 T1641 oasc.SolrException.log SEVERE :org.apache.solr.common.SolrException: There was a problem finding the leader in zk
[junit4:junit4]   2> 		at org.apache.solr.cloud.ZkController.waitForLeaderToSeeDownState(ZkController.java:1080)
[junit4:junit4]   2> 		at org.apache.solr.cloud.ZkController.registerAllCoresAsDown(ZkController.java:273)
[junit4:junit4]   2> 		at org.apache.solr.cloud.ZkController.access$100(ZkController.java:82)
[junit4:junit4]   2> 		at org.apache.solr.cloud.ZkController$1.command(ZkController.java:190)
[junit4:junit4]   2> 		at org.apache.solr.common.cloud.ConnectionManager$1.update(ConnectionManager.java:116)
[junit4:junit4]   2> 		at org.apache.solr.common.cloud.DefaultConnectionStrategy.reconnect(DefaultConnectionStrategy.java:46)
[junit4:junit4]   2> 		at org.apache.solr.common.cloud.ConnectionManager.process(ConnectionManager.java:90)
[junit4:junit4]   2> 		at org.apache.zookeeper.ClientCnxn$EventThread.processEvent(ClientCnxn.java:526)
[junit4:junit4]   2> 		at org.apache.zookeeper.ClientCnxn$EventThread.run(ClientCnxn.java:502)
[junit4:junit4]   2> 	
[junit4:junit4]   2> 65468 T1641 oasc.SolrException.log SEVERE :org.apache.zookeeper.KeeperException$SessionExpiredException: KeeperErrorCode = Session expired for /overseer_elect/election/88491187940622345-127.0.0.1:7000_solr-n_
[junit4:junit4]   2> 		at org.apache.zookeeper.KeeperException.create(KeeperException.java:118)
[junit4:junit4]   2> 		at org.apache.zookeeper.KeeperException.create(KeeperException.java:42)
[junit4:junit4]   2> 		at org.apache.zookeeper.ZooKeeper.create(ZooKeeper.java:643)
[junit4:junit4]   2> 		at org.apache.solr.common.cloud.SolrZkClient.create(SolrZkClient.java:284)
[junit4:junit4]   2> 		at org.apache.solr.cloud.LeaderElector.joinElection(LeaderElector.java:215)
[junit4:junit4]   2> 		at org.apache.solr.cloud.ZkController$1.command(ZkController.java:194)
[junit4:junit4]   2> 		at org.apache.solr.common.cloud.ConnectionManager$1.update(ConnectionManager.java:116)
[junit4:junit4]   2> 		at org.apache.solr.common.cloud.DefaultConnectionStrategy.reconnect(DefaultConnectionStrategy.java:46)
[junit4:junit4]   2> 		at org.apache.solr.common.cloud.ConnectionManager.process(ConnectionManager.java:90)
[junit4:junit4]   2> 		at org.apache.zookeeper.ClientCnxn$EventThread.processEvent(ClientCnxn.java:526)
[junit4:junit4]   2> 		at org.apache.zookeeper.ClientCnxn$EventThread.run(ClientCnxn.java:502)
[junit4:junit4]   2> 	
[junit4:junit4]   2> 65468 T1641 oasc.SolrException.log SEVERE Reconnect to ZooKeeper failed:org.apache.solr.common.cloud.ZooKeeperException: 
[junit4:junit4]   2> 		at org.apache.solr.cloud.ZkController$1.command(ZkController.java:224)
[junit4:junit4]   2> 		at org.apache.solr.common.cloud.ConnectionManager$1.update(ConnectionManager.java:116)
[junit4:junit4]   2> 		at org.apache.solr.common.cloud.DefaultConnectionStrategy.reconnect(DefaultConnectionStrategy.java:46)
[junit4:junit4]   2> 		at org.apache.solr.common.cloud.ConnectionManager.process(ConnectionManager.java:90)
[junit4:junit4]   2> 		at org.apache.zookeeper.ClientCnxn$EventThread.processEvent(ClientCnxn.java:526)
[junit4:junit4]   2> 		at org.apache.zookeeper.ClientCnxn$EventThread.run(ClientCnxn.java:502)
[junit4:junit4]   2> 	Caused by: org.apache.zookeeper.KeeperException$SessionExpiredException: KeeperErrorCode = Session expired for /overseer_elect/election/88491187940622345-127.0.0.1:7000_solr-n_
[junit4:junit4]   2> 		at org.apache.zookeeper.KeeperException.create(KeeperException.java:118)
[junit4:junit4]   2> 		at org.apache.zookeeper.KeeperException.create(KeeperException.java:42)
[junit4:junit4]   2> 		at org.apache.zookeeper.ZooKeeper.create(ZooKeeper.java:643)
[junit4:junit4]   2> 		at org.apache.solr.common.cloud.SolrZkClient.create(SolrZkClient.java:284)
[junit4:junit4]   2> 		at org.apache.solr.cloud.LeaderElector.joinElection(LeaderElector.java:215)
[junit4:junit4]   2> 		at org.apache.solr.cloud.ZkController$1.command(ZkController.java:194)
[junit4:junit4]   2> 		... 5 more
[junit4:junit4]   2> 	
[junit4:junit4]   2> 65469 T1641 oascc.DefaultConnectionStrategy.reconnect Reconnect to ZooKeeper failed
[junit4:junit4]   2> 65469 T1641 oascc.ConnectionManager.process Connected:true
[junit4:junit4]   2> 65469 T1641 oaz.ClientCnxn$EventThread.run EventThread shut down
[junit4:junit4]   2> NOTE: test params are: codec=Lucene41: {}, sim=RandomSimilarityProvider(queryNorm=true,coord=no): {}, locale=ar_DZ, timezone=America/Argentina/Cordoba
[junit4:junit4]   2> NOTE: FreeBSD 9.0-RELEASE amd64/Sun Microsystems Inc. 1.6.0_32 (64-bit)/cpus=16,threads=1,free=106661616,total=236388352
[junit4:junit4]   2> NOTE: All tests run in this JVM: [IndexSchemaRuntimeFieldTest, TestReplicationHandler, TermVectorComponentTest, TestFunctionQuery, TestWriterPerf, TestRealTimeGet, XmlUpdateRequestHandlerTest, StatelessScriptUpdateProcessorFactoryTest, LeaderElectionTest, TestPropInject, BasicZkTest, ZkNodePropsTest, TestMultiCoreConfBootstrap, HighlighterTest, QueryParsingTest, CoreContainerCoreInitFailuresTest, FieldMutatingUpdateProcessorTest, IndexReaderFactoryTest, TestCSVResponseWriter, PeerSyncTest, TestCodecSupport, SuggesterTSTTest, TestSolrJ, TestReversedWildcardFilterFactory, TestQuerySenderListener, TestDistributedSearch, TestSolrXMLSerializer, DirectUpdateHandlerTest, DocumentAnalysisRequestHandlerTest, AnalysisAfterCoreReloadTest, TimeZoneUtilsTest, PrimUtilsTest, BadIndexSchemaTest, TestBM25SimilarityFactory, TestUtils, RequiredFieldsTest, TestJmxIntegration, TestPhraseSuggestions, OverseerTest, TestSolr4Spatial, DisMaxRequestHandlerTest, TestTrie, DocumentBuilderTest, DOMUtilTest, TestOmitPositions, TestLRUCache, StandardRequestHandlerTest, UUIDFieldTest, FullSolrCloudDistribCmdsTest, StatsComponentTest, TestValueSourceCache, TestBinaryField, TestSort, SolrCoreTest, RecoveryZkTest, SpellCheckComponentTest, LeaderElectionIntegrationTest]
[junit4:junit4] Completed on J1 in 65.72s, 2 tests, 1 failure <<< FAILURES!

[...truncated 350 lines...]
BUILD FAILED
/usr/home/hudson/hudson-slave/workspace/Lucene-Solr-Tests-trunk-Java6/build.xml:38: The following error occurred while executing this line:
/usr/home/hudson/hudson-slave/workspace/Lucene-Solr-Tests-trunk-Java6/solr/build.xml:180: The following error occurred while executing this line:
/usr/home/hudson/hudson-slave/workspace/Lucene-Solr-Tests-trunk-Java6/lucene/module-build.xml:61: The following error occurred while executing this line:
/usr/home/hudson/hudson-slave/workspace/Lucene-Solr-Tests-trunk-Java6/lucene/common-build.xml:1143: The following error occurred while executing this line:
/usr/home/hudson/hudson-slave/workspace/Lucene-Solr-Tests-trunk-Java6/lucene/common-build.xml:816: There were test failures: 231 suites, 957 tests, 1 failure, 21 ignored (3 assumptions)

Total time: 28 minutes 57 seconds
Build step 'Invoke Ant' marked build as failure
Archiving artifacts
Recording test results
Email was triggered for: Failure
Sending email for trigger: Failure



Mime
View raw message