lucene-dev mailing list archives

Site index · List index
Message view « Date » · « Thread »
Top « Date » · « Thread »
From Charlie Cron <hudsonsevilt...@gmail.com>
Subject Build failed in Jenkins: fast-io-beasting #6067
Date Sun, 28 Oct 2012 00:34:29 GMT
See <http://sierranevada.servebeer.com/job/fast-io-beasting/6067/>

------------------------------------------
[...truncated 13470 lines...]
[junit4:junit4]   2> 7222453 T48 oascc.SolrZkClient.makePath makePath: /overseer_elect/leader
[junit4:junit4]   2> 7222457 T48 oasc.Overseer.start Overseer (id=88564332466470914-127.0.0.1:7000_solr-n_0000000000)
starting
[junit4:junit4]   2> 7222458 T84 oazs.PrepRequestProcessor.pRequest Got user-level KeeperException
when processing sessionid:0x13aa4ca886f0002 type:create cxid:0x1a zxid:0xfffffffffffffffe
txntype:unknown reqpath:n/a Error Path:/solr/overseer Error:KeeperErrorCode = NodeExists for
/solr/overseer
[junit4:junit4]   2> 7222460 T84 oazs.PrepRequestProcessor.pRequest Got user-level KeeperException
when processing sessionid:0x13aa4ca886f0002 type:create cxid:0x1b zxid:0xfffffffffffffffe
txntype:unknown reqpath:n/a Error Path:/solr/overseer Error:KeeperErrorCode = NodeExists for
/solr/overseer
[junit4:junit4]   2> 7222461 T84 oazs.PrepRequestProcessor.pRequest Got user-level KeeperException
when processing sessionid:0x13aa4ca886f0002 type:create cxid:0x1c zxid:0xfffffffffffffffe
txntype:unknown reqpath:n/a Error Path:/solr/overseer Error:KeeperErrorCode = NodeExists for
/solr/overseer
[junit4:junit4]   2> 7222466 T84 oazs.PrepRequestProcessor.pRequest Got user-level KeeperException
when processing sessionid:0x13aa4ca886f0002 type:create cxid:0x1d zxid:0xfffffffffffffffe
txntype:unknown reqpath:n/a Error Path:/solr/overseer Error:KeeperErrorCode = NodeExists for
/solr/overseer
[junit4:junit4]   2> 7222467 T92 oasc.OverseerCollectionProcessor.run Process current queue
of collection creations
[junit4:junit4]   2> 7222468 T48 oascc.SolrZkClient.makePath makePath: /clusterstate.json
[junit4:junit4]   2> 7222472 T48 oascc.ZkStateReader.createClusterStateWatchersAndUpdate
Updating cluster state from ZooKeeper... 
[junit4:junit4]   2> 7222474 T91 oasc.Overseer$ClusterStateUpdater.run Starting to work
on the main queue
[junit4:junit4]   2> 7222478 T48 oasc.CoreContainer.create Creating SolrCore 'collection1'
using instanceDir: <http://sierranevada.servebeer.com/job/fast-io-beasting/ws/solr/build/solr-core/test-files/solr/collection1>
[junit4:junit4]   2> 7222478 T48 oasc.ZkController.createCollectionZkNode Check for collection
zkNode:collection1
[junit4:junit4]   2> 7222479 T48 oasc.ZkController.createCollectionZkNode Collection zkNode
exists
[junit4:junit4]   2> 7222479 T48 oasc.ZkController.readConfigName Load collection config
from:/collections/collection1
[junit4:junit4]   2> 7222481 T48 oasc.SolrResourceLoader.<init> new SolrResourceLoader
for directory: '<http://sierranevada.servebeer.com/job/fast-io-beasting/ws/solr/build/solr-core/test-files/solr/collection1/'>
[junit4:junit4]   2> 7222481 T48 oasc.SolrResourceLoader.replaceClassLoader Adding '<http://sierranevada.servebeer.com/job/fast-io-beasting/ws/solr/build/solr-core/test-files/solr/collection1/lib/classes/'>
to classloader
[junit4:junit4]   2> 7222482 T48 oasc.SolrResourceLoader.replaceClassLoader Adding '<http://sierranevada.servebeer.com/job/fast-io-beasting/ws/solr/build/solr-core/test-files/solr/collection1/lib/README'>
to classloader
[junit4:junit4]   2> 7222506 T48 oasc.SolrConfig.<init> Using Lucene MatchVersion:
LUCENE_41
[junit4:junit4]   2> 7222527 T48 oasc.SolrConfig.<init> Loaded SolrConfig: solrconfig.xml
[junit4:junit4]   2> 7222529 T48 oass.IndexSchema.readSchema Reading Solr Schema
[junit4:junit4]   2> 7222531 T48 oass.IndexSchema.readSchema Schema name=test
[junit4:junit4]   2> 7222718 T48 oass.OpenExchangeRatesOrgProvider.init Initialized with
rates=open-exchange-rates.json, refreshInterval=1440.
[junit4:junit4]   2> 7222722 T48 oass.IndexSchema.readSchema default search field in schema
is text
[junit4:junit4]   2> 7222723 T48 oass.IndexSchema.readSchema unique key field: id
[junit4:junit4]   2> 7222725 T48 oasc.CoreContainer.create SEVERE Unable to create core:
collection1 java.lang.RuntimeException: java.io.IOException: Error opening /configs/conf1/stopwords.txt
[junit4:junit4]   2> 	at org.apache.solr.schema.IndexSchema.<init>(IndexSchema.java:116)
[junit4:junit4]   2> 	at org.apache.solr.core.CoreContainer.getSchemaFromZk(CoreContainer.java:1434)
[junit4:junit4]   2> 	at org.apache.solr.core.CoreContainer.create(CoreContainer.java:825)
[junit4:junit4]   2> 	at org.apache.solr.core.CoreContainer.load(CoreContainer.java:529)
[junit4:junit4]   2> 	at org.apache.solr.core.CoreContainer.load(CoreContainer.java:351)
[junit4:junit4]   2> 	at org.apache.solr.core.CoreContainer$Initializer.initialize(CoreContainer.java:303)
[junit4:junit4]   2> 	at org.apache.solr.cloud.LeaderElectionIntegrationTest.setupContainer(LeaderElectionIntegrationTest.java:152)
[junit4:junit4]   2> 	at org.apache.solr.cloud.LeaderElectionIntegrationTest.setUp(LeaderElectionIntegrationTest.java:100)
[junit4:junit4]   2> 	at sun.reflect.NativeMethodAccessorImpl.invoke0(Native Method)
[junit4:junit4]   2> 	at sun.reflect.NativeMethodAccessorImpl.invoke(NativeMethodAccessorImpl.java:39)
[junit4:junit4]   2> 	at sun.reflect.DelegatingMethodAccessorImpl.invoke(DelegatingMethodAccessorImpl.java:25)
[junit4:junit4]   2> 	at java.lang.reflect.Method.invoke(Method.java:597)
[junit4:junit4]   2> 	at com.carrotsearch.randomizedtesting.RandomizedRunner.invoke(RandomizedRunner.java:1559)
[junit4:junit4]   2> 	at com.carrotsearch.randomizedtesting.RandomizedRunner.access$600(RandomizedRunner.java:79)
[junit4:junit4]   2> 	at com.carrotsearch.randomizedtesting.RandomizedRunner$7.evaluate(RandomizedRunner.java:771)
[junit4:junit4]   2> 	at com.carrotsearch.randomizedtesting.RandomizedRunner$8.evaluate(RandomizedRunner.java:787)
[junit4:junit4]   2> 	at com.carrotsearch.randomizedtesting.rules.SystemPropertiesRestoreRule$1.evaluate(SystemPropertiesRestoreRule.java:53)
[junit4:junit4]   2> 	at org.apache.lucene.util.TestRuleSetupTeardownChained$1.evaluate(TestRuleSetupTeardownChained.java:50)
[junit4:junit4]   2> 	at org.apache.lucene.util.TestRuleFieldCacheSanity$1.evaluate(TestRuleFieldCacheSanity.java:51)
[junit4:junit4]   2> 	at org.apache.lucene.util.AbstractBeforeAfterRule$1.evaluate(AbstractBeforeAfterRule.java:45)
[junit4:junit4]   2> 	at com.carrotsearch.randomizedtesting.rules.SystemPropertiesInvariantRule$1.evaluate(SystemPropertiesInvariantRule.java:55)
[junit4:junit4]   2> 	at org.apache.lucene.util.TestRuleThreadAndTestName$1.evaluate(TestRuleThreadAndTestName.java:48)
[junit4:junit4]   2> 	at org.apache.lucene.util.TestRuleIgnoreAfterMaxFailures$1.evaluate(TestRuleIgnoreAfterMaxFailures.java:70)
[junit4:junit4]   2> 	at org.apache.lucene.util.TestRuleMarkFailure$1.evaluate(TestRuleMarkFailure.java:48)
[junit4:junit4]   2> 	at com.carrotsearch.randomizedtesting.rules.StatementAdapter.evaluate(StatementAdapter.java:36)
[junit4:junit4]   2> 	at com.carrotsearch.randomizedtesting.ThreadLeakControl$StatementRunner.run(ThreadLeakControl.java:358)
[junit4:junit4]   2> 	at com.carrotsearch.randomizedtesting.ThreadLeakControl.forkTimeoutingTask(ThreadLeakControl.java:782)
[junit4:junit4]   2> 	at com.carrotsearch.randomizedtesting.ThreadLeakControl$3.evaluate(ThreadLeakControl.java:442)
[junit4:junit4]   2> 	at com.carrotsearch.randomizedtesting.RandomizedRunner.runSingleTest(RandomizedRunner.java:746)
[junit4:junit4]   2> 	at com.carrotsearch.randomizedtesting.RandomizedRunner$3.evaluate(RandomizedRunner.java:648)
[junit4:junit4]   2> 	at com.carrotsearch.randomizedtesting.RandomizedRunner$4.evaluate(RandomizedRunner.java:682)
[junit4:junit4]   2> 	at com.carrotsearch.randomizedtesting.RandomizedRunner$5.evaluate(RandomizedRunner.java:693)
[junit4:junit4]   2> 	at com.carrotsearch.randomizedtesting.rules.StatementAdapter.evaluate(StatementAdapter.java:36)
[junit4:junit4]   2> 	at com.carrotsearch.randomizedtesting.rules.SystemPropertiesRestoreRule$1.evaluate(SystemPropertiesRestoreRule.java:53)
[junit4:junit4]   2> 	at org.apache.lucene.util.AbstractBeforeAfterRule$1.evaluate(AbstractBeforeAfterRule.java:45)
[junit4:junit4]   2> 	at org.apache.lucene.util.TestRuleStoreClassName$1.evaluate(TestRuleStoreClassName.java:42)
[junit4:junit4]   2> 	at com.carrotsearch.randomizedtesting.rules.SystemPropertiesInvariantRule$1.evaluate(SystemPropertiesInvariantRule.java:55)
[junit4:junit4]   2> 	at com.carrotsearch.randomizedtesting.rules.NoShadowingOrOverridesOnMethodsRule$1.evaluate(NoShadowingOrOverridesOnMethodsRule.java:39)
[junit4:junit4]   2> 	at com.carrotsearch.randomizedtesting.rules.NoShadowingOrOverridesOnMethodsRule$1.evaluate(NoShadowingOrOverridesOnMethodsRule.java:39)
[junit4:junit4]   2> 	at com.carrotsearch.randomizedtesting.rules.StatementAdapter.evaluate(StatementAdapter.java:36)
[junit4:junit4]   2> 	at org.apache.lucene.util.TestRuleAssertionsRequired$1.evaluate(TestRuleAssertionsRequired.java:43)
[junit4:junit4]   2> 	at org.apache.lucene.util.TestRuleMarkFailure$1.evaluate(TestRuleMarkFailure.java:48)
[junit4:junit4]   2> 	at org.apache.lucene.util.TestRuleIgnoreAfterMaxFailures$1.evaluate(TestRuleIgnoreAfterMaxFailures.java:70)
[junit4:junit4]   2> 	at org.apache.lucene.util.TestRuleIgnoreTestSuites$1.evaluate(TestRuleIgnoreTestSuites.java:55)
[junit4:junit4]   2> 	at com.carrotsearch.randomizedtesting.rules.StatementAdapter.evaluate(StatementAdapter.java:36)
[junit4:junit4]   2> 	at com.carrotsearch.randomizedtesting.ThreadLeakControl$StatementRunner.run(ThreadLeakControl.java:358)
[junit4:junit4]   2> 	at java.lang.Thread.run(Thread.java:662)
[junit4:junit4]   2> Caused by: java.io.IOException: Error opening /configs/conf1/stopwords.txt
[junit4:junit4]   2> 	at org.apache.solr.cloud.ZkSolrResourceLoader.openResource(ZkSolrResourceLoader.java:82)
[junit4:junit4]   2> 	at org.apache.lucene.analysis.util.AbstractAnalysisFactory.getLines(AbstractAnalysisFactory.java:163)
[junit4:junit4]   2> 	at org.apache.lucene.analysis.util.AbstractAnalysisFactory.getWordSet(AbstractAnalysisFactory.java:151)
[junit4:junit4]   2> 	at org.apache.lucene.analysis.core.StopFilterFactory.inform(StopFilterFactory.java:58)
[junit4:junit4]   2> 	at org.apache.solr.core.SolrResourceLoader.inform(SolrResourceLoader.java:611)
[junit4:junit4]   2> 	at org.apache.solr.schema.IndexSchema.<init>(IndexSchema.java:114)
[junit4:junit4]   2> 	... 46 more
[junit4:junit4]   2> Caused by: java.lang.InterruptedException
[junit4:junit4]   2> 	at java.lang.Object.wait(Native Method)
[junit4:junit4]   2> 	at java.lang.Object.wait(Object.java:485)
[junit4:junit4]   2> 	at org.apache.zookeeper.ClientCnxn.submitRequest(ClientCnxn.java:1345)
[junit4:junit4]   2> 	at org.apache.zookeeper.ZooKeeper.exists(ZooKeeper.java:810)
[junit4:junit4]   2> 	at org.apache.solr.common.cloud.SolrZkClient$4.execute(SolrZkClient.java:193)
[junit4:junit4]   2> 	at org.apache.solr.common.cloud.SolrZkClient$4.execute(SolrZkClient.java:190)
[junit4:junit4]   2> 	at org.apache.solr.common.cloud.ZkCmdExecutor.retryOperation(ZkCmdExecutor.java:63)
[junit4:junit4]   2> 	at org.apache.solr.common.cloud.SolrZkClient.exists(SolrZkClient.java:190)
[junit4:junit4]   2> 	at org.apache.solr.cloud.ZkController.pathExists(ZkController.java:493)
[junit4:junit4]   2> 	at org.apache.solr.cloud.ZkSolrResourceLoader.openResource(ZkSolrResourceLoader.java:77)
[junit4:junit4]   2> 	... 51 more
[junit4:junit4]   2> 
[junit4:junit4]   2> 7222726 T48 oasc.SolrException.log SEVERE null:java.lang.RuntimeException:
java.io.IOException: Error opening /configs/conf1/stopwords.txt
[junit4:junit4]   2> 		at org.apache.solr.schema.IndexSchema.<init>(IndexSchema.java:116)
[junit4:junit4]   2> 		at org.apache.solr.core.CoreContainer.getSchemaFromZk(CoreContainer.java:1434)
[junit4:junit4]   2> 		at org.apache.solr.core.CoreContainer.create(CoreContainer.java:825)
[junit4:junit4]   2> 		at org.apache.solr.core.CoreContainer.load(CoreContainer.java:529)
[junit4:junit4]   2> 		at org.apache.solr.core.CoreContainer.load(CoreContainer.java:351)
[junit4:junit4]   2> 		at org.apache.solr.core.CoreContainer$Initializer.initialize(CoreContainer.java:303)
[junit4:junit4]   2> 		at org.apache.solr.cloud.LeaderElectionIntegrationTest.setupContainer(LeaderElectionIntegrationTest.java:152)
[junit4:junit4]   2> 		at org.apache.solr.cloud.LeaderElectionIntegrationTest.setUp(LeaderElectionIntegrationTest.java:100)
[junit4:junit4]   2> 		at sun.reflect.NativeMethodAccessorImpl.invoke0(Native Method)
[junit4:junit4]   2> 		at sun.reflect.NativeMethodAccessorImpl.invoke(NativeMethodAccessorImpl.java:39)
[junit4:junit4]   2> 		at sun.reflect.DelegatingMethodAccessorImpl.invoke(DelegatingMethodAccessorImpl.java:25)
[junit4:junit4]   2> 		at java.lang.reflect.Method.invoke(Method.java:597)
[junit4:junit4]   2> 		at com.carrotsearch.randomizedtesting.RandomizedRunner.invoke(RandomizedRunner.java:1559)
[junit4:junit4]   2> 		at com.carrotsearch.randomizedtesting.RandomizedRunner.access$600(RandomizedRunner.java:79)
[junit4:junit4]   2> 		at com.carrotsearch.randomizedtesting.RandomizedRunner$7.evaluate(RandomizedRunner.java:771)
[junit4:junit4]   2> 		at com.carrotsearch.randomizedtesting.RandomizedRunner$8.evaluate(RandomizedRunner.java:787)
[junit4:junit4]   2> 		at com.carrotsearch.randomizedtesting.rules.SystemPropertiesRestoreRule$1.evaluate(SystemPropertiesRestoreRule.java:53)
[junit4:junit4]   2> 		at org.apache.lucene.util.TestRuleSetupTeardownChained$1.evaluate(TestRuleSetupTeardownChained.java:50)
[junit4:junit4]   2> 		at org.apache.lucene.util.TestRuleFieldCacheSanity$1.evaluate(TestRuleFieldCacheSanity.java:51)
[junit4:junit4]   2> 		at org.apache.lucene.util.AbstractBeforeAfterRule$1.evaluate(AbstractBeforeAfterRule.java:45)
[junit4:junit4]   2> 		at com.carrotsearch.randomizedtesting.rules.SystemPropertiesInvariantRule$1.evaluate(SystemPropertiesInvariantRule.java:55)
[junit4:junit4]   2> 		at org.apache.lucene.util.TestRuleThreadAndTestName$1.evaluate(TestRuleThreadAndTestName.java:48)
[junit4:junit4]   2> 		at org.apache.lucene.util.TestRuleIgnoreAfterMaxFailures$1.evaluate(TestRuleIgnoreAfterMaxFailures.java:70)
[junit4:junit4]   2> 		at org.apache.lucene.util.TestRuleMarkFailure$1.evaluate(TestRuleMarkFailure.java:48)
[junit4:junit4]   2> 		at com.carrotsearch.randomizedtesting.rules.StatementAdapter.evaluate(StatementAdapter.java:36)
[junit4:junit4]   2> 		at com.carrotsearch.randomizedtesting.ThreadLeakControl$StatementRunner.run(ThreadLeakControl.java:358)
[junit4:junit4]   2> 		at com.carrotsearch.randomizedtesting.ThreadLeakControl.forkTimeoutingTask(ThreadLeakControl.java:782)
[junit4:junit4]   2> 		at com.carrotsearch.randomizedtesting.ThreadLeakControl$3.evaluate(ThreadLeakControl.java:442)
[junit4:junit4]   2> 		at com.carrotsearch.randomizedtesting.RandomizedRunner.runSingleTest(RandomizedRunner.java:746)
[junit4:junit4]   2> 		at com.carrotsearch.randomizedtesting.RandomizedRunner$3.evaluate(RandomizedRunner.java:648)
[junit4:junit4]   2> 		at com.carrotsearch.randomizedtesting.RandomizedRunner$4.evaluate(RandomizedRunner.java:682)
[junit4:junit4]   2> 		at com.carrotsearch.randomizedtesting.RandomizedRunner$5.evaluate(RandomizedRunner.java:693)
[junit4:junit4]   2> 		at com.carrotsearch.randomizedtesting.rules.StatementAdapter.evaluate(StatementAdapter.java:36)
[junit4:junit4]   2> 		at com.carrotsearch.randomizedtesting.rules.SystemPropertiesRestoreRule$1.evaluate(SystemPropertiesRestoreRule.java:53)
[junit4:junit4]   2> 		at org.apache.lucene.util.AbstractBeforeAfterRule$1.evaluate(AbstractBeforeAfterRule.java:45)
[junit4:junit4]   2> 		at org.apache.lucene.util.TestRuleStoreClassName$1.evaluate(TestRuleStoreClassName.java:42)
[junit4:junit4]   2> 		at com.carrotsearch.randomizedtesting.rules.SystemPropertiesInvariantRule$1.evaluate(SystemPropertiesInvariantRule.java:55)
[junit4:junit4]   2> 		at com.carrotsearch.randomizedtesting.rules.NoShadowingOrOverridesOnMethodsRule$1.evaluate(NoShadowingOrOverridesOnMethodsRule.java:39)
[junit4:junit4]   2> 		at com.carrotsearch.randomizedtesting.rules.NoShadowingOrOverridesOnMethodsRule$1.evaluate(NoShadowingOrOverridesOnMethodsRule.java:39)
[junit4:junit4]   2> 		at com.carrotsearch.randomizedtesting.rules.StatementAdapter.evaluate(StatementAdapter.java:36)
[junit4:junit4]   2> 		at org.apache.lucene.util.TestRuleAssertionsRequired$1.evaluate(TestRuleAssertionsRequired.java:43)
[junit4:junit4]   2> 		at org.apache.lucene.util.TestRuleMarkFailure$1.evaluate(TestRuleMarkFailure.java:48)
[junit4:junit4]   2> 		at org.apache.lucene.util.TestRuleIgnoreAfterMaxFailures$1.evaluate(TestRuleIgnoreAfterMaxFailures.java:70)
[junit4:junit4]   2> 		at org.apache.lucene.util.TestRuleIgnoreTestSuites$1.evaluate(TestRuleIgnoreTestSuites.java:55)
[junit4:junit4]   2> 		at com.carrotsearch.randomizedtesting.rules.StatementAdapter.evaluate(StatementAdapter.java:36)
[junit4:junit4]   2> 		at com.carrotsearch.randomizedtesting.ThreadLeakControl$StatementRunner.run(ThreadLeakControl.java:358)
[junit4:junit4]   2> 		at java.lang.Thread.run(Thread.java:662)
[junit4:junit4]   2> 	Caused by: java.io.IOException: Error opening /configs/conf1/stopwords.txt
[junit4:junit4]   2> 		at org.apache.solr.cloud.ZkSolrResourceLoader.openResource(ZkSolrResourceLoader.java:82)
[junit4:junit4]   2> 		at org.apache.lucene.analysis.util.AbstractAnalysisFactory.getLines(AbstractAnalysisFactory.java:163)
[junit4:junit4]   2> 		at org.apache.lucene.analysis.util.AbstractAnalysisFactory.getWordSet(AbstractAnalysisFactory.java:151)
[junit4:junit4]   2> 		at org.apache.lucene.analysis.core.StopFilterFactory.inform(StopFilterFactory.java:58)
[junit4:junit4]   2> 		at org.apache.solr.core.SolrResourceLoader.inform(SolrResourceLoader.java:611)
[junit4:junit4]   2> 		at org.apache.solr.schema.IndexSchema.<init>(IndexSchema.java:114)
[junit4:junit4]   2> 		... 46 more
[junit4:junit4]   2> 	Caused by: java.lang.InterruptedException
[junit4:junit4]   2> 		at java.lang.Object.wait(Native Method)
[junit4:junit4]   2> 		at java.lang.Object.wait(Object.java:485)
[junit4:junit4]   2> 		at org.apache.zookeeper.ClientCnxn.submitRequest(ClientCnxn.java:1345)
[junit4:junit4]   2> 		at org.apache.zookeeper.ZooKeeper.exists(ZooKeeper.java:810)
[junit4:junit4]   2> 		at org.apache.solr.common.cloud.SolrZkClient$4.execute(SolrZkClient.java:193)
[junit4:junit4]   2> 		at org.apache.solr.common.cloud.SolrZkClient$4.execute(SolrZkClient.java:190)
[junit4:junit4]   2> 		at org.apache.solr.common.cloud.ZkCmdExecutor.retryOperation(ZkCmdExecutor.java:63)
[junit4:junit4]   2> 		at org.apache.solr.common.cloud.SolrZkClient.exists(SolrZkClient.java:190)
[junit4:junit4]   2> 		at org.apache.solr.cloud.ZkController.pathExists(ZkController.java:493)
[junit4:junit4]   2> 		at org.apache.solr.cloud.ZkSolrResourceLoader.openResource(ZkSolrResourceLoader.java:77)
[junit4:junit4]   2> 		... 51 more
[junit4:junit4]   2> 	
[junit4:junit4]   2> 7222727 T48 oasc.LeaderElectionIntegrationTest.setUp SEVERE !!!Could
not start container:7000 The exception thrown was: class java.lang.AssertionError Container
7000 has no cores!
[junit4:junit4]   2> 7222728 T83 oazs.SyncRequestProcessor.run SyncRequestProcessor exited!
[junit4:junit4]   2> 7222729 T84 oazs.PrepRequestProcessor.run PrepRequestProcessor exited
loop!
[junit4:junit4]   2> 7222729 T48 oazs.FinalRequestProcessor.shutdown shutdown of request
processor complete
[junit4:junit4]   2> 7222773 T48 oazs.NIOServerCnxn.closeSock Closed socket connection
for client /127.0.0.1:47108 which had sessionid 0x13aa4ca886f0002
[junit4:junit4]   2> 7222774 T81 oazs.NIOServerCnxn$Factory.run NIOServerCnxn factory exited
run method
[junit4:junit4]   2> 7222774 T89 oaz.ClientCnxn$SendThread.run Unable to read additional
data from server sessionid 0x13aa4ca886f0002, likely server has closed socket, closing socket
connection and attempting reconnect
[junit4:junit4]   2> 7222775 T48 oazs.FinalRequestProcessor.shutdown shutdown of request
processor complete
[junit4:junit4]   2> 7222776 T48 oas.SolrTestCaseJ4.tearDown ###Ending testSimpleSliceLeaderElection
[junit4:junit4]   2> 7222876 T90 oascc.ConnectionManager.process Watcher org.apache.solr.common.cloud.ConnectionManager@2628de85
name:ZooKeeperConnection Watcher:127.0.0.1:38774/solr got event WatchedEvent state:Disconnected
type:None path:null path:null type:None
[junit4:junit4]   2> 7222876 T90 oascc.ConnectionManager.process zkClient has disconnected
[junit4:junit4]   2> 7223136 T47 ccr.ThreadLeakControl.tryToInterruptAll SEVERE There are
still zombie threads that couldn't be terminated:
[junit4:junit4]   2> 	   1) Thread[id=48, name=SUITE-LeaderElectionIntegrationTest-seed#[734A46D52F0BDDA5]-worker,
state=TIMED_WAITING, group=TGRP-LeaderElectionIntegrationTest]
[junit4:junit4]   2> 	        at java.lang.Thread.sleep(Native Method)
[junit4:junit4]   2> 	        at org.apache.solr.cloud.LeaderElectionIntegrationTest.afterClass(LeaderElectionIntegrationTest.java:317)
[junit4:junit4]   2> 	        at sun.reflect.NativeMethodAccessorImpl.invoke0(Native Method)
[junit4:junit4]   2> 	        at sun.reflect.NativeMethodAccessorImpl.invoke(NativeMethodAccessorImpl.java:39)
[junit4:junit4]   2> 	        at sun.reflect.DelegatingMethodAccessorImpl.invoke(DelegatingMethodAccessorImpl.java:25)
[junit4:junit4]   2> 	        at java.lang.reflect.Method.invoke(Method.java:597)
[junit4:junit4]   2> 	        at com.carrotsearch.randomizedtesting.RandomizedRunner.invoke(RandomizedRunner.java:1559)
[junit4:junit4]   2> 	        at com.carrotsearch.randomizedtesting.RandomizedRunner.access$600(RandomizedRunner.java:79)
[junit4:junit4]   2> 	        at com.carrotsearch.randomizedtesting.RandomizedRunner$5.evaluate(RandomizedRunner.java:700)
[junit4:junit4]   2> 	        at com.carrotsearch.randomizedtesting.rules.StatementAdapter.evaluate(StatementAdapter.java:36)
[junit4:junit4]   2> 	        at com.carrotsearch.randomizedtesting.rules.SystemPropertiesRestoreRule$1.evaluate(SystemPropertiesRestoreRule.java:53)
[junit4:junit4]   2> 	        at org.apache.lucene.util.AbstractBeforeAfterRule$1.evaluate(AbstractBeforeAfterRule.java:45)
[junit4:junit4]   2> 	        at org.apache.lucene.util.TestRuleStoreClassName$1.evaluate(TestRuleStoreClassName.java:42)
[junit4:junit4]   2> 	        at com.carrotsearch.randomizedtesting.rules.SystemPropertiesInvariantRule$1.evaluate(SystemPropertiesInvariantRule.java:55)
[junit4:junit4]   2> 	        at com.carrotsearch.randomizedtesting.rules.NoShadowingOrOverridesOnMethodsRule$1.evaluate(NoShadowingOrOverridesOnMethodsRule.java:39)
[junit4:junit4]   2> 	        at com.carrotsearch.randomizedtesting.rules.NoShadowingOrOverridesOnMethodsRule$1.evaluate(NoShadowingOrOverridesOnMethodsRule.java:39)
[junit4:junit4]   2> 	        at com.carrotsearch.randomizedtesting.rules.StatementAdapter.evaluate(StatementAdapter.java:36)
[junit4:junit4]   2> 	        at org.apache.lucene.util.TestRuleAssertionsRequired$1.evaluate(TestRuleAssertionsRequired.java:43)
[junit4:junit4]   2> 	        at org.apache.lucene.util.TestRuleMarkFailure$1.evaluate(TestRuleMarkFailure.java:48)
[junit4:junit4]   2> 	        at org.apache.lucene.util.TestRuleIgnoreAfterMaxFailures$1.evaluate(TestRuleIgnoreAfterMaxFailures.java:70)
[junit4:junit4]   2> 	        at org.apache.lucene.util.TestRuleIgnoreTestSuites$1.evaluate(TestRuleIgnoreTestSuites.java:55)
[junit4:junit4]   2> 	        at com.carrotsearch.randomizedtesting.rules.StatementAdapter.evaluate(StatementAdapter.java:36)
[junit4:junit4]   2> 	        at com.carrotsearch.randomizedtesting.ThreadLeakControl$StatementRunner.run(ThreadLeakControl.java:358)
[junit4:junit4]   2> 	        at java.lang.Thread.run(Thread.java:662)
[junit4:junit4]   2> NOTE: test params are: codec=Lucene3x, sim=RandomSimilarityProvider(queryNorm=true,coord=no):
{}, locale=fr_LU, timezone=America/Cambridge_Bay
[junit4:junit4]   2> NOTE: Linux 3.2.0-24-generic amd64/Sun Microsystems Inc. 1.6.0_27
(64-bit)/cpus=8,threads=9,free=197257984,total=280100864
[junit4:junit4]   2> NOTE: All tests run in this JVM: [MinimalSchemaTest, TestBM25SimilarityFactory,
TestNumberUtils, ConvertedLegacyTest, FileUtilsTest, TestWriterPerf, TestXIncludeConfig, SoftAutoCommitTest,
HighlighterConfigTest, TestSolr4Spatial, LeaderElectionIntegrationTest]
[junit4:junit4]   2> NOTE: reproduce with: ant test  -Dtestcase=LeaderElectionIntegrationTest
-Dtests.seed=734A46D52F0BDDA5 -Dtests.slow=true -Dtests.locale=fr_LU -Dtests.timezone=America/Cambridge_Bay
-Dtests.file.encoding=UTF-8
[junit4:junit4] ERROR   0.00s J6 | LeaderElectionIntegrationTest (suite) <<<
[junit4:junit4]    > Throwable #1: java.lang.Exception: Suite timeout exceeded (>= 7200000
msec).
[junit4:junit4]    > 	at __randomizedtesting.SeedInfo.seed([734A46D52F0BDDA5]:0)
[junit4:junit4] Completed on J6 in 7223.20s, 1 test, 2 errors <<< FAILURES!
[junit4:junit4] 
[junit4:junit4] Suite: org.apache.solr.cloud.TestMultiCoreConfBootstrap
[junit4:junit4] Completed on J6 in 0.01s, 1 test, 1 skipped
[junit4:junit4] 
[junit4:junit4] Suite: org.apache.solr.internal.csv.CSVParserTest
[junit4:junit4] Completed on J6 in 0.02s, 23 tests
[junit4:junit4] 
[junit4:junit4] Suite: org.apache.solr.schema.PolyFieldTest
[junit4:junit4] Completed on J6 in 0.01s, 4 tests, 4 skipped
[junit4:junit4] 
[junit4:junit4] Suite: org.apache.solr.search.TestRealTimeGet
[junit4:junit4] Completed on J6 in 0.01s, 4 tests, 4 skipped
[junit4:junit4] 
[junit4:junit4] Suite: org.apache.solr.handler.component.TermsComponentTest
[junit4:junit4] Completed on J6 in 0.02s, 13 tests, 13 skipped
[junit4:junit4] 
[junit4:junit4] 
[junit4:junit4] Tests with failures:
[junit4:junit4]   - org.apache.solr.cloud.LeaderElectionIntegrationTest.testLeaderElectionAfterClientTimeout
[junit4:junit4]   - org.apache.solr.cloud.LeaderElectionIntegrationTest (suite)
[junit4:junit4] 
[junit4:junit4] 
[junit4:junit4] JVM J0:     1.10 ..   156.85 =   155.76s
[junit4:junit4] JVM J1:     1.10 ..   140.71 =   139.61s
[junit4:junit4] JVM J2:     0.86 ..   116.24 =   115.38s
[junit4:junit4] JVM J3:     1.10 ..   112.74 =   111.64s
[junit4:junit4] JVM J4:     1.10 ..   142.85 =   141.76s
[junit4:junit4] JVM J5:     0.87 ..   124.40 =   123.53s
[junit4:junit4] JVM J6:     1.10 ..  7263.13 =  7262.03s
[junit4:junit4] JVM J7:     0.86 ..   113.30 =   112.44s
[junit4:junit4] Execution time total: 2 hours 1 minute 3 seconds
[junit4:junit4] Tests summary: 233 suites, 964 tests, 1 suite-level error, 1 error, 29 ignored
(2 assumptions)

BUILD FAILED
<http://sierranevada.servebeer.com/job/fast-io-beasting/ws/build.xml>:39: The following
error occurred while executing this line:
<http://sierranevada.servebeer.com/job/fast-io-beasting/ws/solr/build.xml>:178: The
following error occurred while executing this line:
<http://sierranevada.servebeer.com/job/fast-io-beasting/ws/lucene/module-build.xml>:61:
The following error occurred while executing this line:
<http://sierranevada.servebeer.com/job/fast-io-beasting/ws/lucene/common-build.xml>:1159:
The following error occurred while executing this line:
<http://sierranevada.servebeer.com/job/fast-io-beasting/ws/lucene/common-build.xml>:827:
There were test failures: 233 suites, 964 tests, 1 suite-level error, 1 error, 29 ignored
(2 assumptions)

Total time: 125 minutes 54 seconds
Build step 'Invoke Ant' marked build as failure

---------------------------------------------------------------------
To unsubscribe, e-mail: dev-unsubscribe@lucene.apache.org
For additional commands, e-mail: dev-help@lucene.apache.org


Mime
View raw message