lucene-dev mailing list archives

Site index · List index
Message view « Date » · « Thread »
Top « Date » · « Thread »
From Policeman Jenkins Server <jenk...@sd-datasolutions.de>
Subject [JENKINS] Lucene-Solr-trunk-Linux (32bit/jdk1.8.0-ea-b58) - Build # 2084 - Still Failing!
Date Tue, 30 Oct 2012 01:59:41 GMT
Build: http://jenkins.sd-datasolutions.de/job/Lucene-Solr-trunk-Linux/2084/
Java: 32bit/jdk1.8.0-ea-b58 -client -XX:+UseConcMarkSweepGC

2 tests failed.
FAILED:  junit.framework.TestSuite.org.apache.solr.client.solrj.embedded.TestEmbeddedSolrServer

Error Message:
2 threads leaked from SUITE scope at org.apache.solr.client.solrj.embedded.TestEmbeddedSolrServer:     1) Thread[id=14, name=metrics-meter-tick-thread-1, state=WAITING, group=TGRP-TestEmbeddedSolrServer]         at sun.misc.Unsafe.park(Native Method)         at java.util.concurrent.locks.LockSupport.park(LockSupport.java:186)         at java.util.concurrent.locks.AbstractQueuedSynchronizer$ConditionObject.await(AbstractQueuedSynchronizer.java:2043)         at java.util.concurrent.ScheduledThreadPoolExecutor$DelayedWorkQueue.take(ScheduledThreadPoolExecutor.java:1086)         at java.util.concurrent.ScheduledThreadPoolExecutor$DelayedWorkQueue.take(ScheduledThreadPoolExecutor.java:808)         at java.util.concurrent.ThreadPoolExecutor.getTask(ThreadPoolExecutor.java:1045)         at java.util.concurrent.ThreadPoolExecutor.runWorker(ThreadPoolExecutor.java:1103)         at java.util.concurrent.ThreadPoolExecutor$Worker.run(ThreadPoolExecutor.java:603)         at java.lang.Thread.run(Thread.java:722)    2) Thread[id=15, name=metrics-meter-tick-thread-2, state=TIMED_WAITING, group=TGRP-TestEmbeddedSolrServer]         at sun.misc.Unsafe.park(Native Method)         at java.util.concurrent.locks.LockSupport.parkNanos(LockSupport.java:226)         at java.util.concurrent.locks.AbstractQueuedSynchronizer$ConditionObject.awaitNanos(AbstractQueuedSynchronizer.java:2082)         at java.util.concurrent.ScheduledThreadPoolExecutor$DelayedWorkQueue.take(ScheduledThreadPoolExecutor.java:1091)         at java.util.concurrent.ScheduledThreadPoolExecutor$DelayedWorkQueue.take(ScheduledThreadPoolExecutor.java:808)         at java.util.concurrent.ThreadPoolExecutor.getTask(ThreadPoolExecutor.java:1045)         at java.util.concurrent.ThreadPoolExecutor.runWorker(ThreadPoolExecutor.java:1103)         at java.util.concurrent.ThreadPoolExecutor$Worker.run(ThreadPoolExecutor.java:603)         at java.lang.Thread.run(Thread.java:722)

Stack Trace:
com.carrotsearch.randomizedtesting.ThreadLeakError: 2 threads leaked from SUITE scope at org.apache.solr.client.solrj.embedded.TestEmbeddedSolrServer: 
   1) Thread[id=14, name=metrics-meter-tick-thread-1, state=WAITING, group=TGRP-TestEmbeddedSolrServer]
        at sun.misc.Unsafe.park(Native Method)
        at java.util.concurrent.locks.LockSupport.park(LockSupport.java:186)
        at java.util.concurrent.locks.AbstractQueuedSynchronizer$ConditionObject.await(AbstractQueuedSynchronizer.java:2043)
        at java.util.concurrent.ScheduledThreadPoolExecutor$DelayedWorkQueue.take(ScheduledThreadPoolExecutor.java:1086)
        at java.util.concurrent.ScheduledThreadPoolExecutor$DelayedWorkQueue.take(ScheduledThreadPoolExecutor.java:808)
        at java.util.concurrent.ThreadPoolExecutor.getTask(ThreadPoolExecutor.java:1045)
        at java.util.concurrent.ThreadPoolExecutor.runWorker(ThreadPoolExecutor.java:1103)
        at java.util.concurrent.ThreadPoolExecutor$Worker.run(ThreadPoolExecutor.java:603)
        at java.lang.Thread.run(Thread.java:722)
   2) Thread[id=15, name=metrics-meter-tick-thread-2, state=TIMED_WAITING, group=TGRP-TestEmbeddedSolrServer]
        at sun.misc.Unsafe.park(Native Method)
        at java.util.concurrent.locks.LockSupport.parkNanos(LockSupport.java:226)
        at java.util.concurrent.locks.AbstractQueuedSynchronizer$ConditionObject.awaitNanos(AbstractQueuedSynchronizer.java:2082)
        at java.util.concurrent.ScheduledThreadPoolExecutor$DelayedWorkQueue.take(ScheduledThreadPoolExecutor.java:1091)
        at java.util.concurrent.ScheduledThreadPoolExecutor$DelayedWorkQueue.take(ScheduledThreadPoolExecutor.java:808)
        at java.util.concurrent.ThreadPoolExecutor.getTask(ThreadPoolExecutor.java:1045)
        at java.util.concurrent.ThreadPoolExecutor.runWorker(ThreadPoolExecutor.java:1103)
        at java.util.concurrent.ThreadPoolExecutor$Worker.run(ThreadPoolExecutor.java:603)
        at java.lang.Thread.run(Thread.java:722)
	at __randomizedtesting.SeedInfo.seed([16021ABFA2650B8D]:0)


FAILED:  junit.framework.TestSuite.org.apache.solr.client.solrj.embedded.TestEmbeddedSolrServer

Error Message:
There are still zombie threads that couldn't be terminated:    1) Thread[id=14, name=metrics-meter-tick-thread-1, state=WAITING, group=TGRP-TestEmbeddedSolrServer]         at sun.misc.Unsafe.park(Native Method)         at java.util.concurrent.locks.LockSupport.park(LockSupport.java:186)         at java.util.concurrent.locks.AbstractQueuedSynchronizer$ConditionObject.await(AbstractQueuedSynchronizer.java:2043)         at java.util.concurrent.ScheduledThreadPoolExecutor$DelayedWorkQueue.take(ScheduledThreadPoolExecutor.java:1086)         at java.util.concurrent.ScheduledThreadPoolExecutor$DelayedWorkQueue.take(ScheduledThreadPoolExecutor.java:808)         at java.util.concurrent.ThreadPoolExecutor.getTask(ThreadPoolExecutor.java:1045)         at java.util.concurrent.ThreadPoolExecutor.runWorker(ThreadPoolExecutor.java:1103)         at java.util.concurrent.ThreadPoolExecutor$Worker.run(ThreadPoolExecutor.java:603)         at java.lang.Thread.run(Thread.java:722)    2) Thread[id=15, name=metrics-meter-tick-thread-2, state=TIMED_WAITING, group=TGRP-TestEmbeddedSolrServer]         at sun.misc.Unsafe.park(Native Method)         at java.util.concurrent.locks.LockSupport.parkNanos(LockSupport.java:226)         at java.util.concurrent.locks.AbstractQueuedSynchronizer$ConditionObject.awaitNanos(AbstractQueuedSynchronizer.java:2082)         at java.util.concurrent.ScheduledThreadPoolExecutor$DelayedWorkQueue.take(ScheduledThreadPoolExecutor.java:1091)         at java.util.concurrent.ScheduledThreadPoolExecutor$DelayedWorkQueue.take(ScheduledThreadPoolExecutor.java:808)         at java.util.concurrent.ThreadPoolExecutor.getTask(ThreadPoolExecutor.java:1045)         at java.util.concurrent.ThreadPoolExecutor.runWorker(ThreadPoolExecutor.java:1103)         at java.util.concurrent.ThreadPoolExecutor$Worker.run(ThreadPoolExecutor.java:603)         at java.lang.Thread.run(Thread.java:722)

Stack Trace:
com.carrotsearch.randomizedtesting.ThreadLeakError: There are still zombie threads that couldn't be terminated:
   1) Thread[id=14, name=metrics-meter-tick-thread-1, state=WAITING, group=TGRP-TestEmbeddedSolrServer]
        at sun.misc.Unsafe.park(Native Method)
        at java.util.concurrent.locks.LockSupport.park(LockSupport.java:186)
        at java.util.concurrent.locks.AbstractQueuedSynchronizer$ConditionObject.await(AbstractQueuedSynchronizer.java:2043)
        at java.util.concurrent.ScheduledThreadPoolExecutor$DelayedWorkQueue.take(ScheduledThreadPoolExecutor.java:1086)
        at java.util.concurrent.ScheduledThreadPoolExecutor$DelayedWorkQueue.take(ScheduledThreadPoolExecutor.java:808)
        at java.util.concurrent.ThreadPoolExecutor.getTask(ThreadPoolExecutor.java:1045)
        at java.util.concurrent.ThreadPoolExecutor.runWorker(ThreadPoolExecutor.java:1103)
        at java.util.concurrent.ThreadPoolExecutor$Worker.run(ThreadPoolExecutor.java:603)
        at java.lang.Thread.run(Thread.java:722)
   2) Thread[id=15, name=metrics-meter-tick-thread-2, state=TIMED_WAITING, group=TGRP-TestEmbeddedSolrServer]
        at sun.misc.Unsafe.park(Native Method)
        at java.util.concurrent.locks.LockSupport.parkNanos(LockSupport.java:226)
        at java.util.concurrent.locks.AbstractQueuedSynchronizer$ConditionObject.awaitNanos(AbstractQueuedSynchronizer.java:2082)
        at java.util.concurrent.ScheduledThreadPoolExecutor$DelayedWorkQueue.take(ScheduledThreadPoolExecutor.java:1091)
        at java.util.concurrent.ScheduledThreadPoolExecutor$DelayedWorkQueue.take(ScheduledThreadPoolExecutor.java:808)
        at java.util.concurrent.ThreadPoolExecutor.getTask(ThreadPoolExecutor.java:1045)
        at java.util.concurrent.ThreadPoolExecutor.runWorker(ThreadPoolExecutor.java:1103)
        at java.util.concurrent.ThreadPoolExecutor$Worker.run(ThreadPoolExecutor.java:603)
        at java.lang.Thread.run(Thread.java:722)
	at __randomizedtesting.SeedInfo.seed([16021ABFA2650B8D]:0)




Build Log:
[...truncated 9370 lines...]
[junit4:junit4] Suite: org.apache.solr.client.solrj.embedded.TestEmbeddedSolrServer
[junit4:junit4]   2> -5 T12 oasc.CoreContainer.<init> New CoreContainer 21943975
[junit4:junit4]   2> 4 T12 oasc.CoreContainer.load Loading CoreContainer using Solr Home: '/mnt/ssd/jenkins/workspace/Lucene-Solr-trunk-Linux/solr/solrj/src/test-files/solrj/solr/shared'
[junit4:junit4]   2> 18 T12 oasc.SolrResourceLoader.<init> new SolrResourceLoader for directory: '/mnt/ssd/jenkins/workspace/Lucene-Solr-trunk-Linux/solr/solrj/src/test-files/solrj/solr/shared/'
[junit4:junit4]   2> 222 T12 oasc.CoreContainer.load Registering Log Listener
[junit4:junit4]   2> 310 T12 oasc.CoreContainer.create Creating SolrCore 'collection1' using instanceDir: /mnt/ssd/jenkins/workspace/Lucene-Solr-trunk-Linux/solr/solrj/src/test-files/solrj/solr/shared/.
[junit4:junit4]   2> 310 T12 oasc.SolrResourceLoader.<init> new SolrResourceLoader for directory: '/mnt/ssd/jenkins/workspace/Lucene-Solr-trunk-Linux/solr/solrj/src/test-files/solrj/solr/shared/./'
[junit4:junit4]   2> 359 T12 oasc.SolrConfig.<init> Using Lucene MatchVersion: LUCENE_50
[junit4:junit4]   2> 452 T12 oasc.SolrConfig.<init> Loaded SolrConfig: solrconfig.xml
[junit4:junit4]   2> 463 T12 oass.IndexSchema.readSchema Reading Solr Schema
[junit4:junit4]   2> 473 T12 oass.IndexSchema.readSchema Schema name=example core 
[junit4:junit4]   2> 554 T12 oass.IndexSchema.readSchema default search field in schema is name
[junit4:junit4]   2> 556 T12 oass.IndexSchema.readSchema query parser default operator is OR
[junit4:junit4]   2> 557 T12 oass.IndexSchema.readSchema unique key field: id
[junit4:junit4]   2> 617 T12 oasc.SolrCore.<init> [collection1] Opening new SolrCore at /mnt/ssd/jenkins/workspace/Lucene-Solr-trunk-Linux/solr/solrj/src/test-files/solrj/solr/shared/./, dataDir=/mnt/ssd/jenkins/workspace/Lucene-Solr-trunk-Linux/solr/build/solr-solrj/test/J0/./solrtest-TestEmbeddedSolrServer-1351562342568/data/-1.3/
[junit4:junit4]   2> 617 T12 oasc.SolrCore.<init> JMX monitoring not detected for core: collection1
[junit4:junit4]   2> 621 T12 oasc.SolrCore.initDirectoryFactory org.apache.solr.core.MockDirectoryFactory
[junit4:junit4]   2> 649 T12 oasc.CachingDirectoryFactory.injectLockFactory WARNING No lockType configured for MockDirWrapper(org.apache.lucene.store.RAMDirectory@1593f5 lockFactory=org.apache.lucene.store.SingleInstanceLockFactory@a4f977) assuming 'simple'
[junit4:junit4]   2> 651 T12 oasc.CachingDirectoryFactory.get return new directory for /mnt/ssd/jenkins/workspace/Lucene-Solr-trunk-Linux/solr/build/solr-solrj/test/J0/./solrtest-TestEmbeddedSolrServer-1351562342568/data/-1.3 forceNew:false
[junit4:junit4]   2> 651 T12 oasc.CachingDirectoryFactory.close Releasing directory:/mnt/ssd/jenkins/workspace/Lucene-Solr-trunk-Linux/solr/build/solr-solrj/test/J0/./solrtest-TestEmbeddedSolrServer-1351562342568/data/-1.3
[junit4:junit4]   2> 652 T12 oasc.SolrCore.getNewIndexDir New index directory detected: old=null new=/mnt/ssd/jenkins/workspace/Lucene-Solr-trunk-Linux/solr/build/solr-solrj/test/J0/./solrtest-TestEmbeddedSolrServer-1351562342568/data/-1.3/index/
[junit4:junit4]   2> 652 T12 oasc.SolrCore.initIndex WARNING [collection1] Solr index directory '/mnt/ssd/jenkins/workspace/Lucene-Solr-trunk-Linux/solr/build/solr-solrj/test/J0/./solrtest-TestEmbeddedSolrServer-1351562342568/data/-1.3/index' doesn't exist. Creating new index...
[junit4:junit4]   2> 665 T12 oasc.CachingDirectoryFactory.get return new directory for /mnt/ssd/jenkins/workspace/Lucene-Solr-trunk-Linux/solr/build/solr-solrj/test/J0/./solrtest-TestEmbeddedSolrServer-1351562342568/data/-1.3/index forceNew:false
[junit4:junit4]   2> 782 T12 oasc.SolrDeletionPolicy.onCommit SolrDeletionPolicy.onCommit: commits:num=1
[junit4:junit4]   2> 		commit{dir=MockDirWrapper(NRTCachingDirectory(org.apache.lucene.store.RAMDirectory@37fd3f lockFactory=org.apache.lucene.store.NativeFSLockFactory@1f1db28; maxCacheMB=0.490234375 maxMergeSizeMB=0.7880859375)),segFN=segments_1,generation=1,filenames=[segments_1]
[junit4:junit4]   2> 783 T12 oasc.SolrDeletionPolicy.updateCommits newest commit = 1[segments_1]
[junit4:junit4]   2> 784 T12 oasc.CachingDirectoryFactory.close Releasing directory:/mnt/ssd/jenkins/workspace/Lucene-Solr-trunk-Linux/solr/build/solr-solrj/test/J0/./solrtest-TestEmbeddedSolrServer-1351562342568/data/-1.3/index
[junit4:junit4]   2> 1000 T12 oasc.RequestHandlers.initHandlersFromConfig created standard: solr.StandardRequestHandler
[junit4:junit4]   2> 1008 T12 oasc.RequestHandlers.initHandlersFromConfig created /update: solr.UpdateRequestHandler
[junit4:junit4]   2> 1010 T12 oasc.RequestHandlers.initHandlersFromConfig created /admin/: org.apache.solr.handler.admin.AdminHandlers
[junit4:junit4]   2> 1046 T12 oashl.XMLLoader.init xsltCacheLifetimeSeconds=60
[junit4:junit4]   2> 1058 T12 oasc.CachingDirectoryFactory.close Releasing directory:/mnt/ssd/jenkins/workspace/Lucene-Solr-trunk-Linux/solr/build/solr-solrj/test/J0/./solrtest-TestEmbeddedSolrServer-1351562342568/data/-1.3
[junit4:junit4]   2> 1072 T12 oass.SolrIndexSearcher.<init> Opening Searcher@1967a4c main
[junit4:junit4]   2> 1092 T12 oasu.CommitTracker.<init> Hard AutoCommit: disabled
[junit4:junit4]   2> 1093 T12 oasu.CommitTracker.<init> Soft AutoCommit: disabled
[junit4:junit4]   2> 1119 T12 oashc.HttpShardHandlerFactory.getParameter Setting socketTimeout to: 0
[junit4:junit4]   2> 1120 T12 oashc.HttpShardHandlerFactory.getParameter Setting urlScheme to: http://
[junit4:junit4]   2> 1120 T12 oashc.HttpShardHandlerFactory.getParameter Setting connTimeout to: 0
[junit4:junit4]   2> 1120 T12 oashc.HttpShardHandlerFactory.getParameter Setting maxConnectionsPerHost to: 20
[junit4:junit4]   2> 1121 T12 oashc.HttpShardHandlerFactory.getParameter Setting corePoolSize to: 0
[junit4:junit4]   2> 1121 T12 oashc.HttpShardHandlerFactory.getParameter Setting maximumPoolSize to: 2147483647
[junit4:junit4]   2> 1122 T12 oashc.HttpShardHandlerFactory.getParameter Setting maxThreadIdleTime to: 5
[junit4:junit4]   2> 1122 T12 oashc.HttpShardHandlerFactory.getParameter Setting sizeOfQueue to: -1
[junit4:junit4]   2> 1122 T12 oashc.HttpShardHandlerFactory.getParameter Setting fairnessPolicy to: false
[junit4:junit4]   2> 1131 T12 oascsi.HttpClientUtil.createClient Creating new http client, config:maxConnectionsPerHost=20&maxConnections=10000&socketTimeout=0&connTimeout=0&retry=false
[junit4:junit4]   2> 1378 T12 oasc.CoreContainer.register registering core: collection1
[junit4:junit4]   2> 1378 T16 oasc.SolrCore.registerSearcher [collection1] Registered new searcher Searcher@1967a4c main{StandardDirectoryReader(segments_1:1)}
[junit4:junit4]   2> 1381 T12 oasc.CoreContainer.create Creating SolrCore 'core0' using instanceDir: /mnt/ssd/jenkins/workspace/Lucene-Solr-trunk-Linux/solr/solrj/src/test-files/solrj/solr/shared/.
[junit4:junit4]   2> 1381 T12 oasc.SolrResourceLoader.<init> new SolrResourceLoader for directory: '/mnt/ssd/jenkins/workspace/Lucene-Solr-trunk-Linux/solr/solrj/src/test-files/solrj/solr/shared/./'
[junit4:junit4]   2> 1431 T12 oasc.SolrConfig.<init> Using Lucene MatchVersion: LUCENE_50
[junit4:junit4]   2> 1506 T12 oasc.SolrConfig.<init> Loaded SolrConfig: solrconfig.xml
[junit4:junit4]   2> 1507 T12 oass.IndexSchema.readSchema Reading Solr Schema
[junit4:junit4]   2> 1514 T12 oass.IndexSchema.readSchema Schema name=example core EN
[junit4:junit4]   2> 1547 T12 oass.IndexSchema.readSchema default search field in schema is name
[junit4:junit4]   2> 1549 T12 oass.IndexSchema.readSchema query parser default operator is OR
[junit4:junit4]   2> 1550 T12 oass.IndexSchema.readSchema unique key field: id
[junit4:junit4]   2> 1552 T12 oasc.SolrCore.<init> [core0] Opening new SolrCore at /mnt/ssd/jenkins/workspace/Lucene-Solr-trunk-Linux/solr/solrj/src/test-files/solrj/solr/shared/./, dataDir=/mnt/ssd/jenkins/workspace/Lucene-Solr-trunk-Linux/solr/build/solr-solrj/test/J0/./solrtest-TestEmbeddedSolrServer-1351562342568/data/EN-3.5/
[junit4:junit4]   2> 1553 T12 oasc.SolrCore.<init> JMX monitoring not detected for core: core0
[junit4:junit4]   2> 1554 T12 oasc.SolrCore.initDirectoryFactory org.apache.solr.core.MockDirectoryFactory
[junit4:junit4]   2> 1555 T12 oasc.CachingDirectoryFactory.injectLockFactory WARNING No lockType configured for MockDirWrapper(org.apache.lucene.store.RAMDirectory@ec7fc3 lockFactory=org.apache.lucene.store.SingleInstanceLockFactory@b7f23f) assuming 'simple'
[junit4:junit4]   2> 1555 T12 oasc.CachingDirectoryFactory.get return new directory for /mnt/ssd/jenkins/workspace/Lucene-Solr-trunk-Linux/solr/build/solr-solrj/test/J0/./solrtest-TestEmbeddedSolrServer-1351562342568/data/EN-3.5 forceNew:false
[junit4:junit4]   2> 1555 T12 oasc.CachingDirectoryFactory.close Releasing directory:/mnt/ssd/jenkins/workspace/Lucene-Solr-trunk-Linux/solr/build/solr-solrj/test/J0/./solrtest-TestEmbeddedSolrServer-1351562342568/data/EN-3.5
[junit4:junit4]   2> 1556 T12 oasc.SolrCore.getNewIndexDir New index directory detected: old=null new=/mnt/ssd/jenkins/workspace/Lucene-Solr-trunk-Linux/solr/build/solr-solrj/test/J0/./solrtest-TestEmbeddedSolrServer-1351562342568/data/EN-3.5/index/
[junit4:junit4]   2> 1556 T12 oasc.SolrCore.initIndex WARNING [core0] Solr index directory '/mnt/ssd/jenkins/workspace/Lucene-Solr-trunk-Linux/solr/build/solr-solrj/test/J0/./solrtest-TestEmbeddedSolrServer-1351562342568/data/EN-3.5/index' doesn't exist. Creating new index...
[junit4:junit4]   2> 1557 T12 oasc.CachingDirectoryFactory.get return new directory for /mnt/ssd/jenkins/workspace/Lucene-Solr-trunk-Linux/solr/build/solr-solrj/test/J0/./solrtest-TestEmbeddedSolrServer-1351562342568/data/EN-3.5/index forceNew:false
[junit4:junit4]   2> 1559 T12 oasc.SolrDeletionPolicy.onCommit SolrDeletionPolicy.onCommit: commits:num=1
[junit4:junit4]   2> 		commit{dir=MockDirWrapper(org.apache.lucene.store.RAMDirectory@43ce94 lockFactory=org.apache.lucene.store.NativeFSLockFactory@1f80229),segFN=segments_1,generation=1,filenames=[segments_1]
[junit4:junit4]   2> 1559 T12 oasc.SolrDeletionPolicy.updateCommits newest commit = 1[segments_1]
[junit4:junit4]   2> 1560 T12 oasc.CachingDirectoryFactory.close Releasing directory:/mnt/ssd/jenkins/workspace/Lucene-Solr-trunk-Linux/solr/build/solr-solrj/test/J0/./solrtest-TestEmbeddedSolrServer-1351562342568/data/EN-3.5/index
[junit4:junit4]   2> 1562 T12 oasc.RequestHandlers.initHandlersFromConfig created standard: solr.StandardRequestHandler
[junit4:junit4]   2> 1565 T12 oasc.RequestHandlers.initHandlersFromConfig created /update: solr.UpdateRequestHandler
[junit4:junit4]   2> 1565 T12 oasc.RequestHandlers.initHandlersFromConfig created /admin/: org.apache.solr.handler.admin.AdminHandlers
[junit4:junit4]   2> 1568 T12 oashl.XMLLoader.init xsltCacheLifetimeSeconds=60
[junit4:junit4]   2> 1571 T12 oasc.CachingDirectoryFactory.close Releasing directory:/mnt/ssd/jenkins/workspace/Lucene-Solr-trunk-Linux/solr/build/solr-solrj/test/J0/./solrtest-TestEmbeddedSolrServer-1351562342568/data/EN-3.5
[junit4:junit4]   2> 1571 T12 oass.SolrIndexSearcher.<init> Opening Searcher@1bc778e main
[junit4:junit4]   2> 1572 T12 oasu.CommitTracker.<init> Hard AutoCommit: disabled
[junit4:junit4]   2> 1572 T12 oasu.CommitTracker.<init> Soft AutoCommit: disabled
[junit4:junit4]   2> 1579 T17 oasc.SolrCore.registerSearcher [core0] Registered new searcher Searcher@1bc778e main{StandardDirectoryReader(segments_1:1)}
[junit4:junit4]   2> 1579 T12 oasc.CoreContainer.register registering core: core0
[junit4:junit4]   2> 1580 T12 oasc.CoreContainer.create Creating SolrCore 'core1' using instanceDir: /mnt/ssd/jenkins/workspace/Lucene-Solr-trunk-Linux/solr/solrj/src/test-files/solrj/solr/shared/.
[junit4:junit4]   2> 1581 T12 oasc.SolrResourceLoader.<init> new SolrResourceLoader for directory: '/mnt/ssd/jenkins/workspace/Lucene-Solr-trunk-Linux/solr/solrj/src/test-files/solrj/solr/shared/./'
[junit4:junit4]   2> 1626 T12 oasc.SolrConfig.<init> Using Lucene MatchVersion: LUCENE_50
[junit4:junit4]   2> 1677 T12 oasc.SolrConfig.<init> Loaded SolrConfig: solrconfig.xml
[junit4:junit4]   2> 1678 T12 oass.IndexSchema.readSchema Reading Solr Schema
[junit4:junit4]   2> 1684 T12 oass.IndexSchema.readSchema Schema name=example core FR
[junit4:junit4]   2> 1725 T12 oass.IndexSchema.readSchema default search field in schema is name
[junit4:junit4]   2> 1727 T12 oass.IndexSchema.readSchema query parser default operator is OR
[junit4:junit4]   2> 1728 T12 oass.IndexSchema.readSchema unique key field: id
[junit4:junit4]   2> 1731 T12 oasc.SolrCore.<init> [core1] Opening new SolrCore at /mnt/ssd/jenkins/workspace/Lucene-Solr-trunk-Linux/solr/solrj/src/test-files/solrj/solr/shared/./, dataDir=/mnt/ssd/jenkins/workspace/Lucene-Solr-trunk-Linux/solr/build/solr-solrj/test/J0/./solrtest-TestEmbeddedSolrServer-1351562342568/data/FR-2.4/
[junit4:junit4]   2> 1732 T12 oasc.SolrCore.<init> JMX monitoring not detected for core: core1
[junit4:junit4]   2> 1732 T12 oasc.SolrCore.initDirectoryFactory org.apache.solr.core.MockDirectoryFactory
[junit4:junit4]   2> 1733 T12 oasc.CachingDirectoryFactory.injectLockFactory WARNING No lockType configured for MockDirWrapper(org.apache.lucene.store.RAMDirectory@1e971bf lockFactory=org.apache.lucene.store.SingleInstanceLockFactory@12ac818) assuming 'simple'
[junit4:junit4]   2> 1734 T12 oasc.CachingDirectoryFactory.get return new directory for /mnt/ssd/jenkins/workspace/Lucene-Solr-trunk-Linux/solr/build/solr-solrj/test/J0/./solrtest-TestEmbeddedSolrServer-1351562342568/data/FR-2.4 forceNew:false
[junit4:junit4]   2> 1734 T12 oasc.CachingDirectoryFactory.close Releasing directory:/mnt/ssd/jenkins/workspace/Lucene-Solr-trunk-Linux/solr/build/solr-solrj/test/J0/./solrtest-TestEmbeddedSolrServer-1351562342568/data/FR-2.4
[junit4:junit4]   2> 1734 T12 oasc.SolrCore.getNewIndexDir New index directory detected: old=null new=/mnt/ssd/jenkins/workspace/Lucene-Solr-trunk-Linux/solr/build/solr-solrj/test/J0/./solrtest-TestEmbeddedSolrServer-1351562342568/data/FR-2.4/index/
[junit4:junit4]   2> 1735 T12 oasc.SolrCore.initIndex WARNING [core1] Solr index directory '/mnt/ssd/jenkins/workspace/Lucene-Solr-trunk-Linux/solr/build/solr-solrj/test/J0/./solrtest-TestEmbeddedSolrServer-1351562342568/data/FR-2.4/index' doesn't exist. Creating new index...
[junit4:junit4]   2> 1735 T12 oasc.CachingDirectoryFactory.get return new directory for /mnt/ssd/jenkins/workspace/Lucene-Solr-trunk-Linux/solr/build/solr-solrj/test/J0/./solrtest-TestEmbeddedSolrServer-1351562342568/data/FR-2.4/index forceNew:false
[junit4:junit4]   2> 1737 T12 oasc.SolrDeletionPolicy.onCommit SolrDeletionPolicy.onCommit: commits:num=1
[junit4:junit4]   2> 		commit{dir=MockDirWrapper(org.apache.lucene.store.RAMDirectory@e5acf7 lockFactory=org.apache.lucene.store.NativeFSLockFactory@e4d2ae),segFN=segments_1,generation=1,filenames=[segments_1]
[junit4:junit4]   2> 1738 T12 oasc.SolrDeletionPolicy.updateCommits newest commit = 1[segments_1]
[junit4:junit4]   2> 1738 T12 oasc.CachingDirectoryFactory.close Releasing directory:/mnt/ssd/jenkins/workspace/Lucene-Solr-trunk-Linux/solr/build/solr-solrj/test/J0/./solrtest-TestEmbeddedSolrServer-1351562342568/data/FR-2.4/index
[junit4:junit4]   2> 1740 T12 oasc.RequestHandlers.initHandlersFromConfig created standard: solr.StandardRequestHandler
[junit4:junit4]   2> 1741 T12 oasc.RequestHandlers.initHandlersFromConfig created /update: solr.UpdateRequestHandler
[junit4:junit4]   2> 1741 T12 oasc.RequestHandlers.initHandlersFromConfig created /admin/: org.apache.solr.handler.admin.AdminHandlers
[junit4:junit4]   2> 1745 T12 oashl.XMLLoader.init xsltCacheLifetimeSeconds=60
[junit4:junit4]   2> 1748 T12 oasc.CachingDirectoryFactory.close Releasing directory:/mnt/ssd/jenkins/workspace/Lucene-Solr-trunk-Linux/solr/build/solr-solrj/test/J0/./solrtest-TestEmbeddedSolrServer-1351562342568/data/FR-2.4
[junit4:junit4]   2> 1749 T12 oass.SolrIndexSearcher.<init> Opening Searcher@17c5337 main
[junit4:junit4]   2> 1749 T12 oasu.CommitTracker.<init> Hard AutoCommit: disabled
[junit4:junit4]   2> 1750 T12 oasu.CommitTracker.<init> Soft AutoCommit: disabled
[junit4:junit4]   2> 1756 T18 oasc.SolrCore.registerSearcher [core1] Registered new searcher Searcher@17c5337 main{StandardDirectoryReader(segments_1:1)}
[junit4:junit4]   2> 1756 T12 oasc.CoreContainer.register registering core: core1
[junit4:junit4]   2> 1772 T12 oasc.CoreContainer.shutdown Shutting down CoreContainer instance=21943975
[junit4:junit4]   2> 1773 T12 oasc.SolrCore.close [collection1]  CLOSING SolrCore org.apache.solr.core.SolrCore@1812629
[junit4:junit4]   2> 1773 T12 oasu.DirectUpdateHandler2.close closing DirectUpdateHandler2{commits=0,autocommits=0,soft autocommits=0,optimizes=0,rollbacks=0,expungeDeletes=0,docsPending=0,adds=0,deletesById=0,deletesByQuery=0,errors=0,cumulative_adds=0,cumulative_deletesById=0,cumulative_deletesByQuery=0,cumulative_errors=0}
[junit4:junit4]   2> 1774 T12 oasc.SolrCore.decrefSolrCoreState Closing SolrCoreState
[junit4:junit4]   2> 1774 T12 oasu.DefaultSolrCoreState.closeIndexWriter SolrCoreState ref count has reached 0 - closing IndexWriter
[junit4:junit4]   2> 1774 T12 oasu.DefaultSolrCoreState.closeIndexWriter closing IndexWriter with IndexWriterCloser
[junit4:junit4]   2> 1776 T12 oasc.SolrCore.closeSearcher [collection1] Closing main searcher on request.
[junit4:junit4]   2> 1777 T12 oasc.CachingDirectoryFactory.close Releasing directory:/mnt/ssd/jenkins/workspace/Lucene-Solr-trunk-Linux/solr/build/solr-solrj/test/J0/./solrtest-TestEmbeddedSolrServer-1351562342568/data/-1.3/index
[junit4:junit4]   2> 1777 T12 oasc.SolrCore.close [core0]  CLOSING SolrCore org.apache.solr.core.SolrCore@1b4b7d9
[junit4:junit4]   2> 1778 T12 oasu.DirectUpdateHandler2.close closing DirectUpdateHandler2{commits=0,autocommits=0,soft autocommits=0,optimizes=0,rollbacks=0,expungeDeletes=0,docsPending=0,adds=0,deletesById=0,deletesByQuery=0,errors=0,cumulative_adds=0,cumulative_deletesById=0,cumulative_deletesByQuery=0,cumulative_errors=0}
[junit4:junit4]   2> 1778 T12 oasc.SolrCore.decrefSolrCoreState Closing SolrCoreState
[junit4:junit4]   2> 1779 T12 oasu.DefaultSolrCoreState.closeIndexWriter SolrCoreState ref count has reached 0 - closing IndexWriter
[junit4:junit4]   2> 1779 T12 oasu.DefaultSolrCoreState.closeIndexWriter closing IndexWriter with IndexWriterCloser
[junit4:junit4]   2> 1779 T12 oasc.SolrCore.closeSearcher [core0] Closing main searcher on request.
[junit4:junit4]   2> 1780 T12 oasc.CachingDirectoryFactory.close Releasing directory:/mnt/ssd/jenkins/workspace/Lucene-Solr-trunk-Linux/solr/build/solr-solrj/test/J0/./solrtest-TestEmbeddedSolrServer-1351562342568/data/EN-3.5/index
[junit4:junit4]   2> 1780 T12 oasc.SolrCore.close [core1]  CLOSING SolrCore org.apache.solr.core.SolrCore@54a79a
[junit4:junit4]   2> 1781 T12 oasu.DirectUpdateHandler2.close closing DirectUpdateHandler2{commits=0,autocommits=0,soft autocommits=0,optimizes=0,rollbacks=0,expungeDeletes=0,docsPending=0,adds=0,deletesById=0,deletesByQuery=0,errors=0,cumulative_adds=0,cumulative_deletesById=0,cumulative_deletesByQuery=0,cumulative_errors=0}
[junit4:junit4]   2> 1781 T12 oasc.SolrCore.decrefSolrCoreState Closing SolrCoreState
[junit4:junit4]   2> 1781 T12 oasu.DefaultSolrCoreState.closeIndexWriter SolrCoreState ref count has reached 0 - closing IndexWriter
[junit4:junit4]   2> 1782 T12 oasu.DefaultSolrCoreState.closeIndexWriter closing IndexWriter with IndexWriterCloser
[junit4:junit4]   2> 1782 T12 oasc.SolrCore.closeSearcher [core1] Closing main searcher on request.
[junit4:junit4]   2> 1782 T12 oasc.CachingDirectoryFactory.close Releasing directory:/mnt/ssd/jenkins/workspace/Lucene-Solr-trunk-Linux/solr/build/solr-solrj/test/J0/./solrtest-TestEmbeddedSolrServer-1351562342568/data/FR-2.4/index
[junit4:junit4]   2> 1791 T12 oasc.CoreContainer.<init> New CoreContainer 28429978
[junit4:junit4]   2> 1792 T12 oasc.CoreContainer.load Loading CoreContainer using Solr Home: '/mnt/ssd/jenkins/workspace/Lucene-Solr-trunk-Linux/solr/solrj/src/test-files/solrj/solr/shared'
[junit4:junit4]   2> 1792 T12 oasc.SolrResourceLoader.<init> new SolrResourceLoader for directory: '/mnt/ssd/jenkins/workspace/Lucene-Solr-trunk-Linux/solr/solrj/src/test-files/solrj/solr/shared/'
[junit4:junit4]   2> 1814 T12 oasc.CoreContainer.load Registering Log Listener
[junit4:junit4]   2> 1835 T12 oasc.CoreContainer.create Creating SolrCore 'collection1' using instanceDir: /mnt/ssd/jenkins/workspace/Lucene-Solr-trunk-Linux/solr/solrj/src/test-files/solrj/solr/shared/.
[junit4:junit4]   2> 1836 T12 oasc.SolrResourceLoader.<init> new SolrResourceLoader for directory: '/mnt/ssd/jenkins/workspace/Lucene-Solr-trunk-Linux/solr/solrj/src/test-files/solrj/solr/shared/./'
[junit4:junit4]   2> 1873 T12 oasc.SolrConfig.<init> Using Lucene MatchVersion: LUCENE_50
[junit4:junit4]   2> 1929 T12 oasc.SolrConfig.<init> Loaded SolrConfig: solrconfig.xml
[junit4:junit4]   2> 1929 T12 oass.IndexSchema.readSchema Reading Solr Schema
[junit4:junit4]   2> 1935 T12 oass.IndexSchema.readSchema Schema name=example core 
[junit4:junit4]   2> 1978 T12 oass.IndexSchema.readSchema default search field in schema is name
[junit4:junit4]   2> 1979 T12 oass.IndexSchema.readSchema query parser default operator is OR
[junit4:junit4]   2> 1981 T12 oass.IndexSchema.readSchema unique key field: id
[junit4:junit4]   2> 1983 T12 oasc.SolrCore.<init> [collection1] Opening new SolrCore at /mnt/ssd/jenkins/workspace/Lucene-Solr-trunk-Linux/solr/solrj/src/test-files/solrj/solr/shared/./, dataDir=/mnt/ssd/jenkins/workspace/Lucene-Solr-trunk-Linux/solr/build/solr-solrj/test/J0/./solrtest-TestEmbeddedSolrServer-1351562344382/data/-1.3/
[junit4:junit4]   2> 1983 T12 oasc.SolrCore.<init> JMX monitoring not detected for core: collection1
[junit4:junit4]   2> 1984 T12 oasc.SolrCore.initDirectoryFactory org.apache.solr.core.MockDirectoryFactory
[junit4:junit4]   2> 1994 T12 oasc.CachingDirectoryFactory.injectLockFactory WARNING No lockType configured for MockDirWrapper(org.apache.lucene.store.SimpleFSDirectory@/mnt/ssd/jenkins/workspace/Lucene-Solr-trunk-Linux/solr/build/solr-solrj/test/J0/index6339963399tmp lockFactory=org.apache.lucene.store.NativeFSLockFactory@cf0ef0) assuming 'simple'
[junit4:junit4]   2> 1994 T12 oasc.CachingDirectoryFactory.get return new directory for /mnt/ssd/jenkins/workspace/Lucene-Solr-trunk-Linux/solr/build/solr-solrj/test/J0/./solrtest-TestEmbeddedSolrServer-1351562344382/data/-1.3 forceNew:false
[junit4:junit4]   2> 1995 T12 oasc.CachingDirectoryFactory.close Releasing directory:/mnt/ssd/jenkins/workspace/Lucene-Solr-trunk-Linux/solr/build/solr-solrj/test/J0/./solrtest-TestEmbeddedSolrServer-1351562344382/data/-1.3
[junit4:junit4]   2> 1995 T12 oasc.SolrCore.getNewIndexDir New index directory detected: old=null new=/mnt/ssd/jenkins/workspace/Lucene-Solr-trunk-Linux/solr/build/solr-solrj/test/J0/./solrtest-TestEmbeddedSolrServer-1351562344382/data/-1.3/index/
[junit4:junit4]   2> 1996 T12 oasc.SolrCore.initIndex WARNING [collection1] Solr index directory '/mnt/ssd/jenkins/workspace/Lucene-Solr-trunk-Linux/solr/build/solr-solrj/test/J0/./solrtest-TestEmbeddedSolrServer-1351562344382/data/-1.3/index' doesn't exist. Creating new index...
[junit4:junit4]   2> 1996 T12 oasc.CachingDirectoryFactory.get return new directory for /mnt/ssd/jenkins/workspace/Lucene-Solr-trunk-Linux/solr/build/solr-solrj/test/J0/./solrtest-TestEmbeddedSolrServer-1351562344382/data/-1.3/index forceNew:false
[junit4:junit4]   2> 1998 T12 oasc.SolrDeletionPolicy.onCommit SolrDeletionPolicy.onCommit: commits:num=1
[junit4:junit4]   2> 		commit{dir=MockDirWrapper(org.apache.lucene.store.RAMDirectory@19d8e5f lockFactory=org.apache.lucene.store.NativeFSLockFactory@84e2fd),segFN=segments_1,generation=1,filenames=[segments_1]
[junit4:junit4]   2> 1998 T12 oasc.SolrDeletionPolicy.updateCommits newest commit = 1[segments_1]
[junit4:junit4]   2> 2004 T12 oasc.CachingDirectoryFactory.close Releasing directory:/mnt/ssd/jenkins/workspace/Lucene-Solr-trunk-Linux/solr/build/solr-solrj/test/J0/./solrtest-TestEmbeddedSolrServer-1351562344382/data/-1.3/index
[junit4:junit4]   2> 2006 T12 oasc.RequestHandlers.initHandlersFromConfig created standard: solr.StandardRequestHandler
[junit4:junit4]   2> 2007 T12 oasc.RequestHandlers.initHandlersFromConfig created /update: solr.UpdateRequestHandler
[junit4:junit4]   2> 2008 T12 oasc.RequestHandlers.initHandlersFromConfig created /admin/: org.apache.solr.handler.admin.AdminHandlers
[junit4:junit4]   2> 2010 T12 oashl.XMLLoader.init xsltCacheLifetimeSeconds=60
[junit4:junit4]   2> 2013 T12 oasc.CachingDirectoryFactory.close Releasing directory:/mnt/ssd/jenkins/workspace/Lucene-Solr-trunk-Linux/solr/build/solr-solrj/test/J0/./solrtest-TestEmbeddedSolrServer-1351562344382/data/-1.3
[junit4:junit4]   2> 2014 T12 oass.SolrIndexSearcher.<init> Opening Searcher@a3bd2d main
[junit4:junit4]   2> 2014 T12 oasu.CommitTracker.<init> Hard AutoCommit: disabled
[junit4:junit4]   2> 2014 T12 oasu.CommitTracker.<init> Soft AutoCommit: disabled
[junit4:junit4]   2> 2015 T12 oashc.HttpShardHandlerFactory.getParameter Setting socketTimeout to: 0
[junit4:junit4]   2> 2015 T12 oashc.HttpShardHandlerFactory.getParameter Setting urlScheme to: http://
[junit4:junit4]   2> 2016 T12 oashc.HttpShardHandlerFactory.getParameter Setting connTimeout to: 0
[junit4:junit4]   2> 2016 T12 oashc.HttpShardHandlerFactory.getParameter Setting maxConnectionsPerHost to: 20
[junit4:junit4]   2> 2016 T12 oashc.HttpShardHandlerFactory.getParameter Setting corePoolSize to: 0
[junit4:junit4]   2> 2017 T12 oashc.HttpShardHandlerFactory.getParameter Setting maximumPoolSize to: 2147483647
[junit4:junit4]   2> 2017 T12 oashc.HttpShardHandlerFactory.getParameter Setting maxThreadIdleTime to: 5
[junit4:junit4]   2> 2017 T12 oashc.HttpShardHandlerFactory.getParameter Setting sizeOfQueue to: -1
[junit4:junit4]   2> 2018 T12 oashc.HttpShardHandlerFactory.getParameter Setting fairnessPolicy to: false
[junit4:junit4]   2> 2018 T12 oascsi.HttpClientUtil.createClient Creating new http client, config:maxConnectionsPerHost=20&maxConnections=10000&socketTimeout=0&connTimeout=0&retry=false
[junit4:junit4]   2> 2026 T19 oasc.SolrCore.registerSearcher [collection1] Registered new searcher Searcher@a3bd2d main{StandardDirectoryReader(segments_1:1)}
[junit4:junit4]   2> 2026 T12 oasc.CoreContainer.register registering core: collection1
[junit4:junit4]   2> 2028 T12 oasc.CoreContainer.create Creating SolrCore 'core0' using instanceDir: /mnt/ssd/jenkins/workspace/Lucene-Solr-trunk-Linux/solr/solrj/src/test-files/solrj/solr/shared/.
[junit4:junit4]   2> 2028 T12 oasc.SolrResourceLoader.<init> new SolrResourceLoader for directory: '/mnt/ssd/jenkins/workspace/Lucene-Solr-trunk-Linux/solr/solrj/src/test-files/solrj/solr/shared/./'
[junit4:junit4]   2> 2069 T12 oasc.SolrConfig.<init> Using Lucene MatchVersion: LUCENE_50
[junit4:junit4]   2> 2113 T12 oasc.SolrConfig.<init> Loaded SolrConfig: solrconfig.xml
[junit4:junit4]   2> 2113 T12 oass.IndexSchema.readSchema Reading Solr Schema
[junit4:junit4]   2> 2118 T12 oass.IndexSchema.readSchema Schema name=example core EN
[junit4:junit4]   2> 2155 T12 oass.IndexSchema.readSchema default search field in schema is name
[junit4:junit4]   2> 2156 T12 oass.IndexSchema.readSchema query parser default operator is OR
[junit4:junit4]   2> 2158 T12 oass.IndexSchema.readSchema unique key field: id
[junit4:junit4]   2> 2161 T12 oasc.SolrCore.<init> [core0] Opening new SolrCore at /mnt/ssd/jenkins/workspace/Lucene-Solr-trunk-Linux/solr/solrj/src/test-files/solrj/solr/shared/./, dataDir=/mnt/ssd/jenkins/workspace/Lucene-Solr-trunk-Linux/solr/build/solr-solrj/test/J0/./solrtest-TestEmbeddedSolrServer-1351562344382/data/EN-3.5/
[junit4:junit4]   2> 2161 T12 oasc.SolrCore.<init> JMX monitoring not detected for core: core0
[junit4:junit4]   2> 2162 T12 oasc.SolrCore.initDirectoryFactory org.apache.solr.core.MockDirectoryFactory
[junit4:junit4]   2> 2162 T12 oasc.CachingDirectoryFactory.injectLockFactory WARNING No lockType configured for MockDirWrapper(org.apache.lucene.store.RAMDirectory@1c22e0 lockFactory=org.apache.lucene.store.SingleInstanceLockFactory@135a54f) assuming 'simple'
[junit4:junit4]   2> 2162 T12 oasc.CachingDirectoryFactory.get return new directory for /mnt/ssd/jenkins/workspace/Lucene-Solr-trunk-Linux/solr/build/solr-solrj/test/J0/./solrtest-TestEmbeddedSolrServer-1351562344382/data/EN-3.5 forceNew:false
[junit4:junit4]   2> 2163 T12 oasc.CachingDirectoryFactory.close Releasing directory:/mnt/ssd/jenkins/workspace/Lucene-Solr-trunk-Linux/solr/build/solr-solrj/test/J0/./solrtest-TestEmbeddedSolrServer-1351562344382/data/EN-3.5
[junit4:junit4]   2> 2163 T12 oasc.SolrCore.getNewIndexDir New index directory detected: old=null new=/mnt/ssd/jenkins/workspace/Lucene-Solr-trunk-Linux/solr/build/solr-solrj/test/J0/./solrtest-TestEmbeddedSolrServer-1351562344382/data/EN-3.5/index/
[junit4:junit4]   2> 2164 T12 oasc.SolrCore.initIndex WARNING [core0] Solr index directory '/mnt/ssd/jenkins/workspace/Lucene-Solr-trunk-Linux/solr/build/solr-solrj/test/J0/./solrtest-TestEmbeddedSolrServer-1351562344382/data/EN-3.5/index' doesn't exist. Creating new index...
[junit4:junit4]   2> 2164 T12 oasc.CachingDirectoryFactory.get return new directory for /mnt/ssd/jenkins/workspace/Lucene-Solr-trunk-Linux/solr/build/solr-solrj/test/J0/./solrtest-TestEmbeddedSolrServer-1351562344382/data/EN-3.5/index forceNew:false
[junit4:junit4]   2> 2166 T12 oasc.SolrDeletionPolicy.onCommit SolrDeletionPolicy.onCommit: commits:num=1
[junit4:junit4]   2> 		commit{dir=MockDirWrapper(org.apache.lucene.store.RAMDirectory@143454c lockFactory=org.apache.lucene.store.NativeFSLockFactory@124b13a),segFN=segments_1,generation=1,filenames=[segments_1]
[junit4:junit4]   2> 2166 T12 oasc.SolrDeletionPolicy.updateCommits newest commit = 1[segments_1]
[junit4:junit4]   2> 2167 T12 oasc.CachingDirectoryFactory.close Releasing directory:/mnt/ssd/jenkins/workspace/Lucene-Solr-trunk-Linux/solr/build/solr-solrj/test/J0/./solrtest-TestEmbeddedSolrServer-1351562344382/data/EN-3.5/index
[junit4:junit4]   2> 2168 T12 oasc.RequestHandlers.initHandlersFromConfig created standard: solr.StandardRequestHandler
[junit4:junit4]   2> 2169 T12 oasc.RequestHandlers.initHandlersFromConfig created /update: solr.UpdateRequestHandler
[junit4:junit4]   2> 2169 T12 oasc.RequestHandlers.initHandlersFromConfig created /admin/: org.apache.solr.handler.admin.AdminHandlers
[junit4:junit4]   2> 2172 T12 oashl.XMLLoader.init xsltCacheLifetimeSeconds=60
[junit4:junit4]   2> 2175 T12 oasc.CachingDirectoryFactory.close Releasing directory:/mnt/ssd/jenkins/workspace/Lucene-Solr-trunk-Linux/solr/build/solr-solrj/test/J0/./solrtest-TestEmbeddedSolrServer-1351562344382/data/EN-3.5
[junit4:junit4]   2> 2175 T12 oass.SolrIndexSearcher.<init> Opening Searcher@1a729d5 main
[junit4:junit4]   2> 2176 T12 oasu.CommitTracker.<init> Hard AutoCommit: disabled
[junit4:junit4]   2> 2176 T12 oasu.CommitTracker.<init> Soft AutoCommit: disabled
[junit4:junit4]   2> 2181 T20 oasc.SolrCore.registerSearcher [core0] Registered new searcher Searcher@1a729d5 main{StandardDirectoryReader(segments_1:1)}
[junit4:junit4]   2> 2181 T12 oasc.CoreContainer.register registering core: core0
[junit4:junit4]   2> 2183 T12 oasc.CoreContainer.create Creating SolrCore 'core1' using instanceDir: /mnt/ssd/jenkins/workspace/Lucene-Solr-trunk-Linux/solr/solrj/src/test-files/solrj/solr/shared/.
[junit4:junit4]   2> 2183 T12 oasc.SolrResourceLoader.<init> new SolrResourceLoader for directory: '/mnt/ssd/jenkins/workspace/Lucene-Solr-trunk-Linux/solr/solrj/src/test-files/solrj/solr/shared/./'
[junit4:junit4]   2> 2223 T12 oasc.SolrConfig.<init> Using Lucene MatchVersion: LUCENE_50
[junit4:junit4]   2> 2277 T12 oasc.SolrConfig.<init> Loaded SolrConfig: solrconfig.xml
[junit4:junit4]   2> 2278 T12 oass.IndexSchema.readSchema Reading Solr Schema
[junit4:junit4]   2> 2283 T12 oass.IndexSchema.readSchema Schema name=example core FR
[junit4:junit4]   2> 2320 T12 oass.IndexSchema.readSchema default search field in schema is name
[junit4:junit4]   2> 2321 T12 oass.IndexSchema.readSchema query parser default operator is OR
[junit4:junit4]   2> 2322 T12 oass.IndexSchema.readSchema unique key field: id
[junit4:junit4]   2> 2326 T12 oasc.SolrCore.<init> [core1] Opening new SolrCore at /mnt/ssd/jenkins/workspace/Lucene-Solr-trunk-Linux/solr/solrj/src/test-files/solrj/solr/shared/./, dataDir=/mnt/ssd/jenkins/workspace/Lucene-Solr-trunk-Linux/solr/build/solr-solrj/test/J0/./solrtest-TestEmbeddedSolrServer-1351562344382/data/FR-2.4/
[junit4:junit4]   2> 2326 T12 oasc.SolrCore.<init> JMX monitoring not detected for core: core1
[junit4:junit4]   2> 2326 T12 oasc.SolrCore.initDirectoryFactory org.apache.solr.core.MockDirectoryFactory
[junit4:junit4]   2> 2327 T12 oasc.CachingDirectoryFactory.injectLockFactory WARNING No lockType configured for MockDirWrapper(org.apache.lucene.store.RAMDirectory@66421c lockFactory=org.apache.lucene.store.SingleInstanceLockFactory@17e49ce) assuming 'simple'
[junit4:junit4]   2> 2327 T12 oasc.CachingDirectoryFactory.get return new directory for /mnt/ssd/jenkins/workspace/Lucene-Solr-trunk-Linux/solr/build/solr-solrj/test/J0/./solrtest-TestEmbeddedSolrServer-1351562344382/data/FR-2.4 forceNew:false
[junit4:junit4]   2> 2328 T12 oasc.CachingDirectoryFactory.close Releasing directory:/mnt/ssd/jenkins/workspace/Lucene-Solr-trunk-Linux/solr/build/solr-solrj/test/J0/./solrtest-TestEmbeddedSolrServer-1351562344382/data/FR-2.4
[junit4:junit4]   2> 2328 T12 oasc.SolrCore.getNewIndexDir New index directory detected: old=null new=/mnt/ssd/jenkins/workspace/Lucene-Solr-trunk-Linux/solr/build/solr-solrj/test/J0/./solrtest-TestEmbeddedSolrServer-1351562344382/data/FR-2.4/index/
[junit4:junit4]   2> 2328 T12 oasc.SolrCore.initIndex WARNING [core1] Solr index directory '/mnt/ssd/jenkins/workspace/Lucene-Solr-trunk-Linux/solr/build/solr-solrj/test/J0/./solrtest-TestEmbeddedSolrServer-1351562344382/data/FR-2.4/index' doesn't exist. Creating new index...
[junit4:junit4]   2> 2329 T12 oasc.CachingDirectoryFactory.get return new directory for /mnt/ssd/jenkins/workspace/Lucene-Solr-trunk-Linux/solr/build/solr-solrj/test/J0/./solrtest-TestEmbeddedSolrServer-1351562344382/data/FR-2.4/index forceNew:false
[junit4:junit4]   2> 2330 T12 oasc.SolrDeletionPolicy.onCommit SolrDeletionPolicy.onCommit: commits:num=1
[junit4:junit4]   2> 		commit{dir=MockDirWrapper(org.apache.lucene.store.RAMDirectory@1c7d5a8 lockFactory=org.apache.lucene.store.NativeFSLockFactory@9f4640),segFN=segments_1,generation=1,filenames=[segments_1]
[junit4:junit4]   2> 2331 T12 oasc.SolrDeletionPolicy.updateCommits newest commit = 1[segments_1]
[junit4:junit4]   2> 2331 T12 oasc.CachingDirectoryFactory.close Releasing directory:/mnt/ssd/jenkins/workspace/Lucene-Solr-trunk-Linux/solr/build/solr-solrj/test/J0/./solrtest-TestEmbeddedSolrServer-1351562344382/data/FR-2.4/index
[junit4:junit4]   2> 2333 T12 oasc.RequestHandlers.initHandlersFromConfig created standard: solr.StandardRequestHandler
[junit4:junit4]   2> 2334 T12 oasc.RequestHandlers.initHandlersFromConfig created /update: solr.UpdateRequestHandler
[junit4:junit4]   2> 2334 T12 oasc.RequestHandlers.initHandlersFromConfig created /admin/: org.apache.solr.handler.admin.AdminHandlers
[junit4:junit4]   2> 2336 T12 oashl.XMLLoader.init xsltCacheLifetimeSeconds=60
[junit4:junit4]   2> 2339 T12 oasc.CachingDirectoryFactory.close Releasing directory:/mnt/ssd/jenkins/workspace/Lucene-Solr-trunk-Linux/solr/build/solr-solrj/test/J0/./solrtest-TestEmbeddedSolrServer-1351562344382/data/FR-2.4
[junit4:junit4]   2> 2339 T12 oass.SolrIndexSearcher.<init> Opening Searcher@1eca583 main
[junit4:junit4]   2> 2340 T12 oasu.CommitTracker.<init> Hard AutoCommit: disabled
[junit4:junit4]   2> 2340 T12 oasu.CommitTracker.<init> Soft AutoCommit: disabled
[junit4:junit4]   2> 2345 T21 oasc.SolrCore.registerSearcher [core1] Registered new searcher Searcher@1eca583 main{StandardDirectoryReader(segments_1:1)}
[junit4:junit4]   2> 2345 T12 oasc.CoreContainer.register registering core: core1
[junit4:junit4]   2> 2346 T12 oasc.CoreContainer.shutdown Shutting down CoreContainer instance=28429978
[junit4:junit4]   2> 2346 T12 oasc.SolrCore.close [collection1]  CLOSING SolrCore org.apache.solr.core.SolrCore@bd631a
[junit4:junit4]   2> 2346 T12 oasu.DirectUpdateHandler2.close closing DirectUpdateHandler2{commits=0,autocommits=0,soft autocommits=0,optimizes=0,rollbacks=0,expungeDeletes=0,docsPending=0,adds=0,deletesById=0,deletesByQuery=0,errors=0,cumulative_adds=0,cumulative_deletesById=0,cumulative_deletesByQuery=0,cumulative_errors=0}
[junit4:junit4]   2> 2347 T12 oasc.SolrCore.decrefSolrCoreState Closing SolrCoreState
[junit4:junit4]   2> 2347 T12 oasu.DefaultSolrCoreState.closeIndexWriter SolrCoreState ref count has reached 0 - closing IndexWriter
[junit4:junit4]   2> 2347 T12 oasu.DefaultSolrCoreState.closeIndexWriter closing IndexWriter with IndexWriterCloser
[junit4:junit4]   2> 2348 T12 oasc.SolrCore.closeSearcher [collection1] Closing main searcher on request.
[junit4:junit4]   2> 2348 T12 oasc.CachingDirectoryFactory.close Releasing directory:/mnt/ssd/jenkins/workspace/Lucene-Solr-trunk-Linux/solr/build/solr-solrj/test/J0/./solrtest-TestEmbeddedSolrServer-1351562344382/data/-1.3/index
[junit4:junit4]   2> 2349 T12 oasc.SolrCore.close [core0]  CLOSING SolrCore org.apache.solr.core.SolrCore@24f5ad
[junit4:junit4]   2> 2349 T12 oasu.DirectUpdateHandler2.close closing DirectUpdateHandler2{commits=0,autocommits=0,soft autocommits=0,optimizes=0,rollbacks=0,expungeDeletes=0,docsPending=0,adds=0,deletesById=0,deletesByQuery=0,errors=0,cumulative_adds=0,cumulative_deletesById=0,cumulative_deletesByQuery=0,cumulative_errors=0}
[junit4:junit4]   2> 2349 T12 oasc.SolrCore.decrefSolrCoreState Closing SolrCoreState
[junit4:junit4]   2> 2350 T12 oasu.DefaultSolrCoreState.closeIndexWriter SolrCoreState ref count has reached 0 - closing IndexWriter
[junit4:junit4]   2> 2350 T12 oasu.DefaultSolrCoreState.closeIndexWriter closing IndexWriter with IndexWriterCloser
[junit4:junit4]   2> 2351 T12 oasc.SolrCore.closeSearcher [core0] Closing main searcher on request.
[junit4:junit4]   2> 2351 T12 oasc.CachingDirectoryFactory.close Releasing directory:/mnt/ssd/jenkins/workspace/Lucene-Solr-trunk-Linux/solr/build/solr-solrj/test/J0/./solrtest-TestEmbeddedSolrServer-1351562344382/data/EN-3.5/index
[junit4:junit4]   2> 2351 T12 oasc.SolrCore.close [core1]  CLOSING SolrCore org.apache.solr.core.SolrCore@ddc9d4
[junit4:junit4]   2> 2352 T12 oasu.DirectUpdateHandler2.close closing DirectUpdateHandler2{commits=0,autocommits=0,soft autocommits=0,optimizes=0,rollbacks=0,expungeDeletes=0,docsPending=0,adds=0,deletesById=0,deletesByQuery=0,errors=0,cumulative_adds=0,cumulative_deletesById=0,cumulative_deletesByQuery=0,cumulative_errors=0}
[junit4:junit4]   2> 2352 T12 oasc.SolrCore.decrefSolrCoreState Closing SolrCoreState
[junit4:junit4]   2> 2352 T12 oasu.DefaultSolrCoreState.closeIndexWriter SolrCoreState ref count has reached 0 - closing IndexWriter
[junit4:junit4]   2> 2353 T12 oasu.DefaultSolrCoreState.closeIndexWriter closing IndexWriter with IndexWriterCloser
[junit4:junit4]   2> 2353 T12 oasc.SolrCore.closeSearcher [core1] Closing main searcher on request.
[junit4:junit4]   2> 2353 T12 oasc.CachingDirectoryFactory.close Releasing directory:/mnt/ssd/jenkins/workspace/Lucene-Solr-trunk-Linux/solr/build/solr-solrj/test/J0/./solrtest-TestEmbeddedSolrServer-1351562344382/data/FR-2.4/index
[junit4:junit4]   2> 2354 T12 oasc.CoreContainer.shutdown Shutting down CoreContainer instance=28429978
[junit4:junit4]   2> 2359 T11 ccr.ThreadLeakControl.checkThreadLeaks WARNING Will linger awaiting termination of 2 leaked thread(s).
[junit4:junit4]   2> 22462 T11 ccr.ThreadLeakControl.checkThreadLeaks SEVERE 2 threads leaked from SUITE scope at org.apache.solr.client.solrj.embedded.TestEmbeddedSolrServer: 
[junit4:junit4]   2> 	   1) Thread[id=14, name=metrics-meter-tick-thread-1, state=WAITING, group=TGRP-TestEmbeddedSolrServer]
[junit4:junit4]   2> 	        at sun.misc.Unsafe.park(Native Method)
[junit4:junit4]   2> 	        at java.util.concurrent.locks.LockSupport.park(LockSupport.java:186)
[junit4:junit4]   2> 	        at java.util.concurrent.locks.AbstractQueuedSynchronizer$ConditionObject.await(AbstractQueuedSynchronizer.java:2043)
[junit4:junit4]   2> 	        at java.util.concurrent.ScheduledThreadPoolExecutor$DelayedWorkQueue.take(ScheduledThreadPoolExecutor.java:1086)
[junit4:junit4]   2> 	        at java.util.concurrent.ScheduledThreadPoolExecutor$DelayedWorkQueue.take(ScheduledThreadPoolExecutor.java:808)
[junit4:junit4]   2> 	        at java.util.concurrent.ThreadPoolExecutor.getTask(ThreadPoolExecutor.java:1045)
[junit4:junit4]   2> 	        at java.util.concurrent.ThreadPoolExecutor.runWorker(ThreadPoolExecutor.java:1103)
[junit4:junit4]   2> 	        at java.util.concurrent.ThreadPoolExecutor$Worker.run(ThreadPoolExecutor.java:603)
[junit4:junit4]   2> 	        at java.lang.Thread.run(Thread.java:722)
[junit4:junit4]   2> 	   2) Thread[id=15, name=metrics-meter-tick-thread-2, state=TIMED_WAITING, group=TGRP-TestEmbeddedSolrServer]
[junit4:junit4]   2> 	        at sun.misc.Unsafe.park(Native Method)
[junit4:junit4]   2> 	        at java.util.concurrent.locks.LockSupport.parkNanos(LockSupport.java:226)
[junit4:junit4]   2> 	        at java.util.concurrent.locks.AbstractQueuedSynchronizer$ConditionObject.awaitNanos(AbstractQueuedSynchronizer.java:2082)
[junit4:junit4]   2> 	        at java.util.concurrent.ScheduledThreadPoolExecutor$DelayedWorkQueue.take(ScheduledThreadPoolExecutor.java:1091)
[junit4:junit4]   2> 	        at java.util.concurrent.ScheduledThreadPoolExecutor$DelayedWorkQueue.take(ScheduledThreadPoolExecutor.java:808)
[junit4:junit4]   2> 	        at java.util.concurrent.ThreadPoolExecutor.getTask(ThreadPoolExecutor.java:1045)
[junit4:junit4]   2> 	        at java.util.concurrent.ThreadPoolExecutor.runWorker(ThreadPoolExecutor.java:1103)
[junit4:junit4]   2> 	        at java.util.concurrent.ThreadPoolExecutor$Worker.run(ThreadPoolExecutor.java:603)
[junit4:junit4]   2> 	        at java.lang.Thread.run(Thread.java:722)
[junit4:junit4]   2> 22463 T11 ccr.ThreadLeakControl.tryToInterruptAll Starting to interrupt leaked threads:
[junit4:junit4]   2> 	   1) Thread[id=14, name=metrics-meter-tick-thread-1, state=WAITING, group=TGRP-TestEmbeddedSolrServer]
[junit4:junit4]   2> 	   2) Thread[id=15, name=metrics-meter-tick-thread-2, state=TIMED_WAITING, group=TGRP-TestEmbeddedSolrServer]
[junit4:junit4]   2> 25470 T11 ccr.ThreadLeakControl.tryToInterruptAll SEVERE There are still zombie threads that couldn't be terminated:
[junit4:junit4]   2> 	   1) Thread[id=14, name=metrics-meter-tick-thread-1, state=WAITING, group=TGRP-TestEmbeddedSolrServer]
[junit4:junit4]   2> 	        at sun.misc.Unsafe.park(Native Method)
[junit4:junit4]   2> 	        at java.util.concurrent.locks.LockSupport.park(LockSupport.java:186)
[junit4:junit4]   2> 	        at java.util.concurrent.locks.AbstractQueuedSynchronizer$ConditionObject.await(AbstractQueuedSynchronizer.java:2043)
[junit4:junit4]   2> 	        at java.util.concurrent.ScheduledThreadPoolExecutor$DelayedWorkQueue.take(ScheduledThreadPoolExecutor.java:1086)
[junit4:junit4]   2> 	        at java.util.concurrent.ScheduledThreadPoolExecutor$DelayedWorkQueue.take(ScheduledThreadPoolExecutor.java:808)
[junit4:junit4]   2> 	        at java.util.concurrent.ThreadPoolExecutor.getTask(ThreadPoolExecutor.java:1045)
[junit4:junit4]   2> 	        at java.util.concurrent.ThreadPoolExecutor.runWorker(ThreadPoolExecutor.java:1103)
[junit4:junit4]   2> 	        at java.util.concurrent.ThreadPoolExecutor$Worker.run(ThreadPoolExecutor.java:603)
[junit4:junit4]   2> 	        at java.lang.Thread.run(Thread.java:722)
[junit4:junit4]   2> 	   2) Thread[id=15, name=metrics-meter-tick-thread-2, state=TIMED_WAITING, group=TGRP-TestEmbeddedSolrServer]
[junit4:junit4]   2> 	        at sun.misc.Unsafe.park(Native Method)
[junit4:junit4]   2> 	        at java.util.concurrent.locks.LockSupport.parkNanos(LockSupport.java:226)
[junit4:junit4]   2> 	        at java.util.concurrent.locks.AbstractQueuedSynchronizer$ConditionObject.awaitNanos(AbstractQueuedSynchronizer.java:2082)
[junit4:junit4]   2> 	        at java.util.concurrent.ScheduledThreadPoolExecutor$DelayedWorkQueue.take(ScheduledThreadPoolExecutor.java:1091)
[junit4:junit4]   2> 	        at java.util.concurrent.ScheduledThreadPoolExecutor$DelayedWorkQueue.take(ScheduledThreadPoolExecutor.java:808)
[junit4:junit4]   2> 	        at java.util.concurrent.ThreadPoolExecutor.getTask(ThreadPoolExecutor.java:1045)
[junit4:junit4]   2> 	        at java.util.concurrent.ThreadPoolExecutor.runWorker(ThreadPoolExecutor.java:1103)
[junit4:junit4]   2> 	        at java.util.concurrent.ThreadPoolExecutor$Worker.run(ThreadPoolExecutor.java:603)
[junit4:junit4]   2> 	        at java.lang.Thread.run(Thread.java:722)
[junit4:junit4]   2> NOTE: test params are: codec=Lucene41: {}, sim=DefaultSimilarity, locale=mk, timezone=America/St_Johns
[junit4:junit4]   2> NOTE: Linux 3.2.0-32-generic i386/Oracle Corporation 1.8.0-ea (32-bit)/cpus=8,threads=3,free=2504944,total=16646144
[junit4:junit4]   2> NOTE: All tests run in this JVM: [DocumentAnalysisResponseTest, TestEmbeddedSolrServer]
[junit4:junit4]   2> NOTE: reproduce with: ant test  -Dtestcase=TestEmbeddedSolrServer -Dtests.seed=16021ABFA2650B8D -Dtests.multiplier=3 -Dtests.slow=true -Dtests.locale=mk -Dtests.timezone=America/St_Johns -Dtests.file.encoding=UTF-8
[junit4:junit4] ERROR   0.00s J0 | TestEmbeddedSolrServer (suite) <<<
[junit4:junit4]    > Throwable #1: com.carrotsearch.randomizedtesting.ThreadLeakError: 2 threads leaked from SUITE scope at org.apache.solr.client.solrj.embedded.TestEmbeddedSolrServer: 
[junit4:junit4]    >    1) Thread[id=14, name=metrics-meter-tick-thread-1, state=WAITING, group=TGRP-TestEmbeddedSolrServer]
[junit4:junit4]    >         at sun.misc.Unsafe.park(Native Method)
[junit4:junit4]    >         at java.util.concurrent.locks.LockSupport.park(LockSupport.java:186)
[junit4:junit4]    >         at java.util.concurrent.locks.AbstractQueuedSynchronizer$ConditionObject.await(AbstractQueuedSynchronizer.java:2043)
[junit4:junit4]    >         at java.util.concurrent.ScheduledThreadPoolExecutor$DelayedWorkQueue.take(ScheduledThreadPoolExecutor.java:1086)
[junit4:junit4]    >         at java.util.concurrent.ScheduledThreadPoolExecutor$DelayedWorkQueue.take(ScheduledThreadPoolExecutor.java:808)
[junit4:junit4]    >         at java.util.concurrent.ThreadPoolExecutor.getTask(ThreadPoolExecutor.java:1045)
[junit4:junit4]    >         at java.util.concurrent.ThreadPoolExecutor.runWorker(ThreadPoolExecutor.java:1103)
[junit4:junit4]    >         at java.util.concurrent.ThreadPoolExecutor$Worker.run(ThreadPoolExecutor.java:603)
[junit4:junit4]    >         at java.lang.Thread.run(Thread.java:722)
[junit4:junit4]    >    2) Thread[id=15, name=metrics-meter-tick-thread-2, state=TIMED_WAITING, group=TGRP-TestEmbeddedSolrServer]
[junit4:junit4]    >         at sun.misc.Unsafe.park(Native Method)
[junit4:junit4]    >         at java.util.concurrent.locks.LockSupport.parkNanos(LockSupport.java:226)
[junit4:junit4]    >         at java.util.concurrent.locks.AbstractQueuedSynchronizer$ConditionObject.awaitNanos(AbstractQueuedSynchronizer.java:2082)
[junit4:junit4]    >         at java.util.concurrent.ScheduledThreadPoolExecutor$DelayedWorkQueue.take(ScheduledThreadPoolExecutor.java:1091)
[junit4:junit4]    >         at java.util.concurrent.ScheduledThreadPoolExecutor$DelayedWorkQueue.take(ScheduledThreadPoolExecutor.java:808)
[junit4:junit4]    >         at java.util.concurrent.ThreadPoolExecutor.getTask(ThreadPoolExecutor.java:1045)
[junit4:junit4]    >         at java.util.concurrent.ThreadPoolExecutor.runWorker(ThreadPoolExecutor.java:1103)
[junit4:junit4]    >         at java.util.concurrent.ThreadPoolExecutor$Worker.run(ThreadPoolExecutor.java:603)
[junit4:junit4]    >         at java.lang.Thread.run(Thread.java:722)
[junit4:junit4]    > 	at __randomizedtesting.SeedInfo.seed([16021ABFA2650B8D]:0)
[junit4:junit4]    > Throwable #2: com.carrotsearch.randomizedtesting.ThreadLeakError: There are still zombie threads that couldn't be terminated:
[junit4:junit4]    >    1) Thread[id=14, name=metrics-meter-tick-thread-1, state=WAITING, group=TGRP-TestEmbeddedSolrServer]
[junit4:junit4]    >         at sun.misc.Unsafe.park(Native Method)
[junit4:junit4]    >         at java.util.concurrent.locks.LockSupport.park(LockSupport.java:186)
[junit4:junit4]    >         at java.util.concurrent.locks.AbstractQueuedSynchronizer$ConditionObject.await(AbstractQueuedSynchronizer.java:2043)
[junit4:junit4]    >         at java.util.concurrent.ScheduledThreadPoolExecutor$DelayedWorkQueue.take(ScheduledThreadPoolExecutor.java:1086)
[junit4:junit4]    >         at java.util.concurrent.ScheduledThreadPoolExecutor$DelayedWorkQueue.take(ScheduledThreadPoolExecutor.java:808)
[junit4:junit4]    >         at java.util.concurrent.ThreadPoolExecutor.getTask(ThreadPoolExecutor.java:1045)
[junit4:junit4]    >         at java.util.concurrent.ThreadPoolExecutor.runWorker(ThreadPoolExecutor.java:1103)
[junit4:junit4]    >         at java.util.concurrent.ThreadPoolExecutor$Worker.run(ThreadPoolExecutor.java:603)
[junit4:junit4]    >         at java.lang.Thread.run(Thread.java:722)
[junit4:junit4]    >    2) Thread[id=15, name=metrics-meter-tick-thread-2, state=TIMED_WAITING, group=TGRP-TestEmbeddedSolrServer]
[junit4:junit4]    >         at sun.misc.Unsafe.park(Native Method)
[junit4:junit4]    >         at java.util.concurrent.locks.LockSupport.parkNanos(LockSupport.java:226)
[junit4:junit4]    >         at java.util.concurrent.locks.AbstractQueuedSynchronizer$ConditionObject.awaitNanos(AbstractQueuedSynchronizer.java:2082)
[junit4:junit4]    >         at java.util.concurrent.ScheduledThreadPoolExecutor$DelayedWorkQueue.take(ScheduledThreadPoolExecutor.java:1091)
[junit4:junit4]    >         at java.util.concurrent.ScheduledThreadPoolExecutor$DelayedWorkQueue.take(ScheduledThreadPoolExecutor.java:808)
[junit4:junit4]    >         at java.util.concurrent.ThreadPoolExecutor.getTask(ThreadPoolExecutor.java:1045)
[junit4:junit4]    >         at java.util.concurrent.ThreadPoolExecutor.runWorker(ThreadPoolExecutor.java:1103)
[junit4:junit4]    >         at java.util.concurrent.ThreadPoolExecutor$Worker.run(ThreadPoolExecutor.java:603)
[junit4:junit4]    >         at java.lang.Thread.run(Thread.java:722)
[junit4:junit4]    > 	at __randomizedtesting.SeedInfo.seed([16021ABFA2650B8D]:0)
[junit4:junit4] Completed on J0 in 25.62s, 2 tests, 2 errors <<< FAILURES!

[...truncated 112 lines...]
BUILD FAILED
/mnt/ssd/jenkins/workspace/Lucene-Solr-trunk-Linux/build.xml:335: The following error occurred while executing this line:
/mnt/ssd/jenkins/workspace/Lucene-Solr-trunk-Linux/build.xml:39: The following error occurred while executing this line:
/mnt/ssd/jenkins/workspace/Lucene-Solr-trunk-Linux/solr/build.xml:185: The following error occurred while executing this line:
/mnt/ssd/jenkins/workspace/Lucene-Solr-trunk-Linux/lucene/module-build.xml:61: The following error occurred while executing this line:
/mnt/ssd/jenkins/workspace/Lucene-Solr-trunk-Linux/lucene/common-build.xml:1159: The following error occurred while executing this line:
/mnt/ssd/jenkins/workspace/Lucene-Solr-trunk-Linux/lucene/common-build.xml:827: There were test failures: 43 suites, 239 tests, 2 suite-level errors, 143 ignored

Total time: 26 minutes 9 seconds
Build step 'Invoke Ant' marked build as failure
Archiving artifacts
Recording test results
Description set: Java: 32bit/jdk1.8.0-ea-b58 -client -XX:+UseConcMarkSweepGC
Email was triggered for: Failure
Sending email for trigger: Failure



Mime
View raw message