lucene-dev mailing list archives

Site index · List index
Message view « Date » · « Thread »
Top « Date » · « Thread »
From Charlie Cron <hudsonsevilt...@gmail.com>
Subject Build failed in Jenkins: slow-io-beasting #4920
Date Sat, 27 Oct 2012 12:15:55 GMT
See <http://sierranevada.servebeer.com:8080/job/slow-io-beasting/4920/>

------------------------------------------
[...truncated 18009 lines...]
[junit4:junit4]   2> 96721 T320 C27 UPDATE [collection1] webapp=/solr path=/update params={wt=javabin&version=2}
{add=[360]} 0 0
[junit4:junit4]   2> 96737 T321 C27 UPDATE [collection1] webapp=/solr path=/update params={wt=javabin&version=2}
{add=[361]} 0 0
[junit4:junit4]   2> 96752 T324 C27 UPDATE [collection1] webapp=/solr path=/update params={wt=javabin&version=2}
{add=[362]} 0 0
[junit4:junit4]   2> 96768 T326 C27 UPDATE [collection1] webapp=/solr path=/update params={wt=javabin&version=2}
{add=[363]} 0 0
[junit4:junit4]   2> 96783 T325 C27 UPDATE [collection1] webapp=/solr path=/update params={wt=javabin&version=2}
{add=[364]} 0 0
[junit4:junit4]   2> 96799 T327 C27 UPDATE [collection1] webapp=/solr path=/update params={wt=javabin&version=2}
{add=[365]} 0 0
[junit4:junit4]   2> 96815 T320 C27 UPDATE [collection1] webapp=/solr path=/update params={wt=javabin&version=2}
{add=[366]} 0 0
[junit4:junit4]   2> 96830 T321 C27 UPDATE [collection1] webapp=/solr path=/update params={wt=javabin&version=2}
{add=[367]} 0 0
[junit4:junit4]   2> 96846 T324 C27 UPDATE [collection1] webapp=/solr path=/update params={wt=javabin&version=2}
{add=[368]} 0 0
[junit4:junit4]   2> 96861 T326 C27 UPDATE [collection1] webapp=/solr path=/update params={wt=javabin&version=2}
{add=[369]} 0 0
[junit4:junit4]   2> 96877 T325 C27 UPDATE [collection1] webapp=/solr path=/update params={wt=javabin&version=2}
{add=[370]} 0 0
[junit4:junit4]   2> 96893 T327 C27 UPDATE [collection1] webapp=/solr path=/update params={wt=javabin&version=2}
{add=[371]} 0 0
[junit4:junit4]   2> 96908 T320 C27 UPDATE [collection1] webapp=/solr path=/update params={wt=javabin&version=2}
{add=[372]} 0 0
[junit4:junit4]   2> 96924 T321 C27 UPDATE [collection1] webapp=/solr path=/update params={wt=javabin&version=2}
{add=[373]} 0 0
[junit4:junit4]   2> 96939 T324 C27 UPDATE [collection1] webapp=/solr path=/update params={wt=javabin&version=2}
{add=[374]} 0 0
[junit4:junit4]   2> 96955 T326 C27 UPDATE [collection1] webapp=/solr path=/update params={wt=javabin&version=2}
{add=[375]} 0 0
[junit4:junit4]   2> 96971 T325 C27 UPDATE [collection1] webapp=/solr path=/update params={wt=javabin&version=2}
{add=[376]} 0 0
[junit4:junit4]   2> 96986 T327 C27 UPDATE [collection1] webapp=/solr path=/update params={wt=javabin&version=2}
{add=[377]} 0 0
[junit4:junit4]   2> 97002 T321 C27 UPDATE [collection1] webapp=/solr path=/update params={wt=javabin&version=2}
{add=[378]} 0 0
[junit4:junit4]   2> 97017 T324 C27 UPDATE [collection1] webapp=/solr path=/update params={wt=javabin&version=2}
{add=[379]} 0 0
[junit4:junit4]   2> 97033 T326 C27 UPDATE [collection1] webapp=/solr path=/update params={wt=javabin&version=2}
{add=[380]} 0 0
[junit4:junit4]   2> 97049 T325 C27 UPDATE [collection1] webapp=/solr path=/update params={wt=javabin&version=2}
{add=[381]} 0 0
[junit4:junit4]   2> 97064 T327 C27 UPDATE [collection1] webapp=/solr path=/update params={wt=javabin&version=2}
{add=[382]} 0 0
[junit4:junit4]   2> 97080 T320 C27 UPDATE [collection1] webapp=/solr path=/update params={wt=javabin&version=2}
{add=[383]} 0 0
[junit4:junit4]   2> 97095 T321 C27 UPDATE [collection1] webapp=/solr path=/update params={wt=javabin&version=2}
{add=[384]} 0 0
[junit4:junit4]   2> 97111 T324 C27 UPDATE [collection1] webapp=/solr path=/update params={wt=javabin&version=2}
{add=[385]} 0 0
[junit4:junit4]   2> 97127 T326 C27 UPDATE [collection1] webapp=/solr path=/update params={wt=javabin&version=2}
{add=[386]} 0 0
[junit4:junit4]   2> 97142 T325 C27 UPDATE [collection1] webapp=/solr path=/update params={wt=javabin&version=2}
{add=[387]} 0 0
[junit4:junit4]   2> 97158 T327 C27 UPDATE [collection1] webapp=/solr path=/update params={wt=javabin&version=2}
{add=[388]} 0 0
[junit4:junit4]   2> 97173 T320 C27 UPDATE [collection1] webapp=/solr path=/update params={wt=javabin&version=2}
{add=[389]} 0 0
[junit4:junit4]   2> 97189 T321 C27 UPDATE [collection1] webapp=/solr path=/update params={wt=javabin&version=2}
{add=[390]} 0 0
[junit4:junit4]   2> 97205 T324 C27 UPDATE [collection1] webapp=/solr path=/update params={wt=javabin&version=2}
{add=[391]} 0 0
[junit4:junit4]   2> 97220 T326 C27 UPDATE [collection1] webapp=/solr path=/update params={wt=javabin&version=2}
{add=[392]} 0 0
[junit4:junit4]   2> 97236 T325 C27 UPDATE [collection1] webapp=/solr path=/update params={wt=javabin&version=2}
{add=[393]} 0 0
[junit4:junit4]   2> 97251 T327 C27 UPDATE [collection1] webapp=/solr path=/update params={wt=javabin&version=2}
{add=[394]} 0 0
[junit4:junit4]   2> 97267 T320 C27 UPDATE [collection1] webapp=/solr path=/update params={wt=javabin&version=2}
{add=[395]} 0 0
[junit4:junit4]   2> 97283 T321 C27 UPDATE [collection1] webapp=/solr path=/update params={wt=javabin&version=2}
{add=[396]} 0 0
[junit4:junit4]   2> 97298 T324 C27 UPDATE [collection1] webapp=/solr path=/update params={wt=javabin&version=2}
{add=[397]} 0 0
[junit4:junit4]   2> 97314 T326 C27 UPDATE [collection1] webapp=/solr path=/update params={wt=javabin&version=2}
{add=[398]} 0 0
[junit4:junit4]   2> 97329 T325 C27 UPDATE [collection1] webapp=/solr path=/update params={wt=javabin&version=2}
{add=[399]} 0 0
[junit4:junit4]   2> 97345 T327 C27 UPDATE [collection1] webapp=/solr path=/update params={wt=javabin&version=2}
{add=[400]} 0 0
[junit4:junit4]   2> 97361 T320 C27 UPDATE [collection1] webapp=/solr path=/update params={wt=javabin&version=2}
{add=[401]} 0 0
[junit4:junit4]   2> 97376 T321 C27 UPDATE [collection1] webapp=/solr path=/update params={wt=javabin&version=2}
{add=[402]} 0 0
[junit4:junit4]   2> 97392 T324 C27 UPDATE [collection1] webapp=/solr path=/update params={wt=javabin&version=2}
{add=[403]} 0 0
[junit4:junit4]   2> 97407 T325 C27 UPDATE [collection1] webapp=/solr path=/update params={wt=javabin&version=2}
{add=[404]} 0 0
[junit4:junit4]   2> 97423 T327 C27 UPDATE [collection1] webapp=/solr path=/update params={wt=javabin&version=2}
{add=[405]} 0 0
[junit4:junit4]   2> 97439 T320 C27 UPDATE [collection1] webapp=/solr path=/update params={wt=javabin&version=2}
{add=[406]} 0 0
[junit4:junit4]   2> 97454 T321 C27 UPDATE [collection1] webapp=/solr path=/update params={wt=javabin&version=2}
{add=[407]} 0 0
[junit4:junit4]   2> 97470 T324 C27 UPDATE [collection1] webapp=/solr path=/update params={wt=javabin&version=2}
{add=[408]} 0 0
[junit4:junit4]   2> 97485 T326 C27 UPDATE [collection1] webapp=/solr path=/update params={wt=javabin&version=2}
{add=[409]} 0 0
[junit4:junit4]   2> 97501 T325 C27 UPDATE [collection1] webapp=/solr path=/update params={wt=javabin&version=2}
{add=[410]} 0 0
[junit4:junit4]   2> 97517 T327 C27 UPDATE [collection1] webapp=/solr path=/update params={wt=javabin&version=2}
{add=[411]} 0 0
[junit4:junit4]   2> 97548 T320 C27 UPDATE [collection1] webapp=/solr path=/update params={wt=javabin&version=2}
{add=[412]} 0 0
[junit4:junit4]   2> 97563 T321 C27 UPDATE [collection1] webapp=/solr path=/update params={wt=javabin&version=2}
{add=[413]} 0 0
[junit4:junit4]   2> 97579 T324 C27 UPDATE [collection1] webapp=/solr path=/update params={wt=javabin&version=2}
{add=[414]} 0 0
[junit4:junit4]   2> 97595 T326 C27 UPDATE [collection1] webapp=/solr path=/update params={wt=javabin&version=2}
{add=[415]} 0 0
[junit4:junit4]   2> 97610 T325 C27 UPDATE [collection1] webapp=/solr path=/update params={wt=javabin&version=2}
{add=[416]} 0 0
[junit4:junit4]   2> 97626 T327 C27 UPDATE [collection1] webapp=/solr path=/update params={wt=javabin&version=2}
{add=[417]} 0 0
[junit4:junit4]   2> 97641 T320 C27 UPDATE [collection1] webapp=/solr path=/update params={wt=javabin&version=2}
{add=[418]} 0 0
[junit4:junit4]   2> 97657 T321 C27 UPDATE [collection1] webapp=/solr path=/update params={wt=javabin&version=2}
{add=[419]} 0 0
[junit4:junit4]   2> 97688 T324 C27 UPDATE [collection1] webapp=/solr path=/update params={wt=javabin&version=2}
{add=[420]} 0 0
[junit4:junit4]   2> 97704 T326 C27 UPDATE [collection1] webapp=/solr path=/update params={wt=javabin&version=2}
{add=[421]} 0 0
[junit4:junit4]   2> 97719 T325 C27 UPDATE [collection1] webapp=/solr path=/update params={wt=javabin&version=2}
{add=[422]} 0 0
[junit4:junit4]   2> 97735 T327 C27 UPDATE [collection1] webapp=/solr path=/update params={wt=javabin&version=2}
{add=[423]} 0 0
[junit4:junit4]   2> 97751 T320 C27 UPDATE [collection1] webapp=/solr path=/update params={wt=javabin&version=2}
{add=[424]} 0 0
[junit4:junit4]   2> 97766 T321 C27 UPDATE [collection1] webapp=/solr path=/update params={wt=javabin&version=2}
{add=[425]} 0 0
[junit4:junit4]   2> 97782 T324 C27 UPDATE [collection1] webapp=/solr path=/update params={wt=javabin&version=2}
{add=[426]} 0 0
[junit4:junit4]   2> 97797 T326 C27 UPDATE [collection1] webapp=/solr path=/update params={wt=javabin&version=2}
{add=[427]} 0 0
[junit4:junit4]   2> 97813 T327 C27 UPDATE [collection1] webapp=/solr path=/update params={wt=javabin&version=2}
{add=[428]} 0 0
[junit4:junit4]   2> 97829 T320 C27 UPDATE [collection1] webapp=/solr path=/update params={wt=javabin&version=2}
{add=[429]} 0 0
[junit4:junit4]   2> 97844 T321 C27 UPDATE [collection1] webapp=/solr path=/update params={wt=javabin&version=2}
{add=[430]} 0 0
[junit4:junit4]   2> 97860 T324 C27 UPDATE [collection1] webapp=/solr path=/update params={wt=javabin&version=2}
{add=[431]} 0 0
[junit4:junit4]   2> 97875 T325 C27 UPDATE [collection1] webapp=/solr path=/update params={wt=javabin&version=2}
{add=[432]} 0 0
[junit4:junit4]   2> 97891 T326 C27 UPDATE [collection1] webapp=/solr path=/update params={wt=javabin&version=2}
{add=[433]} 0 0
[junit4:junit4]   2> 97907 T327 C27 UPDATE [collection1] webapp=/solr path=/update params={wt=javabin&version=2}
{add=[434]} 0 0
[junit4:junit4]   2> 97922 T320 C27 UPDATE [collection1] webapp=/solr path=/update params={wt=javabin&version=2}
{add=[435]} 0 0
[junit4:junit4]   2> 97938 T321 C27 UPDATE [collection1] webapp=/solr path=/update params={wt=javabin&version=2}
{add=[436]} 0 0
[junit4:junit4]   2> 97953 T317 oash.SnapPuller.fetchLatestIndex SEVERE Master at: http://127.0.0.1:49479/solr
is not available. Index fetch failed. Exception: org.apache.solr.client.solrj.SolrServerException:
Server refused connection at: http://127.0.0.1:49479/solr
[junit4:junit4]   2> 97953 T324 C27 UPDATE [collection1] webapp=/solr path=/update params={wt=javabin&version=2}
{add=[437]} 0 0
[junit4:junit4]   2> 97969 T325 C27 UPDATE [collection1] webapp=/solr path=/update params={wt=javabin&version=2}
{add=[438]} 0 0
[junit4:junit4]   2> 97985 T326 C27 UPDATE [collection1] webapp=/solr path=/update params={wt=javabin&version=2}
{add=[439]} 0 0
[junit4:junit4]   2> 98000 T327 C27 UPDATE [collection1] webapp=/solr path=/update params={wt=javabin&version=2}
{add=[440]} 0 0
[junit4:junit4]   2> 98016 T320 C27 UPDATE [collection1] webapp=/solr path=/update params={wt=javabin&version=2}
{add=[441]} 0 0
[junit4:junit4]   2> 98031 T321 C27 UPDATE [collection1] webapp=/solr path=/update params={wt=javabin&version=2}
{add=[442]} 0 0
[junit4:junit4]   2> 98047 T324 C27 UPDATE [collection1] webapp=/solr path=/update params={wt=javabin&version=2}
{add=[443]} 0 0
[junit4:junit4]   2> 98063 T325 C27 UPDATE [collection1] webapp=/solr path=/update params={wt=javabin&version=2}
{add=[444]} 0 0
[junit4:junit4]   2> 98078 T326 C27 UPDATE [collection1] webapp=/solr path=/update params={wt=javabin&version=2}
{add=[445]} 0 0
[junit4:junit4]   2> 98094 T327 C27 UPDATE [collection1] webapp=/solr path=/update params={wt=javabin&version=2}
{add=[446]} 0 0
[junit4:junit4]   2> 98109 T320 C27 UPDATE [collection1] webapp=/solr path=/update params={wt=javabin&version=2}
{add=[447]} 0 0
[junit4:junit4]   2> 98125 T321 C27 UPDATE [collection1] webapp=/solr path=/update params={wt=javabin&version=2}
{add=[448]} 0 0
[junit4:junit4]   2> 98141 T324 C27 UPDATE [collection1] webapp=/solr path=/update params={wt=javabin&version=2}
{add=[449]} 0 0
[junit4:junit4]   2> 98156 T325 C27 UPDATE [collection1] webapp=/solr path=/update params={wt=javabin&version=2}
{add=[450]} 0 0
[junit4:junit4]   2> 98172 T326 C27 UPDATE [collection1] webapp=/solr path=/update params={wt=javabin&version=2}
{add=[451]} 0 0
[junit4:junit4]   2> 98187 T327 C27 UPDATE [collection1] webapp=/solr path=/update params={wt=javabin&version=2}
{add=[452]} 0 0
[junit4:junit4]   2> 98203 T320 C27 UPDATE [collection1] webapp=/solr path=/update params={wt=javabin&version=2}
{add=[453]} 0 0
[junit4:junit4]   2> 98219 T324 C27 UPDATE [collection1] webapp=/solr path=/update params={wt=javabin&version=2}
{add=[454]} 0 0
[junit4:junit4]   2> 98234 T325 C27 UPDATE [collection1] webapp=/solr path=/update params={wt=javabin&version=2}
{add=[455]} 0 0
[junit4:junit4]   2> 98250 T326 C27 UPDATE [collection1] webapp=/solr path=/update params={wt=javabin&version=2}
{add=[456]} 0 0
[junit4:junit4]   2> 98265 T327 C27 UPDATE [collection1] webapp=/solr path=/update params={wt=javabin&version=2}
{add=[457]} 0 0
[junit4:junit4]   2> 98281 T320 C27 UPDATE [collection1] webapp=/solr path=/update params={wt=javabin&version=2}
{add=[458]} 0 0
[junit4:junit4]   2> 98297 T321 C27 UPDATE [collection1] webapp=/solr path=/update params={wt=javabin&version=2}
{add=[459]} 0 0
[junit4:junit4]   2> 98312 T324 C27 UPDATE [collection1] webapp=/solr path=/update params={wt=javabin&version=2}
{add=[460]} 0 0
[junit4:junit4]   2> 98328 T325 C27 UPDATE [collection1] webapp=/solr path=/update params={wt=javabin&version=2}
{add=[461]} 0 0
[junit4:junit4]   2> 98343 T326 C27 UPDATE [collection1] webapp=/solr path=/update params={wt=javabin&version=2}
{add=[462]} 0 0
[junit4:junit4]   2> 98359 T327 C27 UPDATE [collection1] webapp=/solr path=/update params={wt=javabin&version=2}
{add=[463]} 0 0
[junit4:junit4]   2> 98375 T320 C27 UPDATE [collection1] webapp=/solr path=/update params={wt=javabin&version=2}
{add=[464]} 0 0
[junit4:junit4]   2> 98390 T321 C27 UPDATE [collection1] webapp=/solr path=/update params={wt=javabin&version=2}
{add=[465]} 0 0
[junit4:junit4]   2> 98406 T324 C27 UPDATE [collection1] webapp=/solr path=/update params={wt=javabin&version=2}
{add=[466]} 0 0
[junit4:junit4]   2> 98421 T325 C27 UPDATE [collection1] webapp=/solr path=/update params={wt=javabin&version=2}
{add=[467]} 0 0
[junit4:junit4]   2> 98437 T326 C27 UPDATE [collection1] webapp=/solr path=/update params={wt=javabin&version=2}
{add=[468]} 0 0
[junit4:junit4]   2> 98453 T327 C27 UPDATE [collection1] webapp=/solr path=/update params={wt=javabin&version=2}
{add=[469]} 0 0
[junit4:junit4]   2> 98468 T320 C27 UPDATE [collection1] webapp=/solr path=/update params={wt=javabin&version=2}
{add=[470]} 0 0
[junit4:junit4]   2> 98484 T321 C27 UPDATE [collection1] webapp=/solr path=/update params={wt=javabin&version=2}
{add=[471]} 0 0
[junit4:junit4]   2> 98499 T324 C27 UPDATE [collection1] webapp=/solr path=/update params={wt=javabin&version=2}
{add=[472]} 0 0
[junit4:junit4]   2> 98515 T325 C27 UPDATE [collection1] webapp=/solr path=/update params={wt=javabin&version=2}
{add=[473]} 0 0
[junit4:junit4]   2> 98546 T326 C27 UPDATE [collection1] webapp=/solr path=/update params={wt=javabin&version=2}
{add=[474]} 0 0
[junit4:junit4]   2> 98562 T327 C27 UPDATE [collection1] webapp=/solr path=/update params={wt=javabin&version=2}
{add=[475]} 0 0
[junit4:junit4]   2> 98577 T320 C27 UPDATE [collection1] webapp=/solr path=/update params={wt=javabin&version=2}
{add=[476]} 0 0
[junit4:junit4]   2> 98593 T321 C27 UPDATE [collection1] webapp=/solr path=/update params={wt=javabin&version=2}
{add=[477]} 0 0
[junit4:junit4]   2> 98609 T324 C27 UPDATE [collection1] webapp=/solr path=/update params={wt=javabin&version=2}
{add=[478]} 0 0
[junit4:junit4]   2> 98624 T326 C27 UPDATE [collection1] webapp=/solr path=/update params={wt=javabin&version=2}
{add=[479]} 0 0
[junit4:junit4]   2> 98640 T327 C27 UPDATE [collection1] webapp=/solr path=/update params={wt=javabin&version=2}
{add=[480]} 0 0
[junit4:junit4]   2> 98655 T320 C27 UPDATE [collection1] webapp=/solr path=/update params={wt=javabin&version=2}
{add=[481]} 0 0
[junit4:junit4]   2> 98671 T321 C27 UPDATE [collection1] webapp=/solr path=/update params={wt=javabin&version=2}
{add=[482]} 0 0
[junit4:junit4]   2> 98687 T325 C27 UPDATE [collection1] webapp=/solr path=/update params={wt=javabin&version=2}
{add=[483]} 0 0
[junit4:junit4]   2> 98702 T324 C27 UPDATE [collection1] webapp=/solr path=/update params={wt=javabin&version=2}
{add=[484]} 0 0
[junit4:junit4]   2> 98718 T326 C27 UPDATE [collection1] webapp=/solr path=/update params={wt=javabin&version=2}
{add=[485]} 0 0
[junit4:junit4]   2> 98733 T327 C27 UPDATE [collection1] webapp=/solr path=/update params={wt=javabin&version=2}
{add=[486]} 0 0
[junit4:junit4]   2> 98749 T320 C27 UPDATE [collection1] webapp=/solr path=/update params={wt=javabin&version=2}
{add=[487]} 0 0
[junit4:junit4]   2> 98765 T321 C27 UPDATE [collection1] webapp=/solr path=/update params={wt=javabin&version=2}
{add=[488]} 0 0
[junit4:junit4]   2> 98780 T325 C27 UPDATE [collection1] webapp=/solr path=/update params={wt=javabin&version=2}
{add=[489]} 0 0
[junit4:junit4]   2> 98796 T324 C27 UPDATE [collection1] webapp=/solr path=/update params={wt=javabin&version=2}
{add=[490]} 0 0
[junit4:junit4]   2> 98811 T326 C27 UPDATE [collection1] webapp=/solr path=/update params={wt=javabin&version=2}
{add=[491]} 0 0
[junit4:junit4]   2> 98827 T327 C27 UPDATE [collection1] webapp=/solr path=/update params={wt=javabin&version=2}
{add=[492]} 0 0
[junit4:junit4]   2> 98843 T320 C27 oasu.DirectUpdateHandler2.commit start commit{flags=0,_version_=0,optimize=false,openSearcher=true,waitSearcher=true,expungeDeletes=false,softCommit=false}
[junit4:junit4]   2> 98889 T320 C27 oasc.SolrDeletionPolicy.onCommit SolrDeletionPolicy.onCommit:
commits:num=2
[junit4:junit4]   2> 		commit{dir=NRTCachingDirectory(org.apache.lucene.store.SimpleFSDirectory@<http://sierranevada.servebeer.com:8080/job/slow-io-beasting/ws/solr/build/solr-core/test/J6/org.apache.solr.handler.TestReplicationHandler$SolrInstance-1351339930862/master/collection1/data/index>
lockFactory=org.apache.lucene.store.SingleInstanceLockFactory@1d6545e; maxCacheMB=48.0 maxMergeSizeMB=4.0),segFN=segments_i,generation=18,filenames=[_a_nrm.cfe,
_a_MockSep_0.tib, _a_MockSep_0.skp, _a_MockSep_0.doc, _a.fdt, _a_MockSep_0.tii, _a.si, _a_nrm.cfs,
segments_i, _a.fnm, _a.fdx]
[junit4:junit4]   2> 		commit{dir=NRTCachingDirectory(org.apache.lucene.store.SimpleFSDirectory@<http://sierranevada.servebeer.com:8080/job/slow-io-beasting/ws/solr/build/solr-core/test/J6/org.apache.solr.handler.TestReplicationHandler$SolrInstance-1351339930862/master/collection1/data/index>
lockFactory=org.apache.lucene.store.SingleInstanceLockFactory@1d6545e; maxCacheMB=48.0 maxMergeSizeMB=4.0),segFN=segments_j,generation=19,filenames=[_b_MockSep_0.doc,
_b.si, _b_nrm.cfe, _b_MockSep_0.skp, _b_MockSep_0.tii, _b.fnm, _b.fdt, _b_nrm.cfs, segments_j,
_b.fdx, _b_MockSep_0.tib]
[junit4:junit4]   2> 98889 T320 C27 oasc.SolrDeletionPolicy.updateCommits newest commit
= 19
[junit4:junit4]   2> 98921 T320 C27 oass.SolrIndexSearcher.<init> Opening Searcher@7282a1
main
[junit4:junit4]   2> 98921 T320 C27 oasu.DirectUpdateHandler2.commit end_commit_flush
[junit4:junit4]   2> 98921 T328 oasc.SolrCore.registerSearcher [collection1] Registered
new searcher Searcher@7282a1 main{StandardDirectoryReader(segments_j:35 _b(4.1):C493)}
[junit4:junit4]   2> 98921 T320 C27 UPDATE [collection1] webapp=/solr path=/update params={waitSearcher=true&wt=javabin&commit=true&softCommit=false&version=2}
{commit=} 0 78
[junit4:junit4]   2> 98936 T321 C27 REQ [collection1] webapp=/solr path=/replication params={command=details}
status=0 QTime=0 
[junit4:junit4]   2> 98967 T321 C27 REQ [collection1] webapp=/solr path=/replication params={command=backup&numberToKeep=1}
status=0 QTime=15 
[junit4:junit4]   2> 99030 T317 oash.SnapPuller.fetchLatestIndex SEVERE Master at: http://127.0.0.1:49479/solr
is not available. Index fetch failed. Exception: org.apache.solr.client.solrj.SolrServerException:
Server refused connection at: http://127.0.0.1:49479/solr
[junit4:junit4]   2> 99139 T324 C27 REQ [collection1] webapp=/solr path=/replication params={command=details}
status=0 QTime=0 
[junit4:junit4]   2> 100013 T317 oash.SnapPuller.fetchLatestIndex SEVERE Master at: http://127.0.0.1:49479/solr
is not available. Index fetch failed. Exception: org.apache.solr.client.solrj.SolrServerException:
Server refused connection at: http://127.0.0.1:49479/solr
[junit4:junit4]   2> 100153 T325 C27 REQ [collection1] webapp=/solr path=/replication params={command=details}
status=0 QTime=0 
[junit4:junit4]   2> 100153 T321 C27 REQ [collection1] webapp=/solr path=/replication params={command=backup&numberToKeep=1}
status=0 QTime=0 
[junit4:junit4]   2> 100371 T326 C27 REQ [collection1] webapp=/solr path=/replication params={command=details}
status=0 QTime=0 
[junit4:junit4]   2> 100403 T109 oas.SolrTestCaseJ4.tearDown ###Ending test
[junit4:junit4]   1> replicate slave to master
[junit4:junit4]   2> 100418 T109 oasc.CoreContainer.shutdown Shutting down CoreContainer
instance=2083637
[junit4:junit4]   2> 100418 T109 oasc.SolrCore.close [collection1]  CLOSING SolrCore org.apache.solr.core.SolrCore@a151fa
[junit4:junit4]   2> 100418 T109 oasu.DirectUpdateHandler2.close closing DirectUpdateHandler2{commits=1,autocommits=0,soft
autocommits=0,optimizes=0,rollbacks=0,expungeDeletes=0,docsPending=0,adds=0,deletesById=0,deletesByQuery=0,errors=0,cumulative_adds=493,cumulative_deletesById=0,cumulative_deletesByQuery=1,cumulative_errors=0}
[junit4:junit4]   2> 100418 T109 oasc.SolrCore.decrefSolrCoreState Closing SolrCoreState
[junit4:junit4]   2> 100418 T109 oasu.DefaultSolrCoreState.closeIndexWriter SolrCoreState
ref count has reached 0 - closing IndexWriter
[junit4:junit4]   2> 100418 T109 oasu.DefaultSolrCoreState.closeIndexWriter closing IndexWriter
with IndexWriterCloser
[junit4:junit4]   2> 100418 T109 oasc.SolrCore.closeSearcher [collection1] Closing main
searcher on request.
[junit4:junit4]   2> 100418 T109 oejsh.ContextHandler.doStop stopped o.e.j.s.ServletContextHandler{/solr,null}
[junit4:junit4]   2> 100532 T109 oasc.CoreContainer.shutdown Shutting down CoreContainer
instance=3383899
[junit4:junit4]   2> 100532 T109 oasc.SolrCore.close [collection1]  CLOSING SolrCore org.apache.solr.core.SolrCore@1288e12
[junit4:junit4]   2> 100532 T109 oasu.DirectUpdateHandler2.close closing DirectUpdateHandler2{commits=2,autocommits=0,soft
autocommits=0,optimizes=0,rollbacks=0,expungeDeletes=0,docsPending=0,adds=0,deletesById=0,deletesByQuery=0,errors=0,cumulative_adds=1,cumulative_deletesById=0,cumulative_deletesByQuery=0,cumulative_errors=0}
[junit4:junit4]   2> 100532 T109 oasc.SolrCore.decrefSolrCoreState Closing SolrCoreState
[junit4:junit4]   2> 100532 T109 oasu.DefaultSolrCoreState.closeIndexWriter SolrCoreState
ref count has reached 0 - closing IndexWriter
[junit4:junit4]   2> 100532 T109 oasu.DefaultSolrCoreState.closeIndexWriter closing IndexWriter
with IndexWriterCloser
[junit4:junit4]   2> 100532 T109 oasc.SolrCore.closeSearcher [collection1] Closing main
searcher on request.
[junit4:junit4]   2> 100532 T109 oejsh.ContextHandler.doStop stopped o.e.j.s.ServletContextHandler{/solr,null}
[junit4:junit4]   2> 100859 T109 oas.SolrTestCaseJ4.deleteCore ###deleteCore
[junit4:junit4]   2> 101078 T317 oash.SnapPuller.fetchLatestIndex SEVERE Master at: http://127.0.0.1:49479/solr
is not available. Index fetch failed. Exception: org.apache.solr.client.solrj.SolrServerException:
Server refused connection at: http://127.0.0.1:49479/solr
[junit4:junit4]   2> 101080 T317 oash.SnapPuller.logReplicationTimeAndConfFiles WARNING
Exception while updating statistics java.io.FileNotFoundException: .\org.apache.solr.handler.TestReplicationHandler$SolrInstance-1351339935611\slave\collection1\data\replication.properties
(The system cannot find the path specified)
[junit4:junit4]   2> 	at java.io.FileOutputStream.open(Native Method)
[junit4:junit4]   2> 	at java.io.FileOutputStream.<init>(FileOutputStream.java:179)
[junit4:junit4]   2> 	at java.io.FileOutputStream.<init>(FileOutputStream.java:131)
[junit4:junit4]   2> 	at org.apache.solr.handler.SnapPuller.logReplicationTimeAndConfFiles(SnapPuller.java:481)
[junit4:junit4]   2> 	at org.apache.solr.handler.SnapPuller.fetchLatestIndex(SnapPuller.java:409)
[junit4:junit4]   2> 	at org.apache.solr.handler.ReplicationHandler.doFetch(ReplicationHandler.java:297)
[junit4:junit4]   2> 	at org.apache.solr.handler.SnapPuller$1.run(SnapPuller.java:176)
[junit4:junit4]   2> 	at java.util.concurrent.Executors$RunnableAdapter.call(Executors.java:441)
[junit4:junit4]   2> 	at java.util.concurrent.FutureTask$Sync.innerRunAndReset(FutureTask.java:317)
[junit4:junit4]   2> 	at java.util.concurrent.FutureTask.runAndReset(FutureTask.java:150)
[junit4:junit4]   2> 	at java.util.concurrent.ScheduledThreadPoolExecutor$ScheduledFutureTask.access$101(ScheduledThreadPoolExecutor.java:98)
[junit4:junit4]   2> 	at java.util.concurrent.ScheduledThreadPoolExecutor$ScheduledFutureTask.runPeriodic(ScheduledThreadPoolExecutor.java:180)
[junit4:junit4]   2> 	at java.util.concurrent.ScheduledThreadPoolExecutor$ScheduledFutureTask.run(ScheduledThreadPoolExecutor.java:204)
[junit4:junit4]   2> 	at java.util.concurrent.ThreadPoolExecutor$Worker.runTask(ThreadPoolExecutor.java:886)
[junit4:junit4]   2> 	at java.util.concurrent.ThreadPoolExecutor$Worker.run(ThreadPoolExecutor.java:908)
[junit4:junit4]   2> 	at java.lang.Thread.run(Thread.java:662)
[junit4:junit4]   2> 
[junit4:junit4]   2> 223465 T109 oas.SolrTestCaseJ4.endTrackingSearchers SEVERE ERROR:
SolrIndexSearcher opens=61 closes=60
[junit4:junit4]   2> NOTE: test params are: codec=Lucene41: {newname=PostingsFormat(name=MockSep),
id=PostingsFormat(name=MockSep), name=PostingsFormat(name=MockSep)}, sim=RandomSimilarityProvider(queryNorm=true,coord=crazy):
{}, locale=ar_SY, timezone=Europe/Skopje
[junit4:junit4]   2> NOTE: Windows Vista 6.0 x86/Sun Microsystems Inc. 1.6.0_23 (32-bit)/cpus=4,threads=1,free=8897936,total=48193536
[junit4:junit4]   2> NOTE: All tests run in this JVM: [TestPluginEnable, RAMDirectoryFactoryTest,
SearchHandlerTest, TestNumberUtils, CurrencyFieldTest, TestBM25SimilarityFactory, UniqFieldsUpdateProcessorFactoryTest,
FieldMutatingUpdateProcessorTest, TestStressLucene, HighlighterConfigTest, PolyFieldTest,
TermsComponentTest, ConvertedLegacyTest, TestHashPartitioner, SortByFunctionTest, CSVRequestHandlerTest,
SpellCheckComponentTest, TestReplicationHandler]
[junit4:junit4]   2> NOTE: reproduce with: ant test  -Dtestcase=TestReplicationHandler
-Dtests.seed=192BE1DE9309ADFE -Dtests.slow=true -Dtests.locale=ar_SY -Dtests.timezone=Europe/Skopje
-Dtests.file.encoding=US-ASCII
[junit4:junit4] ERROR   0.00s J6 | TestReplicationHandler (suite) <<<
[junit4:junit4]    > Throwable #1: java.lang.AssertionError: ERROR: SolrIndexSearcher opens=61
closes=60
[junit4:junit4]    > 	at __randomizedtesting.SeedInfo.seed([192BE1DE9309ADFE]:0)
[junit4:junit4]    > 	at org.junit.Assert.fail(Assert.java:93)
[junit4:junit4]    > 	at org.apache.solr.SolrTestCaseJ4.endTrackingSearchers(SolrTestCaseJ4.java:242)
[junit4:junit4]    > 	at org.apache.solr.SolrTestCaseJ4.afterClass(SolrTestCaseJ4.java:97)
[junit4:junit4]    > 	at sun.reflect.NativeMethodAccessorImpl.invoke0(Native Method)
[junit4:junit4]    > 	at sun.reflect.NativeMethodAccessorImpl.invoke(NativeMethodAccessorImpl.java:39)
[junit4:junit4]    > 	at sun.reflect.DelegatingMethodAccessorImpl.invoke(DelegatingMethodAccessorImpl.java:25)
[junit4:junit4]    > 	at java.lang.reflect.Method.invoke(Method.java:597)
[junit4:junit4]    > 	at com.carrotsearch.randomizedtesting.RandomizedRunner.invoke(RandomizedRunner.java:1559)
[junit4:junit4]    > 	at com.carrotsearch.randomizedtesting.RandomizedRunner.access$600(RandomizedRunner.java:79)
[junit4:junit4]    > 	at com.carrotsearch.randomizedtesting.RandomizedRunner$5.evaluate(RandomizedRunner.java:700)
[junit4:junit4]    > 	at com.carrotsearch.randomizedtesting.rules.StatementAdapter.evaluate(StatementAdapter.java:36)
[junit4:junit4]    > 	at com.carrotsearch.randomizedtesting.rules.SystemPropertiesRestoreRule$1.evaluate(SystemPropertiesRestoreRule.java:53)
[junit4:junit4]    > 	at org.apache.lucene.util.AbstractBeforeAfterRule$1.evaluate(AbstractBeforeAfterRule.java:45)
[junit4:junit4]    > 	at org.apache.lucene.util.TestRuleStoreClassName$1.evaluate(TestRuleStoreClassName.java:42)
[junit4:junit4]    > 	at com.carrotsearch.randomizedtesting.rules.SystemPropertiesInvariantRule$1.evaluate(SystemPropertiesInvariantRule.java:55)
[junit4:junit4]    > 	at com.carrotsearch.randomizedtesting.rules.NoShadowingOrOverridesOnMethodsRule$1.evaluate(NoShadowingOrOverridesOnMethodsRule.java:39)
[junit4:junit4]    > 	at com.carrotsearch.randomizedtesting.rules.NoShadowingOrOverridesOnMethodsRule$1.evaluate(NoShadowingOrOverridesOnMethodsRule.java:39)
[junit4:junit4]    > 	at com.carrotsearch.randomizedtesting.rules.StatementAdapter.evaluate(StatementAdapter.java:36)
[junit4:junit4]    > 	at org.apache.lucene.util.TestRuleAssertionsRequired$1.evaluate(TestRuleAssertionsRequired.java:43)
[junit4:junit4]    > 	at org.apache.lucene.util.TestRuleMarkFailure$1.evaluate(TestRuleMarkFailure.java:48)
[junit4:junit4]    > 	at org.apache.lucene.util.TestRuleIgnoreAfterMaxFailures$1.evaluate(TestRuleIgnoreAfterMaxFailures.java:70)
[junit4:junit4]    > 	at org.apache.lucene.util.TestRuleIgnoreTestSuites$1.evaluate(TestRuleIgnoreTestSuites.java:55)
[junit4:junit4]    > 	at com.carrotsearch.randomizedtesting.rules.StatementAdapter.evaluate(StatementAdapter.java:36)
[junit4:junit4]    > 	at com.carrotsearch.randomizedtesting.ThreadLeakControl$StatementRunner.run(ThreadLeakControl.java:358)
[junit4:junit4]    > 	at java.lang.Thread.run(Thread.java:662)
[junit4:junit4] Completed on J6 in 223.64s, 1 test, 1 failure <<< FAILURES!
[junit4:junit4] 
[junit4:junit4] 
[junit4:junit4] Tests with failures:
[junit4:junit4]   - org.apache.solr.handler.TestReplicationHandler (suite)
[junit4:junit4] 
[junit4:junit4] 
[junit4:junit4] JVM J0:     2.65 ..   265.95 =   263.30s
[junit4:junit4] JVM J1:     5.05 ..   269.42 =   264.36s
[junit4:junit4] JVM J2:     2.65 ..   265.13 =   262.47s
[junit4:junit4] JVM J3:     2.65 ..   275.11 =   272.46s
[junit4:junit4] JVM J4:     2.12 ..   335.33 =   333.21s
[junit4:junit4] JVM J5:     2.92 ..   263.27 =   260.35s
[junit4:junit4] JVM J6:     2.65 ..   364.09 =   361.44s
[junit4:junit4] JVM J7:     2.67 ..   363.95 =   361.29s
[junit4:junit4] Execution time total: 6 minutes 4 seconds
[junit4:junit4] Tests summary: 233 suites, 965 tests, 1 suite-level error, 12 ignored (7 assumptions)

BUILD FAILED
<http://sierranevada.servebeer.com:8080/job/slow-io-beasting/ws/build.xml>:39: The following
error occurred while executing this line:
<http://sierranevada.servebeer.com:8080/job/slow-io-beasting/ws/solr/build.xml>:178:
The following error occurred while executing this line:
<http://sierranevada.servebeer.com:8080/job/slow-io-beasting/ws/lucene/module-build.xml>:61:
The following error occurred while executing this line:
<http://sierranevada.servebeer.com:8080/job/slow-io-beasting/ws/lucene/common-build.xml>:1159:
The following error occurred while executing this line:
<http://sierranevada.servebeer.com:8080/job/slow-io-beasting/ws/lucene/common-build.xml>:827:
There were test failures: 233 suites, 965 tests, 1 suite-level error, 12 ignored (7 assumptions)

Total time: 14 minutes 23 seconds
Build step 'Invoke Ant' marked build as failure

---------------------------------------------------------------------
To unsubscribe, e-mail: dev-unsubscribe@lucene.apache.org
For additional commands, e-mail: dev-help@lucene.apache.org


Mime
View raw message